##TITLE=1H_EC-3222(2)
 CDCl3, 8 sc, 
 4.2.2020
##JCAMPDX= 6.0         $$ Bruker NMR JCAMP-DX V2.0
##DATA TYPE= NMR FID
##DATA CLASS= NTUPLES
##ORIGIN= UXNMR, Bruker Analytische Messtechnik GmbH
##OWNER= root
$$ XWIN-NMR		Version 3.5
$$ Tue Feb  4 13:54:09 2020 Russian Standard Time (UT+4h)  she@DPX200
##.OBSERVE FREQUENCY= 200.1315
##.OBSERVE NUCLEUS= ^1H
##.DELAY= (6, 6)
##.ACQUISITION MODE= SIMULTANEOUS
##.ACQUISITION SCHEME= undefined
##.AVERAGES= 8
##.DIGITISER RES= 18
##SPECTROMETER/DATA SYSTEM= spect
##.PULSE SEQUENCE= zg30
##.SOLVENT NAME= CDCl3
##.SHIFT REFERENCE= (INTERNAL, CDCl3, 0, 15.7039)
##AUDIT TRAIL= $$ (NUMBER, WHEN, WHO, WHERE, WHAT)
$$ ##TITLE= Audit trail, XWIN-NMR		Version 3.5
$$ ##JCAMPDX= 5.01
$$ ##ORIGIN= Bruker BioSpin GmbH
$$ ##OWNER= she
$$ F:/spectra/data/she/nmr/H-F/1/audita.txt
$$ ##AUDIT TRAIL=  $$ (NUMBER, WHEN, WHO, WHERE, WHAT)
(   1,<2020-02-04 13:52:57.46 +0400>,<she>,<DPX200>,
      <created by zg, POWCHK disabled, PULCHK disabled
       configuration hash MD5:
       00 E9 B6 7A A2 85 ED C7 34 08 36 98 17 FE 4E 26
       data hash MD5: 16K
       D7 D5 4B 3E 60 D0 C5 D8 84 18 2F 29 FB 35 5F CE>)
$$ ##END=
$$ 
$$ hash MD5
$$ 4A A7 D5 1A A7 62 5C 1A 1B 75 01 93 F1 A7 79 07
##$RELAX= 
##$RELAX= 
##$RELAX= 
##$RELAX= 
##$RELAX= 
##$RELAX= 
$$ Bruker specific parameters
$$ --------------------------
##$DU= <F:/spectra>
##$EXPNO= 1
##$NAME= <H-F>
##$PROCNO= 1
##$TYPE= <nmr>
##$USER= <she>
##$AMP= (0..31)
100 100 100 100 100 100 100 100 100 100 100 100 100 100 100 100 100 100 
100 100 100 100 100 100 100 100 100 100 100 100 100 100 
##$AQSEQ= 0
##$AQ_mod= 1
##$AUNM= <au_zg>
##$AUTOPOS= <>
##$BF1= 200.13
##$BF2= 200.13
##$BF3= 200.13
##$BF4= 200.13
##$BF5= 200.13
##$BF6= 200.13
##$BF7= 200.13
##$BF8= 200.13
##$BYTORDA= 1
##$CFDGTYP= 0
##$CFRGTYP= 5
##$CHEMSTR= <none>
##$CNST= (0..31)
1 1 145 1 1 1 1 1 1 1 1 1 1 1 1 1 1 1 1 1 1 1 1 1 1 1 1 1 1 1 1 1 
##$CPDPRG= <>
##$CPDPRG1= <>
##$CPDPRG2= <>
##$CPDPRG3= <>
##$CPDPRG4= <mlev>
##$CPDPRG5= <mlev>
##$CPDPRG6= <mlev>
##$CPDPRG7= <mlev>
##$CPDPRG8= <mlev>
##$CPDPRGB= <>
##$CPDPRGT= <>
##$D= (0..31)
0 1.2 0 0 0 0 0 0 0 0.06 0 0.03 0 0 0 0 0.0002 0 0 0 0 0 0 0 0 0 0 0 0 
0 0 0 
##$DATE= 1580809976
##$DBL= (0..7)
120 120 120 120 120 120 120 120 
##$DBP= (0..7)
150 150 150 150 150 150 150 150 
##$DBP07= 0
##$DBPNAM0= <>
##$DBPNAM1= <>
##$DBPNAM2= <>
##$DBPNAM3= <>
##$DBPNAM4= <>
##$DBPNAM5= <>
##$DBPNAM6= <>
##$DBPNAM7= <>
##$DBPOAL= (0..7)
0.5 0.5 0.5 0.5 0.5 0.5 0.5 0.5 
##$DBPOFFS= (0..7)
0 0 0 0 0 0 0 0 
##$DE= 6
##$DECBNUC= <off>
##$DECIM= 24
##$DECNUC= <off>
##$DECSTAT= 4
##$DIGMOD= 1
##$DIGTYP= 9
##$DL= (0..7)
0 120 120 120 120 120 120 120 
##$DP= (0..7)
150 150 150 150 150 150 150 150 
##$DP07= 0
##$DPNAME0= <>
##$DPNAME1= <>
##$DPNAME2= <>
##$DPNAME3= <>
##$DPNAME4= <>
##$DPNAME5= <>
##$DPNAME6= <>
##$DPNAME7= <>
##$DPOAL= (0..7)
0.5 0.5 0.5 0.5 0.5 0.5 0.5 0.5 
##$DPOFFS= (0..7)
0 0 0 0 0 0 0 0 
##$DQDMODE= 0
##$DR= 18
##$DS= 0
##$DSLIST= <SSSSSSSSSSSSSSS>
$$ [...]
##$SUBNAM2= <"">
##$SUBNAM3= <"">
##$SUBNAM4= <"">
##$SUBNAM5= <"">
##$SUBNAM6= <"">
##$SUBNAM7= <"">
##$SUBNAM8= <"">
##$SUBNAM9= <"">
##$SW= 24.9337058887773
##$SWIBOX= (0..15)
0 0 2 0 0 0 0 0 0 0 0 0 0 0 0 0 
##$SW_h= 4990.01996007984
##$TD= 16384
##$TD0= 1
##$TE= 0
##$TE2= 300
##$TE3= 300
##$TEG= 300
##$TL= (0..7)
0 120 120 120 120 120 120 120 
##$TP= (0..7)
150 150 150 150 150 150 150 150 
##$TP07= 0
##$TPNAME0= <>
##$TPNAME1= <>
##$TPNAME2= <>
##$TPNAME3= <>
##$TPNAME4= <>
##$TPNAME5= <>
##$TPNAME6= <>
##$TPNAME7= <>
##$TPOAL= (0..7)
0.5 0.5 0.5 0.5 0.5 0.5 0.5 0.5 
##$TPOFFS= (0..7)
0 0 0 0 0 0 0 0 
##$TUNHIN= 0
##$TUNHOUT= 0
##$TUNXOUT= 0
##$USERA1= <user>
##$USERA2= <user>
##$USERA3= <user>
##$USERA4= <user>
##$USERA5= <user>
##$V9= 5
##$VALIST= <valist>
##$VCLIST= <CCCCCCCCCCCCCCC>
##$VD= 0
##$VDLIST= <DDDDDDDDDDDDDDD>
##$VPLIST= <PPPPPPPPPPPPPPP>
##$VTLIST= <TTTTTTTTTTTTTTT>
##$WBST= 1024
##$WBSW= 4
##$XGAIN= (0..3)
0 0 0 0 
##$XL= 0
##$YL= 0
##$YMAX_a= 563458
##$YMIN_a= -415414
##$ZGOPTNS= <>
##$ZL1= 120
##$ZL2= 120
##$ZL3= 120
##$ZL4= 120
##$ABSF1= 10
##$ABSF2= 0
##$ABSG= 5
##$ABSL= 3
##$ALPHA= 0
##$AQORDER= 0
##$ASSFAC= 0
##$ASSFACI= 0
##$ASSFACX= 0
##$ASSWID= 0
##$AUNMP= <proc_1d>
##$AZFE= 0.1
##$AZFW= 0.1
##$BCFW= 1
##$BC_mod= 2
##$BYTORDP= 1
##$COROFFS= 0
##$CY= 11.3945322036743
##$DATMOD= 1
##$DC= 2
##$DFILT= <>
##$DTYPP= 0
##$F1P= 16.9975609425685
##$F2P= -3.02152046262296
##$FCOR= 0.5
##$FTSIZE= 0
##$FT_mod= 4
##$GAMMA= 1
##$GB= 0.15
##$INTBC= 1
##$INTSCL= 1
##$ISEN= 128
##$LB= 0.24
##$LEV0= 0
##$LPBIN= 0
##$MAXI= 10000
##$MC2= 0
##$MEAN= 0
##$ME_mod= 0
##$MI= 1.114404
##$NCOEF= 0
##$NC_proc= 0
##$NLEV= 6
##$NOISF1= 3.799351
##$NOISF2= 2.8
##$NSP= 1
##$NTH_PI= 0
##$NZP= 0
##$OFFSET= 15.70392
##$PC= 1
##$PHC0= -9788.835
##$PHC1= 16.80081
##$PH_mod= 1
##$PKNL= yes
##$PPARMOD= 0
##$PSCAL= 0
##$PSIGN= 0
##$REVERSE= no
##$SF= 200.130013532006
##$SI= 16384
##$SIGF1= 3
##$SIGF2= 2
##$SINO= 400
##$SIOLD= 16384
##$SREGLST= <1H.CDCl3>
##$SSB= 0
##$STSI= 0
##$STSR= 0
##$SW_p= 3612.71676300578
##$SYMM= 0
##$S_DEV= 0
##$TDeff= 0
##$TDoff= 0
##$TI= <>
##$TILT= no
##$TM1= 0
##$TM2= 0
##$TOPLEV= 0
##$USERP1= <user>
##$USERP2= <user>
##$USERP3= <user>
##$USERP4= <user>
##$USERP5= <user>
##$WDW= 1
##$XDIM= 8192
##$YMAX_p= 0
##$YMIN_p= 0
$$ End of Bruker specific parameters
$$ ---------------------------------
##NTUPLES= NMR FID
##VAR_NAME=  TIME,          FID/REAL,        FID/IMAG
##SYMBOL=    X,             R,               I
##VAR_TYPE=  INDEPENDENT,   DEPENDENT,       DEPENDENT
##VAR_FORM=  AFFN,          ASDF,            ASDF
##VAR_DIM=   8192,          8192,            8192
##UNITS=     SECONDS,       ARBITRARY UNITS, ARBITRARY UNITS
##FACTOR=    0.0002004,     1,               1
##FIRST=     0,             0,               0
##LAST=      1.6414764,     0,               0
##MIN=       0,             -415414,         0
##MAX=       1.6414764,     563458,          0
$$ Real data points
##PAGE= N=1
##DATA TABLE= (X++(R..R)), XYDATA
0@%%%%qJ6qQk4L2l2M0n6O4p2R2j16J38j61J91k28K66l06L56m12M71n40O19p02
$$ 0 0 0 0 0 -8 8 0 8 -16 16 -16 24 -32 32 -40 52 -64 74 -87 104 -124 142 -164 192 -220 251 -289 330 -372
29c72P92q95J010j134J270j421J587j767J963k181K422k683K968l287L642m031
$$ -372 420 -475 535 -599 671 -750 837 -930 1033 -1148 1274 -1409 1559 -1728 1914 -2117
45b117M465m957N509o136O858p703Q702r897J1372j3242J5698j9094K4127l2440
$$ -2117 2348 -2609 2900 -3236 3622 -4081 4621 -5276 6096 -7146 8552 -10542 13585 -18855
59a8855M9304j37753L77455K15331o33111k67785L69936L31591k58730k31738
$$ -18855 30449 -107304 270151 485482 -147629 -415414 -45478 286113 27383 -204355
69b04355J97047K39453j82781k11970J46919K26452j43059k22036J37914K90386
$$ -204355 -7308 232145 49364 -162606 -15687 210765 67706 -154330 -16416 273970
79B73970r6990l41361k1503L37302J28423k56993j91000J65831J77352j07730
$$ 273970 176980 -164381 -185884 151418 279841 22848 -168152 -2321 175031 67301
89F7301j52297Q8461J15521j10451j18295J45166J62591j57060k48867R5983L00670
$$ 67301 -84996 3465 118986 8535 -109760 35406 197997 40937 -207930 -111947 188723
100A88723J0415k78387q5022K15989R1813j92162q5391K19590J34225k26567k14114
$$ 188723 199138 -79249 -164271 51718 143531 -48631 -134022 85568 219793 -6774 -220888
111b20888J76194K68445j00433k82872M1602K97934K5402l16743j33045K79479
$$ -220888 -44694 223751 123318 -159554 -117952 179982 205384 -111359 -244404 35075
121C5075K38033j68305k67005M3667J97727k650j21197L5554J01541q5375j48431
$$ 35075 273108 104803 -162202 -118535 79192 76542 -44655 -9101 92440 7065 -141366
132a41366Q2467J99573l8593k30517l1261K22774R7813j81077j46023J09111J47417
$$ -141366 -58899 140674 102081 -128436 -159697 63077 160890 -20187 -166210 -57099 90318
143I0318m2325j05122J7517N6859l6301l6453P0182M7340j01568q3731J20769
$$ 90318 47993 -57129 -39612 17247 -19054 -55507 14675 62015 -39553 -123284 -2515
154b515J49638j03184k26788K4178K59188Q7196k12505j61451J17515J54633n9170
$$ -2515 147123 43939 -182849 -158671 100517 187713 -24792 -186243 -68728 85905 26735
165B6735j17621N6668J12692o2947j45185K8411J60303K3375j37129n1960J07808
$$ 26735 -90886 -34218 78474 15527 -129658 -101247 59056 82431 -54698 -106658 1150
176A150N7985r6385p0195R0428J03452n3208j14699Q120R8597J9089o4476r006
$$ 1150 59135 -37250 -107445 -17017 86435 33227 -81472 -73352 25245 44334 -20142 -29148
188b9148O0474K411p0281q769Q5828L7469p5220o1505N0979P1279j5781n1041
$$ -29148 31326 33737 -36544 -45313 40515 77984 2764 -58741 -7762 63517 47736 -3305
200c305j501J3220j7736J2465O8072O927j10569o8376J01686J22808n6975j43759
$$ -3305 -4806 8414 -9322 3143 71215 78142 -32427 -100803 883 123691 66716 -77043
212g7043N854J36810K8661j29802o7484J07861J04026n9823j15205M98P7657K2299
$$ -77043 -71189 65621 94282 -35520 -103004 4857 108883 49060 -66145 -65647 12010 34309
224C4309k8096P064J7711m4734n4087M3315R5935K3j00381m3679P5134O5636m1776
$$ 34309 6213 13277 30988 -13746 -67833 -24518 71417 71440 -28941 -72620 2514 68150 26374
237B6374o4554J8781N9608K023m7040j8165K6413K3078j849j0996j1587j1405
$$ 26374 -38180 -19399 40209 42232 -4808 -22973 3440 26518 24669 13673 2086 -9319
249i319Q189L3071R524m3761l7511L2689N7744q773o1061j4449M8080K2439m2354
$$ -9319 -1130 31941 41465 -2296 -39807 -7118 50626 41853 -19208 -33657 14423 36862 -5492
262e492k6741M3811M1049m2261o7066J4541P4479K1563n2220l8959J8002K4666
$$ -5492 -32233 11578 52627 10366 -56700 -42159 32320 53883 1663 -37296 -19294 5372
274E372p347o318J7213N840k8699k1138K2652K8824j1633k7284R596K6991j0646
$$ 5372 -1975 -8293 8920 14760 -13939 -35077 -12425 16399 4766 -22518 -12922 14069 3423
287C423l9943l103M6484L0484l0246n1161n580M2427L5301q459l6243k8114Q900
$$ 3423 -36520 -39623 6861 37345 7099 -44062 -49642 -7215 28086 19627 -16616 -44730 -35830
300c5830M1121K7227k7851m9548J924N3304K1316m3728l5718L2312M5457j7833
$$ -35830 5291 32518 4667 -44881 -42957 10347 31663 -12065 -47783 -15471 29986 12153
312A2153n3570j974N2645K4727l2285l2460N991J6914N997R642R201j7812l2827
$$ 12153 -41417 -43391 9254 33981 1696 -30764 -24773 -7859 -1862 7780 16981 -831 -33658
325c3658R88M1710K5208k4417l4387N844K7739J252j8771J544K1500M104k1973
$$ -33658 -32670 9040 34248 9831 -24556 -18712 9027 10279 -8492 -6948 14552 18656 -3317
338c317j5174J1587K2217J0832q705k0152j4235R190K8817J5561k1231l2291M162
$$ -3317 -18491 -6904 15313 26145 17440 -2712 -16947 -7757 21060 36621 15390 -16901 -12739
351a2739L5299J0357k9675j5934K6585K2517k5306l4406J5203M5784P406m3439
$$ -12739 22560 32917 3242 -12692 13893 36410 11104 -23302 -8099 37685 45091 1652
363A652k9732K2986L4764r17k0219p456R14n149M539K0283N697k4719k0894J6531
$$ 1652 -28080 -5094 29670 28753 8534 1078 1992 -3157 1382 21665 27362 2643 -18251 -1720
377a720K7675q185l1805R47L5067R051l8762k6363K9341M0722n977l9321j8548
$$ -1720 25955 17770 -14035 -13088 21979 31030 -7732 -34095 -4754 35968 29991 -9330 -27878
390b7878J6986K3774O854q121j5072j5146K793K5587J7481k1660l1479R850L5142
$$ -27878 -10892 12882 19736 11615 -3457 -18603 -15810 9777 27258 5598 -25881 -16031 19111
403A9111q37l7853r399L7849K3945l2258l9869J3020M2645Q071l1476j8152J0493
$$ 19111 18274 -19579 -28978 8871 32816 558 -39311 -26291 16354 24425 -7051 -25203 -14710
416a4710R030l253N411J0339j1739k3532K656K6039Q601k1894j4234J6153J4630
$$ -14710 -5680 -8933 -3522 6817 -4922 -28454 -25798 241 8842 -13052 -27286 -11133 3497
429C497j6897j9712J6739L1063n602l6584j3312K7322K7865m758k3557j0589R683
$$ 3497 -13400 -33112 -16373 14690 9088 -27496 -40808 -13486 14379 9621 -13936 -24525 -14842
442a4842J3186M809j279m921n603J862R028J705r232OJ5924P644j8607k0434J1325
$$ -14842 -1656 3153 1874 -3047 -8650 -6788 2240 3945 -5287 -5281 10643 18287 -320 -20754 -9429
457i429L2721J0035k8766k9265R387L2881J1354j8024j9054JJ0331P613J360n247
$$ -9429 23292 33327 4561 -24704 -15317 17564 28918 10894 -8160 -8159 2172 9785 11145 5898
471E898p123j695O657N100p203q329P999J6724l292k5807j0860K4113K7484p346
$$ 5898 -1225 -2920 3737 8837 1634 -6695 1304 18028 14736 -11071 -21931 2182 29666 22320
485B2320l0075j3553J6598K2976L868j4205j3855K30J1422Q115l830r981P95J1964
$$ 22320 -7755 -21308 -4710 18266 22134 7929 -5926 -5696 5726 13841 10011 30 825 12789
499A2789L095j5875j0862J4228K0678k887k3398j2858J2770J9380K508j3188j2082
$$ 12789 15884 9 -10853 3375 24053 21166 -2232 -15090 -2320 17060 19568 6380 -5702
512e702p33Q680J0564R60j1645j1385O636J5527j586j5859l417J6258R519j5460
$$ -5702 -6435 2245 12809 13769 2124 -9261 -2625 12902 11316 -4543 -7960 8298 17817 2357
526B357j8261P496K3139N401j9515j6515M344J4431Q200j845q973j1398k865J0758
$$ 2357 -15904 -8408 14731 20132 617 -15898 -11554 2877 11077 9232 259 -11139 -14004 -3246
540c246J0804m774j3567j613J0976J669j5668p253J7899J8287j2877k8633n072
$$ -3246 7558 2784 -10783 -12396 -1420 249 -15419 -22672 -4773 13514 637 -27996 -33068
553c3068K4915J7978r533j9505l107J0850O044j462q86M18l748K69P605K693q914
$$ -33068 -8153 9825 292 -19213 -22320 -11470 -5426 -6888 -7774 -7356 -11104 -10835 -3230 -537 -9451
568i451m054J2975J2336j1480j9645O497K7866P611k6809k2229J7193L0806K127
$$ -9451 -13505 -530 11806 326 -19319 -12822 15044 22655 -4154 -26383 -9190 21616 23743
581B3743k5186j4508R020J1911L426q0k844q768p519P039J2733l241j4282K379
$$ 23743 -1443 -15951 -6931 4980 8406 8326 5482 -3286 -10805 -3766 8967 5726 -8556 -6177
595f177J8529j659k7540j0790K8322K7685j4217l2985n108K4062J3942q266p374
$$ -6177 12352 10693 -16847 -27637 685 28370 14153 -18832 -23940 122 14064 5798 -1576
608a576L143k57o501M229J2454j39j1723J6J3545J272j4376l684J6777J0499j4680
$$ -1576 1567 1310 -5191 -962 11492 11353 -370 -354 13191 14463 87 -3597 13180 23679 8999
623H999j6705J0605K1994k743k2936p937J8128J4119q794j4586k10Q066q9m688
$$ 8999 -7706 2899 24893 22150 -786 -8723 9405 23524 14730 144 -66 8000 7911 3223
637C223J768N366k198o508n95J291n402k050J4570J2598j6477k9512L27L3762
$$ 3223 4991 10357 8159 1651 1056 2347 -3055 -5105 9465 22063 5586 -23926 -23599 10163
651A0163J9816k1066k8713K840K2051M644j3529m215R387L768o198m800L42k649
$$ 10163 29979 8913 -19800 -16960 5091 9735 -3794 -8009 1378 5146 -1052 -5852 -5510 -8159
665h159J663J1815O779j5189k1586M190K7701J1518k2751k2444J1125K4152j361
$$ -8159 -6496 5319 12098 -3091 -24677 -20487 7214 18732 -4019 -26463 -15338 8814 7453
678G453k0467o665J2821R011m600n023J600m04n419J696J0089K727q979m311Q886
$$ 7453 -13014 -19679 -6858 2153 -2447 -7470 -5870 -6274 -11693 -9997 92 2819 -6160 -10471 -1585
693a585J937j1609l505J7943J3915j3755k2400J674J9587P862j0660m781P381
$$ -1585 352 -11257 -14762 3181 17096 3341 -19059 -17385 2202 10064 -596 -5377 2004
706B004J977j1903o233J1731J3193j085j0742p217k653L050J0051R592k930j6786
$$ 2004 3981 -7922 -14155 -2424 10769 9684 -1058 -8275 -10928 -7878 2173 11765 8835 -7951
720g951r149J2201J7486l075j9063n137J7785J3086j1385j8069J638J8066Q869
$$ -7951 -17100 -4899 12587 9512 -9551 -14688 3097 16183 4798 -13271 -11633 6433 15302
733A5302r832j0555J511P598K365q53k118l439q3J0283Q781j1474k0091J338K5973
$$ 15302 5470 -5085 -3574 4024 6389 5536 3418 -21 -104 10179 18960 7486 -12605 -11267 14706
748A4706J5798j6628k4241j74J8510Q126p644m349L921o84o600j908M974L293
$$ 14706 30504 13876 -10365 -10539 7971 16097 8453 4104 8025 7341 741 -1167 3807 7100
762G100L29J208o65p668p828M321J3818M768j0782j1585L825R096k134p224L498
$$ 7100 7429 8637 7972 304 -7524 -3203 10615 15383 4601 -6984 -3159 5937 3803 -3421 77
777G7R389j285j1805o184Q165R307j889q331k207N403L163k462m222k944M17O870
$$ 77 9466 8181 -3624 -9808 -1643 7664 5775 -2556 -4763 640 3803 1341 -2881 -5825 -5408 1462
793A462P822l942j4524q057J0445J6799M94j5818r103Q964J0601n597j1824J078
$$ 1462 9284 5342 -9182 -17239 -6794 10005 10499 -5319 -14422 -5458 5143 -454 -12278 -11200
807a1200J3484O114q435j2950m252Q297J3353N900r237j5798n200J1886J4733
$$ -11200 2284 8398 -37 -12987 -17239 -8942 4411 10311 1074 -14724 -19924 -8038 6695
820F695p27j3781n943P942P962m673q532J244R723M535o114q838n8P514M929j814
$$ 6695 5968 -7813 -13756 -5814 2148 -2525 -11057 -9813 -90 4445 -1669 -10507 -10565 -3051 1878 64
836F4l469j581N77K717K060k032l937P62P309L135n747p174K356P904J75m425
$$ 64 -3405 -4986 -4409 -1692 368 -1664 -5601 -4839 2470 5605 -142 -7316 -4960 2944 3119 -1306
852a306J351N374j890r015j478Q847Q869n00q008p964q00P788R569J186q873p052
$$ -1306 45 5419 3529 -5486 -6964 1883 10752 10252 2244 -5720 -6520 1268 10837 12023 3150 -3902
868c902L214P342J041n985k038O293N773m091r746m079Q518J2281J051j2999j0115
$$ -3902 -688 6654 7695 1710 -328 5965 11738 7647 -2099 -6178 2340 14621 15672 2673 -7442
883g442N192J2512L563q396q666R49Q936N779m724r817l168P753R601j525j0492
$$ -7442 -2250 10262 13825 5429 -3237 -2288 6648 12427 7703 -2114 -5282 2471 12072 10547 55
898E5n965N953P749p94o877k072M166M322k683p231k800O033P407m91p531o432
$$ 55 -5910 43 7792 6998 121 -1951 2215 6537 3854 -3377 -6177 -144 7263 6772 -759 -7191
914g191J279O413M076k029m495k240J152R34r60L34K484K133k876n821j723N085
$$ -7191 -5912 501 4577 2548 -1947 -4187 -3035 -2101 -3061 -2727 -243 1890 -986 -6807 -8530 -3445
930c445O130j146o612l560L817M693k05m187k004L342L559j370n084k074L770
$$ -3445 2685 1539 -5073 -8633 -4816 -123 -328 -4515 -6519 -3177 382 -988 -6072 -8146 -4376
945d376N824m81o252m556M570Q152O73q906n551M184R314L274o762r300N1R462
$$ -4376 1448 967 -5285 -9841 -5271 2881 3554 -5352 -10903 -6719 2595 5869 -893 -10193 -10142 -680
961f80P526l160j0303l000O518O813k117o510k24N813K629l268n130p04M813O637
$$ -680 6846 3686 -6617 -9617 -3099 3714 1597 -4913 -5137 676 3305 37 -5093 -5797 -984 5653
977E653j7q116p038M345J0671L167p972p362K500P166K194m332k524J207K640
$$ 5653 5636 -2480 -9518 -5173 5498 8665 693 -6669 -4169 2997 5191 859 -1665 -458 2182
992B182R02j467j776N45L211J742l213l519J679N267R81l943l929J260N305K530
$$ 2182 3084 1617 -159 386 3597 5339 2126 -1393 286 5553 6534 2591 -1338 -78 5227 7757
1008G757l162n026j84M237K940k151l556P23L643J09l906j867L380M234j111m301
$$ 7757 4595 -431 -615 3622 6562 4411 855 1578 5221 5330 1424 -443 2937 7171 6060 1759
1024A759l436P52N182L943k925o417k013N138N570j718o771j776M777M601l355
$$ 1759 -1677 -925 4257 8200 5275 -1142 -3155 1983 7553 5835 -936 -2712 2065 6666 3311
1039C311n788M55N276K942l783n466j379N559M773j795o048l424K725O132K335
$$ 3311 -2477 -2022 3254 6196 2413 -3053 -4432 1127 5900 4105 -1943 -5367 -2642 3490 5825
1054E825n901o449J680O898K117n510n184K525N238J120n241m313L310M917m1
$$ 5825 -76 -6525 -4845 2053 4170 -1340 -6524 -3999 1239 2359 -2882 -7195 -3885 1032 991
1069I91m855l316J233L955L221k285n309k749M542N547q95o177l138M267M822
$$ 991 -3864 -7180 -5947 -1992 1229 -1056 -6365 -9114 -4572 975 80 -6097 -9235 -4968 -146
1084a46j466m736k81M319J444l361k414J245L168J987j302m065p62L278M032J40
$$ -146 -1612 -6348 -6629 -2310 -866 -4227 -6641 -5396 -2228 -241 -1543 -5608 -6370 -3092 940 1080
1100A080m018k877J826M683J040l382k312K230L390k99k755j267L389K952j548
$$ 1080 -2938 -5815 -3989 694 1734 -1648 -3960 -1730 1660 1361 -1394 -2661 728 3680 2132
1115B132m460r32N197L929k083m489j343K789M290R35k713m151O94M403L128l105
$$ 2132 -2328 -3260 1937 5866 3783 -706 -2049 740 5030 5965 3252 -899 -205 4198 7326 4221
1131D221m279J077N272J381m641l608L259N234n28m554l193K265M576K061l052
$$ 4221 -58 1019 6291 7672 3031 -577 2682 7916 7388 2834 -359 1906 6482 8543 5491
1146E491m687p02L938M292q48n857k880L825M838q98n675k165L961L675j703n222
$$ 5491 804 102 4040 8332 7484 1627 -1253 2572 7410 6512 837 -1328 2633 6308 4605 -617
1162f17j387M058L339j921m546j867L020L080N14l736l991P19M383K253l175m394
$$ -617 -2004 2054 5393 3472 -1074 -2941 79 3159 3673 -63 -4054 -3335 1048 3301 126 -4268
1178d268M61M078J215l217l712J998L848k60l791k184K121K788P77k624k824k95
$$ -4268 -3807 271 1486 -1731 -5443 -3445 403 143 -3648 -5832 -3711 -923 -146 -2770 -5594 -5889
1194e889K787K054j408k819j050K473J770r44k576k05L550J391l114k815J190
$$ -5889 -3102 -1048 -2456 -5275 -6325 -3852 -2082 -3026 -5602 -5807 -2257 -866 -3980 -6795 -5605
1209e605L904K008l215l050J146L600J613k111k730L39K417K257k9l086j199K685
$$ -5605 -1701 307 -2908 -5958 -4812 -1212 401 -1710 -4440 -4101 -1684 573 544 -2542 -3741 -1056
1225a056L181m30l358j122L467L434j985n047m42N568L874k896n231j072L796
$$ -1056 2125 1695 -1663 -2785 682 4116 2131 -2916 -3358 2210 6084 3188 -2043 -3115 681
1240F81L937J74l697k718N19L933K193k033m095J80M562K339m273m487K286N802
$$ 681 4618 4792 1095 -1623 -1104 2829 5022 2989 -1106 -926 3636 5975 1702 -2785 -499 5303
1256E303J303m748l893J428M820J403k438l011l83K566K292ql270k582J889M437
$$ 5303 6606 1858 -2035 -607 4213 5616 3178 167 -216 2350 4642 4634 1364 -1218 671 5108
1272E108O57m492k929K116L579p0k971j240K025J608j607k133J71K179M67j105
$$ 5108 5765 1273 -1656 460 4039 3969 998 -242 1783 3391 1784 -349 -178 2001 2468 1363
1288A363j385r72K68J542P28q69j156o03J136N20j428j237J954K268j252m157
$$ 1363 -22 -994 -726 816 1544 675 -481 -1084 52 572 -856 -2093 -139 2129 877 -3280
1304c280p13L659L269j907m274k24L112J981k376k652J218J789J268l79k214k455
$$ -3280 -3993 -334 2935 1028 -3246 -3470 -358 1623 -753 -3405 -2187 -398 870 491 -1723 -4178
1320d178Q09M032K210l733m312K44N457L028m299n117J397O246Q64m057l901J113
$$ -4178 -3369 663 2873 -860 -5172 -4928 529 3557 -742 -5859 -4462 1784 2648 -1409 -5310 -4197
1336d197L712K594o88l862k176J172L877J792k886l801Q02M839J055m223l358
$$ -4197 -485 2109 1421 -2441 -4617 -3445 432 2224 -662 -4463 -3661 1178 2233 -1990 -5348
1351e348L254M964q8m675k722J727L364J414j345j684q22J64J383J713p34j598
$$ -5348 -2094 2870 2782 -1893 -4615 -2888 476 1890 545 -1139 -1961 -1797 -414 1299 565 -1033
1367a033j24J760K48j961p50K195J938j192j967M65J918k30k317m47L406J720
$$ -1033 -1157 603 851 -1110 -1860 335 2273 1081 -886 -421 1497 1267 -1050 -1497 1909 3629
1383C629k118k750N5K545J477j015j240k10K90Q88L54q08j175L31L261J758l977
$$ 3629 1511 -1239 -1184 1361 2838 1823 583 373 663 1551 1905 1097 -78 253 3514 5272 1295
1400A295m964J425O546L035m639n721M39N526K268l018k915N29K416P32m39k063
$$ 1295 -3669 -2244 4302 7337 2698 -3023 -2584 2942 5210 2192 -723 -194 2222 2954 2515 452
1416D52k083J304M085J745l986m942Q35N817K543m136m661J586M492K84l646j608
$$ 452 -1631 -327 3758 5503 1517 -3425 -2590 3227 5770 1634 -3027 -1441 3051 3335 -311 -1919
1432a919J938J963R2j094k075p93N58K412J357j582k947m28K286J195j913j477
$$ -1919 19 1982 2074 980 -1095 -1888 -1330 1082 2439 857 -2090 -2518 -232 963 -950 -2427
1448b427J792J472j868k493M64K718R62k168j114J107R24j745j754K021K261m56
$$ -2427 -635 837 -1031 -3524 -3060 -342 620 -1548 -2662 -1555 -631 -2376 -4130 -2109 152 -304
1464c04j912o01K05k6R33J751l39k745j748K674L380j077l588p20M432K045l407
$$ -304 -2216 -2817 -2612 -2638 -1705 46 -293 -3038 -4786 -2112 1268 191 -3397 -4117 315 2360 -1047
1481a047l424J035L836J500j469k204q23J495J694J091j453k200J6K730K048k817
$$ -1047 -4471 -3436 400 1900 431 -1773 -2596 -1101 593 1684 231 -1969 -1953 777 2825 8
1497Hl585J282N037K082l700m672Q82M258J814k060k234J013N22j34j33O26j91
$$ 8 -3577 -2295 2742 4824 1124 -3548 -2666 1592 3406 1346 -888 125 647 513 380 1006 815
1514H15l62P99R55j665k128J082L092J497l004k707J516K978o98k142L05K199
$$ 815 453 1252 2207 542 -1586 -504 2588 4085 1081 -1626 -110 2868 2170 28 333 2532
1530B532J90k064p42R77J142j29m29k06L58m32k03M45k50m84M86J451j96k352
$$ 2532 2722 658 -84 893 2035 1906 1477 1271 1629 1197 994 1439 1189 705 1191 2642 2446 94
1548I4j621J769L359k13l454k317K635K563j061k532J14K279K34j605j229l3Q56
$$ 94 -1527 242 3601 3388 -66 -2383 252 2815 1754 -778 -664 1615 1849 244 -985 -1018 -162
1565a62P09J130o41k794j236K098L479j232m064o72L281J610k169k577P71K773
$$ -162 547 1677 1036 -1758 -2994 -896 2583 1351 -2713 -3385 -104 1506 -663 -3240 -2469 304
1581C04O51k232j600K51J428O46M56j123j017j04J193J289r28j665L04K542L81
$$ 304 955 -1277 -2877 -2626 -1198 -552 -96 -1219 -2236 -2340 -1147 142 -786 -2451 -2147 395 776
1598G76k403j635J552K906O3k351q20J613J430j513j064Q72J298j62r90j49m19
$$ 776 -1627 -3262 -1710 1196 1259 -1092 -1912 -299 1131 -382 -1446 -574 724 562 -428 -577 -996
1615i96j75Q86J420j58k477j069J990K078j399k145O13K276mk591r54K016J625
$$ -996 -1171 -285 1135 977 -1500 -2569 -579 1499 100 -2045 -1432 844 840 -1751 -2705 -689 936
1632I36m33j696q43R73J153M78m09p75l62J024J065j26j259p81J530J575o0j606
$$ 936 503 -1193 -2036 -1063 90 568 159 -616 -978 46 1111 985 -274 -1055 475 2050 1990 384
1650C84j218J802K088p49k398J13K049M93j327j052P44J047O20r42p69l16j89
$$ 384 -834 968 3056 2307 -91 22 2071 2564 1237 185 929 1976 2596 1654 885 569 380
1667C80R40J651j229j991j91K338P81j837j789J062J881p7k050r96J675J221m23
$$ 380 1320 2971 1742 -249 -440 1898 2679 842 -947 115 1996 1919 -131 -1127 548 1769 1346
1684A346j359k70L61P92J86o71p56Q8Q20O90l91j418n25R40J589p52j969m21J719
$$ 1346 -13 -283 78 870 1056 385 -371 -283 537 1227 836 -582 -1107 -167 1422 670 -1299 -1720 -1
1703aJ216j209j485K44J282K33r86p59L11K40M55q2k91r04K53J213L13q05j645
$$ -1 1215 6 -1479 -1235 47 280 -706 -1465 -1154 -914 -459 -541 -832 -1736 -1483 -270 43 -762 -2407
1722b407J136J310K37j776n79J619J016n57j302j91Q00R23k25j075j44M21L89
$$ -2407 -1271 39 276 -1500 -2079 -460 556 -1 -1303 -1494 -694 229 4 -1071 -1215 -794 -405
1739d05K06n12m41M33O07M53j222p95M60J240J22q56j897O32J893O00j526j279
$$ -405 -199 -711 -1152 -719 -112 341 -881 -1676 -1216 24 146 -710 -2607 -1975 -82 518 -1008 -2287
1757b287J081J017O69r91o95L77P74L66J54m25r52P84J767l62j262q99J767J139
$$ -2287 -1206 -189 480 -511 -1206 -829 -55 311 465 40 -912 -128 1639 1277 15 -884 883 2022
1775B022k40j647O9J184R72l16j568O6O28K25N50n97j218N07P62L31r37m71j14
$$ 2022 1782 135 204 1388 2360 2044 476 542 1170 1395 1945 1348 130 637 1399 1730 793 322 208
1794B08P59L92o35p89M29Q66J53r64r62N74J067K97j012q90O55O08K70o96n45
$$ 208 967 1359 724 -65 364 1230 1383 419 -543 31 1098 1395 383 -507 148 756 1026 330 -215
1813b15K41N21K15k70m59j79N03O53j54j361J05J130M82j015j225L83J090J84
$$ -215 26 547 762 492 33 -146 357 1010 856 -505 -400 730 1212 197 -1028 -645 445 629
1831F29n81p58O7P48M76l46j148m22Q68N64j17r74k78M04J163m6j424n17M23J619
$$ 629 48 -710 -643 105 581 235 -913 -1335 -467 97 -20 -994 -1272 -868 295 249 -1175 -1692 -1269 350
1851C50K42j424r77J071O17N7n51p91M73O13M21q78p06K15J071L24q60o85m44
$$ 350 592 -832 -1809 -738 -121 -64 -615 -1406 -933 -320 101 -777 -1483 -1268 -197 127 -733 -1418 -1862
1870a862J637O28p50r89p8R64Q39o75p40J42N18L16j16o40J68K17O91k15q39p
$$ -1862 -225 403 -347 -1336 -1414 -450 389 -286 -1026 -884 -366 -50 -166 -806 -638 -421 270 55 -784 -791
1890g91N18P47k79o98k30P15P42m4r65k65O09O56j37n95k45N51Q00m11n46k99
$$ -791 -273 474 195 -503 -733 -18 724 680 -285 -550 59 715 578 -17 -262 289 1089 678 132 -167
1910a67P08J11K67l02n62N12L43L03o56p09O39P89K20j124n08N42R18Jn79o69
$$ -167 541 652 919 617 55 567 910 1213 557 -152 487 1276 1496 372 -136 406 1324 1325 746 77
1930G7K77O91O9l2r95J39M97P28r03p22L86P53O14r47q73J44P50N22m35r59L9
$$ 77 354 1045 1114 1082 87 226 723 1451 548 -174 212 965 1579 632 -241 -97 653 1175 740 -219 -180
1951a80J17J090l56q43o59Q80M87k72p74k85M56N47K30l51o57K25L67o0j19o19
$$ -180 -63 1027 671 -172 -831 49 536 264 -510 -795 -339 208 438 87 -570 -345 22 -38 -157 -776
1971g76M41N35k75l76l81J79M98pk47m47J62L01L82o92l46M88M02L76j024l96
$$ -776 -335 200 -75 -451 -832 -653 -155 -162 -409 -856 -694 -393 -11 -703 -1049 -561 -159 217 -807 -1203
1991a203L18P53M4m77l10K5N18o9O4m96k74J083K03p12n14J00Q23Q1m50n22rP95
$$ -1203 -885 -132 -88 -565 -875 -850 -332 -401 -337 -833 -1107 -24 179 -533 -1047 -947 -124 -43 -493 -1015 -1024 -229
2013b29N22l82p98j4Q24K38K88q98m50M94J054n1r14n34L89O12L47k85n40M09
$$ -229 293 -89 -887 -901 -77 161 449 -449 -899 -405 649 598 -316 -850 -461 151 498 213 -327 82
2033H2L40R5j82l75K96Q11M9o24n78L53O06l5Q6n98j28M19n7J76k21R5J74Q9j15
$$ 82 422 517 335 -40 256 1067 1116 492 -86 267 873 838 924 326 198 617 560 736 515 610 784 873 758
2056G58m40j23O58J42j3j003J57L39M36l05k25k68M58L19m88m59J71L05N23j45
$$ 758 318 195 853 995 982 -21 136 475 911 606 381 113 571 890 402 -57 114 419 942 797
2076G97q97K6R7N50k02m07l73L02O56m71p32O2M07O72L46r81p51N30Q31r1m08
$$ 797 -100 -74 23 573 371 -36 -409 -107 549 78 -654 -592 -185 487 833 -148 -899 -369 462 371 -37
2097c7n09L59K99M62l83o67J91L21Q4j24j067J87Q09M76Qj036L06M5K13j18q9
$$ -37 -546 -187 112 574 191 -476 -285 36 120 -4 -1071 -884 -75 401 409 -627 -321 -276 -63 -181 -270
2118b70k1J16K0l07k54j7N09K08l3p13K2j2J61L24m91JJ80J66n1p43j79N71O50
$$ -270 -291 -175 -155 -462 -716 -733 -224 -16 -49 -762 -740 -752 -591 -267 -758 -757 -577 -411 -462 -1205 -1384 -813 -163
2141a63k51k53L1K06J76J58m21p2K18N17k48l24j52N75O97j01o37q26M58P02L94
$$ -163 -414 -667 -636 -430 -254 -96 -517 -589 -371 146 -102 -426 -578 -3 694 593 -44 -870 -412 290 684
2162F84m37p24M27Q65k61j31j2m80N69L16o79l75J86M30K97O8n05m27M33K07J66
$$ 684 247 -477 -50 815 554 423 411 -69 500 816 137 -238 -52 378 675 743 238 -189 244 451 617
2183F17l66l36P46O3j3k89m16L59L68k6l92k2PQ4k14J89pM20J7l31j42O9m7M62
$$ 617 251 -85 661 724 711 422 6 365 733 707 315 293 300 384 170 359 352 772 789 458 316 385 338 800
2207H00q6Qr43K36N71L71p58l03O82j35j63l94j30J43O91j23p74l05L32K03N76
$$ 800 714 722 -221 15 586 957 199 -104 578 443 280 -114 -244 -101 590 467 -307 -612 -280 -77 499
2228D99o45k76L10r0M93n72j76RO23J89o55j83l12M61L49P8p93j75M59K08J4n64
$$ 499 -146 -422 -112 -202 291 -281 -457 -448 175 364 -291 -474 -786 -325 24 102 -691 -866 -407 -199 -185 -749
2250g49L6K77K17K64n23n67O2P24M5l60m34k48R07r6k05j99K61L23j37j15k73
$$ -749 -713 -436 -219 45 -478 -1045 -983 -259 -214 -574 -1008 -1256 -349 -445 -650 -849 -588 -265 -402 -517 -790
2271g90L48k6M49j49m59K97J13lJ49p3K41r2K99n22K30K25q9K38m36O0Q5M39k18
$$ -790 -442 -468 -19 -168 -627 -330 -217 -220 -71 -144 97 5 304 -218 12 237 148 386 -50 10 95 534 316
2294C16nl58L72q4M1j9k76L29J42K32k76o47J12M28L27k85m11k4M59k0j12j82
$$ 316 311 -47 325 241 282 263 -13 316 458 690 414 -233 -121 307 634 349 -62 -86 373 353 241 59
2316E9L0L16K05P8n45k72M13L63M13n22n34K02J54O34n87j37l99P20J49m64m24
$$ 59 89 405 610 688 143 -129 284 647 1060 538 4 206 360 994 407 270 -129 591 740 276 -148
2337a48L06J97J11J79m52l13L54L38j02q58K11K38Q4j40k98k2L07K69j29m39k64
$$ -148 158 355 466 645 193 -120 234 572 470 -388 -177 61 145 5 -293 -315 -8 261 132 -307 -571
2358e71M67L19m02l11Q3L17K34l77J06j94L67J22m04K41l70J11K77J7j51o46M10
$$ -571 -104 215 -187 -498 -415 -98 136 -241 -135 -329 38 160 -244 -3 -373 -262 15 32 -119 -765 -355
2379c55J56j30k7l00M91ln7j32m0L0L83J47k02m91j65P64j67N8l58NL68K02n37
$$ -355 -199 -329 -356 -656 -165 -168 -225 -357 -397 -367 16 163 -39 -530 -695 69 -98 -40 -398 -393 -25 177 -360
2402c60j88j8Q94l40j53M7LO9K68n3m31l10N26K70J7l14J4M6J31M56n19k62L30
$$ -360 -548 -566 328 -12 -165 -118 -115 -46 222 169 -262 -572 -46 224 241 -73 -59 -13 118 574 55 -207 123
2425A23J22J74m20J46lL14j28n94L84k29N56pn07K13k54N71J01m80R2k22O03j28
$$ 123 245 419 -1 145 142 456 328 -266 118 -111 445 438 -69 144 -110 461 562 82 174 -48 555 427
2447D27l68j99K87N1nK14l98R8K37j7k9j51J02K66m7k11n90M31R8l8J06l09K13
$$ 427 59 -140 147 198 193 407 9 107 344 327 298 147 249 515 468 257 -333 98 196 158 264 -45 168
2470A68k6K46J25l66l44N53K52l73l89L05O2L45m00l58J33R1K66j04l90J91P1
$$ 168 142 388 513 147 -197 356 608 235 -154 151 213 558 158 -200 -67 24 290 186 -204 -13 58
2491E8L97j93l75k26J07Q28p31j7L2L0J17J63l94j12r2L42J03j61o9r2K03j88
$$ 58 455 262 -113 -339 -232 596 -135 -152 -120 -90 27 190 -204 -316 -408 -66 37 -124 -193 -285 -82 -270
2513b70J34j91M5L94k12j26l35K67l30M29P6p7l01J53L69l92j18k5rO14j8n69
$$ -270 -136 -327 -282 112 -100 -226 -561 -294 -624 -195 -119 -196 -497 -344 25 -367 -485 -510 -519 95 77 -492
2535d92K5K70Lj74p8k2Q2K53M7k09K26k26L12n7j03j15o7L97M2m36O2J29K71L12
$$ -492 -467 -197 -194 -368 -446 -468 -386 -133 -86 -295 -69 -295 17 -40 -143 -258 -325 72 114 -322 -260 -131 140 452
2559D52l01j35j34N22j41j81j55K18K00L0J1l43J9K74K46m66k04Q6K85J29m31
$$ 452 151 16 -118 404 263 82 -73 145 345 375 386 43 62 336 582 116 -88 -2 283 412 -19
2580a9J60j47L25J76j92n6r7k34M10k1j41k80K00J60K31j92m02L99K31on04J70
$$ -19 141 -6 319 495 303 247 150 -84 326 305 164 -116 84 244 475 283 -119 280 511 505 1 171
2602A71K15RJ0J11k01J19j27K64m13m27L74L24o2m41r0J92L63j11j35q3l50J60
$$ 171 386 395 405 516 315 434 307 571 158 -269 105 429 367 -74 -164 28 391 280 145 62 -288 -128
2624a28Q7k9k18J48Q8J79l4l57k5N77j74J8n02R2j22M00k15j59J81K47L08p48
$$ -128 -41 -70 -288 -140 -52 127 93 -264 -289 288 114 132 -370 -278 -400 0 -215 -374 -193 54 362 -386
2646c86k37J34M65q7j58j72j47K23N52n99J36o18O34J69p2l4p7q3M38m49N6N9
$$ -386 -623 -489 -24 -111 -269 -441 -588 -365 187 -412 -276 -894 -260 -91 -163 -197 -274 -357 81 -368 -312 -253
2668b53q4L92j67j67q7L0L06M37k26l31o6M16j46J42n44mK99J65n8k92L21k46
$$ -253 -337 55 -112 -279 -366 -336 -30 407 181 -150 -216 200 54 196 -348 -352 -53 112 54 -238 83 -163
2690a63Q8M9n65L68K43K65m00J83m84K50N87k94k73Q7R2J23qo4J65j37J66r0J80
$$ -163 -75 -26 -591 -223 20 285 -115 68 -416 -166 421 127 -146 -59 33 156 148 84 249 112 278 188 368
2713C68k25K3j52O49l14o34M91pK32O6k01q7J76L52m19k70J49J88j13M2m22M35
$$ 368 143 166 14 663 349 -285 206 199 431 497 296 209 385 737 318 48 197 385 272 314 -108 327
2735C27j1K99o44NK53J57o8k30k58L00M89k07j26l21J63O7n6q5p9J73q6J82j18
$$ 327 316 615 -29 -24 229 386 318 88 -170 130 619 412 286 -35 128 195 139 54 -25 148 62 244 126
2758A26k89J48L26k4j90k21m47Q63j29k9l47K0n5K17j44K6k49J05N13l74k06k
$$ 126 -163 -15 311 287 97 -124 -571 292 163 134 -213 -193 -248 -31 -175 -149 -398 -293 220 -154 -360 -362
2780c62J15K85k51r6j22J01N6N87p04n5K1L75J13m17k09l1N39ko6j13j2J68K15
$$ -362 -247 38 -213 -309 -431 -330 -274 313 -391 -446 -425 -50 63 -354 -563 -594 -55 -57 -123 -236 -248 -80 135
2803A35r3k87L32k12K77m52J02r1M9L53m79j70P3N33Q9k79j48R2L62l7j36j65
$$ 135 42 -245 87 -125 152 -300 -198 -289 -240 113 -366 -536 -463 70 159 -120 -268 -176 186 149 13 -152
2825a52qL43j73O3J25j57J56K79o29J45NJ97J49j26l52J86j30P91j39l77J78m00
$$ -152 -160 183 10 73 198 41 197 476 -153 -8 -3 194 343 217 -135 51 -79 712 573 196 374 -26
2847b6O49k67j53J00j50J62j02J00k54L63p0J22m4l16p6M72k75J26m32r9M54O6
$$ -26 623 356 203 303 153 315 213 313 59 422 352 474 430 114 38 510 235 361 -71 -170 284 350
2869C50k1N4l13R1J74j03n4J13k13L65k57k47q8L76R6j27q9o4QJ62J23l87PK00
$$ 350 329 383 70 161 335 232 178 291 78 443 186 -61 -149 227 323 196 107 43 51 213 336 -51 -44 156
2893A56J94m12q4j50J91K70O2j12m25L67K13k10j09k78n9P42m93m8m7k70K71m0
$$ 156 350 -62 -146 -296 -105 165 227 115 -310 57 270 60 -49 -327 -386 356 -137 -185 -232 -502 -231 -271
2915b71J9o1J73J08k3l10k5k69N67L22m87l78L77J33J61k06j76j29L19N0j23J1
$$ -271 -252 -313 -140 -32 -55 -365 -390 -659 -92 230 -257 -635 -258 -125 36 -170 -346 -475 -156 -106 -229 -218
2937b18m30N26o1j2p8Rk6J89j1k14OM8L65M8l68j00L44P1j64L2k47R6K45K88r0
$$ -218 -648 -122 -183 -195 -273 -264 -290 -101 -112 -326 -320 -272 93 141 -227 -327 17 88 -76 -44 -291 -195 50 338 248
2962B48n68N1M69K61m79l12L25K30O3l25j7M8K32l6o5r2R8K3J01Q1m54K61M28
$$ 248 -320 -269 200 461 -18 -330 -5 225 288 -37 -54 -6 226 190 125 33 131 154 255 336 -118 143 571
2985E71l05o5k29KK33K50l6j37J8K66k93J91j92k58K98R3l12J64J04M0l9O1m37
$$ 571 266 201 -28 -26 207 457 421 284 302 568 275 466 274 16 314 407 95 259 363 403 364 425 -12
3008a2J58K63q5J31l49n3J13RK97l99k27K19L32r6k99m48J76O70p0k89j94J3K63
$$ -12 146 409 324 455 106 53 166 175 472 73 -154 65 397 301 2 -446 -270 400 330 41 -153 -140 123
3031A23J83j16m06k03N77l5m41OJ97J66L7k41l30K38j88L25k58K5rK0M36k74l33
$$ 123 306 190 -216 -419 158 123 -318 -312 -115 51 88 -153 -483 -245 -433 -108 -366 -341 -350 -330 106 -168 -501
3054e01k07N81J75j82m51J77J94J85j42p3k42J28L94m61m2j35L83j08j9K15n16
$$ -501 -708 -127 48 -134 -585 -408 -214 -29 -171 -244 -486 -358 36 -425 -467 -602 -219 -327 -346 -131 -647
3075f47K53L48L92l98j34mK65m6m16q8RM36J44r4J8j02K0K47p0k53l28O94Q9k78
$$ -647 -394 -46 346 -52 -186 -190 75 29 -387 -475 -466 -30 114 20 38 -64 -44 203 133 -120 -448 246 335 57
3099E7l07L25J89L14n04J54k67L42M7J57m11j03L49M6J5j91j57L38L76m63m33
$$ 57 -250 75 264 578 74 228 -39 303 350 507 96 -7 342 388 403 212 55 393 769 306 -127
3120a27L13J08J80k73q0j10N89k9J42m23j62J40L70j47m68q2N28K50l85Om35L54
$$ -127 186 294 474 201 121 11 600 571 713 290 128 268 638 491 23 -59 469 719 334 340 -95 259
3142B59j97L72j61m8J48n9j5l00J66m6L22l27L6m15K89J81N9j17m81N5L36R5o6
$$ 259 62 434 273 225 373 314 299 -1 165 119 441 114 150 -265 24 205 264 147 -334 -279 57 152 86
3165H6m84K60j16J90o1k94n6O07Ok80J10m11K88L3Rk40J23k1J41j00k64m1L42
$$ 86 -398 -138 -254 -64 -125 -419 -475 132 138 -142 -32 -443 -155 -122 -113 -353 -230 -251 -110 -210 -474 -515 -173
3188a73M7k81n37K28L25L96k83j9r0p6M10m2l05r9J86K9N8j37j70L3M06k71j56
$$ -173 -126 -407 -944 -716 -391 5 -278 -297 -387 -463 -53 -95 -400 -499 -313 -284 -226 -363 -533 -500 -94 -365 -521
3211e21L23k88K98J09j7k33M28J55o9l03m55N6M58O00l99p9m02N39l16J55o1l15
$$ -521 -198 -486 -188 -79 -96 -329 99 254 185 -118 -573 -517 -59 541 142 63 -339 200 -116 39 -22 -337
3233c37O34L5j3o32N11J37J82j94k14K38j31J92R4j39n35L96J79Q8l03j6K96p2
$$ -337 297 332 319 -313 198 335 517 323 109 347 216 408 502 363 -172 224 403 491 188 172 468 396
3255C96J66n38O6N67n42Q6L10l74L73J58j79j77k29J48O2K10k48k91K88J74J60
$$ 396 562 24 90 657 115 201 511 137 510 668 489 312 83 231 293 503 255 -36 252 426 586
3276E86m17j5j48J53J88Q0o83L09J47J06k89j86M14P0N4l21m19K04m3J89N9m67
$$ 586 169 154 6 159 347 427 -256 53 200 306 17 -169 245 315 369 48 -371 -167 -210 -21 38 -429
3298d29L62j36J99j38l02J68K50j36k03J2k32L16J80R4n93j50J78K88l2j59q3
$$ -429 -67 -203 -4 -142 -444 -276 -26 -162 -365 -353 -585 -269 -89 5 -588 -738 -560 -272 -304 -463 -546
3319e46M46m1k13l79L00K75j34J14l35o2J26K45P6k14j73K92M20k17m06j76K95
$$ -546 -100 -141 -354 -733 -433 -158 -292 -178 -513 -575 -449 -204 -128 -342 -515 -223 197 -20 -426 -602 -307
3340c07K06J77k21j08k26K86M9J45kjJ09j6k9P6q8K11P5l79l5R8M48j86r4j89
$$ -307 -101 76 -145 -253 -479 -193 -144 1 -1 -2 107 91 62 138 50 261 336 -43 -78 20 468 282 188 -1
3364aJ14L85P1j44o0j51k35N01k55j20K8K20L47n50M04j31Q0J1k26j04N2L58J56
$$ -1 113 498 569 425 365 214 -21 480 225 105 133 353 700 150 554 423 503 514 288 184 236 594 750
3387G50l21J29l34K81J91j26l80P1j93K80R4k45o1l28O29M2n8j08OL2J40k85l57
$$ 750 429 558 224 505 696 570 190 261 68 348 442 197 136 -192 437 479 421 313 319 351 491 206 -151
3410a51J60J99j60J04l92k9M86j72j5l39J64L57m0l1l70J70j57K07j54R1m61M33
$$ -151 9 208 48 152 -240 -269 217 45 30 -309 -145 212 172 141 -229 -59 -216 -9 -163 -72 -533 -100
3432a00P4k02j28j11M80j90k97k04K17k21L64J14l42J90J62L38k61m12q7L87J54
$$ -100 -26 -228 -356 -467 13 -177 -474 -678 -461 -682 -318 -204 -546 -356 -194 144 -117 -529 -616 -229 -75
3453g5J00l54k09J54N7M11l82l5Q3Q0m0j21j39R1K09K3o8j03K14mK05n49J99N5
$$ -75 25 -329 -538 -384 -327 84 -298 -333 -250 -170 -210 -331 -470 -379 -170 -147 -215 -318 -104 -108 97 -452 -253 -198
3477a98J68K13j02n1k88O01J31j97k11n30N20J91o2M2J84l7J12r9m92J12O8M22
$$ -198 -30 183 81 30 -258 343 474 277 66 -464 56 247 185 227 411 374 486 387 -105 7 75 497
3499D97k27m16p2M76M91l02l29j76L06L94l47k59J43J76J35r1k8k47k7M4L68m43
$$ 497 270 -146 -218 258 749 447 118 -58 248 642 295 36 179 355 490 399 371 124 97 141 509 66
3521F6K96k10o3Q9O4j75K38J22J73j08m74P2J79O1N7o53M16J83k81L9l22O2M72
$$ 66 362 152 89 178 242 67 305 427 600 492 18 90 269 330 387 -266 150 333 52 91 -231 -169 303
3544C03j01l00n5k15L58L42m37J58l45K55l49N50l34m6L20j58j10n4j46L50K13
$$ 303 202 -98 -153 -368 -10 332 -105 53 -292 -37 -386 164 -170 -216 104 -54 -164 -218 -364 -14 199
3565A99k99l44j16L43Q1Ml10Q6K60J89Q8n17k41J5M56Om7l85L15J22j03J64m17
$$ 199 -100 -444 -560 -217 -136 -132 -442 -356 -96 93 181 -336 -577 -562 -106 -100 -147 -532 -217 -95 -198 -34 -451
3588d51L35j46j7P5n2k63L16L20m37l28M08R5K64k51l41J95J27M68n08j50K54
$$ -451 -116 -262 -279 -204 -256 -519 -203 117 -320 -648 -240 -145 119 -132 -473 -278 -151 317 -191 -341 -87
3609h7r6j3K66l73J42M79j42k16l15N69O6R0j43l9j7L2o1p3m6O4R6J78o1k1j1
$$ -87 -183 -196 70 -303 -161 318 176 -40 -355 214 280 370 227 188 171 203 142 69 23 87 183 361 300 279 268
3634B68j09M18j76l75M75j82L52l28j63P6K28L86j4o12k70L13rRj8l5RK43J77
$$ 268 159 577 401 26 501 319 671 343 180 256 484 870 856 244 -26 287 278 287 269 234 243 486 663
3657F63l93J08j94L79J4o36R3J36J09k3j00j72N5L00q3k07r0m6r2K38j71p8K98
$$ 663 270 378 184 563 577 -59 34 170 279 256 156 -16 39 339 256 49 -41 -87 -179 59 -112 -190 108
3680A08j06N07n67j83k03M6N86n62L17J9k62n5J84k49k9M2L20r2L1m39K68j12
$$ 108 2 509 -58 -241 -444 -398 188 -374 -57 -38 -300 -355 -171 -420 -449 -407 -87 -179 -148 -587 -319 -431
3702d31K37k53k66N52m7k5m36K32J29J09l02K2j67K69P5l2o2L5m4j3L25j71r1
$$ -431 -194 -447 -713 -161 -208 -233 -669 -437 -308 -199 -501 -479 -646 -377 -302 -334 -396 -361 -405 -418 -93 -264 -355
3725c55J73J52j44q5k7j32N22k04l33J79J35J38L5j90r0k40N93K16k04k13j92
$$ -355 -182 -30 -174 -259 -286 -418 104 -100 -433 -254 -119 19 54 -136 -226 -466 127 343 139 -74 -266
3746b66N00o3J41l18J3L20j42Km5P1J06O9K94n47P6K04n2K46l69m8K10J27j4n6
$$ -266 234 171 312 -6 7 327 185 187 142 213 319 388 682 135 211 415 363 609 240 192 402 529 515 459
3770D59j77j4K14j22K24k62o0L13j93M6l97K08J33R6m59P8O1J28K60k60k59K26
$$ 459 282 268 482 360 584 322 262 575 382 428 31 239 372 468 9 87 148 276 536 276 17 243
3792B43q1N12m68k25P1J46K19k53l21j43M20Mm4j10qL5j12r1J76j07j5N5J26j88
$$ 243 162 674 206 -19 52 198 417 164 -157 -300 120 124 80 -30 -38 -3 -115 -206 -30 -137 -152 -97 29 -159
3816a59J19j88Q4K23n30j37N64M1k97J8P9q3J98k37j38j05M01j11k69K18j31k30
$$ -159 -40 -228 -144 79 -451 -588 -24 17 -280 -262 -183 -266 -68 -305 -443 -548 -147 -258 -527 -309 -440 -670
3838f70K97L4R9j41J35K50l97j48m1J19J48K26l89J02n7L77J32k15k30J25j4M65
$$ -670 -373 -339 -240 -381 -246 4 -393 -541 -582 -463 -315 -89 -478 -376 -433 -56 76 -139 -369 -244 -258 207
3860B07m05l54L38M98k61J25j13j08L23p1J32o43K06L67J01q7j55l27N80j44J10
$$ 207 -198 -552 -214 284 23 148 35 -73 250 179 311 -332 -126 241 342 255 100 -227 353 209 319
3881C19k66N6p6O01j50r8l70K60QJ79k47O6J47j22J36l09M8K8J05j23Q7k84K6
$$ 319 53 109 33 634 484 386 16 276 284 463 216 282 429 307 443 134 182 210 315 192 279 -5 21
3904B1N12j16j44j95J27M66l25o6j82M22j59J06j69M6j84O9K17L9k42o0K21M7
$$ 21 533 417 273 78 205 671 346 280 98 520 361 467 298 344 160 229 446 485 243 183 404 451
3926D51k57l38J45L98o6k36m62L81L65k78L2l19P2j20L25mj79l65K68j19O5j68
$$ 451 194 -144 1 399 333 97 -365 16 381 103 135 -184 -112 -232 93 89 -90 -455 -187 -306 -241 -409
3948d09J56j40M51l29k21j51K82K13k21j16K02J20N2m3k21K32k06M2N2j79J10
$$ -409 -253 -393 58 -271 -492 -643 -361 -148 -369 -485 -283 -163 -111 -154 -375 -143 -349 -307 -255 -434 -324
3969c24m4J35L02m52j68k14N28J46k37n1m6M41k20j56q5K10J62j75q4p0M86k13
$$ -324 -368 -233 69 -383 -551 -765 -237 -91 -328 -379 -425 16 -204 -360 -445 -235 -73 -248 -332 -402 84 -129
3991a29L2j03K23j48M63k92m10K53n5N92n80N37l52k07K59N59n41n4R1PM47k46
$$ -129 -97 -200 23 -125 338 46 -364 -111 -166 426 -154 383 31 -176 83 642 101 47 138 145 592 346
4013C46l07L05J80J23k65l89N25K3p9j47j25N2L39J58n5j72l61K99Q8L85o26Q
$$ 346 39 344 524 647 382 -7 518 541 462 315 190 242 581 739 684 512 151 450 538 923 297 305
4035C05L4L03J36o71n1J24L48n7k44%J43m6L4k5j75P2K7K54m90j14J03k6N36m04
$$ 305 339 642 778 107 56 180 528 471 227 227 370 324 358 333 158 230 257 511 21 -93 10 -16 520 116
4059A16q0M5j37NJ20j61o9K00J88j87k03m7R8L74k57k06j34J45j40P8j14J95m28
$$ 116 36 81 -56 -51 69 -92 -161 39 227 40 -163 -210 -112 262 5 -201 -335 -190 -330 -252 -366 -171 -599
4082e99M33o9m32J85J95M00l10j96r9J91J24k42j53k34M66K30l32L6k97L46J18
$$ -599 -166 -235 -667 -482 -287 113 -197 -393 -492 -301 -177 -419 -572 -806 -340 -110 -442 -406 -703 -357 -239
4103b39L07m18nJ86J56o0r9l12J74J11p3j6j5mJ95J74l00J16j74J33L19k09l70
$$ -239 68 -350 -355 -169 -13 -73 -172 -484 -310 -199 -272 -288 -303 -307 -112 62 -238 -122 -296 -163 156 -53 -423
4126d23J07L30K08m67K26j55L47J0j07k12j75M10L17o8n58K24M44K1j94K05k76
$$ -423 -316 14 222 -245 -19 -174 173 183 76 -136 -311 99 416 348 -210 14 458 479 285 490 214
4147B14QJ98J44J8m09n8L75k61J06j95L35J27k51j19J80N4m4j03l33K17R8k3P2
$$ 214 222 420 564 582 173 115 490 229 335 140 475 602 351 232 412 466 422 319 -14 203 301 278 350
4170C50j55j51J51K00K54n71RJ3P4j93K1Q0nl7N7J6j54r9J54L47j59n21M51j18
$$ 350 195 44 195 395 649 78 87 100 174 -19 2 82 77 40 97 113 -41 -140 14 361 202 -319 132 14
4194A4lM0j67j17n3J46L16k81m64M66K12r2j78k95R8p6J2j92L25o6P6N1j35L3
$$ 14 11 51 -116 -233 -286 -140 176 -105 -569 -103 109 17 -161 -456 -358 -434 -422 -614 -289 -355 -279 -228 -363 -330
4218c30J25j03K59m16k42L88Q8J08k01K3k48mK69k7p0j41J14L74j60j52j03L74
$$ -330 -205 -308 -49 -465 -707 -319 -231 -123 -324 -301 -549 -553 -284 -311 -381 -522 -408 -34 -194 -346 -449 -75
4240g5P5l12lJ98l0j25K3r5J68K22QJ21l87M1N4L02L1k20K56j52L15k32l30K14
$$ -75 0 -312 -315 -117 -147 -272 -249 -344 -176 46 54 175 -212 -171 -117 185 216 -4 252 100 415 183 -147 67
4264F7L58j1j29L6oo9L94k62j29j63K66J04j84j29L5j07M41m4j56J12l16N47J46
$$ 67 425 414 285 321 315 246 640 378 249 86 352 456 272 143 178 71 512 468 312 424 108 655 801
4287H01l55m50L93n5Q3J41n01J90p4L80k32j64p4K72m2pK8k21R2J42j76j02R1
$$ 801 446 -4 389 334 417 558 57 247 173 553 321 157 83 355 313 306 334 113 205 347 171 69 160
4310A60K93j81l85J26L20l07L17p9m47K22j38J39r9r8J56R3j17J45k68K8K02l08
$$ 160 453 272 -113 13 333 26 343 264 -183 39 -99 40 -59 -157 -1 92 -25 120 -148 -120 82 -226
4332b26o5M29m73Q8K36k91j57m4K69n2P0l27r8K73K39O1k0l31l02O07K1l62j6
$$ -226 -291 138 -335 -247 -11 -302 -459 -503 -234 -286 -216 -543 -641 -368 -129 -68 -88 -419 -721 -114 -93 -455 -471
4355d71k58N15J07n59K72J88j63J30Q6j16L7K60k97j41o9J63L39j16Qk11J50J34
$$ -471 -729 -214 -107 -666 -394 -206 -369 -239 -153 -269 -232 28 -269 -410 -479 -316 23 -93 -85 -296 -146 -12
4377a2p0j59L60k50P1R3p8J22k06M07j0j87O5k65M09J8ok78l59O02Qn3j02K39
$$ -12 -82 -241 119 -131 -60 33 -45 77 -129 278 268 81 146 -119 290 308 302 24 -335 267 275 222 120 359
4401C59j80K58k07n6J4Q9n3K75j38n6r8K36j05j26M1jJ78O4q2p6J57p9j32J97
$$ 359 179 437 230 174 188 277 224 499 361 305 207 443 338 212 253 252 430 494 412 336 493 414 282 479
4425D79j98j70L62j50j51j06R3J88k18J06j8k39J23K80O0n27K23j70r6L20l34
$$ 479 281 111 473 323 172 66 159 347 129 235 217 -22 101 381 441 -86 137 -33 -129 191 -143
4446a43J20NJ37k52k17L64j98M38j00l63k43K37K05K01o12j9L21J42Rl68J3o0
$$ -143 -23 -18 119 -133 -350 14 -184 254 154 -209 -452 -215 -10 191 -421 -440 -119 23 32 -336 -323 -383
4468c83M64l35J9l10J82J41o9k61j55O06k70M8J92n48O8N16j03l48K36j26J05
$$ -383 81 -254 -235 -545 -363 -222 -291 -552 -707 -101 -371 -323 -131 -679 -611 -95 -198 -546 -310 -436 -331
4489c31K28l7k56j53N43k6k70j08O2J92J4j90K62Q4L12l90M46m65jK90l11K19
$$ -331 -103 -140 -396 -549 -6 -32 -302 -410 -348 -156 -142 -332 -70 14 326 -64 382 -83 -84 206 -105 114
4511A14j86PL50r1k31j07J58j21J53M06n06J6KK73j00N1J91j97K27p7j59rK20
$$ 114 -72 -65 285 194 -37 -144 14 -107 46 452 -54 -38 -36 237 137 188 379 182 409 332 173 164 384
4534C84m6K46l15j09L14l8p0k64J74j64K35J15k83K0j90M07J8k94K42RJ13l62
$$ 384 338 584 269 160 474 436 366 102 276 112 347 462 179 199 9 416 434 140 382 391 504 142
4556A42J4j31j19J11K91j74j14K16P0k43k8np0o0M25l35L8O2j1kP2l10j54L7K59
$$ 142 156 25 -94 17 308 134 20 236 306 63 35 30 -40 -100 325 -10 28 90 79 77 149 -161 -315 -278 -19
4581a9r9l00K34J11J56j81Q8j22l2R8k94K2kM78p5j98j33q5k40M30J21m64N5M8
$$ -19 -118 -418 -184 -73 83 -98 -10 -132 -164 -66 -360 -338 -340 138 63 -135 -268 -353 -593 -163 -42 -506 -451 -403
4605d03p8J75J21j14j73L0J53j17J77m5j73M53ql64Q3K53m9l9o00J46L66Q9q2
$$ -403 -481 -306 -185 -299 -472 -442 -289 -406 -229 -274 -447 6 -2 -366 -283 -30 -79 -118 -718 -572 -206 -117 -199
4628a99k17l4O29J5l41j01L06N5J64Lm82L7M03k38J08m25K42L20j93J1J05l73
$$ -199 -416 -450 179 194 -147 -248 58 113 277 280 -202 -165 238 0 108 -317 -75 245 52 63 168 -205
4650b05N52j54K24k25j55L90k34pm8j86J89M08o2l31J0L16J12J7o32o8M66K31
$$ -205 347 193 417 192 37 427 193 186 138 -48 141 549 487 156 166 482 594 611 -21 -89 377 608
4672F08l29k14J30J90q5J05q3j04m5K03j59j02J92k24J57K91k11k87j71L65M1
$$ 608 279 65 195 385 300 405 322 218 173 376 217 115 307 83 240 531 320 33 -138 227 268
4693B68O1q6k9Jr5k4K15n32K88O1k51P6j4K06l3k70J8j72J02jO5J61m51M13j23
$$ 268 329 243 214 215 120 96 311 -221 67 128 -123 -47 -61 145 112 -158 -140 -312 -210 -211 -146 15 -436 -23 -146
4718a46p7j49r0M79k53O6n9J18r8j34l4J21o5j91L86j48J44j98j47K67L74l27
$$ -146 -223 -372 -462 17 -236 -170 -229 -111 -209 -343 -377 -256 -321 -512 -126 -274 -130 -328 -475 -208 166 -161
4740a61k08J34o7R0j14j18K7K30J33k28L0J57j37M0J12j14j12J37L33j30l8j28
$$ -161 -369 -235 -302 -212 -326 -444 -417 -187 -54 -282 -252 -95 -232 -192 -80 -194 -306 -169 164 34 -4 -132
4762a32J41j25n8P8K59M6l53J42J68%kj08J01k80J57J31J93k0j93p9M01j55l08
$$ -132 9 -116 -174 -96 163 209 -144 -2 166 166 164 56 157 -123 34 165 358 338 145 66 467 312 4
4785Dj4K80j37K92j15O1l6QJ07j74j37K4J50L10o8m64J56P6j90K24K9k51j0M8
$$ 4 -10 270 133 425 310 371 335 343 450 276 139 163 313 623 555 91 247 323 133 357 386 135 125 173
4809A73J33j74j98L47k00N1J82k47L99j33L7k97l27L62K67k13N3o2l6k40K19J02
$$ 173 306 132 -66 281 81 132 314 67 466 333 370 73 -254 108 375 162 215 153 117 -123 96 198
4831A98m30L7M80k76k31N24o47R7K03j13n0k58L52LO4j96K32k00J7J10mk44R6
$$ 198 -232 -195 285 9 -222 302 -345 -248 -45 -158 -208 -466 -114 -111 -47 -243 -11 -211 -194 -84 -88 -332 -236
4854b36J43N3n19K76K60j92j0j57K02k74M41k40p0K98k57K24l56L63o6m88L53
$$ -236 -93 -40 -559 -283 -23 -215 -225 -382 -180 -454 -13 -253 -323 -25 -282 -58 -414 -51 -117 -605 -252
4875b52J09L3l08K64O8K21j86m64J59J73L36n57J38L55k61q9J47K1O9L8O0N0q1
$$ -252 -143 -110 -418 -154 -86 135 -51 -515 -356 -183 153 -404 -266 89 -172 -261 -114 -93 -24 14 74 124 43
4898D3k54L34j14n6LK92m1R3j64k60L86N7nj32q0K17N9M1j55q8J91mr8J78m04
$$ 43 -211 123 9 -47 -44 248 207 300 136 -124 262 319 314 182 102 319 378 419 264 176 367 363 265 443 39
4923C9K70j32J49j31l6JN6k09J93J49j9l4p3Q5l89L19l72L92j3j02l74M06j10
$$ 39 309 177 326 195 159 160 216 7 200 349 330 296 223 308 -81 238 -134 258 245 143 -231 175 65
4946F5J24O0l63K03q7L30k52l31M07j19J76Q6k41l9n4J70J16m17K8O9K57k25k78
$$ 65 189 249 -114 89 2 332 80 -251 156 37 213 299 58 19 -35 135 251 -166 -138 -69 188 -37 -315
4969c15J65l23M72m47K69j09K46p1q8j28M8k77L14QL6j42J29K9j56J01o7pM7L45
$$ -315 -150 -473 -1 -448 -179 -288 -42 -113 -201 -329 -281 -558 -244 -236 -200 -342 -213 -184 -340 -239 -306 -313 -266 79
4993G9m66K84k64M01j18q2l32J78N2Q1k1k88R0J80J66k95j1J17K2K70P5k93M5
$$ 79 -387 -103 -367 34 -84 -166 -498 -320 -268 -187 -208 -496 -406 -226 -60 -355 -366 -249 -227 43 118 -175 -130
5016a30k6J90p6k8J03l7k8J77j55j04K46K03J5k18O1J19m1j05m03J30K04O4J17
$$ -130 -156 34 -42 -70 33 -4 -32 145 -10 -114 132 335 350 132 193 312 271 166 -237 -107 97 161 278
5039B78k38k21O18l60oK37r4l0n1j48O39m58K18k41n0J2l8J34j06L07m78J20K60
$$ 278 40 -181 437 77 71 308 214 184 133 -15 624 166 384 143 93 105 67 201 95 402 -76 44 304
5062C04k49K64j02k09K35o7J68l74M54l77J2J01n6j91J99J69j47j60J08pJ0l0
$$ 304 55 319 217 8 243 176 344 -30 424 47 59 160 104 -87 112 281 134 -26 82 75 85 55
5084E5R0l02K05K1R8j86o0J4K59l7l12J09l26K10J22O2j64j76K37p5Q6j81l7K32
$$ 55 145 -157 48 69 167 -19 -79 -65 194 157 -155 -46 -372 -162 -40 22 -142 -318 -81 -156 -70 -251 -288 -56
5108e6J60k40j40j46J36J65k43o0P5R9O0K0l20K23n8k3J68K26m55K36O0k36J00
$$ -56 104 -136 -276 -422 -286 -121 -364 -424 -349 -250 -190 -170 -490 -267 -325 -348 -180 46 -409 -173 -113 -349 -249
5131b49J69Kl36K94k22K28p2K34Q1N6l88J09K40j95K33n01K59J12m4r0K7J8J34
$$ -249 -80 -78 -414 -120 -342 -114 -186 48 129 185 -203 -94 146 -49 184 -317 -58 54 10 -80 -53 -35 99
5154I9m6j23M4K07p4J19J63l65J6P1j00J10k92L11P7n2j52M20m35L49l8J4K96
$$ 99 53 -70 -26 181 107 226 389 24 40 111 11 121 -171 140 217 165 13 433 -2 347 309 323 619
5177F19k87k23L23k18j82L1K62O0r0N5l46J90LK75j42k78L6N0K82k09l0j20J60
$$ 619 332 109 432 214 32 63 325 385 295 350 4 194 197 472 330 52 88 138 420 211 181 61 221
5200B21l23K18j00J15M2J7j13j0o6J13L8j91M18n53K28O0o0p3m4j23n6J01J59
$$ 221 -102 116 16 131 173 190 77 67 1 114 152 -39 379 -174 54 114 54 -19 -63 -186 -242 -141 18
5223A8Oj53P5L4j18k03M0L88n58L88O7l84J02J61j24J00J04N4k4k90J35q5q2K08
$$ 18 24 -129 -54 -20 -138 -341 -301 87 -471 -83 -16 -400 -298 -137 -261 -161 -57 -3 -27 -317 -182 -267 -349 -141
5247a41j95R6l7j07J05K40N2j35k62J94rj17L79j34J71j72k32N1J32p8j81J2K94
$$ -141 -336 -240 -277 -384 -279 -39 13 -122 -384 -190 -199 -316 63 -71 100 -72 -304 -253 -121 -199 -380 -368 -74
5270g4K76l14l6K3j26K74j4r4R0j00J59L43m74J6J25k10P5L09P1k21q9L10j78
$$ -74 202 -112 -148 -125 -251 23 9 -85 5 -95 64 407 -67 -51 74 -136 -61 248 319 98 9 319 141
5293A41j55J6P9J46l3k00K7K6J32K4j02K19j30M1k38J58N3J21k69J59J09l54R8
$$ 141 -14 2 81 227 194 -6 21 47 179 203 101 320 190 231 -7 151 204 325 56 215 324 -30 68
5316F8K52J64m50Q0m8J21K15k79k1R2j12K74l56P7K25p2K92l20m65J88K55J65
$$ 68 320 484 34 114 66 187 402 123 102 194 82 356 0 77 302 230 522 202 -263 -75 180 345
5338C45m21J90m9j4L2p3k67K62k15K05k33J73j61Q8n9j2o2K41P8l38P5j96J16
$$ 345 -76 114 65 51 83 10 -257 5 -210 -5 -238 -65 -226 -138 -197 -209 -271 -30 48 -290 -215 -411 -295
5361b95K25j58J58j17k25J64J6k12L90k42J49m6N1j37k08L44p0J04N9R6l30K49
$$ -295 -70 -228 -70 -187 -412 -248 -232 -444 -54 -296 -147 -193 -142 -279 -487 -143 -213 -109 -50 46 -284 -35
5383c5O1k19JN9r9K28O7l60J61o5j22K07K1j26J46j06J79q4K16j98m6p2m4K70
$$ -35 26 -193 -192 -133 -232 -4 63 -297 -136 -201 -323 -116 -95 -221 -75 -181 -2 -86 130 -68 -114 -186 -230 40
5407D0l2l25L40L38l85L33k71P2n7K03R1k80J50J28k01l0K21l18J12j28k7J52
$$ 40 8 -317 23 361 -24 309 38 110 53 256 347 67 217 345 144 114 335 17 129 1 -26 126
5429A26M13l42j50O7lo8J14J9m9P4K50o42N53j72J02J03j27j88L5j99J08P7O6
$$ 126 539 197 47 114 111 43 157 176 127 201 451 -191 362 190 292 395 268 80 115 -84 24 101 167
5452A67R1J17l60Kn1J19K5P5l17K00m3J82k13k1K39k77j62M74l27lo6J49k2%j08
$$ 167 258 375 15 17 -34 85 110 185 -132 68 25 207 -6 -27 212 -65 -227 247 -80 -83 -149 0 -22 -22 -130
5477a30J39Lo3Q4l16N47m36J12j98kN9m3PL95k51K07k83PRL5j07J7K5j94J44L2
$$ -130 9 12 -51 33 -283 264 -172 -60 -258 -260 -201 -244 -237 158 -93 114 -169 -162 -153 -118 -225 -208 -183 -377 -233 -201
5503b01o7K41L9k98o4K86m7J14m47O06j54l34L60l40J67O0n7O3k57L28k2J7Lj15
$$ -201 -268 -27 12 -286 -350 -64 -111 3 -444 162 8 -326 34 -306 -139 -79 -136 -73 -330 -2 -24 -7 -4 -119
5527a19Q3j04O0l3q8L38k29N3j31M84k04j39R2o7K85m6k00J14r3pJ34k5n4K83
$$ -119 -36 -140 -80 -113 -201 137 -92 -39 -170 314 110 -29 63 -4 281 235 35 149 56 49 183 158 104 387
5551C87o1m18O51m22m8K75j92k93L25j46K54j13P8k26J72nk16L9j84N47k88n0
$$ 387 326 -92 559 137 89 364 172 -121 204 58 312 199 277 51 223 218 2 41 -143 404 116 66
5573F6K11j29J04R1l32J86k99J12K18o4R9j61j20J54k17n7J02J98O8n3n5q7j56
$$ 66 277 148 252 343 11 197 -102 10 228 164 263 102 -18 136 -81 -138 -36 162 230 177 122 35 -121
5596a21J44j26K78q4p5J0J53nk75K81l71K6K38o0N8qj78J43j73K78J02m52K1O9
$$ -121 23 -103 175 91 16 26 179 174 -101 180 -191 -165 73 13 71 63 -115 28 -145 133 235 -217 -196 -127
5620a27j2k49L02m14N19j78q9K41k14k19K60K76j82j95j65L96J47n2j54l0L4J2
$$ -127 -139 -388 -86 -500 19 -159 -248 -7 -221 -440 -180 96 -86 -281 -446 -50 97 45 -109 -139 -105 -93
5642i3j10J71l8k1k6j60K05j16J04M3K79m15q5K69J26k25k56L34q9P0J75l53L32
$$ -93 -203 -32 -70 -91 -117 -277 -72 -188 -84 -41 238 -177 -262 7 133 -92 -348 -14 -103 -33 142 -211 121
5665A21k17J63Ok35J17j03K08k41J4K93j56J38J22k89L87l43M87l33j24j75K98
$$ 121 -96 67 73 -162 -45 -148 60 -181 -167 126 -30 108 230 -59 328 -15 472 139 15 -160 138
5686A38L53n88K90j24R0J45l1j87J31J22k75J87j38m7J29P6J2m68M01n0J69j97
$$ 138 491 -97 193 69 159 304 273 86 217 339 64 251 113 66 195 271 283 -185 216 166 335 138
5708A38j51l5P5j61n3L14K86l96K05k41K14j45p3J3J78l7j27k38K92Q2m2k1j33
$$ 138 -13 -48 27 -134 -187 127 413 17 222 -19 195 50 -23 -10 168 131 4 -234 58 140 98 77 -56
5731e6K21l21k9j03J69Kn3m2R7j86N9J96j50j69K69k3o7L36m73M73m02K8L40j21
$$ -56 165 -156 -185 -288 -119 -117 -170 -212 -115 -301 -242 -46 -196 -365 -96 -119 -186 150 -323 150 -252 -224 116 -5
5755ej65k7R7N5Q6j14m0j47J13J62j85J12k74K75j24j2J23j21J53K6k28J08o5
$$ -5 -170 -197 -100 -45 41 -73 -113 -260 -147 15 -170 -58 -332 -57 -181 -193 -70 -191 -38 -12 -240 -132 -197
5778a97J59r2k89L06J21Qn6o4%L41j39l34L15j89L93l52L1K1K02K13l49Q2l3p9
$$ -197 -38 -130 -419 -113 8 16 -40 -104 -104 237 98 -236 79 -110 283 -69 -38 -17 185 398 49 131 98 19
5802A9J97j36J41J59m02L39M0N1j43q7j92j8K96k26l8K78k19N0P1p2M68m18L4
$$ 19 216 80 221 380 -22 317 357 408 265 178 -14 -32 264 38 0 278 59 109 180 108 576 158 192
5825A92j00L31l09P9j88M05m94M09p2j80M13l27r6n8J25o9Pp5M3j78J69J9K07
$$ 192 92 423 114 193 5 410 -84 325 253 73 486 159 63 5 130 61 68 -7 36 -142 27 46 253
5848B53l94K0M23O3m15L24l56L42q1k66R3l9J59k18J46j40J63k5j03nk51O6J21
$$ 253 -141 -121 302 365 -50 274 -82 260 179 -87 6 -33 126 -92 54 -86 77 52 -51 -56 -307 -241 -120
5871a20J62j04q3j7j10J91O2l7J21n9k25K57l67M03j63J17k78J51j55K08j17j19
$$ -120 42 -62 -145 -162 -272 -81 -19 -56 65 6 -219 38 -329 74 -89 28 -250 -99 -254 -46 -163 -282
5893b82L37J6j77j10j02M20j09N2J7l13L29j6m02K99l81K23N9j7K44j70K91J63
$$ -282 55 71 -106 -216 -318 102 -7 45 62 -251 78 62 -340 -41 -422 -199 -140 -157 87 -83 208 371
5915C71o01L97k31m9K33n8j91k1K79j15K06l28K62k64K75k17P1j60N7J99J16o7
$$ 371 -230 167 -64 -113 120 62 -129 -150 129 14 220 -108 154 -110 165 -52 19 -141 -84 115 231 164
5937A64N2M7j31j88L0M49k2k68j68J80l20J69R2J7J0n2o9M0J96J15k12j90J80
$$ 164 216 263 132 -56 -26 423 401 133 -35 145 -175 -6 86 103 113 61 -8 32 228 343 131 -59 121
5960A21jJ34M3O0k72O5r6Qj17m3J89o9J43j66J81O0l90P1L69k70R4J78l26R4l19
$$ 121 120 254 297 357 85 150 54 62 -55 -98 91 22 165 -1 180 240 -150 -79 290 20 114 292 -34 60 -259
5985b59K96l41M45k75J59o3K7J15L7k21K63k62O5m8l8n9K25l44r9K4J98k8Pnn6
$$ -259 37 -304 141 -134 25 -38 -11 104 141 -80 183 -79 -14 -62 -100 -159 66 -278 -377 -353 -155 -183 -176 -181 -237
6010b37j29M30j44N9n7j28jrL45p8j71j08J29m2J50k10J34R1kl6J17m14O3L77
$$ -237 -366 64 -80 -21 -78 -206 -207 -216 129 51 -120 -228 -99 -141 9 -201 -67 24 22 -14 103 -311 -248 129
6034A29j99J61l77J01k4P1K83m08M04p6n9J84n7l6k55J72J35j49j74L97R8k28
$$ 129 -70 91 -286 -185 -209 -138 145 -263 141 65 6 190 133 97 -158 14 149 0 -174 223 321 93
6056I3K18l42k36K46J8l8L83m13K48k04j03R0K68k98L0J20j49J9L53l41J88J41
$$ 93 311 -31 -267 -21 -3 -41 342 -71 177 -27 -130 -40 228 -70 -40 80 -69 -50 303 -38 150 291
6078B91r3k71K09k66K67j21J05J85k45J19k52RM06j67J98j52n6J28j62J05n9l1
$$ 291 198 -73 136 -130 137 16 121 306 61 180 -72 -63 343 176 374 222 166 294 132 237 178 147
6100A47k41L7j99L1L24j34N3p2K18o7Q4j32j55J89k02mJ29P0j67n0J64n4j20m1
$$ 147 -94 -57 -256 -225 99 -35 18 -54 164 97 181 49 -106 83 -119 -123 6 76 -91 -141 23 -31 -151 -192
6124a92J93J51J53k54q4l6o4J20k50k20N55q3j9k74J14J32J6j13P9M4J53l85N2
$$ -192 1 152 305 51 -33 -69 -133 -13 -263 -483 72 -11 -30 -304 -190 -58 -42 -155 -76 -32 121 -264 -212
6147b12R4L3LP8P8n12N31k8J12j16J58l44K13j07p9q4K22J26j22N9n6N1j54j34
$$ -212 -118 -85 -82 -4 74 -438 93 65 177 61 219 -125 88 -19 -98 -182 40 166 44 103 47 98 -56 -190
6171a90L5n6K28L01k86K3pr3k0J98k39n3KJ77O35n17L5j53nl3L45k16j5j1j09
$$ -190 -155 -211 17 318 32 55 48 -45 -65 133 -106 -159 -157 20 655 138 173 20 15 -18 327 111 96 85 -24
6196b4K08k53J54M00k77o8j2k12J52k19M50k15J2r2J77J10l39k76N80j73k26L57
$$ -24 184 -69 85 485 208 140 128 -84 68 -151 299 84 96 4 181 291 -48 -324 256 83 -143 214
6218B14j93J11l76M56l61L16j76q4L82n6p5l2K1P4l25L37j98O6j32j65L14j65
$$ 214 21 132 -244 212 -149 167 -9 -93 289 233 158 126 147 221 -104 233 35 101 -31 -196 118 -47
6240d7L9Q6l8o7k11J64J36M6j70K48l19J46k42K85j27n2J79j21o2J42J65n71L71
$$ -47 -8 78 40 -27 -238 -74 62 108 -62 186 -133 13 -229 56 -71 -123 56 -65 -127 15 180 -391 -20
6263b0o5ON9p4j06J91j46j30N6K96l47K04k11J49J25N8J6O9l41j32L61R6j67K07
$$ -20 -85 -79 -20 -94 -200 -9 -155 -285 -229 67 -280 -76 -287 -138 -13 45 61 130 -211 -343 18 114 -53 154
6287A54j34k14mL9K50j77K2J79K7k82J42k0n36N36J38l4o6q4L31k14o4j33L77
$$ 154 20 -194 -198 -159 91 -86 -64 115 142 -140 2 -18 -554 -18 120 86 20 -64 267 53 -11 -144 233
6310B33r1o3m5l84M11R8l8m8M6J31j51M1j50l8J54k00M27j25j85q9l9P8J56k21
$$ 233 142 79 34 -350 61 159 121 73 119 250 99 140 -10 -48 106 -94 333 208 23 -66 -105 -27 129 -92
6334i2N2K96j59N8k63K20r1L39j83j26j64N5K19l94L89q0j52j25M56j24q9n0m0
$$ -92 -40 256 97 155 -108 112 21 360 177 51 -113 -58 161 -233 156 76 -76 -201 255 131 42 -8 -48
6357d8K47m07J88J01K61m12L16j20j64L35j41j91R1n7R5J87m23K66o2J02k77Q7
$$ -48 199 -208 -20 81 342 -70 246 126 -38 297 156 -35 56 -1 94 281 -142 124 62 164 -113 -26
6379b6j69J55K66k02l9M6k38J37j3nJ06k1j94J18K93L6j85j09M6Q6j20l3L81k35
$$ -26 -195 -40 226 24 -15 31 -207 -70 -83 -88 18 -3 -197 -79 214 250 65 -44 2 88 -32 -65 316 81
6403H1j01k15L79k49L20l67K97j21k13L73l59K61p0J13k28K40m2j09k10K29q0
$$ 81 -20 -235 144 -105 215 -152 145 24 -189 184 -175 86 16 129 -99 141 99 -10 -220 9 -71
6424g1P3j24R7JJ69l95O6o1K73P4j3M8k25L10nj89j05k2K16K04j93Q9m66M23j05
$$ -71 2 -122 -25 -24 145 -250 -184 -245 28 102 89 137 -88 222 217 28 -77 -99 117 321 128 217 -249 174 69
6449F9k23j82M13P4j21k08K82j45p7j23K42N5l29K09K38K35m06J70K21m27K29
$$ 69 -154 -336 77 151 30 -178 104 -41 -118 -241 1 56 -273 -64 174 409 3 173 394 -33 196
6470A96j65p7K82rk11J08j44p8L13J14l19k5J64n6QN5k53K31k12R9m6J50j80P1
$$ 196 31 -46 236 227 16 124 -20 -98 215 329 10 -15 149 93 101 156 -97 134 -78 21 -25 125 -55 16
6494A6M4J5O2q4k6j3Ol39J69j16J14O7K20l93K57J61j42j79LJ11J53k38j27L1
$$ 16 60 75 137 53 27 14 20 -319 -150 -266 -152 -85 135 -258 -1 160 18 -161 -158 -47 106 -132 -259 -228
6518b28R7J86k01L57k72J14J14k10q6J84M2k81K39k62K72m4n0j06k84K2L97J07
$$ -228 -131 55 -146 211 -61 53 167 -43 -129 55 97 -184 55 -207 65 21 -29 -135 -419 -397 0 107
6540A07j84R4J9k9j93L41l05P2k9Q3L1j35K16o9k6M3K69l90K7J16n4q2j66Q1R5
$$ 107 -77 17 36 7 -186 155 -150 -78 -107 -24 7 -128 88 19 -7 36 305 -85 -58 58 4 -78 -244 -163 -68
6565f8L5j15J33M79l91j54J10J81r2j29J26j79J96j91M0L64m40Q0K67j09l29K85
$$ -68 -33 -148 -15 464 73 -81 29 210 118 -11 115 -64 132 -59 -19 345 -95 -15 252 143 -186 99
6587I9j38K35k64J20J43j53J46r0PR7q3N0j01O2K0l7o3M9j3K17k12m01L21jj33
$$ 99 -39 196 -68 52 195 42 188 98 105 202 119 169 68 130 150 113 50 99 86 303 91 -310 11 10 -123
6612a23J28l9l00K91M6j87L85q9q7P2r2L1j05M73k77k37RK00k06L8J24L6o0j25
$$ -123 5 -34 -334 -43 3 -184 201 112 25 97 5 36 -69 404 127 -110 -101 99 -107 -69 55 91 31 -94
6636i4J63k9j71J49k2k14L51k08K27j94P5k36J38k0K25j64j15J15j32K03n1j73
$$ -94 69 40 -131 18 -4 -218 133 -75 152 -42 33 -203 -65 -85 140 -24 -139 -24 -156 47 -4 -177
6658a77j71M29n36N68k16Lq6l4J45J29q2L62l88J57k04n0J71j42m8J93R1m6Oj2
$$ -177 -348 81 -455 113 -103 -100 -186 -220 -75 54 -28 334 -54 103 -101 -151 20 -122 -170 23 114 68 74 62
6682F2j80j18K53m5J58j00l44L74J1o2K5n5J94P0j45l99L30J61q3J82k59n8j73
$$ 62 -118 -236 17 -28 130 30 -314 60 71 9 34 -21 173 243 98 -301 29 190 107 289 30 -28 -201
6705b01N50l89J50J06k57k7Q3Q3l8nl4p8M06k14qK3l64K37j14L77o5O1On1j64
$$ -201 349 -40 110 216 -41 -68 15 98 60 55 21 -57 349 135 127 150 -214 23 -91 286 221 282 288 237 73
6730G3p5J31N6k39J9J57m3L0K5m01M93m09K42k73J08J11K41o4n6j01P3J95k99
$$ 73 -2 129 185 -54 -35 122 79 109 134 -267 226 -183 59 -214 -106 5 246 182 126 25 98 293 -6
6753fr9K22n3l02M13o4j6j24J13rj9q0J45l1m79J94K43k68J74L2k27K45j55K90
$$ -6 -105 117 64 -238 175 111 95 -29 84 75 56 -24 121 90 -389 -195 48 -220 -46 -14 -241 4 -151 139
6777A39k60K8mJ06j95K46r6j19K90k57p3n0J51K26n56K87M82l88j15L05j59j64
$$ 139 -121 -93 -97 9 -186 60 -36 -155 135 -122 -195 -245 -94 132 -424 -137 345 -43 -158 147 -12 -176
6799a76R5o3K8j41j08K95%O2r4k68M17n7OR6m5l1j77j12j8K91k7J50m9j58K7K56
$$ -176 -81 -144 -116 -257 -365 -70 -70 -8 -102 -370 47 -10 -4 92 47 16 -161 -273 -291 0 -27 123 74 -84 -57 199
6825A99jo6j36J26kk30J9r5N09j9l36k8j28J52j4L77l85lJ16K51r4m03L5K96k3
$$ 199 198 132 -4 122 120 -110 -91 -186 323 304 -32 -60 -188 -36 -50 327 -58 -61 55 306 212 -191 -156 140 117
6850A17Q9l66P2J65l1J76k45k3J46M6l64L67q4j64M16n00L35l3k18O0k16J23K5
$$ 117 206 -160 -88 77 46 222 -23 -46 100 146 -218 149 65 -99 317 -183 152 119 -99 -39 -255 -132 -107
6873a07P9J85p4l23K70OMR9j37J61j80K02j60J67J13m99K97l25J62ql1J05j24
$$ -107 -28 157 83 -240 30 36 40 139 2 163 -17 185 25 192 305 -194 103 -222 -60 -68 -99 6 -118
6896a18N9L26k61l09K19q1J01n2K42k07K27j72q4l0O2K44k07J24l5j32l61N18
$$ -118 -59 267 6 -303 -84 -165 -64 -116 126 -81 146 -26 -110 -140 -78 166 -41 83 48 -84 -445 73
6918G3l01P5m3kR8R1J46k84J11j1J03j84L0K80k4n24L83K3k43K35J59k75j10K27
$$ 73 -228 -153 -196 -198 -100 -9 137 -147 -36 -47 56 -128 -98 182 158 -366 17 40 -203 32 191 -84 -194 33
6942C3l7j90J52j92N9J91p4j0PJ21On3J63j88J88l12Q7J70k01p4L04j10j28J72
$$ 33 -4 -194 -42 -234 -175 16 -58 -68 -61 60 66 13 176 -12 176 -136 -49 121 -80 -154 150 40 -88 84
6966H4j18K63k3l23J16K86l86m9L57k26j51K79j53J49k4O8l31J67k8K98j89J26
$$ 84 -34 229 206 -117 -1 285 -101 -150 207 -19 -170 109 -44 105 81 149 -182 -15 -43 255 66 192
6988A92j93J01q5O0m0J99l32Q5J58Jk02L06m3j05k76J96O3j86L21k84j58J43m0
$$ 192 -1 100 15 75 35 234 -98 -13 145 146 -56 250 207 102 -174 22 85 -101 220 -64 -222 -79 -119
7011a19L27k93m9K09J73k66K7k22J50J52k05j56J01K88k61K00R5l6k39J86l46
$$ -119 208 -85 -134 75 248 -18 9 -213 -63 89 -116 -272 -171 117 -144 56 151 115 -124 62 -284
7032b84J51k11L09J36k27m07M82j01K49j51k1m2l6L00k4j26m9j63L24Jj0j93J64
$$ -284 -133 -344 -35 101 -126 -533 -51 -152 97 -54 -75 -117 -153 147 123 -3 -52 -215 109 110 100 -93 71
7055G1m8j31K5l6j71K03J51j08lj61J18K21p4K04l73r5K29j67L11nj18K1j37K68
$$ 71 23 -108 -83 -119 -290 -87 64 -44 -47 -208 -90 131 57 261 -112 -207 22 -145 166 161 43 64 -73 195
7079A95n8l75K07j53J1J66j61N19k84J62k22O6L5l89M19l8j61Q1o3jJ71k93J09
$$ 195 137 -238 -31 -184 -173 -7 -168 351 67 229 7 73 108 -281 138 100 -61 20 -43 -44 127 -166 -57
7102e7J52l66N32j09j63M6K30J52j96j96k03J11Q7o7QL79l58M6p4K04l26R5K24
$$ -57 95 -271 261 152 -11 35 265 417 221 25 -178 -67 20 -47 -39 340 -18 28 -46 158 -168 -73 151
7125A51k28m5j09K07j76M05J85m82L84j2l67K05n8o0j52J13r4R6n5R8o1oq2o9
$$ 151 -77 -122 -231 -24 -200 205 390 -92 292 280 -87 118 60 0 -152 -39 -133 -37 -92 6 -55 -61 -143 -212
7149b12K91k53J46j50p0J22J77K7j66K47Mk88R7k04K13K3J5q9k56M27l40J4J63
$$ -212 79 -174 -28 -178 -248 -126 51 78 -88 159 163 -125 -28 -232 -19 4 19 -70 -326 101 -239 -225 -62
7172f2J49j44R2r9J81l47o9O0J72L61n38K72K92k79J34J12l81K04j28k51J63M29
$$ -62 87 -57 35 -64 117 -230 -299 -239 -67 294 -244 28 320 41 175 287 -94 110 -18 -269 -106 323
7194C23k58o1r0J13j47L52j58j15M59m96L44O7m44M4p0m5K96k59n7M40j62l00
$$ 323 65 4 -86 27 -120 232 74 -41 418 -78 266 333 -111 -67 -137 -182 114 -145 -202 238 76 -224
7216b24L60m5o3J02O5J87l28p9o7K24P9l7j81N8k19L89k20%J96j88J2n0j2Q6K34
$$ -224 136 91 28 130 195 382 54 -25 -92 132 211 174 -7 51 -168 221 1 1 197 9 21 -29 -41 45 279
7241B79j34k69M15m86M16j94j43K85j73Q0k4l83N18l54k5K69l20L03J7r8K05m2
$$ 279 145 -124 291 -195 221 27 -116 169 -4 76 52 -331 187 -167 -192 77 -243 60 77 -21 184 142
7263A42j90J59j37P4j33J96o6j99K92k82P9K82j39l82N5J45J46n2O7j46j28K12
$$ 142 -48 111 -26 48 -85 111 45 -154 138 -144 -65 217 78 -304 -249 -104 42 -10 57 -89 -217 -5
7285eo3K06l39L13l6n05M02K50l09R1j06l2L20r4m0n8L8r9j73L24p1M7q9J03k30
$$ -5 -68 138 -201 112 76 -429 -27 223 -86 5 -101 -133 187 93 53 -5 33 -66 -239 85 14 61 -28 75 -155
7310a55K03j80K28k17J72p0J70K2k81J21k05N04k28k48R6j16J70j21J6m2j8J30
$$ -155 48 -132 96 -121 51 -19 151 173 -108 13 -192 312 84 -164 -68 -184 -14 -135 -119 -161 -179 -49
7332d9J12jl56L17l0J97m44K22J07k16r9N30m18K08p4j14m0J88Q2k58K01l8j28
$$ -49 63 62 -294 23 -7 190 -254 -32 75 -141 -240 290 -128 80 6 -108 -148 40 122 -136 65 27 -101
7355a01L08l45K05K04l40J87Qk6Q2j80m4J42j03j19L41j13j69j28J56J78Pj39
$$ -101 207 -138 67 271 -69 118 126 100 182 2 -42 100 -3 -122 219 106 -63 -191 -35 143 150 11
7377A1l22L36k36J98n4L92l93L4N4k7o4J80K08k75J76k1o16K63K28k83K64o7J22
$$ 11 -311 25 -211 -13 -67 325 -68 -34 20 -7 -71 109 317 42 218 197 -419 -156 72 -211 53 -14 108
7400A08L6o1j80J42J10k30k6k0J67L3j69L9NK75l23J8m6J56o6J83j71J99k28j5
$$ 108 144 83 -97 45 155 -75 -101 -121 46 79 -90 -51 -46 229 -94 -76 -122 34 -32 151 -20 179 -49 -64
7424f4RJ7q2nK57L32j78l43J3k27L66p1M5l05M26l20K49j34J09k8n8J54k41M7
$$ -64 -55 -38 -120 -125 132 464 286 -57 -44 -271 95 24 69 -236 190 -130 119 -15 94 66 8 162 -79 -32
7448c2j16J47j7n8K09l7k22j76K26L70l24K07N1j92l28N56j23k29K4j62O24l37
$$ -32 -148 -1 -18 -76 133 96 -126 -302 -76 294 -30 177 228 36 -292 264 141 -88 -64 -226 398 61
7470F1o2K83j23Rk57M9j48M71l05K8K69m31Q2K80j54k03O8p9P9M6L32j99J04l15
$$ 61 -1 282 159 168 -89 -40 -188 283 -22 6 275 -156 -74 206 52 -151 -83 -162 -83 -37 295 96 200 -115
7494a15K81m37K93JJ27j02J75k85J82m8P2q0N4j50J15j31N3J22J61nk83j69K61
$$ -115 166 -271 22 23 150 48 223 -62 120 72 144 64 118 -32 83 -48 5 127 288 283 0 -169 92
7517I2Q6m04M97j04J73l46J54j60k39K77j41R1J39k58J61L9k57K3K64j87M8J91
$$ 92 178 -226 271 167 340 -6 148 -12 -251 26 -115 -24 115 -143 18 57 -200 -177 87 -100 -52 139
7539A39k65M20j16j76m5j33l9P3R5rK81m64J44K2j23N8mQ4L3o0J81k20oJ4J5J69
$$ 139 -126 294 178 2 -43 -176 -215 -142 -47 -56 225 -239 -95 -73 -196 -138 -142 -58 -25 -85 96 -124 -130 -116 -101 68
7565F8K23j70q3k41K28J0j00J86l39K22j22J09L25m05K47r3K00l91J75k7J58n04
$$ 68 291 121 38 -203 25 35 -65 121 -218 4 -118 -9 316 -89 158 65 265 -126 49 22 180 -324
7587c24M77j88K77k60j06j7L59m54L76j05j72L61k50J08J72k6l64j06J41K52q2
$$ -324 153 -35 242 -18 -124 -141 218 -236 140 35 -137 224 -26 82 254 228 -136 -242 -101 151 69
7608F9J30m7k51K58M6j39q9J32O7l40K97j65P5J86l82L06j73J69j28K50j74l18
$$ 69 199 152 -99 159 205 66 -23 109 176 -164 133 -32 43 229 -153 153 -20 149 21 271 97 -221
7630b21Q7J62j04k6j08K79l17Q3K92j8k5l46M02m15k27N16j15J70L6p9j27L81
$$ -221 -134 28 -76 -102 -210 69 -248 -165 127 109 84 -262 140 -275 -502 14 -101 69 105 26 -101 280
7652B80k00j52O4K32j41l27L25j25J46n7J31k59J27l1j5j0k8K09k23q5K53l39
$$ 280 80 -72 -8 224 83 -244 81 -44 102 45 176 -83 44 13 -2 -12 -40 169 -54 -139 114 -225
7674b25L52j09K1j49J31kj58P5QK42l39Q3L03p1j45J21J09pl71J02k63K37o5K02
$$ -225 127 18 39 -110 21 19 -139 -64 -56 186 -153 -70 233 162 17 138 247 240 -131 -29 -292 -55 -120 82
7698H2p0l21K15l4K01O7M0j13O3l9j04J09p4J3Jj52J28k65M3K11k20L03k30N5
$$ 82 12 -309 -94 -128 73 140 180 67 130 91 -13 96 22 35 36 -116 12 -253 -210 1 -219 84 -146 -91
7722i1l1k35L76k57K72rR5j07j46K03N8j66K6j23J18L36j99j38J85j36j73j6M17
$$ -91 -122 -357 19 -238 34 25 120 13 -133 70 128 -38 -12 -135 -17 319 120 -18 167 31 -142 -158 259
7745B59k21N7N2J75j23r7p9j94R8q7J40K03k58R3J97k01J56j54j0j86K34j64J49
$$ 259 38 95 147 322 199 102 23 -171 -73 -160 -20 183 -75 18 215 14 170 16 6 -180 54 -110 39
7768C9k61J95J04L3k14m1J38Q4k7n8k03N14k31J79P0j98j18J16j45K78l12rl5
$$ 39 -222 -27 77 110 -104 -145 -7 77 50 -8 -211 303 72 251 321 123 5 121 -24 254 -58 -67 -102
7791a02K68j41J02k89N15k02j66M26l70ql16M77l37L0m4Q7J1k09J94M5j70K16
$$ -102 166 25 127 -162 353 151 -15 411 41 33 -283 194 -143 -113 -157 -70 -59 -268 -74 -29 -199 17
7813A7n29K24M15k09rK9J58j06N8j86J29k66M18q5k17J66k2p8j54L02l80L47P1
$$ 17 -512 -288 127 -82 -91 -62 96 -10 48 -138 -9 -275 143 58 -159 7 -15 -93 -247 55 -325 22 93
7836I3l0Pk86L13j00R8j1l0j9J65p9o0J6j4l1j15J80j6j57J98N3k15O1j0o2j1
$$ 93 63 70 -216 97 -3 95 84 54 35 200 121 61 77 63 32 -83 97 81 -76 122 175 -40 21 11 -51 -62
7862f2J19q9r0M65l11q1O9Q2l80K97q5J65o9l05L12j47n0M00l17J3M08l60Q3J76
$$ -62 57 -32 -122 343 32 -49 20 102 -278 19 -66 99 30 -275 37 -110 -160 240 -77 -64 344 -16 67 243
7886B43k02P8j97K80r3j72N8j82R5K4K9K39j13k05R1k21J90L34k60j34N1J69k73
$$ 243 41 119 -78 202 109 -63 -5 -187 -92 -68 -39 200 87 -118 -27 -248 -58 276 16 -118 -67 102 -171
7909a71L82O0j05N5n68J69N42m20j95L52k86KO00l37q7J1M20p51j3M52m1oK57
$$ -171 211 271 166 221 -347 -178 364 -56 -251 101 -185 -183 417 80 -7 4 424 -327 -340 112 71 65 322
7932C22l95J06J00M3k56j96L84Q7m03M53o0l08O3J0J74j69K89j55J40j62k99K47
$$ 322 -73 33 133 176 -80 -276 108 195 -208 245 185 -123 -60 -50 124 -45 244 89 229 67 -232 15
7954A5P0j16q7M5j70K97l57K36j98J54J75n6k06M13q3m5l50j65N58l19K25k10
$$ 15 85 -31 -118 -73 -243 54 -303 -67 -265 -111 64 8 -198 215 132 87 -263 -428 130 -189 36 -174
7976a74N4L31k83J75n4p4L4o7k37J51N22k71K3q7j94J2L36l51l0K80oJ4k6j65
$$ -174 -120 211 -72 103 49 -25 9 -58 -295 -144 378 107 130 43 -151 -139 197 -154 -184 96 90 104 78 -87
8000h7O5k77M73j43r4m2n4l6j6L02Ml06K39j70K78j24R1l5q7j62J8K27l3k09J77
$$ -87 -22 -299 174 31 -63 -105 -159 -195 -211 91 95 -211 28 -142 136 12 103 68 -19 -181 -163 64 31 -178 -1
8025aL41l79K38k18Q3j65J69p4j70J19N4m9J15l5O3j97Q7j70K47k27K84R5k96
$$ -1 340 -39 199 -19 64 -101 68 -6 -176 -57 -3 -52 63 28 91 -106 -19 -189 58 -169 115 210 -86
8048h6j88K27qJ06k8O2l08K08J33k4k10J36j75l4r3K9K46j22O6K13j45n5J00n9
$$ -86 -274 -47 -55 51 23 85 -223 -15 118 94 -116 20 -155 -189 -282 -253 -7 -129 -63 150 5 -50 50 -9
8072ij27M9K6P6J51K8j91p1nJ86k95L31j34q3j15M5K58k13K39j54R6j1j10J53
$$ -9 -136 -87 -61 15 166 194 3 -68 -73 113 -182 149 15 -68 -183 -138 120 -93 146 -8 88 77 -33 120
8096A20l12J64j94J67K30j83J45k06J75P8n5j6j29MM3M2P9j57j7K8%k45K39j36
$$ 120 -192 -28 -222 -55 175 -8 137 -69 106 184 129 113 -16 -12 31 73 152 -5 -22 6 6 -239 0 -136
8120a36R5R3m1K2p9r2J85j59J05n0J3J66j89J37j8j22J65J00k49lL85r28P01j80
$$ -136 -41 52 11 33 -46 -138 47 -112 -7 -57 -44 122 -67 70 52 -70 95 195 -54 -57 328 -600 101 -79
8144g9rn9QJ90K81n11J68k71J77J53o4j15K2j45J15J26k34k1L85O3k68J82m3k67
$$ -79 -88 -147 -139 51 332 -179 -11 -282 -105 48 -16 -131 -109 -254 -139 -13 -247 -268 117 180 -88 94 51 -216
8168b16P9J30r5J54j8j89J12K21L8j58n2J42j61J3J21k33K13j36K83n60M88J0
$$ -216 -137 -7 -102 52 34 -155 -43 178 216 58 6 148 -13 0 121 -112 101 -35 248 -312 176 186
8190A86L
$$ 186 189
8191A89
$$ Imaginary data points
##PAGE= N=2
##DATA TABLE= (X++(I..I)), XYDATA
0@%%%qJ6j4J4k4L2l2M0n6P2q8J12j41J65j92K32k79L26l77M39n09N81o66P64q68
$$ 0 0 0 0 -8 8 -6 8 -16 16 -16 24 -32 40 -48 64 -77 88 -104 128 -151 175 -202 237 -272 309 -357 407 -461
28d61R83j112J256j412J581j769J978k207K453k725L028l356L713m113M557n042
$$ -461 522 -590 666 -746 835 -934 1044 -1163 1290 -1435 1593 -1763 1950 -2163 2394 -2648
44b648N585o198O885p662Q554r591J0809j2260J4035j6263J9146k3046K8660l7479
$$ -2648 2937 -3261 3624 -4038 4516 -5075 5734 -6526 7509 -8754 10392 -12654 16006 -21473
58b1473N3405r1092L33459K89159p52405j96133M57266L47267l25878k62025K02412
$$ -21473 31932 -59160 274299 563458 -188947 -385080 72186 419453 93575 -168450 33962
69C3962K42754k05808k17305J51183K25725j53543k16011J32213K53934j35643
$$ 33962 276716 70908 -146397 4786 230511 76968 -139043 -6830 247104 111461
79A11461l20060L5301L50280P2983l03172j74180K09598J85212j31025j69202
$$ 111461 -208599 -173298 176982 249965 -53207 -227387 -17789 167423 36398 -132804
89a32804R3506J29439r4743j13031J28324J33413j57364k04692J37031K83469
$$ -132804 -39298 90141 -4602 -117633 10691 144104 -13260 -217952 -80921 202548
99B02548m3622k98784n4659K46083R6030j95884q4974K03522J02303k30714j74405
$$ 202548 158926 -139858 -194517 51566 147596 -48288 -133262 70260 172563 -58151 -232556
110b32556K06861K46895j38754k78835O8087K86981j3258l11048p6133L07584
$$ -232556 -25695 221200 82446 -196389 -128302 158679 145421 -165627 -241760 65824
120F5824J89792k32243k66584R9731K39892j1288j55690J2742J01718o4272j19431
$$ 65824 255616 23373 -243211 -143480 96412 85124 -70566 -57824 43894 -20378 -139809
131a39809R0688J76268o3955k18596N381K31909O6575k05470j25658J48347J54533
$$ -139809 -49121 127147 63192 -155404 -150023 81886 148461 -57009 -182667 -34320 120213
142A20213p1895j29243K4142P9344k2547m1518N3268L8540q5933o1692J13741
$$ 120213 48318 -80925 -56783 22561 14 -41504 11764 50304 -35629 -97321 16420
153A6420J13549j18971j89605P1620K52322L1592k45277j33010J65471J67604
$$ 16420 129969 10998 -178607 -106987 145335 176927 -68350 -201360 -35889 131715
163A31715p9944j34733N3720J09869o2169j26642N2093J59096p73j50487m0528
$$ 131715 51771 -82962 -29242 80627 18458 -108184 -56091 103005 102232 -48255 -88783
174h8783J22211N7141r8389n9933R6373Q7949p4316j12331L0290J11093J0280
$$ -88783 33428 90569 -7820 -67753 28620 116569 42253 -70078 -39788 71305 81585
185H1585p9578j6669N8860L727o4097l450P9130K0883q3675n2088O3598O8444
$$ 81585 2007 -14662 44198 47925 -16172 -19622 59508 80391 -3284 -55372 8226 76670
197G6670l4176o5790J891L1759l943K168L9755j0448r4726l6264J12329R8067
$$ 76670 42494 -23296 -21405 10354 6411 8579 48334 37886 -56840 -93104 19225 117292
209A17292q2557j38329K9272J41230J2293j33458m6547J21379Q7281q6677j15088
$$ 117292 34735 -103594 -74322 66908 79201 -54257 -100804 20575 107856 21179 -93909
220i3909K9179J01848J8492n0650j1888J6062k8017l1744N0764P8322k3869j03668
$$ -93909 -64730 37118 55610 4960 -6928 9134 -18883 -50627 137 78459 54590 -49078
232d9078k3967R0388N7961n8006o6990K8779O2236q625n4561j1856L7470K2400
$$ -49078 -73045 17343 75304 17298 -49692 -20913 41323 32698 -21863 -33719 3751 26151
244B6151j4937j9526p058p98J1326K2782j868m0711k4333M0012M9350k2218o2225
$$ 26151 11214 -8312 -15370 -16168 -4842 17940 16072 -24639 -48972 -8960 40390 18172 -44053
257d4053m703N5250J9799m4305k3987M2517L1459m5506n4274L1648P4162M538
$$ -44053 -48756 6494 26293 -18012 -41999 518 31977 -13529 -67803 -36155 38007 42545
269D2545o6512l4402L4435L4349q740j3759J0837L485k4223j3204K8122K7450
$$ 42545 -23967 -58369 -23934 10415 1675 -12084 -1247 2238 -21985 -35189 -7067 20383
281B0383j6611k8758R972K5883j0468l2588O571M5794J6767m1338m3393J4087
$$ 20383 3772 -24986 -15014 10869 401 -32187 -25616 20178 36945 -4393 -47786 -33699
293c3699N1150K3242k6518m0182j0826K5723L8646J0000l6591m0792J5687N4360
$$ -33699 17451 40693 14175 -26007 -36833 -11110 27536 37536 945 -39847 -24160 30200
305C0200J0733m8865k8876L8382M1363k5827m9859R573N5552J4427m4214l1408
$$ 30200 40933 -7932 -36808 1574 42937 17110 -32749 -23176 32376 46803 2589 -28819
317b8819J9298K7435L543l091j016j6376k1504J2528M0430J2946l4860l2230J4162
$$ -28819 -9521 17914 21457 18366 17350 974 -20530 -8002 32428 45374 10514 -21716 -7554
330g554L2434j58k2522M82J9219R0k2999r642J8259K0621m06j8208j8590k848
$$ -7554 24880 24722 2200 2682 21901 21991 -1008 -10650 7609 28230 27824 9616 -8974 -11822
344a1822J6997K3620K385k7681k6111J2511L5157L457l2761j4596K6929J8073
$$ -11822 5175 28795 31180 3499 -22612 -10101 25056 28513 -4248 -18844 8085 26158
356B6158k6691k8311K1699M0195n493m7400j9728L3980L4267j1197k9550o586
$$ 26158 -533 -28844 -7145 33050 27557 -19843 -39571 -5591 28676 17479 -12071 -18657
368a8657R522K580M032J3179j317k4591j4232K1562K4955j2331k9620L941L3075
$$ -18657 -9135 -6555 -2523 10656 9339 -15252 -29484 -7922 17033 4702 -24918 -20977 12098
381A2098L327l8243j6555L5468L4846j8900m3210p728L0006K4231l896j8388j3672
$$ 12098 15425 -22818 -39373 -3905 30941 12041 -31169 -38897 -8891 15340 11444 -6944 -20616
394b0616m095J1000K2294P502k4929k5831J5193L4463m963l6578l791L8495J5622
$$ -20616 -24711 -13711 8583 16085 -8844 -34675 -19482 14981 10018 -26560 -30351 8144 23766
407B3766l6404l2561K3927M3355j556l9086j5165K1178J5651n081o28N639j0630
$$ 23766 -12638 -45199 -21272 22083 20527 -18559 -33724 -12546 3105 -1976 -2604 3035 -7595
420g595j6465Q656K7137L884k4367j1384J8888J5115j5183j5413J8495K6000j2005
$$ -7595 -24060 -15404 11733 15617 -8750 -20134 -1246 13869 -1314 -16727 1768 27768 15763
433A5763l4568l027L4322K3414j6073k7087m165J7431J4602p50p578o179k765
$$ 15763 -18805 -21832 12490 35904 19831 -7256 -11421 6010 20612 19862 12284 6105 3340
446C340L430P939O28r109o18J1739K628j8714j3848J6593K7511k380l3651k1237
$$ 3340 6770 14709 15337 6228 5610 17349 19977 1263 -12585 4008 31519 29139 -4512 -25749
460b5749J9754L2991J870k6921j8479Q703J5140N174m303p418n626J185P527L741
$$ -25749 -5995 26996 28866 1945 -16534 -7831 7309 12483 8180 762 -4864 -3679 3848 7589
474G589o320o290P694J1881o833k1898k689K6945K0058j7379l0650l785K4933
$$ 7589 1269 -5021 2673 14554 7721 -14177 -16866 10079 30137 12758 -17892 -21677 3256
487C256K0237n613k0742j1089O885J3809M783p808r558K057R865M89j4251o634
$$ 3256 23493 17880 -2862 -13951 -7066 6743 11526 3718 -5840 -3783 6082 6571 -7680 -14314
501a4314J5604J5832r898k3939n530J9496J7095m668j7878r537O540J1191O897
$$ -14314 1290 17122 7224 -16715 -22245 -2749 14346 9678 -8200 -17737 -11197 -6 6891
514F891m605j2262o940R769J3785m070j5659r19J5943N495j6459j4036J2256K1194
$$ 6891 2286 -9976 -16916 -7147 6638 2568 -13091 -14010 1933 7428 -9031 -23067 -10811 10383
528A0383j516k2683j2325J2169J7008L155r115j0819o258L652J2752Q063q301
$$ 10383 8867 -13816 -26141 -13972 3036 6191 -2924 -13743 -20001 -16349 -3597 4466 -3835
541c835j2865J195J2271J607j2448k996J7805J2649j6105k4043N601K9299J3194
$$ -3835 -16700 -15505 -3234 -1627 -14075 -17071 734 13383 -2722 -26765 -21164 8135 21329
554B1329j6993j9779L379J6462O523m739l145P03r61L51O197K014p454l296J1386
$$ 21329 4336 -15443 -12064 4398 10921 6182 3037 3740 2779 3130 9327 11341 3887 591 11977
569A1977Q120j3087j6051R766K4093L9k9282j5150K2735K7580q078l0216r947
$$ 11977 20097 7010 -9041 725 24818 24857 -4425 -19575 3160 30740 22662 -7554 -17501
582a7501J6319J4935j576p191m656n645k455R037J1150m796j3673K794J5301k753
$$ -17501 -1182 13753 12177 4986 330 -5315 -7770 1267 12417 7621 -6052 -3258 12043 9290
596I290k2581k906K9832J9998k2483l2325M529L0747J1709j5582j1787M559L375
$$ 9290 -13291 -16197 13635 33633 11150 -21175 -16646 14101 25810 10228 -1559 3000 6375
609F375m354L285J0218k617j2702j09J1792M05j4183k761J5485O137j6850j4204
$$ 6375 2021 5306 15524 12907 205 96 11888 12293 -1890 -4651 10834 16971 121 -14083
623a4083J2401J9020p722k3498l031K0663J0925j4575j5892L115J1201O50n860
$$ -14083 -1682 17338 9616 -13882 -16913 3750 14675 100 -15792 -12677 -1476 -826 -6686
636f686R14M522l042o558K26L857j445j38J0324N728j7502k1563R982L4295J0160
$$ -6686 -5772 -1250 -4292 -10850 -10624 -6767 -8212 -8350 1974 7702 -9800 -31363 -21381 12914 23074
651B3074k8421k6406J1214K6553K423j6986m972J1355L804q736m675L836K042
$$ 23074 -5347 -31753 -20539 6014 8437 -8549 -13521 -2166 1638 -7098 -11773 -7937 -5895
664e895K089P078J501j5041j4375J1618K6351L823k6052j7899J8034K3968n677
$$ -5895 -3806 3272 4773 -10268 -24643 -13025 13326 17149 -8903 -26802 -8768 15200 9523
677I523k2485k951J7438Q932p763p521K409K718k967K340Q598Q56j0047m157Q451
$$ 9523 -12962 -15913 1525 10457 2694 -4827 -2418 300 -2667 -327 8271 9127 -920 -5077 3374
692C374M082r164j898J5656P799j7335j8943P605K2671M451j5229p606Q078K837
$$ 3374 7456 -1708 -3606 12050 19849 2514 -16429 -8824 13847 18298 3069 -4537 3541 6378
706F378j0027k820J3140J0432p490j3495m366M507P464P447L500q508j4144k576
$$ 6378 -3649 -6469 6671 17103 9613 -3882 -8248 -3741 3723 11170 14670 6162 -7982 -10558
720a0558J5314J4418p394j8914q40J9187R323j5596j5999P534J8772M275j4491
$$ -10558 4756 19174 11780 -7134 -7974 11213 20536 4940 -11059 -3525 15247 19522 5031
733E031j1062N075R926J145m652k507j417Q85P148L328j2538j4644P336K4520
$$ 5031 -6031 -956 8970 10115 5463 2956 1539 2424 9572 12900 362 -14282 -6946 17574
747A7574O522k3263k2087P780K2675N388j2950p615L834R89n471K95O284K967
$$ 17574 24096 833 -21254 -13474 9201 14589 1639 -5976 -2142 -1153 -6624 -6329 -45 2922
761B922k141k500j776n360l201P495J1577k76j3483r259P500J0750k084p852K740
$$ 2922 781 -1719 -3495 -8855 -12056 -4561 7016 6740 -6743 -16002 -8502 2248 164 -7688 -4948
776d948P799l192j0894k646J0595Q396m614r278p35O891K881m029l907j25K916
$$ -4948 2851 -341 -11235 -13881 -3286 5110 496 -8782 -9517 -2626 255 -3774 -7681 -7806 -4890
791d890N831L110o437j1988j943J4329J3586n765j7081n527J2983J0106o737j0570
$$ -4890 941 4051 -2386 -14374 -16317 -1988 11598 5833 -11248 -16775 -3792 6314 -423 -10993
805a0993L505J2915K057j1370j0346K447J2756J0311j445j2746j2305K340J5925
$$ -10993 -7488 5427 7484 -3886 -14232 -11785 971 11282 9837 -2909 -15214 -12874 3051
818C051J1855o349j5428k679J0878P029n639p744L374R219K171q211p421L531
$$ 3051 14906 8557 -6871 -9550 1328 8357 2718 -5026 -1652 7567 9738 1527 -5894 -2363
832b363R065L311m597m871k11K112K390J287j905k910J449N529J009o531n523
$$ -2363 6702 10013 5416 545 334 2446 4836 6123 4218 1308 2757 8286 9295 2764 -2759
847b759M212P794k01o090J95M226k147p042P21R920N633n542j0206m633M595Q532
$$ -2759 1453 9247 9046 2956 3151 7377 5230 -1812 -1091 8829 14462 8920 -1286 -5919 -1324 7208
863G208O108l967j0025m814N537P598n85o610j827N699L318n840q117M23J0075
$$ 7208 13316 9349 -676 -5490 47 7645 7060 450 -1377 4322 7640 1800 -6317 -5894 4181
878D181Q197m688j4173o053R443J1872p43j0692p507N082Q785K659p549q295M49
$$ 4181 12378 7690 -6483 -12536 -3093 8779 8036 -2656 -10163 -5081 3704 6363 -1186 -9481 -9032
893i032R470O740n246j1017k754Q384P552l263p820j152N676K979m016n895M51
$$ -9032 438 7178 1932 -9085 -11839 -3455 4097 834 -6986 -8138 -2462 517 -3499 -9394 -8943
908h943P430M844l302q728l292M904P328K163m485n091q29K771K132Q5O2J958
$$ -8943 -1513 3331 29 -8699 -11991 -7087 241 2404 -2081 -7172 -8001 -5230 -3098 -3013 -2951 -993
924i93J29k766m205P59O280M687l198o913j118N571M511j619m230r95L935K812
$$ -993 -864 -3630 -7835 -7076 -796 3891 693 -6220 -7338 -1767 2744 1125 -3105 -4100 -165 2647
940B647k037m587l36N191M449k193n847k541O032O892j958r108l130O743Q576
$$ 2647 610 -3977 -4313 878 5327 3134 -2713 -5254 778 7670 5712 -3396 -6526 217 8793
955H793n85q617o524L454J0190M475o675r592R0Q582N732m450o911J142O405J237
$$ 8793 8208 -409 -6933 -3479 6711 11186 4511 -5081 -4991 3591 9323 4873 -2038 -896 5509 6746
971F746m860m426K134N511L774l002q100l479P310R511o33r753o148N443P774
$$ 6746 1886 -2540 -406 5105 8879 5877 -2223 -5702 1608 11119 10486 733 -5415 28 7802
986G802j8o101k090K428K823l14k108j343R39K433M00l557k825L080M269p12m604
$$ 7802 7784 1683 -407 2021 4844 4530 2422 1079 2018 4451 4851 1294 -1531 1549 5818 5106 502
1003E02l116K693M798R63n046m309J297M785J874l599l136R91L286n79l460r55
$$ 502 -2614 79 4877 5840 794 -3515 -2218 2567 4441 842 -2294 -1303 1983 1404 -2056 -3011
1019c011L635K710k639m884j353L073M464J868m747n775P2O569L778l741n946
$$ -3011 624 3334 695 -4189 -5542 -2469 1995 3863 -884 -6659 -6587 -18 3760 19 -5927
1034e927p00N735L090m219n069J803N928J083n046m647J574N848K855l553n695
$$ -5927 -6627 -892 2198 -2021 -7090 -5287 641 1724 -3322 -7969 -6395 -547 2308 -1245 -6940
1049f940j144M660N023n27o208m349L784O841L17o245l937M089O037r15n686k549
$$ -6940 -8084 -3424 1599 1072 -5136 -9485 -5701 1140 1457 -4788 -8725 -4636 1401 486 -5200 -7749
1065g749M182N345j598n253j395L497L910J144l084m652jN711M166k433o039r09
$$ -7749 -3567 1778 180 -5073 -6468 -2971 939 2083 -1001 -5653 -5654 57 4223 1790 -4249 -5158
1081e158N552M033k300m925J065M812Q91l654k079K923L527M61k897k860N65L915
$$ -5158 394 4427 2127 -2798 -1733 3079 3970 316 -1763 1160 4687 5148 2251 -609 -44 3871
1097C871L450j730m621j550L030M288l19l391k280K638K847j074k890p8K831K306
$$ 3871 7321 5591 970 -580 2450 6738 6419 3028 748 3386 6233 5159 2269 2191 5022 7328
1113G328k986m101P14N264K340l847m589J38L752K696p42m044k731J656M481J041
$$ 7328 4342 241 955 6219 8559 4712 123 261 4013 6709 5967 1923 -808 848 5329 6370
1129F370l535m058J535M581K17n331k716M075M106j903n462j778L402M234Nn032
$$ 6370 2835 -1223 312 4893 5110 -221 -2937 1138 5244 3341 -2121 -3899 -497 3737 3742 -1290
1145a290m004J392M603K677k931n648j248M803M156k645o079o42M799K835k794
$$ -1290 -5294 -3902 701 3378 447 -5201 -6449 -1646 2510 -135 -6214 -6856 -2057 778 -2016
1160b016m994K23M625K768l213m393K42L790K300r68l653k363K045M805J045m220
$$ -2016 -7010 -6787 -2162 606 -2607 -7000 -6758 -2968 -668 -1636 -5289 -7652 -5607 -802 243 -3977
1176c977l633K415M143O48m104j986K903L484j073l993m79L084K851n46k592k031
$$ -3977 -7610 -5195 -1052 -404 -4508 -6494 -3591 -107 -1180 -5173 -5652 -2568 283 -263 -2855 -4886
1192d886J051L310J658k117k474K76L127J825j661k296J135L130J088l080k174
$$ -4886 -3835 -525 1133 -984 -3458 -3182 -55 1770 109 -2187 -1052 2078 3166 86 -2088
1207b088K301M048L81l620k253K275M026J47k935k126J436K813J083j465k752
$$ -2088 213 4261 4642 1022 -1231 1044 5070 5217 2282 156 1592 4405 5488 4023 1271
1222A271m18K979K091j640l337o22L886K299l282m425J034N679K158n015m639
$$ 1271 853 3832 5923 4283 946 324 4210 6509 3227 -1198 -164 5515 7673 2658 -1981
1237a981Q30M731K570j772m338j986K387L911N76l243l611J350M755M86m733l226
$$ -1981 -1151 3580 6150 4378 40 -1946 441 4352 4928 1685 -1926 -576 4179 4665 -68 -3294
1253c294L055N591r13n422l021L249M813j76l926k456L67L069J696j488l023j758
$$ -3294 -239 5352 4439 -983 -4004 -755 4058 3882 -44 -2500 -2133 936 2632 1144 -1879 -3637
1269c637K840L647j113m396k057K923L687j023l525r44K430J510j963k075J208
$$ -3637 -797 2850 1737 -2659 -4716 -1793 1894 871 -2654 -3598 -1168 342 -1621 -3696 -2488
1284b488J842R5j376j600l3J228J250N60j139j400k9J279N71r96l38J555J478
$$ -2488 -646 -551 -1927 -3527 -3560 -2332 -1082 -522 -1661 -3061 -3090 -1811 -1240 -2236 -2574 -1019 459
1301D59j670l220Q19L863K159k980l787L87L983J197k756j812J295K678O37j783
$$ 459 -1211 -4431 -3612 251 2410 -570 -4357 -3970 13 1210 -1546 -3358 -2063 615 1252 -531
1317e31j817j247K223L462M99l980l957K454N731J060m853m061L213N629m12n135
$$ -531 -2348 -3595 -1372 2090 2589 -1391 -5348 -2894 2837 3897 -956 -5017 -1804 3825 3413 -1722
1333a722k870L102M462R99k580l382j036K687L775o8l167l118J943M673j30m634
$$ -1722 -4592 -1490 2972 3971 1391 -1991 -3027 -340 3435 3367 200 -2918 -975 3698 3568 -1066
1349a066j658L749M261j550n080k027L609L424J67k592j658J71R36R77J202p57
$$ -1066 -2724 1025 5286 3736 -1344 -3371 238 3662 3829 1237 -421 -250 686 1663 2865 2108
1365B108j830K09J687K50k070k66J749J650j462k466P22K637p47k277l3L104P06
$$ 2108 278 487 2174 2424 354 88 1837 3487 2025 -441 281 2918 2171 -106 -139 2965 3671
1382C671k894k156P74K928N71j270j567o07J357M81J76p67j052P12K113K81l489
$$ 3671 777 -1379 -605 2323 2894 1624 57 -550 807 1288 1464 697 -355 357 2470 2751 -738
1399g38l618K762O020Q98o131m870K823N686J585m536l212J780K341L04j477j404
$$ -738 -4356 -1594 4426 5324 -807 -5677 -2854 2832 4417 -119 -3331 -1551 790 1094 -383 -1787
1415a787j087J982L435pm828l320K435N591J269n526l661K596M331l62m140q80
$$ -1787 -2874 -892 2543 2536 -2292 -5612 -3177 2414 3683 -1843 -5504 -2908 1423 1061 -3079 -3959
1431c959K661J749j047j854j142J41J720J585M28k200k460P67K860J016k004j343
$$ -3959 -1298 451 -596 -2450 -3592 -3451 -1731 -146 282 -1918 -4378 -3611 -751 265 -1739 -3082
1447c082K050J124j642k162J086K989L34k227j070J530J151j063j362J933K163
$$ -3082 -1032 92 -1550 -3712 -2626 363 697 -1530 -2600 -1070 81 -982 -2344 -411 1752
1462A752r78k459Q5R11J170N70N73n37k497p78L073K715j445l835L27M420R83
$$ 1752 774 -1685 -1600 -689 481 1051 1624 1087 -1410 -2188 885 3600 2155 -1680 -1353 3067 4050
1479D050m035k546K470L831J04k695k348O46K269J404k49j522j705O15K395R94
$$ 4050 15 -2531 -61 3770 3874 1179 -1169 -523 1746 3150 2901 1379 -326 289 2684 3678
1495C678k878k940K026M727N65m759l854K501M326J107l104k566J250J542j89
$$ 3678 800 -2140 -114 4613 5178 419 -3435 -934 3392 4499 1395 -1171 79 1621 1432
1510A432o68P88k48p04N14L67r08j469Q75L473J92l526k195J901K863q49k718
$$ 1432 764 1552 1304 600 1114 1481 573 -896 -21 3452 3644 118 -2077 -176 2687 1838 -880
1527h80L46J877l8k116o53J653R93n69j219Q5J22n7q2J33J76r8k67J071n80k308
$$ -880 -534 1343 1305 -811 -1464 189 1182 613 -606 -521 -399 -456 -538 -405 -229 -327 -594 477 -103 -2411
1547b411o79K305K734j318l799l55K493K408j670k621O51K367m07j517j230R87
$$ -2411 -3090 -785 1949 631 -3168 -3523 -1030 1378 -292 -2913 -2262 105 -302 -1819 -3049 -2062
1563b062J003M75J43j112j678k05K603K487j639l571p3L502J445k768k186J922
$$ -2062 -1059 -584 -441 -1553 -3231 -3436 -833 1654 15 -3556 -3629 -127 1318 -1450 -3636 -1714
1579a714K913n5k609j270J237J880N39p17q81m71M53J202Q06j063j397Q04K010
$$ -1714 1199 1144 -1465 -2735 -1498 382 921 204 -677 -1148 -695 507 1313 250 -1147 -343 1667
1596A667L42k306j031J573K317m58k717n95K070J093j542r83P80J265l60j226
$$ 1667 2009 -297 -1328 245 2562 2104 -613 -1208 862 1955 413 -570 210 1475 1115 -111
1612a11k90J55N23N81O18n41k218p30K726J503j448k171J003K571n72k401o11
$$ -111 -401 -246 277 858 1476 935 -1283 -2013 713 2216 768 -1403 -400 2171 1599 -802 -1413
1629a413K586J575j333j719k12J414J239k46q07n27J89J054N02o07j168q5J387
$$ -1413 1173 2748 1415 -304 -516 898 2137 1891 1084 557 746 1800 2302 1695 527 442 1829
1646A829J327j159j810p78K300J486j937j715Q9K226J28j782j125J176Q64m18
$$ 1829 3156 1997 187 -591 1709 3195 1258 -457 -368 1858 1986 204 -921 255 1119 701
1662G01j017n19j11N81P60L46j241j800O38K097M13j967j293J520J656o12k071
$$ 701 -316 -835 -946 -365 395 741 -500 -2300 -1662 435 848 -1119 -2412 -892 764 152 -1919
1679a919m80K202R19p51j737l04J386O80l73p11m16L06O92M65q20j087k51J495
$$ -1919 -2399 -197 722 -29 -1766 -2070 -684 -4 -377 -1088 -1504 -1198 -506 -41 -861 -1948 -2199 -704
1697g04J027j025k047J46K306Q95j898j001Q13J156J05j178l42N22J276n30j79
$$ -704 323 -702 -2749 -2603 -297 598 -1300 -2301 -1488 -332 -227 -1405 -1747 -1225 51 -479 -658
1714f58J44q42L93J255K91j137r62J308J314n27j360j80J585J001j283j132k21
$$ -658 -514 -1356 -963 292 583 -554 -1516 -208 1106 579 -781 -961 624 1625 342 -790 -1011
1731a011J552N28o83o36j23L75O03j55m61o30M21R47m79l15n95O71J074J27j245
$$ -1011 541 1069 386 -250 -373 2 605 450 -11 -641 -220 727 248 -67 -662 9 1083 1210 -35
1750c5j049J265J909l10j865q59J714J295k14j239k18K18J138R1k32o55l22P91
$$ -35 -1084 181 2090 1780 -85 -944 770 2065 1851 612 394 612 1750 1841 1609 954 632 1423
1768A423J321n35j905%J075J118r41j651N7J363P66j093r76n46J211N19n3j448
$$ 1423 2744 2209 304 304 1379 2497 1556 -95 -38 1325 2091 998 22 -524 687 1206 1153 -295
1786b95m62K79J101r0q92p69Q87N71l02o92l57L85R85K01j484l85R09R69p7j232
$$ -295 -757 -478 623 533 -359 -1128 -241 330 28 -664 -1021 -636 349 550 -934 -1319 -410 559 482 -750
1806g50m76N13J245n33n87m81L88N09J12l07o74k26Q53O37o21j038N40O28N14
$$ -750 -1226 -713 532 -1 -588 -1069 -681 -172 -60 -367 -1041 -1267 -414 223 -398 -1436 -896 -268 246
1825B46j336q75P88J236J63j133o25L17R62K63q36n93K17N43Q13p47o61J33N72
$$ 246 -1090 -1965 -1177 59 222 -911 -1536 -1219 -257 6 -830 -1423 -1206 -663 150 -597 -1258 -1125 -553
1844e53P28l8j527j52J241Q10l41q72l75O82J058m33o43n41O98Q24k03q58r6K75
$$ -553 175 137 -1390 -1542 -301 509 168 -704 -1079 -397 661 228 -415 -956 -258 566 363 -495 -591 -316
1864c16R45K93q55p07M27J230J60j079j134Q05J181K97j024m15L45M05P24m35
$$ -316 629 922 67 -640 -213 1017 1177 98 -1036 -231 950 1247 223 -192 153 558 1282 847
1882H47o12k23P75N10m74n74j56Q15M06n23l20l11J042L97m28j025o1Q39O89n46
$$ 847 235 12 787 1297 823 249 93 908 1314 791 471 160 1202 1599 1171 146 85 924 1613 1067
1902A067p48l28O06P27o36m79j48M57L44j59n16p5M47L08l40o56j97M65N97j3
$$ 1067 319 -9 597 1324 688 209 61 518 862 703 187 112 559 867 527 -129 -326 139 736 723
1922G23j018k05P30Q70m04j171m61Q35O53k86o54l97J72R05j04q07n75K18J103
$$ 723 -295 -500 230 1100 696 -475 -936 -101 552 266 -388 -785 -613 292 188 -619 -1194 -976 127
1941A27np52o22R0J139J28m57r78K04O72J3k6q52J04R66L85p42m53l53J073L48
$$ 127 122 -630 -1252 -1162 -23 105 -352 -1330 -1126 -454 -441 -467 -1319 -1215 -249 136 -606 -1059 -1412 -339 9
1962IJ03q91l98O07J34O22q03m20M99N86%r70P5M56N90l63l62mJ63J00L32p50
$$ 9 112 -779 -1177 -570 -436 186 -617 -1037 -538 48 48 -922 -847 -391 199 -164 -526 -530 -367 -267 65 -685
1984f85r0N25O65o46k42k16M02P47o1m03m92N56K23J92m97l52M68K31J20n38j59
$$ -685 -775 -250 415 -231 -473 -689 -287 460 399 -4 -496 60 283 475 -22 -374 94 325 445 -93 -252
2005b52N36O22K49q46o86J74J038N70n79j085K33Q34M15l05p73j37P74L88j77
$$ -252 284 906 1155 309 -377 -203 835 1405 826 -259 -26 808 1223 918 145 8 782 1170 993
2024I93p51m7O13J32l6l47j26j13O32j86m81k36O80M44k7j103k26M43N79J85o35
$$ 993 242 195 808 940 904 557 431 318 950 764 283 47 727 1171 1144 41 -185 258 837 1022 387
2045C87o89N04K70p2K6o83J63J69K60p43k05M50N22k0k22r18L50M77J14o63l91
$$ 387 -302 202 472 400 426 -257 -94 75 335 -408 -613 -163 359 339 117 -801 -451 26 140 -523 -914
2066i14N73K74J01n38m32K37Q26j14k79n24j15P87J37k50n09%P09j63r7o40L70
$$ -914 -341 -67 34 -504 -936 -699 127 13 -266 -790 -905 -118 19 -231 -740 -740 -31 -194 -291 -931 -561
2087e61J33O80n18n24k83O23J010m40m06l51M18J90J40n21j49L34K68J12n00m10
$$ -561 -428 252 -266 -790 -1073 -450 560 120 -286 -637 -219 -29 111 -410 -559 -225 43 155 -345 -755
2107g55K15M96K61k51j131O16N64j55k53K23k84K04K91n78k76M15M17j52J71o85
$$ -755 -540 -44 217 -34 -1165 -549 15 -140 -393 -170 -454 -250 41 -537 -813 -398 19 -133 38 -647
2127f47N3P04J02j96k38P8N04j35j64q3k7N48L99l50m80j38O61O32m44l62J23
$$ -647 -594 110 212 16 -222 -144 360 225 61 -22 -49 499 898 548 68 -70 591 1223 779 417 540
2148E40L63Rl31o76N20M41O33o05n21k19L09Q27j67n65o37L48N06R3j76o94K43
$$ 540 903 912 581 -95 425 866 1499 894 373 154 463 1290 1123 558 -79 269 775 868 692 -2 241
2169B41K60J49o60o6J36M78J96k91p08J75K11M04l05k21N1J96M1n2l55j88N82
$$ 241 501 650 -10 -76 60 538 734 443 -265 -90 121 525 220 -1 50 246 287 235 -120 -308 274
2190B74P3mo77J77j12N76j62r3k32L27Qk29l60P4K48K04p1l25l32M34R0l29k27
$$ 274 347 343 -334 -157 -269 307 145 52 -180 147 155 -74 -434 -360 -112 92 21 -304 -636 -202 -112 -441 -668
2213f68J49J30K69m34k79k80O50J25L8n15j83N81K81rm21m25K53Q07m48k45k74
$$ -668 -519 -389 -120 -554 -833 -1113 -463 -338 -300 -815 -998 -417 -136 -145 -566 -991 -738 69 -379 -624 -898
2234h98L87N56K6n30j32j98J047j34k65l16m33O15L41M2r55L95K55L24k57m22
$$ -898 -511 45 71 -459 -591 -789 258 124 -141 -457 -890 -275 66 108 -847 -452 -197 127 -130 -552
2254e52K6L13N82j69k72M5j14N54k02M2n01L57M03L7n18j96N48K38p7M0l05L6
$$ -552 -526 -213 369 200 -72 -27 -141 413 211 253 -248 109 512 549 31 -165 383 621 544 584 279 315
2276C15L19J98k01k21K21J48k24m28L71K03q1k17r5k09L42M3k2m26m2J71J06L41
$$ 315 634 832 631 410 631 779 555 127 498 701 620 403 308 99 441 484 462 36 -6 165 271 612
2298F12o68n14M96L45M6l40m0k06O27J43l71k28j93N13J79q8n29PN63K12o08K8
$$ 612 -56 -570 -74 271 317 -23 -63 -269 358 501 130 -98 -291 222 401 313 -216 -209 354 566 -42 -14
2320a4m00P24n6Kl94m94M59L87J0o57l2K99L33k79m23K0k57N04J51m31J75j33
$$ -14 -414 310 254 256 -138 -632 -173 214 224 -433 -465 -166 167 -112 -535 -515 -772 -268 -117 -548 -373 -506
2342e06J31L96n74L5N0M76N1n82J18m3L84R1k55m23L98MK84m58N8j0K44R2m06
$$ -506 -375 21 -553 -518 -468 8 59 -523 -405 -448 -64 27 -228 -651 -253 -249 35 -423 -365 -375 -131 -39 -445
2365d45m4O01j31r2j5Kj65J73Q9j17j89j96N54L35k89j08k19L12Q6j30k80j93
$$ -445 -489 112 -19 -111 -126 -124 -289 -116 -27 -144 -333 -529 25 360 71 -37 -256 56 142 12 -268 -461
2387d61O88r6L27o62j17L4M49L04o01J59K64j57K95l24l16L66K33j83l2l27R2
$$ -461 227 131 458 -204 -321 -287 162 466 -135 24 288 131 426 102 -214 152 385 202 170 -157 -65
2408f5L72j13L3k30K95M80k90l34l23P4N30n5Kl68qK77L25k96l94q2K25M26o9
$$ -65 307 194 227 -3 292 772 482 148 -175 -101 429 374 376 8 0 277 602 306 -88 -170 55 481 412
2431D12k93k08K60J04j87k14J75J74J70j22k49j32q1N11n6l89K53r2L31l59j3
$$ 412 119 -89 171 275 88 -126 49 223 393 271 22 -110 -191 320 264 -125 128 36 367 8 -5
2452ej70K74R4P5j40k86k13J41M46j97m72NO20J70j40k59j17J39K20j50l06j15
$$ -5 -175 99 193 268 128 -158 -371 -230 216 19 -453 -448 172 342 202 -57 -174 -35 185 35 -271 -386
2474c86K22j29M90k67j93J01L40M6o16J78K04J82l28m11K19J39L55j55n79K86
$$ -386 -164 -293 197 -70 -263 -162 178 224 -392 -214 -10 172 -156 -567 -348 -209 146 -9 -588 -302
2494c02J84L19rq24K09J21M07l32j1m16L57L14q8j83l21M41J71J50o43qJ76p5
$$ -302 -118 201 192 -632 -423 -302 105 -227 -238 -654 -297 17 -71 -254 -575 -134 37 187 -456 -464 -288 -363
2516c63M39j75k18KK47J13j01k18J53Q7K41j60j77L11j60O78r83K82Q9L7L15k48
$$ -363 76 -99 -317 -315 -68 45 -56 -274 -121 -34 207 47 -130 181 21 699 -284 -2 87 124 439 191
2538A91L7j25j15L38k67l1N5L15J1l87K7K42K48p4l36k21K67J32R8J77m08P2J73
$$ 191 228 103 -12 326 59 28 83 398 409 22 49 291 539 465 129 -92 175 307 405 582 174 246 419
2561D19L45l57k18J60Q6j68P8k46J05k10O7M96n26J2K73j30J09r7k40j4L34K66
$$ 419 764 407 189 349 435 267 345 99 204 -6 61 557 31 43 316 186 295 198 -42 -56 278 544
2583E44n22j51N0J0M13l49k61J74J50J44l75R5k24N43j54J1m26J39L35n9j42k39
$$ 544 22 -129 -79 -69 344 -5 -266 -92 58 202 -173 -78 -302 241 87 98 -328 -189 146 87 -55 -294
$$ [...]
8191A64
##END NTUPLES=NMR FID
##END=
