##TITLE=1H_EC-3222(1)
 CDCl3, 8 sc, 
 4.2.2020
##JCAMPDX= 6.0         $$ Bruker NMR JCAMP-DX V2.0
##DATA TYPE= NMR FID
##DATA CLASS= NTUPLES
##ORIGIN= UXNMR, Bruker Analytische Messtechnik GmbH
##OWNER= root
$$ XWIN-NMR		Version 3.5
$$ Tue Feb  4 13:50:39 2020 Russian Standard Time (UT+4h)  she@DPX200
##.OBSERVE FREQUENCY= 200.1315
##.OBSERVE NUCLEUS= ^1H
##.DELAY= (6, 6)
##.ACQUISITION MODE= SIMULTANEOUS
##.ACQUISITION SCHEME= undefined
##.AVERAGES= 8
##.DIGITISER RES= 18
##SPECTROMETER/DATA SYSTEM= spect
##.PULSE SEQUENCE= zg30
##.SOLVENT NAME= CDCl3
##.SHIFT REFERENCE= (INTERNAL, CDCl3, 0, 15.7039)
##AUDIT TRAIL= $$ (NUMBER, WHEN, WHO, WHERE, WHAT)
$$ ##TITLE= Audit trail, XWIN-NMR		Version 3.5
$$ ##JCAMPDX= 5.01
$$ ##ORIGIN= Bruker BioSpin GmbH
$$ ##OWNER= she
$$ F:/spectra/data/she/nmr/H-F/1/audita.txt
$$ ##AUDIT TRAIL=  $$ (NUMBER, WHEN, WHO, WHERE, WHAT)
(   1,<2020-02-04 13:49:40.42 +0400>,<she>,<DPX200>,
      <created by zg, POWCHK disabled, PULCHK disabled
       configuration hash MD5:
       00 E9 B6 7A A2 85 ED C7 34 08 36 98 17 FE 4E 26
       data hash MD5: 16K
       CC 1B 00 34 C7 BB ED AB 46 BA 4F 64 70 FE B9 3C>)
$$ ##END=
$$ 
$$ hash MD5
$$ AC 7E 54 BA 31 10 40 39 F2 F8 D0 6B AB 2D 88 E7
##$RELAX= 
##$RELAX= 
##$RELAX= 
##$RELAX= 
##$RELAX= 
##$RELAX= 
$$ Bruker specific parameters
$$ --------------------------
##$DU= <F:/spectra>
##$EXPNO= 1
##$NAME= <H-F>
##$PROCNO= 1
##$TYPE= <nmr>
##$USER= <she>
##$AMP= (0..31)
100 100 100 100 100 100 100 100 100 100 100 100 100 100 100 100 100 100 
100 100 100 100 100 100 100 100 100 100 100 100 100 100 
##$AQSEQ= 0
##$AQ_mod= 1
##$AUNM= <au_zg>
##$AUTOPOS= <>
##$BF1= 200.13
##$BF2= 200.13
##$BF3= 200.13
##$BF4= 200.13
##$BF5= 200.13
##$BF6= 200.13
##$BF7= 200.13
##$BF8= 200.13
##$BYTORDA= 1
##$CFDGTYP= 0
##$CFRGTYP= 5
##$CHEMSTR= <none>
##$CNST= (0..31)
1 1 145 1 1 1 1 1 1 1 1 1 1 1 1 1 1 1 1 1 1 1 1 1 1 1 1 1 1 1 1 1 
##$CPDPRG= <>
##$CPDPRG1= <>
##$CPDPRG2= <>
##$CPDPRG3= <>
##$CPDPRG4= <mlev>
##$CPDPRG5= <mlev>
##$CPDPRG6= <mlev>
##$CPDPRG7= <mlev>
##$CPDPRG8= <mlev>
##$CPDPRGB= <>
##$CPDPRGT= <>
##$D= (0..31)
0 1.2 0 0 0 0 0 0 0 0.06 0 0.03 0 0 0 0 0.0002 0 0 0 0 0 0 0 0 0 0 0 0 
0 0 0 
##$DATE= 1580809779
##$DBL= (0..7)
120 120 120 120 120 120 120 120 
##$DBP= (0..7)
150 150 150 150 150 150 150 150 
##$DBP07= 0
##$DBPNAM0= <>
##$DBPNAM1= <>
##$DBPNAM2= <>
##$DBPNAM3= <>
##$DBPNAM4= <>
##$DBPNAM5= <>
##$DBPNAM6= <>
##$DBPNAM7= <>
##$DBPOAL= (0..7)
0.5 0.5 0.5 0.5 0.5 0.5 0.5 0.5 
##$DBPOFFS= (0..7)
0 0 0 0 0 0 0 0 
##$DE= 6
##$DECBNUC= <off>
##$DECIM= 24
##$DECNUC= <off>
##$DECSTAT= 4
##$DIGMOD= 1
##$DIGTYP= 9
##$DL= (0..7)
0 120 120 120 120 120 120 120 
##$DP= (0..7)
150 150 150 150 150 150 150 150 
##$DP07= 0
##$DPNAME0= <>
##$DPNAME1= <>
##$DPNAME2= <>
##$DPNAME3= <>
##$DPNAME4= <>
##$DPNAME5= <>
##$DPNAME6= <>
##$DPNAME7= <>
##$DPOAL= (0..7)
0.5 0.5 0.5 0.5 0.5 0.5 0.5 0.5 
##$DPOFFS= (0..7)
0 0 0 0 0 0 0 0 
##$DQDMODE= 0
##$DR= 18
##$DS= 0
##$DSLIST= <SSSSSSSSSSSSSSS>
$$ [...]
##$SUBNAM2= <"">
##$SUBNAM3= <"">
##$SUBNAM4= <"">
##$SUBNAM5= <"">
##$SUBNAM6= <"">
##$SUBNAM7= <"">
##$SUBNAM8= <"">
##$SUBNAM9= <"">
##$SW= 24.9337058887773
##$SWIBOX= (0..15)
0 0 2 0 0 0 0 0 0 0 0 0 0 0 0 0 
##$SW_h= 4990.01996007984
##$TD= 16384
##$TD0= 1
##$TE= 0
##$TE2= 300
##$TE3= 300
##$TEG= 300
##$TL= (0..7)
0 120 120 120 120 120 120 120 
##$TP= (0..7)
150 150 150 150 150 150 150 150 
##$TP07= 0
##$TPNAME0= <>
##$TPNAME1= <>
##$TPNAME2= <>
##$TPNAME3= <>
##$TPNAME4= <>
##$TPNAME5= <>
##$TPNAME6= <>
##$TPNAME7= <>
##$TPOAL= (0..7)
0.5 0.5 0.5 0.5 0.5 0.5 0.5 0.5 
##$TPOFFS= (0..7)
0 0 0 0 0 0 0 0 
##$TUNHIN= 0
##$TUNHOUT= 0
##$TUNXOUT= 0
##$USERA1= <user>
##$USERA2= <user>
##$USERA3= <user>
##$USERA4= <user>
##$USERA5= <user>
##$V9= 5
##$VALIST= <valist>
##$VCLIST= <CCCCCCCCCCCCCCC>
##$VD= 0
##$VDLIST= <DDDDDDDDDDDDDDD>
##$VPLIST= <PPPPPPPPPPPPPPP>
##$VTLIST= <TTTTTTTTTTTTTTT>
##$WBST= 1024
##$WBSW= 4
##$XGAIN= (0..3)
0 0 0 0 
##$XL= 0
##$YL= 0
##$YMAX_a= 529549
##$YMIN_a= -327038
##$ZGOPTNS= <>
##$ZL1= 120
##$ZL2= 120
##$ZL3= 120
##$ZL4= 120
##$ABSF1= 10
##$ABSF2= 0
##$ABSG= 5
##$ABSL= 3
##$ALPHA= 0
##$AQORDER= 0
##$ASSFAC= 0
##$ASSFACI= 0
##$ASSFACX= 0
##$ASSWID= 0
##$AUNMP= <proc_1d>
##$AZFE= 0.1
##$AZFW= 0.1
##$BCFW= 1
##$BC_mod= 2
##$BYTORDP= 1
##$COROFFS= 0
##$CY= 11.3945322036743
##$DATMOD= 1
##$DC= 2
##$DFILT= <>
##$DTYPP= 0
##$F1P= 16.9975609425685
##$F2P= -3.02152046262296
##$FCOR= 0.5
##$FTSIZE= 0
##$FT_mod= 4
##$GAMMA= 1
##$GB= 0.15
##$INTBC= 1
##$INTSCL= 1
##$ISEN= 128
##$LB= 0.24
##$LEV0= 0
##$LPBIN= 0
##$MAXI= 10000
##$MC2= 0
##$MEAN= 0
##$ME_mod= 0
##$MI= 1.114404
##$NCOEF= 0
##$NC_proc= 0
##$NLEV= 6
##$NOISF1= 3.799351
##$NOISF2= 2.8
##$NSP= 1
##$NTH_PI= 0
##$NZP= 0
##$OFFSET= 15.70392
##$PC= 1
##$PHC0= -9786.382
##$PHC1= 13.60081
##$PH_mod= 1
##$PKNL= yes
##$PPARMOD= 0
##$PSCAL= 0
##$PSIGN= 0
##$REVERSE= no
##$SF= 200.130013532006
##$SI= 16384
##$SIGF1= 3
##$SIGF2= 2
##$SINO= 400
##$SIOLD= 16384
##$SREGLST= <1H.CDCl3>
##$SSB= 0
##$STSI= 0
##$STSR= 0
##$SW_p= 3612.71676300578
##$SYMM= 0
##$S_DEV= 0
##$TDeff= 0
##$TDoff= 0
##$TI= <>
##$TILT= no
##$TM1= 0
##$TM2= 0
##$TOPLEV= 0
##$USERP1= <user>
##$USERP2= <user>
##$USERP3= <user>
##$USERP4= <user>
##$USERP5= <user>
##$WDW= 1
##$XDIM= 8192
##$YMAX_p= 0
##$YMIN_p= 0
$$ End of Bruker specific parameters
$$ ---------------------------------
##NTUPLES= NMR FID
##VAR_NAME=  TIME,          FID/REAL,        FID/IMAG
##SYMBOL=    X,             R,               I
##VAR_TYPE=  INDEPENDENT,   DEPENDENT,       DEPENDENT
##VAR_FORM=  AFFN,          ASDF,            ASDF
##VAR_DIM=   8192,          8192,            8192
##UNITS=     SECONDS,       ARBITRARY UNITS, ARBITRARY UNITS
##FACTOR=    0.0002004,     1,               1
##FIRST=     0,             0,               0
##LAST=      1.6414764,     0,               0
##MIN=       0,             -327038,         0
##MAX=       1.6414764,     529549,          0
$$ Real data points
##PAGE= N=1
##DATA TABLE= (X++(R..R)), XYDATA
$$ plain form
0 0 0 0 0 0 -4 8 0 8 -8 14 -16 22 -24 32 -40 48 -56 66 -79 94 -111 128 -148 173 -198 227 -259 298 -335
29 -335 379 -428 481 -539 603 -676 753 -838 933 -1035 1146 -1271 1406 -1557 1724 -1908
45 -1908 2118 -2350 2615 -2919 3267 -3678 4168 -4762 5503 -6457 7732 -9545 12330 -17192
59 -17192 28057 -103611 209224 423716 -78824 -327038 -91305 173521 42423 -92967
69 -92967 1781 126928 31254 -56392 17473 102123 20866 -38159 63730 169600 71136 -81050
81 -81050 -57444 103892 155126 43915 -63537 -25952 70433 89170 24394 -14251 -1569 7863
93 7863 7040 43573 75698 19166 -79377 -68903 55753 117914 28161 -65154 -26977 42181 7217
106 7217 -40415 33539 114112 31019 -98762 -53583 92194 89506 -44535 -60012 79917 126266
$$ packed form
0@%%%%mJ2qQj6K2l0L8m6N6p2Q8j04J22j45J73k05K39k76L21l71M25m86N57o33
29c35P14q07R09j020J142j279J429j591J771j968K181k417K677k963L281l632
45a908M026m468M965n534O186o945P846q930J0265j1960J4189j7277K1875k9522
59a7192M5249j31668L12835K14492n02540k48214K35733K64826j31098j35390
69i2967R4748J25147r5674q7646P3865Q4650q1257n9025J01889J05870r8464j52186
81h1050K3606J61336N1234j11211j07452L7585R6385J8737o4776l8645J2682R432
93G863q23L6533L2125n6532r8543J0474J24656O2161q9753r3315L8177O9158l4964
106G217m7632P3954Q0573q3093j29781M5179J45777k688j34041j5477J39929M6349
$$ plain form
118 126266 -26495 -138746 -18084 152680 111346 -57360 -91384 11659 53944 8795 6690
129 6690 38025 -7759 -75223 -21914 85931 58251 -78149 -101320 28416 95337 -2495 -94614
141 -94614 -42606 44581 29763 -30309 -32627 -4754 -8491 -13021 11854 9357 -49545 -69864 15475
154 15475 92644 21588 -113963 -108809 32712 99703 10498 -81210 -55345 7153 708 -35600
166 -35600 -21716 17170 6191 -47047 -61413 -15531 15953 -11260 -41268 -19675 8504 -18049
178 -18049 -57515 -33871 26390 26538 -35036 -55751 -1604 33794 -4744 -36010 2019 32890
190 32890 -8759 -40945 12433 65509 16950 -57771 -31761 52114 65245 10267 -16507 -5690
202 -5690 -8710 -1031 51702 72980 -4268 -73896 -15387 80929 53679 -45538 -41770 52081 66277
$$ packed form
118A26266j52761j12251J20662J70764m1334j68706l4024J03043M2285m5149k105
129F690L1335m5784o7464N3309J07845k7680j36400k3171J29736O6921r7832r2119
141i4614N2008Q7187j4818o0072k318K7873l737m530K4875k497n8902k0319Q5339
154A5475P7169p1056j35551N154J41521O6991q9205r1708K5865O2498o445l6308
166c5600J3884L8886j0979n3238j4366M5882L1484k7213l0008K1593K8179k6553
178a8049l9466K3644O0261J48o1574k0715N4147L5398l8538l1266L8029L0871
190C2890m1649l2186N3378N3076m8559p4721K6010Q3875J3131n4978k6774J0817
202e690l020P679N2733K1278p7248o9628N8509R6316k7250r9217L768R3851J4196
$$ plain form
215 66277 -25980 -69769 960 67863 38166 -22664 -29613 -4075 5683 10435 26873 21954 -18939
228 -18939 -39793 1651 52215 36964 -24172 -43133 6621 52423 31379 -19879 -23799 19993
240 19993 39468 6635 -19030 7690 39593 21739 -13955 -11830 15578 23360 15771 15939 9351
253 9351 -15743 -18782 20646 46119 11317 -30289 -11133 29301 13362 -28761 -12678 40863
265 40863 33941 -32156 -52181 4370 46514 15333 -30528 -24910 6033 7370 -11349 -9685 5508
278 5508 -1413 -21045 -14508 9029 4459 -23720 -24012 8767 17168 -20901 -46170 -11072 35117
291 35117 16835 -44706 -55818 -808 36310 10083 -29934 -33808 -15869 -2225 7401 6985 -13402
304 -13402 -30714 -15589 12150 6112 -25536 -25909 13386 26523 -17457 -51035 -16631 34413 26964
$$ packed form
215F6277r2257m3789P0729O6903k9697o0830o949K5538R758M752J6438m919m0893
228a8939k0854M1444N0564j5251o1136j8961M9754M5802k1044n1258l920M3792
240A9993J9475l2833k5665K6720L1903j7854l5694K125K7408P782p589J68o588
253I351k5094l039L9428K5473l4802m1606J9156M0434j5939m2123J6083N3541
265D0863o922o6097k0025N6551M2144l1181m5861N618L0943J337j8719J664J5193
278E508o921j9632O537K3537m570k8179k92L2779Q401l8069k5269L5098M6189
291C5117j8282o1541j1112N5010L7118k6227m0017l874J7939J3644R626m16k0387
304a3402j7312J5125K7739o038l1648l73L9295J3137m3980l3578L4404N1044p449
$$ plain form
317 26964 -20554 -38910 -14212 9080 8774 1107 -1420 -7535 -18942 -14011 12607 23892 -1897
330 -1897 -25786 -9404 17830 9806 -14160 -6292 22732 19549 -18788 -30264 12300 47734 21123
343 21123 -25744 -23011 15821 28078 9715 2132 8186 5824 -2212 3985 16913 16743 6551 5024
357 5024 9894 3676 -5361 9631 35447 26480 -14590 -27903 9459 43012 28515 -7534 -17394
370 -17394 3000 21358 18162 5855 3018 4830 3442 4501 10707 8141 -2453 2139 17840 12306
384 12306 -14282 -19162 13926 39394 14777 -30319 -29506 16433 38221 7715 -22733 -12889 7457
397 7457 7229 1315 2739 -711 -8363 -2935 9159 4139 -13653 -12527 10577 16819 -12148 -33579
411 -33579 -10204 22877 13275 -22870 -29429 -5836 6600 -4534 -14440 -10089 -6411 -13004 -18288
$$ packed form
317B6964m7518j8356K4698K3292l06p667k527o115j1407M931K6618J1285k5789
330a897k3889J6382K7234q024k3966P868K9024l183l8337j1476M2564L5434k6611
343B1123m6867K733L8832J2257j8363p583O054k362q036O197J2928j70j0192j527
357E024M870o218r037J4992K5816q967m1070j3313L7362L3553j4497l6049r860
370a7394K0394J8358l196j2307k837J812j388J059O206k566j0594M592J5701n534
384A2306k6588m880L3088K5468k4617m5096Q13M5939K1788l0506l0448R844K0346
397G457k28n914J424l450p652N428J2094n020j7792J126K3104O242k8967k1431
411c3579K3375L3081r602l6145o559K3593J2436j1134r906M351L678o593n284
$$ plain form
424 -18288 -9785 -1079 -8634 -19410 -13046 -4111 -14356 -25278 -9642 11223 -1624 -34416 -36202
437 -36202 331 23595 -1250 -34993 -25335 8156 10273 -15433 -18270 5298 11277 -8451 -18306
450 -18306 -3235 10930 6824 -699 1091 -869 -9619 -2803 23128 27949 -6671 -31818 -4218
463 -4218 36137 28502 -10287 -19481 7005 21222 4622 -8821 4084 17869 7363 -8248 -3629
476 -3629 7957 7289 5474 11765 6577 -12470 -13425 16652 36422 12218 -24235 -20354 19269 36042
490 36042 9370 -15380 -2842 18991 14671 -1364 1977 16134 15489 2983 -586 6700 11358
503 11358 10519 12008 11972 -627 -11577 2989 29003 26338 -8205 -24515 351 26783 16641
516 16641 -9260 -9262 10127 12990 -5319 -11801 4742 16568 4827 -9638 -7571 692 1715 1527
$$ packed form
424a8288Q503Q706p555j0776O364Q935j0245j0922J5636K0865j2847l2792j786
437c6202L6533K3264k4845l3743R658L3491K117k5706k837K3568N979j9728r855
450a8306J5071J4165m106p523J790j960q750O816K5931M821l4620k5147K7600
463d218M0355p635l8789r194K6486J4217j6600j3443J2905J3785j0506j5611M619
476c629J1586o68j815O291n188j9047r55L0077J9770k4204l6453L881L9623J6773
490C6042k6672k4750J2538K1833m320j6035L341J4157o45j2506l569P286M658
503A1358q39J489l6j2599j0950J4566K6014k665l4543j6310K4866K6432j0142
516A6641k5901kJ9389K863j8309o482J6543J1826j1741j4465K067Q263J023j88
$$ plain form
530 1527 4756 151 -13442 -15016 3600 15929 83 -23036 -17009 8850 11848 -12944 -24963
543 -24963 -5314 11710 -2256 -24404 -19509 2200 5307 -11970 -21794 -14011 -5687 -5731 -5086 -5088 -15466
558 -15466 -25204 -13578 8719 7122 -17748 -25598 -3625 10397 -6636 -23117 -7951 15217 9386
571 9386 -14647 -19847 -3731 9897 9489 3906 -3062 -11519 -8595 9169 19056 4733 -14382 -9405
585 -9405 9997 12217 -2780 -8253 3307 10298 1775 -9437 -7442 4623 11632 3896 -10105 -12582
599 -12582 177 11793 7955 -5300 -10361 -3780 4318 7935 8371 2485 -8027 -7492 7035 15389
613 15389 5205 -1058 10329 14855 -3347 -12759 10821 35072 22189 -8304 -12377 8928 21361
626 21361 15788 10799 9729 2467 -2063 10004 21317 10236 -4799 4471 19532 9844 -9708
$$ packed form
530A527L229m605j3593j574J8616J2329j5846k3119O027K5859K998k4792j2019
543b4963J9649J7024j3966k2148M895K1709L107j7277r824P783Q324m4O45kj0378
558a5466r738J1626K2297j597k4870p850K1973J4022j7033j6481J5166K3168n831
571I386k4033n200J6116J3628m08n583o968q457K924J7764R887j4323j9115M977
585i405J9402K220j4997n473J1560O991q523j1212J995J2065P009p736j4001k477
599a2582J2759J1616l838j3255n061O581Q098L617M36n886j0512N35J4527Q354
613A5389j0184o263J1387M526j8202r412K3580K4251j2883l0493m073K1305J2433
626B1361n573m989j070p262m530J2067J1313j1081j5035R270J5061r688j9552
$$ plain form
639 -9708 -6057 15711 20772 1682 -13890 -6675 10233 14134 2411 -9556 -10591 -88 11725
652 11725 10431 -4909 -16925 -10462 5541 11175 2239 -8772 -10688 -2473 3461 -1886 -9680 -4242
666 -4242 7403 4285 -11621 -18971 -9335 5072 7787 -2755 -13592 -13489 -6531 -2094 -3274 -5034
680 -5034 -5837 -5590 -6328 -8882 -10832 -7804 -1362 1056 -4025 -12875 -14836 -5360 6045 698 -14312
695 -14312 -13631 2802 5729 -9140 -15968 -3618 7253 908 -8252 -7309 -2927 -2702 -1253 3007 -1145
710 -1145 -12331 -6893 12069 10637 -15392 -23429 2730 22555 7773 -13952 -12852 -667 4479
723 4479 5225 5392 839 -5031 -1504 7143 5062 -5386 -2564 13983 16650 -2123 -12554 520
737 520 15345 13964 7198 2907 -1409 1428 13008 16058 3802 -4348 7422 19253 11605 -2854
$$ packed form
639i708L651K1768N061j9090j5572P215J6908L901j1723j1967j035J0503J1813
652A1725j294j5340j2016O463J6003N634q936j1011j916Q215N934n347p794N438
666d242J1645l118j5906p350R636J4407K715j0542j0837J03O958M437j180j760
680e034q03K47p38k554j950L028O442K418n081q850j961R476J1405n347j5010
695a4312O81J6433K927j4869o828J2350J0871o345r160R43M382K25J449M260m152
710a145j1186N438J8962j432k6029q037K6159J9825j4782k1725J100J2185N146
723D479P46J67m553n870L527Q647k081j0448K822J6547K667j8773j0431J3074
737E20J4825j381o766m291m316K837J1580L050j2256q150J1770J1831p648j4459
$$ plain form
751 -2854 -215 11543 12215 4602 5482 11266 6376 -1677 3322 9141 4897 4353 12865 9897 -8582
766 -8582 -12847 7463 21681 8528 -8693 -6879 4958 5170 -1826 -811 4354 2818 -989 521
780 521 -807 -8017 -4836 9205 10257 -7403 -15393 -1232 11736 3050 -12508 -13048 215 9157
794 9157 4921 -7138 -16069 -12605 1152 11592 3903 -13063 -17045 -4854 3274 -1859 -7584 -4834
808 -4834 -1901 -3833 -8113 -10461 -8608 -750 5741 -90 -13681 -17479 -6600 4538 3282 -6862
822 -6862 -10981 -6044 -2116 -4162 -5572 -3601 -2457 -2504 -3467 -5428 -6765 -2635 1150 -931 -5666 -4864
838 -4864 225 2206 -980 -5533 -6120 99 6445 4017 -5013 -7534 1226 8045 2685 -5310 -3021
853 -3021 6234 7634 24 -4672 -2301 3179 9617 12090 2473 -10701 -7478 10749 18917 6544
$$ packed form
751b854K639J1758O72p613Q80N784m890q053M999N819m244n44Q512k968j8479
766h582m265K0310J4218j3153j7221J814J1837K12o996J015N165j536l807J510
780E21j328p210L181J4041J052j7660p990J4161J2968q686j5558n40J3263Q942
794I157m236j2059q931L464J3757J0440p689j6966l982J2191Q128n133n725K750
808d834K933j932m280k348J853P858O491n831j3591l798J0879J1138j256j0144
822f862m119M937L928k046j410J971J144m7r63j961j337M130L785k081m735Q02
838d864N089J981l186m553n87O219O346k428r030k521Q760O819n360p995K289
853c021R255J400p610m696K371N480O438K473r617j3174L223J8227Q168j2373
$$ plain form
867 6544 -5529 -1569 6194 5997 2709 4316 6931 6860 6452 4373 -1819 -3460 8542 19280 11296
882 11296 -6347 -8819 5921 15567 10864 2225 -1396 -1445 3620 11478 10845 174 -5036 3646 9958
897 9958 4087 -432 5029 8700 340 -5985 698 8950 7574 2165 -779 -3667 -5050 3026 11770
912 11770 5920 -8572 -10414 1060 5705 -1153 -3546 2228 1504 -6830 -9294 -2229 2576 737 -1261
927 -1261 -5026 -10866 -9367 2387 8031 -3792 -17106 -11630 3667 5625 -5187 -11413 -7306 -3555
941 -3555 -2729 -2118 -4025 -8758 -7272 659 -480 -11305 -13367 -167 7062 -3391 -14169 -10906 -285
956 -285 2881 -771 -5914 -8626 -7406 -990 4220 -773 -9857 -7545 3639 4050 -6463 -9055 -54
971 -54 5189 781 -3473 -4301 -3071 722 5220 3517 -4033 -5414 2617 7901 2348 -4003 -931 6305
$$ packed form
867F544j2073L960P763j97l288J607K615p1m08k079o192j641J2002J0738p984
882A1296j7643k472J4740R646m703q639l621m9N065P858o33j0671n210Q682O312
897I958n871m519N461L671q360o325O683Q252j376n409k944k888j383Q076Q744
912A1770n850j4492j842J1474M645o858k393N774p24q334k464P065M805j839j998
927a261l765n840J499J1754N644j1823j3314N476J5297J958j0812o226M107L751
941c555Q26O11j907m733J486P931j139j0825k062J3200P229j0453j0778L263J0621
956b85L166l652n143k712J220O416N210m993r084K312J1184M11j0513k592R001
971e4N243m408m254q28J230L793M498j703p550j381Q031N284n553o351L072P236
$$ plain form
987 6305 5050 -1002 238 4938 5338 3139 3293 1909 401 5405 11438 7684 -1987 -2140 7459 12110
1003 12110 7009 944 2038 6248 7247 5211 4564 5369 5478 5389 4384 2642 2380 7862 10744 4159
1019 4159 -3207 -975 6624 10193 6664 -212 -4074 115 7624 8101 391 -4735 -1058 4810 5022
1034 5022 -181 -2946 30 3311 905 -3273 -2872 628 3240 2242 -4271 -9479 -4725 5337 6675
1049 6675 -3421 -10655 -7662 184 4099 134 -6712 -8901 -4229 853 -411 -5371 -7315 -3685 -275
1064 -275 -3671 -8605 -6652 -754 -1067 -5818 -7027 -5375 -4627 -1983 248 -4591 -10813 -7157 2193 2624
1080 2624 -5861 -9934 -4394 1173 -1257 -5748 -3717 -267 -2076 -4922 -2971 -798 -1958 -1163 1572
1095 1572 -978 -5972 -3412 4368 4248 -2798 -4691 786 4499 2260 -1743 -1531 1506 3807 3650 1166
$$ packed form
987F305j255o052J240M700M00k199J54j384j508N004O033l754r671j53R599M651
1003A2110n101o065J094M210R99k036o47Q05J09q9j005j742k62N482K882o585
1019D159p366K232P599L569l529o876l862M189P509M77p710n126L677N868K12
1034E022n203k765K976L281k406m178M01L500K612r98o513n208M754J0062J338
1049F675j0096p234K993P846L915l965o846k189M672N082j264m960j944L630L410
1064b75l396m934J953N898l13m751j209J652P48K644K231m839o222L656R350M31
1080B624q485m073N540N567k430m491K031L450j809k846J951K173j160P95K735
1095A572k550m994K560P780j20p046j893N477L713k239m003K12L037K301j57k484
$$ plain form
1111 1166 -1639 -882 5000 7979 1814 -4142 -26 7074 6219 899 -135 1688 3005 5176 5383 1160
1127 1160 -1666 2404 8475 6653 -1476 -2699 5769 10900 4230 -3530 -402 6950 7705 4572 1647
1142 1647 -366 -221 5329 9763 5270 -2330 -1667 5195 7523 2760 -1221 1299 5395 4085 92
1157 92 -1064 1700 4553 3807 -118 -3568 -1647 3755 5130 -85 -4753 -3511 716 2761 1721 -1902
1173 -1902 -4644 -3308 608 1410 -2147 -4173 -1367 441 -2660 -6183 -3963 2162 1680 -5423 -8172
1188 -8172 -3812 898 619 -2746 -5290 -5959 -3776 298 228 -4170 -6758 -3776 165 -643 -4395 -6026
1204 -6026 -2391 591 -1375 -5742 -6038 -1218 2270 -764 -6497 -7033 -783 3597 938 -4882 -6339
1219 -6339 -2375 1986 2155 -1414 -4888 -4129 925 3564 383 -4619 -3846 2723 5627 267 -5494 -2684
$$ packed form
1111A166k805P57N882K979o165n956M116P100q55n320j034J823J317K171K07m223
1127A160k826M070O071j822q129j223Q468N131o670p760L128P352P55l133k925
1142A647k013J45N550M434m493p600O63O862K328m763l981K520M096j310l993
1157I2j156K764K853p46l925l450J921N402J375n215m668J242M227K045j040l623
1173a902k742J336L916Q02l557k026K806J808l101l523K220O125m82p103k749
1188h172M360M710k79l365k544o69K183M074p0m398k588K982L941q08l752j631
1204f026L635K982j966m367k96M820L488l034n733n36O250M380k659n820j457
1219f339L964M361J69l569l474P59N054K639l181n002P73O569K904n360n761K810
$$ plain form
1235 -2684 4305 4993 -252 -3733 -1185 3140 3424 687 -1464 -1278 1432 3925 3106 -571 -3345 -34
1251 -34 5493 5355 -634 -3679 849 5892 4999 -226 -808 2758 4651 2556 1009 2281 3519 2868
1267 2868 2938 3261 3025 2677 3556 3594 2280 1029 3242 5695 4606 365 -899 2665 6383 4820 639
1284 639 -1130 1724 3923 3404 419 -724 2190 4406 1686 -2078 -1311 2561 3923 1674 -1490 -3215
1300 -3215 -829 2587 3171 199 -4585 -5164 1114 5635 1350 -7250 -6420 1964 5093 -619 -5848 -5092
1316 -5092 -952 1118 478 -1703 -3604 -4293 -2049 193 -1572 -5107 -4353 1329 1873 -4601 -8460 -4227
1332 -4227 2075 1429 -3405 -6432 -5053 -1927 -486 -1592 -3623 -4709 -3785 -1252 -657 -2610 -4967 -3378
1348 -3378 -1081 -1452 -2789 -2223 -1476 -2072 -3051 -3188 -1118 1258 652 -2782 -5328 -2560 1926 2967 208
$$ packed form
1235b684O989O88n245l481K548M325K84k737k151J86K710K493q19l677k774L311
1251c4N527j38n989l045M528N043q93n225n82L566J893k095j547J272J238o51
1267B868P0L23k36l48Q79L8j314j251K213K453j089m241j264L564L718j563m181
1284F39j769K854K199n19k985j143K914K216k720l764P67L872J362k249l164j725
1300c215K386L416N84k972m784n79O278M521m285q600Q30Q384L129n712n229P56
1316e092M140K070o40k181j901o89K244K242j765l535P54N682N44o474l859M233
1332d227O302o46m834l027J379L126J441j106k031j086R24K533N95j953k357J589
1348c378K297l71j337N66P47n96r79j37K070K376o06l434k546K768M486J041k759
$$ plain form
1365 208 -3051 -2874 508 2597 -240 -1673 1194 3780 1533 -1305 -1321 318 3486 5357 3295 -1743
1381 -1743 -3113 2157 7618 5563 -1238 -3068 3716 8961 3938 -2321 -165 4638 5445 3839 2479
1396 2479 1007 361 3762 7418 4555 -1900 -1285 5610 8546 2622 -3070 585 6815 5899 767 -186
1412 -186 1935 2694 2901 3821 2596 279 1378 3746 1513 -1418 -600 3812 5148 911 -3119 -2328
1428 -2328 1470 2681 1787 750 -1015 -2440 -1147 662 -787 -1815 799 1425 -3814 -6891 -2289
1443 -2289 2907 1330 -3869 -5815 -4406 -2111 -912 -575 -2442 -6042 -5845 -839 1481 -4291 -8278
1458 -8278 -3394 1260 -1645 -6446 -5083 -600 -726 -4091 -5007 -3499 -1287 -44 -337 -3308 -7005 -5415
1474 -5415 838 4542 155 -5916 -5566 -1104 1059 193 -1445 -1647 -1182 261 -335 -2534 -1957 2086
$$ packed form
1365B08l259J77L382K089k837j433K867K586k247k838j6J639L168J871k062n038
1381a743j370N270N461k055o801j830O784N245n023o259K156M803Q07j606j360
1396B479j472o46L401L656k863o455O15O895K936n924n692L655O230r16n132r53
1412a86K121P59K07R20j225k317J099K368k233k931Q18M412J336m237m030P91
1428b328L798J211q94j037j765j425J293J809j449j028K614O26n239l077M602
1443b289N196j577n199j946J409K295J199L37j867l600J97N006K320n772l987
1458h278M884M654k905m801J363M483j26l365r16J508K212J243k93k971l697J590
1474e415O253L704m387o071L50M462K163q66j638k02M65J443n96k199N77M043
$$ plain form
1490 2086 3309 -31 -2745 -1395 1250 2198 1297 97 -708 454 1598 2290 264 -1504 483 3986
1506 3986 3345 -1049 -1648 1878 4359 2149 -144 269 2412 3328 2883 1007 19 1966 4096 4026 1608
1523 1608 784 2143 3747 3621 2383 1580 2852 4083 4428 2551 -415 676 5435 7514 2654 -2393
1539 -2393 251 4440 4461 2124 1524 1839 982 455 2242 2608 483 598 2260 1497 -2642 -3006 2553
1556 2553 4848 -109 -5051 -3177 1532 1780 -727 -2215 -2233 -1767 -692 371 -1751 -3909 -2191 659
1572 659 20 -3354 -3896 -980 -101 -2152 -3408 -2827 -1462 -166 -206 -2524 -5668 -3681 903 1839 -2903
1589 -2903 -5712 -2985 447 -253 -2812 -2668 -1870 -1602 -1269 -685 -2150 -3844 -1859 1536 22 -4016
1605 -4016 -3997 -122 1063 -1678 -3582 -1337 815 -417 -2043 -2139 -1534 -558 1009 763 -2978 -4356 -187
$$ packed form
1490B086J223l340k714J350K645R48r01j200q05J162J144O92k026j768J987L503
1506C986o41m394n99L526K481k210k293M13K143R16m45j876r88J947K130p0k418
1523A608q24J359J604j26j238q03J272J231L45j877k966J091M759K079m860n047
1539b393K644M189K1k337o00L15q57n27J787L66k125J15J662p63m139l64N559
1556B553K295m957m942J874M709K48k507j488j8M66J075J063k122k158J718K850
1572F59o39l374n42K916Q79k051j256N81J365J296m0k318l144J987M584R36m742
1589b903k809K727L432p00k559J44P98K68L33N84j465j694J985L395j514m038
1605d016J9L875J185k741j904K245K152j232j626r6O05R76J567k46l741j378M169
$$ plain form
1622 -187 2729 663 -2393 -1427 268 1 -40 463 -115 -1043 53 1297 -64 -1314 770 4041 1717
1639 1717 -2719 -1831 4421 5672 1618 -1258 898 2555 2507 3867 4578 1565 -439 3529 6505 3624
1655 3624 -297 2261 6213 4900 1072 785 4068 5469 3179 1393 1663 1511 3046 5130 3339 -1413
1671 -1413 -1919 3249 5221 1836 -1204 -831 905 1664 2036 604 -1508 -1723 901 2208 -952 -3334
1687 -3334 -465 2673 369 -3768 -2684 1253 1381 -2016 -1537 -175 -1080 -2021 -301 -44 -2254 -2331 617
1704 617 1153 -2356 -4159 -1577 1440 -70 -3087 -2939 -557 -699 -2274 -2314 -1422 -1861 -1792 -1409 -2767 -3787
1722 -3787 -2261 41 -878 -3948 -4528 -2316 -593 -690 -2814 -4230 -3609 -1124 773 -1012 -3775 -4463
1738 -4463 -858 1437 -848 -3891 -2694 54 -278 -1304 -953 -1085 -496 314 -79 -2036 -2235 785 3109
$$ packed form
1622a87K916k066l056R66J695k67m1N03n78r28J096J244j361j250K084L271k324
1639A717m436Q88O252J251m054k876K156J657m8J360P11l013k004L968K976k881
1655C624l921K558L952j313l828k87L283J401k290j786K70j52J535K084j791m752
1671a413n06N168J972l385l040L73J736P59L72j432k112k15K624J307l160k382
1687c334K869L138k304m137J084L937J28l397M79J362r05r41J720K57k210p7K948
1704F17N36l509j803K582L017j510l017J48K382j42j575m0Q92m39O9L83j358j020
1722c787J526K302r19l070n80K212J723r7k124j416O21K485J897j785k763o88
1738d463L605K295k285l043J197K748l32j026L51j32N89Q10l93j957j99L020K324
$$ plain form
1755 3109 1459 -1756 -2204 225 2882 2723 441 -623 -235 1225 3223 2319 -193 -370 2829 3452
1771 3452 1307 932 2898 3017 1687 1701 3253 2865 2254 2856 3265 1104 344 3240 5206 2967 -825
1788 -825 538 4502 4084 503 393 2703 2188 295 1168 2429 912 82 2391 2151 -502 -1231 1765
1805 1765 3401 558 -2588 -276 2625 1764 -741 -1070 -442 -51 1281 1755 -556 -3385 -1276 2390
1821 2390 1363 -2145 -2533 507 1207 -758 -1554 -1003 -820 -716 15 -533 -2608 -3049 -60 1490 -1918
1838 -1918 -4801 -1814 1209 -398 -3778 -3472 -1152 -1212 -1633 -1499 -2592 -3894 -2854 84 75 -3288 -4889
1855 -4889 -1775 -172 -1931 -3308 -2188 -269 -1442 -2460 -1923 -1468 -1479 -547 -329 -1611 -2564 -946 1477
1872 1477 -131 -2579 -2266 442 999 -164 -836 -930 -331 101 1073 802 -791 -880 1034 1639 -321 -1001
$$ packed form
1755C109j650l215m48K429K657j59k282j064L88J460J998r04k512j77L199O23
1771C452k145l75J966J19j330J4J552l88o11O02M09k161p60K896J966k239l792
1788h25J363L964m18l581j10K310n15j893Q73J261j517q30K309k40k653p29K996
1805A765J636k843l146K312K901q61k505l29O28L91J332M74k311k829K109L666
1821B390j027l508l88L040P00j965p96N51J83J04P31n48k075m41K989J550l408
1838a918k883K987L023j607l380L06K320o0m21J34j093j302J040K938rl363j601
1855d889L114J603j759j377J120J919j173j018N37M55j1R32K18j282r53J618K423
1872A477j608k448L13K708N57j163o72r4N99M32R72k71j593q9J914O05j960o80
$$ plain form
1890 -1001 1541 2792 982 -1125 -128 2258 2515 1458 683 114 782 2351 3492 2145 -17 236
1906 236 3040 3569 1690 423 1037 2639 2857 1865 1005 1184 2710 2762 1735 769 1030 3008 3321 1690
1924 1690 -60 603 2272 3441 2475 454 -177 845 2635 2812 172 -611 978 2339 1156 -360
1940 -360 -557 709 1104 142 -731 -484 -44 301 250 -1064 -1388 -390 501 252 -1870 -2396 -1084 475 -136
1959 -136 -1621 -2375 -2227 -652 313 -617 -2600 -2026 -597 -183 -1835 -2547 -1891 -724 -847 -2124 -1810 -1675
1977 -1675 -1112 -1521 -1548 -2143 -2645 -1392 462 -1105 -3750 -3000 -209 422 -1492 -2860 -2474 -1116 -812
1994 -812 -1275 -1113 -1595 -2121 -1490 -54 -910 -2175 -718 1141 -480 -2427 -1796 792 744 -398 -1111 -1094
2012 -1094 -361 743 1187 381 -610 -529 1307 2850 931 -855 578 2424 2058 370 910 2115 1951
$$ packed form
1890a001K542J251j810k107R97K386K57j057p75n69O68J569J141j347k162K53
1906B36K804N29j879j267O14J602K18r92q60J79J526N2j027r66K61J978L13j631
1924A690j750O63J669J169r66k021o31J022J790J77k640p83J589J361j183j516
1940c60j97J266L95r62q73K47M40L45n1j314l24R98Q91k49k122n26J312J559o11
1959a36j485p54J48J575R65r30j983N74J429M14j652p12O56J167j23j277L14J35
1977a675N63m09k7n95n02J253J854j567k645P50K791O31j914j368L86J358L04
1994h12m63J62m82n26O31J436q56j265J457J859j621j947O31K588m8j142p13J7
2012a094P33J104M44q06r91Q1J836J543j919j786J433J846l66j688N40J205j64
$$ plain form
2029 1951 1406 1818 1640 1135 2044 3394 2259 177 305 3135 4052 2168 100 885 2873 2561 1091
2046 1091 1075 1916 1323 1506 2311 1276 -337 824 2452 2282 150 -745 1062 1955 1143 -279 -90 1189
2064 1189 1082 -14 -277 2 425 770 1253 56 -1671 -835 1357 1263 -553 -1085 -755 342 260 -636
2082 -636 -940 -387 -193 -710 -1059 -450 -743 -736 -99 -1211 -1996 -1098 382 -138 -2168 -3289 -1586 497 162
2101 162 -1656 -2721 -2099 -1251 -812 -806 -1595 -2553 -2360 -844 -1059 -2732 -2519 -504 33 -2176 -3347 -2050
2119 -2050 -384 212 -1266 -2404 -2203 -1303 -433 320 -1086 -2335 -1957 523 1010 -628 -2069 -867 1043
2136 1043 424 -350 -612 41 233 449 389 -95 161 551 869 673 161 492 1627 1789 755 -43 1293
2155 1293 2115 1526 500 734 1347 2074 2008 1031 850 1127 1927 2374 1824 921 575 1768 2079 1231 396
$$ packed form
2029A951n45M12j78n05R09J350j135k082J28K830R17j884k068P85J988l12j470
2046A091j6Q41n93J83Q05j035j613J161J628j70k132q95J807Q93q12j422J89J279
2064A189j07j096k63K79M23L45M83j197j727Q36K192r4j816n32L30J097q2q96
2082f36l04N53J94n17l49O09k93PO37j112p85Q98J480n20k030j121J703K083l35
2101A62j818j065O22Q48M39Op89r58J93J516k15j673K13K015N37k209j171J297
2119b050J666N96j478j138K01R00Q70P53j406j249L78K480M87j638j441J202J910
2136A043o19p74k62O53J92K16o0m84K56L90L18j96n12L31J135J62j034p98J336
2155A293Q22n89j026K34O13P27o6r77j81K77Q00M47n50r03l46J193L11q48q35
$$ plain form
2174 396 1379 2414 1467 -142 -331 1075 2088 1727 473 -74 -663 457 1665 1995 198 -1320 99
2191 99 1810 1421 -329 -592 912 780 141 457 431 787 739 636 325 17 -288 1276 2117 82 -1630
2210 -1630 -521 1871 1799 -529 -1250 -452 -104 -357 260 284 -959 -1647 -1116 -279 -1268 -1938 -882 -234 -1440
2229 -1440 -3241 -1981 -394 -971 -2434 -2365 -1655 -1531 -1897 -1483 -1375 -2254 -2188 -1115 -571 -2184 -2640 -760
2247 -760 491 -558 -2487 -1401 386 -351 -721 -812 -703 -1218 -455 393 -10 -1221 -1079 710 472 -1041
2265 -1041 -1701 250 1255 116 -1376 -764 219 725 682 202 -605 -896 345 1605 743 -605 -638 501
2283 501 1395 619 299 881 1259 1156 563 941 1088 1721 1752 943 390 190 1702 2633 2188 1233 481 1038
2303 1038 2205 2492 1449 754 1262 1927 1578 997 1155 1731 1525 1032 757 763 1322 1592 1493 497 -32 455
$$ packed form
2174C96R83J035r47j609j89J406J013l61j254n47n89J120J208L30j797j518J419
2191I9J711l89j750k63J504j32o39L16k6L56m8j03l11l08l05J564Q41k035j712
2210a630J109K392p2k328p21P98L48k53O17K4j243o88N31Q37r89o70J056O48j206
2229a440j801J260J587n77j463O9P10J24l66M14J08q79O6J073N44j613m56J880
2247g60J251j049j929J086J787p37l70r1J09n15P63Q48m03j211J42J789k38j513
2265a041o60J951J005j139j492O12R83N06m3m80q07k91J241J260q62j348l3J139
2283E01Q94p76l20N82L78j03n93L78J47O33L1q09n53k00J512R31m45r55p52N57
2303A038J167K87j043o95N08O65l49n81J58N76k06m93k75ON59K70r9r96n29M87
$$ plain form
2323 455 2037 2193 108 -885 563 1792 687 163 760 959 68 260 682 451 -617 -346 946 119
2341 119 -1234 -953 763 451 -1616 -2103 -378 196 -946 -1766 -1329 -1234 -1562 -1155 -391 -1347 -2668 -2064
2359 -2064 -251 -1081 -2711 -2673 -375 -436 -2556 -2689 -1082 -1189 -2476 -1864 -801 -1442 -2330 -934 -405 -2137
2377 -2137 -2965 -777 621 -907 -2439 -1720 63 -56 -1079 -800 -234 -1005 -1099 363 867 -889 -1651
2394 -1651 413 1121 -802 -1312 463 1149 242 -481 339 817 504 348 794 673 4 879 2064 1673
2412 1673 -179 -271 1404 2340 1030 648 1398 1207 654 1231 1772 1137 1179 1632 1795 910 686 1655 1822
2431 1822 1654 486 779 1787 1703 1303 585 1176 1101 1301 1329 779 15 519 1672 1439 295 262 611 650
2451 650 911 480 -53 194 830 410 -408 -428 135 1224 474 -715 -1137 -372 191 276 -328 -669 -977 -696
$$ packed form
2323D55J582J56k085r93J448J229j105n24N97J99q91J92M22k31j068K71J292q27
2341A19j353K81J716l12k067m87J725N74j142q20M37R5l28M07P64r56j321O04
2359b064J813q30j630L8K298o1k120j33J607j07j287O12J063o41q88J396N29j732
2377b137q28K188J398j528j532P19J783j19j023K79N66p71r4J462N04j756p62
2394a651K064P08j923n10J775O86r07p23Q20M78l13j56M46j21o69Q75J185l91
2412A673j852r2J675R36j310l82P50j91n53N77N41o35M2M53J63q85k24R69J67
2431A822j68j168K93J008q4m00p18N91p5K00K8n50p64N04J153k33j144l3L49L9
2451F50K61m31n33K47O36m20q18k0N63J089p50j189m22P65N63Q5o04l41l08K81
$$ plain form
2471 -696 187 -88 -1432 -2017 -313 300 -1162 -1533 -879 -614 -1263 -1446 -840 -1054 -1285 -1334 -400 -1425 -2288
2490 -2288 -1232 50 -356 -2591 -2228 -526 -365 -1769 -1573 -1080 -1318 -1661 -1094 -378 -854 -1388 -945 19
2508 19 -898 -1658 -688 260 -345 -1722 -644 160 -5 -992 -413 330 -463 -647 592 925 -681 -983 481
2527 481 1486 106 -727 513 1451 270 -105 741 1078 504 459 1280 512 -123 428 1899 1417 -246
2545 -246 175 1938 1796 117 126 820 1239 1115 1184 1275 478 329 1133 1989 786 -428 506 2138 1203 -163
2565 -163 248 1651 979 402 706 1463 623 484 1250 1091 117 -52 1255 1755 279 -652 586 1473 883
2584 883 -85 164 414 84 442 695 401 -750 -344 157 225 -594 -717 465 -53 -982 -1154 -68 -79 -557
2604 -557 -773 -1075 -1082 -914 -242 -758 -1322 -1276 -728 -478 -934 -1604 -1603 -796 -1041 -912 -1147 -1122 -1067 -1034 -813 -1198 -1285
$$ packed form
2471f96Q83k75j344n85J704O13j462l71O54K65o49j83O06k14k31m9R34j025q63
2490b288J056J282m06k235L63J702J61j404J96M93k38l43N67P16m76n34M43R64
2508A9r17p60R70R48o05j377J078Q04j65r87N79P43p93j84J239L33j606l02J464
2527D81J005j380q33J240R38j181l75Q46L37n74m5Q21p68o35N51J471m82j663
2545b46M21J763j42j679RO94M19j24O9R1p97j49Q04Q56j203j214R34J632r35j366
2565a63M11J403o72n77L04P57q40j39P66j59r74j69J307N00j476r31J238Q87n90
2584H83r68K49K50l30L58K53k94j151M06N01O8q19j23J182n18r29j72J086j1m78
2604e57k16l02pJ68O72n16n64M6N48K50m56o70JQ07k45J29k35K5N5L3K21l85q7
$$ plain form
2627 -1285 -532 57 -1298 -1741 -1214 -487 -404 -348 -553 -1347 -937 -213 372 -541 -1301 -678 270 -189 -399 -705
2647 -705 -485 -32 -377 129 138 -332 -441 211 459 -609 -517 468 1083 -260 -643 422 658 654 337 695 220
2668 220 60 653 1183 982 129 269 1382 842 258 291 1294 1352 12 520 1474 1303 235 1148 1405
2687 1405 854 701 1280 1371 705 71 1158 1889 1144 -321 345 1389 1089 555 892 1073 485 659 1291
2706 1291 1104 -105 -205 775 1078 -84 -401 511 1024 447 -413 -85 441 -284 -477 321 -232 -1024 -81
2725 -81 611 346 -1032 -1616 -163 281 -722 -1004 -591 -949 -1135 -1044 -580 -658 -1250 -1254 -793 -1159 -1310 -940 -225
2746 -225 -533 -1690 -1596 -481 -366 -775 -997 -969 -1124 -943 -569 -241 -718 -955 -734 -438 -436 -1109 -789 -200 -453
2767 -453 -811 -798 -267 -4 -441 -899 -393 -619 -186 167 -86 -451 -334 136 155 271 -161 -119 331 463 143
$$ packed form
2627a285P53N89j355m43N27P27Q3N6k05p94M10P24N85r13p60O23R48m59k10l06
2647g05K20M53l45N06Rm70j09O52K48j068R2R85O15j343l83J065K36ml17L58m75
2668B20j60N93N30k01q53J40J113n40n84L3J003N8j340N08R54j71j068R13K57
2687A405n51j53N79R1o66o34J087P31p45j465O66J044l00n34L37J81n88J74O32
2706A291j87j209j00R80L03j162l17R12N13n77q60L28N26p25j93P98n53p92R43
2725h1O92k65j378n84J453M44j003k82M13l58j86R1M64p8n92mM61l66j51L70P15
2746b25l08j157R4J115J15m09k22K8j55J81L74L28m77k37K21K96Ko73L20N89k53
2767d53l58J3N31K63m37m58N06k26M33L53k53l65J17M70J9J16m32M2M50J32l20
$$ plain form
2788 143 -449 -180 567 734 323 344 369 295 629 794 348 578 576 752 967 524 257 837 1687 894 408 549
2810 549 1410 1414 869 864 735 947 613 875 973 967 471 766 949 797 236 965 1098 622 50 589 987 1121
2832 1121 447 203 242 71 442 893 932 -109 -199 287 944 449 -440 -10 514 -179 -611 279 349 -151 -881
2853 -881 -100 -406 -859 -196 -32 -130 -877 -1066 -271 245 -547 -780 -665 -559 -556 -884 -705 -608 -1047 -931 -439
2874 -439 -607 -1152 -1362 -406 -415 -1066 -1343 -360 -77 -614 -990 -821 -475 -477 -623 -469 -653 -992 -646 -489 -282
2895 -282 -860 -867 -232 -51 -666 -874 -570 -19 -206 -175 -486 -231 -175 -266 -320 -107 -132 -115 78 36 -173 148 726
2918 726 822 -90 -518 427 735 523 290 418 481 -64 478 954 1047 408 130 784 776 667 509 838 1213 472
2940 472 89 471 1285 805 400 863 762 550 632 1337 1397 81 -43 751 1295 506 578 818 503 461 251
$$ packed form
2788A43n92K69P47J67m11K1K5p4L34J65m46K30kJ76K15m43k67N80Q50p93m86J41
2810E49Q61Mn45nj29K12l34K62R8om96K95J83j52n61P29J33m76n72N39L98J34
2832A121o74k44L9j71L71M51L9j041r0M86O57m95q89M30N24o93m32Q90P0n00p30
2853h81P81l06m53O63J64r8p47j89P95N16p92k33J15J06Ll28J79R7m39J16M92
2874d39j68n45k10R56ro51k77R83K83n37l76J69L46kj46J54j84l39L46J57K07
2895b82n78pO35J81o15k08L04N51j87L1l11K55N6r1n4K13k5J7J93m2k09L21N78
2918G26R6r12m28R45L08k12k33J28O3n45N42M76R3o39k78O54qj09j58L29L75p41
2940D72l83L82Q14m80m05M63j01k12Q2P05O0j316j24P94N44p89P2K40l15m2k10
$$ plain form
2961 251 616 820 283 -21 339 550 131 175 678 367 -324 -386 532 729 -174 -229 280 288 135 -361 -298 -168
2983 -168 -45 -490 -207 -154 -477 -534 -228 -220 -815 -748 -418 -115 -537 -975 -486 -511 -315 -795 -1059 -522 -408 -655
3005 -655 -674 -545 -853 -1203 -359 139 -763 -1472 -722 -337 -352 -608 -584 -680 -562 -738 -557 -305 -646 -678 -372 -353
3027 -353 -544 -736 -146 287 -549 -902 -313 106 -78 -434 -271 -133 -92 -215 6 215 14 -509 193 771
3047 771 241 -77 406 521 194 -223 490 918 567 232 232 362 453 497 943 1008 107 268 992 1586 347
3068 347 221 701 1125 211 352 1049 843 480 492 953 487 414 767 1002 654 141 227 1040 1342 254 223
3089 223 330 878 393 207 776 192 -126 145 510 211 -571 -8 551 24 -432 -197 265 119 -536 -9
3109 -9 103 -1 -569 -88 106 -121 -726 -224 -122 -873 -908 -553 165 -385 -865 -699 -515 -683 -630 -508 -280
$$ packed form
2961B51L65K04n37l04L60K11m19M4N03l11o91o2R18J97r03n5N09Qj53m96O3J30
2983a68J23m45K83N3l23n7L06Qn95O7L30L03m22m38M89k5J96m80k64N37J14k47
3005f55j9J29l08l50Q44M98r02p09P50L85j5k56K4r6J18j76J81K52l41l2L06J9
3027c53j91j92N90M33q36l53N89M19j84l56J63J38M1j23K21K09k01n23P02N78
3047G71n30l18M83J15l27m17P13M28l51l35%J30R1M4M46O5r01J61P24N94j239
3068C47j26M80M24r14J41O97k06l63J2M61m66p3L53K35l48n13Q6Q13L02j088l1
3089B23J07N48m85j86N69n84l18K71L65k99p82N63N59n27m56K35M62j46o55N27
3109iJ12j04n68M81J94k27o05N02J02p51l5L55P18n50m80J66J84j68N3J22K28
$$ plain form
3130 -280 -561 -594 -653 -410 -709 -514 -256 -270 -616 -772 -299 -141 -805 -714 -865 -549 -237 -677 -467 -979 -606
3151 -606 -303 -209 -399 -635 -418 -597 -117 -415 -540 -455 -379 204 -22 -170 70 31 310 -513 -234 -165 226 229
3173 229 55 162 -139 227 505 569 25 -333 363 504 288 271 177 285 543 268 285 709 476 446 719 977
3195 977 336 162 1009 912 513 28 541 1057 850 315 599 760 369 528 498 818 225 272 572 907 279
3216 279 71 949 326 97 -62 963 326 257 -1 327 264 111 456 774 21 -578 129 774 708 -367
3236 -367 20 220 -131 -426 -30 188 -213 -772 -133 13 -455 -511 -108 54 -609 -869 -108 375 -291 -1024
3256 -1024 -462 -85 -946 -709 -366 -488 -1162 -811 -93 -488 -914 -1057 -311 -122 -870 -804 -320 -246 -420 -811
3276 -811 -279 -583 -667 -495 5 -546 -1023 -255 -18 -505 -797 -366 -80 -273 -246 -442 -311 11 -115 14 400
$$ packed form
3130b80k81l3n9K43k99J95K58j4l46j56M73J58o64R1j51L16L12m40K10n12L73
3151f06L03R4j90k36K17j79M80k98j25Q5P6N83k26j48K40l9K79q23K79O9L91L
3173B29j74J07l01L66K78O4n44l58O96J41k16j7r4J08K58k75J7M24k33l0K73K58
3195I77o41j74Q47r7l99m85N13N16k07n35K84J61l91J59l0L20n93M7L00L35o28
3216B79k08Q78o23k29j59J025o37o9k58L28o3j53L45L18p53n99P07O45o6j075
3236c67L87K00l51k95L96K18m01n59O39J46m68n6M03J62o63k60P61M83o66p33
3256a024N62L77q61K37L43j22o74L51P18l95m26j43P46J89p48O6M84P4j74l91
3276h11N32l04q4J72N00n51m77P68K37m87k92M31K86j93K7j96J31L22j26J29L86
$$ plain form
3297 400 -46 -330 -64 192 11 -134 370 167 152 -26 282 320 416 406 203 503 236 493 665 196 472
3318 472 54 637 507 564 267 431 747 688 520 668 246 541 611 876 360 301 554 -47 339 263 702 592
3340 592 350 428 586 261 454 467 418 427 158 441 409 -65 184 167 452 -381 186 280 322 -141 3 195 122
3363 122 -193 -34 343 191 -429 -363 331 35 -181 -531 -98 -566 -536 -178 -4 -391 -629 36 -493 -695 -970
3384 -970 -454 -414 -420 -519 -302 -99 -418 -673 -392 -490 -740 -554 -285 -176 -629 -839 -328 -234 -408 -463 -300 -208 -447
3407 -447 -204 54 -387 -722 -330 -18 -84 -275 -188 104 -194 -402 -140 410 -1 -237 -105 162 201 -230 176
3428 176 301 -119 3 210 449 -181 -129 390 369 315 39 316 176 318 393 794 576 222 166 529 607 361
3450 361 522 714 642 425 401 761 539 604 369 249 562 338 500 484 133 293 265 504 573 69 151 280
$$ packed form
3297D00m46k84K66K56j81j45N04k03j5j78L08L8R6j0k03L00k67K57J72m69K76
3318D72m18N83j30N7k97J64L16n9j68J48m22K95P0K65n16n9K53o01L86p6M39j10
3340E92k42P8J58l25J93J3m9Rk69K83l2m74K49j7K85q33N67R4M2m63J44J92p3
3363A22l15J59L77j52o20O6O94k96k16l50M33m68L0L58J74l87k38O65n29k02k75
3384i70N16M0or9K17K03l19k55K81r8k50J86K69J09m53k10N11R4j74n5J63R2k39
3407d47K43K58m41l35L92L12o6j91Q7K92k98k08K62N50m11k36J32K67L9m31M06
3428A76J25m20J22K07K39o30N2N19k1n4k76K77j40J42P5M01k18l54n6L63P8k46
3450C61J61J92p2k17k4L60k22O5k35j20L13k24J62j6l51J60k8K39O9n04Q2J29
$$ plain form
3472 280 322 458 510 358 315 112 448 273 -39 261 316 199 -201 178 198 179 369 128 8 89 46 -118 81
3495 81 -209 -145 130 -262 -367 -337 -15 169 -584 -448 59 -318 -285 -569 -135 -387 -948 -210 -271 -291 -798 -490
3517 -490 -327 -287 -394 -284 -297 -507 -773 -248 -503 -708 -345 -316 -252 -421 -795 -222 -214 -349 -725 -177 -118 -583
3539 -583 -479 -30 -34 -87 -74 -81 36 -164 -135 110 -23 -92 -171 46 178 16 69 86 -277 -70 144 51 319 486
3563 486 -158 265 286 205 78 367 257 146 98 330 486 246 491 217 68 200 313 557 494 395 359 312
3585 312 330 356 679 374 400 -31 351 552 653 241 188 220 341 557 597 424 -22 82 424 360 70 404
3607 404 46 -45 413 341 189 256 236 -212 282 -133 24 -77 290 -198 100 -9 76 -36 -16 -54 -208 -151 39
3630 39 -21 -476 -93 -232 -106 -462 -362 -141 -394 -699 -249 -62 -620 -664 -379 -71 -259 -405 -410 -318 -285 -362 -436
$$ packed form
3472B80M2J36N2j52m3k03L36j75l12L00N5j17m00L79K0j9J90k41j20Q1m3j64J99
3495H1k90O4K75l92j05L0L22J84p53J36N07l77L3k84M34k52n61P38o1k0n07L08
3517d90J63M0j07J10j3k10k66N25k55k05L63K9O4j69l74N73Qj35l76N48N9m65
3539e83J04M49mn3J3pJ17k00K9K45j33o9p9K17J32j62N3J7l63K07K14r3K68J67
3563D86o44M23K1q1j27K89j10j11m8K32J56k40K45k74j49J32J13K44o3r9l6m7
3585C12J8K6L23l05K6m31L82K01J01m12n3L2J21K16M0j73m46J04L42o4k90L34
3607D04l58r1M58p2j52O7k0m48M94m15J57j01L67m88K98j09Q5j12K0l8j54N7J90
3630C9o0m55L83j39J26l56J00K21k53l05M50J87n58m4K85L08j88j46nR2L3p7p4
$$ plain form
3653 -436 -391 -454 -535 -548 -100 -272 -269 -264 -201 -363 -445 -265 -59 -364 -306 -176 -487 -414 -133 -75 -294 -259 -275 -39 85
3678 85 -166 -235 -25 79 -166 72 -113 542 29 -49 -115 8 44 -56 418 412 51 185 255 411 68 -66 161
3701 161 441 139 -283 345 476 478 250 -54 548 240 228 673 342 437 213 581 231 321 240 79 623 327
3723 327 328 265 532 61 160 287 309 189 343 624 168 126 242 182 179 133 370 139 171 139 -122 93 -13 131
3747 131 207 -11 103 -209 -52 91 16 -542 7 21 -262 -285 -221 99 -395 -84 -241 -152 -346 -426 -44 -83 -245
3770 -245 -365 -325 88 -313 -478 -611 -104 -325 -745 -691 -123 -336 37 -180 -562 -403 -165 -291 -356 -311 -277 -362
3792 -362 11 -366 -259 -221 -34 -248 -375 -166 -72 -65 -71 -212 -238 -75 48 -196 208 -344 -177 21 52 1 -211
3815 -211 -28 -9 62 185 230 157 177 437 221 294 144 165 271 379 339 104 442 367 394 501 425 337 343 441 421
$$ packed form
3653d36M5o3q1j3M48j72LNO3j62q2J80K06l05N8J30l11P3K81N8k19L5j6K36J24
3678H5k51o9K10J04k45K38j85O55n13p8o6J23L6j00M74ol61J34P0J56l43j34K27
3701A61K80l02m22O28J31Kk28l04O02l08j2M45l31R5k24L68l50R0q1j61N44k96
3723C27Jo3K67m71R9J27K2j20J54K81m56m2J16o0lm6K37k31L2l2k61K15j06J44
3747A31P6k18J14l12J57J43p5n58N49J4k83k3O4L20m94L11j57Q9j94q0L82l9j62
3770b45j20M0M13m01j65j33N07k21m20N4N68k13L73k17l82J59K38j26o5M5L4q5
3792c62L73l77J07L8J87k14j27K09R4Poj41k6J63J23k44M04n52J67J98L1n1k12
3815b11J83J9P1J23M5p3K0K60k16P3j50K1J06J08m0k35L38p5K7J07p6q8OR8k0
$$ plain form
3840 421 74 384 353 433 259 74 262 221 373 399 404 420 389 272 180 348 337 207 626 391 90 47 -10 437
3864 437 207 -103 59 23 108 239 221 280 -38 84 -3 -88 -307 176 83 133 102 -150 -417 77 -269 -172 -104 -431
3888 -431 -195 -276 -156 -366 -142 -414 -502 -45 4 -399 -492 -379 -188 -344 -417 -325 212 -243 -274 -171 -317 -236 -85
3911 -85 -250 -71 -278 -354 -244 -224 -492 -215 -156 131 -123 -168 -87 -84 -399 -84 -108 -103 -71 -168 10 -290 -387 -88 137
3936 137 -162 -457 -157 113 166 17 -196 -47 187 187 43 368 91 229 307 330 6 123 172 87 18 100 292
3959 292 275 294 -85 42 182 84 91 -6 474 127 176 219 429 342 8 244 401 260 187 185 274 97 27 524 380
3984 380 46 268 167 155 177 -87 428 210 161 314 -173 255 99 121 98 111 45 76 -8 66 -174 57 116 181
4008 181 69 148 177 -71 176 -254 -178 -30 -58 -2 -152 -378 -195 57 10 -117 -384 -196 -124 -236 -78 -364
$$ packed form
3840D21l47L10l1Q0j74j85J88m1J52K6NJ6l1j17r2J68j1j30M19k35l01m3n7M47
3864D37k30l10J62l6Q5J31j8N9l18J22q7q5k19M83r3N0l1k52k67M94l46R7O8l27
3888d31K36q1J20k10K24k72q8M57M9m03r3J13J91j56p3R2N37m55l1J03j46Q1J51
3911h5j65J79k07p6J10K0k68K77N9K87k54m5Q1Ll15L15k4NL2r7J78l00r7K99K25
3936A37k99k95L00K70N3j49k13J49K34%j44L25k77J38P8K3l24J17M9q5o9Q2J92
3959B92j7J9l79J27J40r8Pr7M80l47M9M3K10q7l34K36J57j41p3kQ9j77p0M97j44
3984C80l34K22j01j2K2k64N15k18m9J53m87M28j56K2k3J3o6L1q4P4k40K31N9O5
4008A81j12P9K9k48K47m30P6J48k8N6j50k26J83K52m7j27k67J88P2j12J58k86
$$ plain form
4030 -364 -352 -471 -91 -405 -178 -203 -307 -117 191 -222 -251 -199 38 -364 -17 -442 -149 -259 -473 -131 -133 -297
4052 -297 -169 -213 -493 74 -1 -135 -305 -10 111 75 -247 21 -86 24 -173 -11 -67 -38 -211 135 249 -2
4074 -2 -258 422 132 -30 478 120 343 -73 381 201 494 -53 83 712 289 -28 494 207 301 50 220
4095 220 192 60 324 293 257 324 380 168 -81 420 159 207 370 20 234 103 290 244 513 59 230 262 410
4118 410 299 146 274 93 320 97 -164 176 221 313 322 31 21 -145 -276 -1 -32 40 -423 61 -62 -289
4140 -289 -185 -74 -98 294 -443 -230 -366 -487 -97 -273 0 -359 -234 -92 -315 -162 -429 -132 -247 -66
4160 -66 -159 -120 -24 -233 -357 -411 -55 -316 -132 19 -36 -482 -256 -43 -292 -373 -223 -106 -315 -186 -168 -15 -24
4183 -24 -42 189 -36 -103 -528 104 13 -26 -265 143 215 -262 73 -129 -13 5 86 166 -19 -26 -253 4 157 -74
$$ packed form
4030c64J2j19L80l14K27k5j04J90L08m13k9N2K37m02L47m25K93j10k14L42kj64
4052b97J28m4k80N67p5j34j70K95J21l6l22K68j07J10j97J62n6K9j73L46J14k51
4074bk56O80k90j62N08l58K23m16M54j80K93n47J36O29m23l17N22k87R4k51J70
4095B20k8j32K64l1l6O7N6k12k49N01k61M8J63l50K14j31J87m6K69m54J71L2J48
4118D10j11j53J28j81K27k23k61L40M5R2Rk91j0j66j31K75l1P2m63M84j23k27
4140b89J04J11k4L92p37K13j36j21L90j76K73l59J25J42k23J53k67K97j15J81
4160f6r3L9R6k09j24n4L56k61J84J51n5m46K26K13k49q1J50J17k09J29J8J53r
4183b4j8K31k25o7m25O32r1l9k39M08P2m77L35k02J16J8Q1Q0j85pk27K57J53k31
$$ plain form
4207 -74 308 99 -109 -100 -3 430 311 158 202 99 307 41 244 324 107 -266 241 345 83 409 470 96
4229 96 366 -120 236 161 -41 442 374 129 -257 117 224 413 33 60 190 274 168 270 -76 38 203 197
4251 197 192 -135 169 -30 165 -80 -68 76 162 237 -48 20 -17 -209 -467 96 85 -8 -251 -2 -132 -63 -166
4274 -166 -188 -446 84 -259 -331 -165 182 -449 -134 -257 -329 104 -228 -378 -677 -75 -197 -363 -572 86 -241
4295 -241 -281 -18 -80 -286 -47 18 -70 -130 -263 -335 -107 44 -302 -64 -31 -151 -167 -428 -36 -243 -33 253 -201
4318 -201 -180 11 -114 105 -605 322 6 217 -152 -136 -11 -169 88 -164 256 -149 -154 -54 401 355 176 159
4340 159 383 254 242 40 317 57 -275 273 34 204 132 279 238 201 260 118 541 337 -84 365 308 199
4362 199 158 295 255 106 96 432 358 267 241 85 -139 327 118 199 345 301 103 482 109 218 266 155 -21
$$ packed form
4207g4L82k09k08RR7M33j19j53M4j03K08k66K03Q0k17l73N07J04k62L26O1l74
4229I6K70m86L56p5k02M83o8k45l86L74J07J89l80K7J30Q4j06J02l46J14J65o
4251A97nl27L04j99J95k45J2J44Q6P5k85O8l7j92k58N63j1r3k43K49j30O9j03
4274a66k2k58N30l43p2J66L47o31L15j23p2M33l32j50k99O02j22j66k09O58l27
4295b41m0K63o2k06K39O5q8o0j33p2K28J51l46K38L3j20j6k61L92k07K10K86m54
4318b01K1J91j25K19p10R27l16K11l69J6J25j58K57k52M20m05nJ00M55m6j79j7
4340A59K24j29j2k02K77k60l32N48k39J70p2J47m1l7N9j42M23k04m21M49n7j09
4362A99m1J37m0j49j0L36p4r1k6j56k24M66k09Q1J46m4j98L79l73J09M8j11j76
$$ plain form
4385 -21 129 -113 -31 -98 93 -106 194 -207 -41 -85 -85 22 34 -172 -305 33 -308 -316 29 137 -145 -193 24
4408 24 -312 -318 -73 -42 -79 127 -38 -459 2 -435 -44 -310 -280 -458 -262 -22 -428 -387 -70 -93 -97 99 76 -92
4432 -92 -174 -351 -285 28 -79 -273 -74 -68 -177 -332 -88 -40 -194 -467 -365 -163 -42 188 -98 -235 -24 -102
4454 -102 -145 -112 101 -21 -115 178 5 7 -75 -76 141 237 72 132 175 394 64 11 55 451 51 442 -52 297
4478 297 329 88 345 -40 186 188 517 4 -70 33 231 121 339 20 -21 206 292 -8 337 103 -97 230
4500 230 104 -188 323 418 356 -214 -59 -65 188 8 -91 266 147 217 -11 270 358 -115 102 158 -9 -93 17
4523 17 95 -42 32 81 -7 117 -179 165 -206 -159 -143 -118 -125 70 -243 -627 55 -177 -102 -407 -408 -30 125 71 -341
4548 -341 -184 38 -151 -115 -498 -238 -221 -231 -154 -159 -204 -305 -284 -97 -127 -71 -210 -200 -18 -97 -148 66 -111 124
$$ packed form
4385b1J50k42Q2o7J91j99L00m01J66m4%J07J2k06j33L38l41qL45J08k82m8K17
4408B4l36oK45L1l7K06j65m21M61m37L91k66L0j78J96K40m06M1L17k3mJ96k3j68
4432i2q2j77O6L13j07j94J99Oj09j55K44M8j54k73J02K02J21K30k86j37K11p8
4454a02m3L3K13j22r4K93j73Kq2jK17R6j65O0M3K19l30n3M4L96m00L91m94L49
4478B97L2k41K57l85K26KL29n13p4J03J98j10K18l19m1K27Q6l00L45k34k00L27
4500B30j26k92N11R5o2n70J55oK53j80r9L57j19P0k28K81Q8m73K17N6j67q4J10
4523A7P8j37P4M9q8J24k96L44l71M7J6K5pJ95l13l84O82k32P5l05jL78J55n4m12
4548c41J57K22j89L6l83K60J7j0P7nm5j01K1J87l0N6j39J0J82p9n1K14j77K35
$$ plain form
4572 124 -44 -29 -170 -47 -287 -179 -92 -81 -22 103 67 -272 37 -141 -135 18 -42 144 166 194 256 218 -76 144
4596 144 -42 25 21 336 197 -209 -2 10 298 361 212 -3 60 339 159 201 342 211 51 73 148 193 396
4619 396 217 94 268 112 -111 155 -15 -30 -192 203 -244 135 93 130 71 83 245 100 170 72 -131 105
4641 105 200 98 -211 -158 -153 7 320 -117 -187 -84 -54 159 -299 -195 -288 -7 -165 188 109 -234 289 -489 -151
4664 -151 -210 50 -389 -243 -27 204 -117 -322 -30 -215 -388 -234 -508 -203 -327 -113 -212 -227 -219 -158 17 78
4686 78 -94 -261 -255 -263 -75 -141 76 -80 -38 -219 -271 174 84 -137 -98 -176 -292 -24 -23 17 -283 -34 124 24 263
4711 263 72 -282 -43 -37 -108 92 -96 9 128 -17 126 104 138 619 23 -28 6 231 103 263 -14 -142
4733 -142 431 324 222 290 332 -153 208 -181 -183 410 -68 15 493 177 241 -97 56 136 156 47 7 -161 228
$$ packed form
4572A24j68J5j41J23k40J08Q7J1N9J25l6l39L09j78OJ53o0J86K2K8O2l8k94K20
4596A44j86O7mL15j39m06K07J2K88O3j49k15O3K79j80M2J41j31j60K2P5M5K03
4619C96j79j23J74j56k23K66j70j5j62L95m47L79m2L7n9J2J62j45P0r8k03K36
4641A05R5j02l09N3NJ60L13m37p0J03L0K13m58J04r3K81j58L53p9l43N23p78L38
4664a51n9K60m39J46K16K31l21k05K92j85j73J54k74L05j24K14r9j5QO1J75O1
4686G8j72j67OqJ88o6K17j56M2j81n2M45r0k21L9p8j16K68JM0l00K49J58j00K39
4711B63j91l54K39Op1K00j88J05J19j45J43k2L4M81n96n1L4K25j28J60k77j28
4733a42N73j07j02O8M2m85L61l89kN93m78Q3M78l16O4l38J53Q0K0j09m0j68L89
$$ plain form
4756 228 61 228 286 103 212 109 171 139 112 198 45 194 124 63 -87 154 31 60 58 103 90 -44 27 91 -91
4781 -91 -231 39 -298 22 -104 -172 -347 -88 -179 -177 55 -183 255 89 -65 -154 -49 55 -278 -285 -108 -187 -36
4804 -36 -313 -359 -49 -113 -199 -124 -93 -274 -120 -135 3 -171 -83 -177 9 -421 76 99 -318 -310 14 185 -10 -133
4828 -133 88 3 -234 -144 52 -2 -173 69 -253 143 -34 112 49 149 29 94 95 208 209 6 182 -12 -31
4851 -31 23 386 193 132 -175 408 267 365 287 -13 109 -198 -1 93 275 43 122 229 283 125 290 41 -205
4874 -205 72 -8 0 114 101 220 43 -50 401 195 355 -57 -70 -39 253 41 131 -19 115 -66 14 198 249
4897 249 -231 127 -103 -27 57 -100 106 -264 -104 -96 -41 283 -53 72 101 -40 81 -178 -77 -2 60 -35 -173
4920 -173 35 -219 -340 -129 -107 -125 -145 19 29 -88 61 -445 -134 -110 -440 -190 13 -27 -29 -182 -136 -84 -287
$$ packed form
4756B28j67J67N8j83J09j03O2l2k7Q6j53J49p0o1j50K41j23K9kM5j3j34P1O4j82
4781i1j40K70l37L20j26o8j75K59r1KK32k38M38j66j54q9J05J04l33pJ77p9J51
4804c6k77m6L10o4q6P5L1j81J54j5J38j74Q8r4J86m30M97K3m17QL24J71j95j23
4828a33K21q5k37R0J96n4j71K42l22L96j77J46o3J00j20O5JJ13Jk03J76j94j9
4851c1N4L63j93o1l07N83j41R8p8l00J22l07J97R4J82k32P9J07N4j58J65k49k46
4874b05K77q0QJ14j3J19j77r3M51k06J60m12j3L1K92k12R0j50J34j81Q0J84N1
4897B49m80L58k30P6Q4j57K06l70J60QN5L24l36J25K9j41J21k59J01P5O2r5j38
4920a73K08k54j21K11K2j8k0J64J0j17J49n06L11K4l30K50K03m0kj53M6N2k03
$$ plain form
4943 -287 -135 -179 14 -199 -74 -44 -256 -245 -205 -73 -12 23 -147 -74 -73 -54 -429 -15 -44 -34 145 375 -129 -92
4967 -92 -196 -76 306 -115 192 181 -14 23 -102 -61 45 247 273 155 -29 35 135 -65 -6 -21 142 61 328
4990 328 237 -91 90 229 110 54 342 -4 301 -182 128 10 330 514 265 -157 -52 190 257 219 202 102
5012 102 407 -171 188 123 94 -147 29 92 68 184 135 59 -38 74 21 255 112 -34 30 207 43 -42 300
5035 300 -66 177 79 -55 -112 44 39 162 92 120 3 -229 -198 -83 60 -166 41 -317 -64 -40 -127 -337 -282
5058 -282 -201 -235 -18 -122 62 -278 -29 63 -260 -167 123 -49 -84 16 -428 -230 -32 271 180 105 -116 -215 -424
5081 -424 -140 -148 -290 -224 -261 277 -146 49 -104 -467 -327 137 165 -222 -293 -78 -201 -86 -67 273 -270 -155
5103 -155 -15 -226 6 74 -311 84 4 -56 54 35 234 -169 39 -9 -10 126 306 -59 184 49 112 360 -228
$$ packed form
4943b87J52m4J93k13J25L0k12J1M0J32O1L5j70P3JJ9l75M14k9J0J79K30n04L7
4967i2j04J20L82m21L07j1j95L7j25M1J06K02K6j18j84O4J00k00N9j5J63q1K67
4990C28r1l28J81J39j19n6K88l46L05m83L10j18L20J84k49m22J05K42O7l8j7j00
5012A02L05n78L59o5k9k41J76O3k4J16m9p6r7J12n3K34j43j46O4J77j64q5L42
5035C00l66K43r8j34n7J56nJ23p0K8j17k32L1J15J43k26K07l58K53K4q7k10N5
5058b82Q1l4K17j04J84l40K49R2l23R3K90j72l5J00m44J98J98L03r1p5k21r9k09
5081d24K84qj42O6l7N38m23J95j53l63J40M64K8l87p1K15j23J15J9L40n43J15
5103a55J40k11K32O8l85L95q0o0J10j9J99m03K08m8jJ36J80l65K43j35O3K48n88
$$ plain form
5126 -228 46 278 -20 96 51 331 -20 389 159 5 254 255 116 362 61 -74 155 161 32 54 -284 63
5148 63 128 10 225 -44 -342 -122 -2 420 353 359 -186 -260 -153 23 169 -297 205 -197 -369 -1 -105 0
5170 0 -103 -321 143 26 159 41 -146 -302 -3 145 169 -318 183 13 120 52 151 145 -160 -141 -247 -241 -141
5193 -141 107 -69 -107 -6 -64 -250 419 197 -322 10 -100 -25 -135 -341 -74 12 -225 -11 5 -311 -380 64
5215 64 -303 -190 -32 215 -83 -14 -87 -151 -36 -219 138 -72 -212 172 -276 27 134 43 73 20 389 11
5237 11 -62 -17 -49 -119 161 136 202 67 95 32 -240 314 344 98 -44 95 139 108 185 428 50 18 94 -90 327
5262 327 107 190 -46 -7 108 138 137 227 31 174 260 204 66 -113 244 -270 251 209 227 -229 -25 150 505
5285 505 -112 229 94 328 56 -236 39 87 144 37 -181 231 55 -96 -36 118 4 -331 399 -79 -227
$$ packed form
5126b28K74K32k98J16m5K80l51M09k30j54K49Jj39K46l01j35K29Oj29K2l38L47
5148F3O5j18K15k69k98K20J20M22o7On45p4J07J76J46m66N02m02j72L68j04J05
5170@j03k18M64j17J33j18j87j56K99J48K4m87N01j70J07o8R9ol05J9j06OJ00
5193a41K48j76l8J01n8j86O69k22n19L32j10P5j10k06K67Q6k37K14J6l16o9M44
5215F4l67J13J58K47k98O9p3o4J15j83L57k10j40L84m48L03J07r1L0n3L69l78
5237A1p3M5l2p0K80k5O6j35K8o3k72N54L0k46j42J39M4l1P7K43l78l2P6j84M17
5262C27k20Q3k36L9J15L0jR0j96J43Q6n6j38j79L57n14N21m2J8m56K04J75L55
5285E05o17L41j35K34k72k92K75M8N7j07k18M12j76j51O0J54j14l35P30m78j48
$$ plain form
5306 -227 -21 -197 -274 -70 -172 68 65 -99 -183 -223 3 -190 430 -338 -213 -83 121 84 -30 -89 -110 -190 -95
5329 -95 55 -422 -64 -167 -117 169 98 -237 -322 -307 36 -74 9 -56 87 -201 -32 -287 -53 219 248 97 -183
5352 -183 115 120 79 -49 -240 -154 -55 -153 321 -133 -130 -187 -211 152 139 87 256 -66 237 -128 238 115 -78 -177
5376 -177 82 151 406 229 111 -15 -92 250 -18 161 39 398 55 77 144 -89 154 216 123 -30 231 169
5398 169 305 -140 10 14 37 129 145 15 -113 -134 56 174 -51 184 129 131 -25 -166 395 -27 53 -32 201 168
5422 168 93 254 -81 19 -270 93 22 -47 -73 -51 18 -93 56 -105 -75 140 -45 90 -294 -78 -75 -221 -281
5445 -281 94 -340 -212 -39 143 -190 -91 -250 -305 -172 -272 -220 135 -260 -97 159 -41 -556 -322 191 136
5466 136 45 -65 -223 -345 26 -24 -89 -180 -46 235 -179 -37 -178 -350 172 18 -161 -202 423 -4 267 -236
$$ packed form
5306b27K06j76p7K04j02K40lj64q4m0K26j93O20p68J25J30K04l7j14n9k1q0R5
5329i5J50m77L58j03N0K86p1l35q5J5L43j10Q3o5J43k88J69k55K34K72K9j51k80
5352a83K98Nm1j28j91Q6R9r8M74m54Ln7k4L63j3n2J69l22L03l65L66j23j93r9
5376a77K59O9K55j77j18j26p7L42k68J79j22L59l43K2O7k33K43O2r3j53K61o2
5398A69J36m45J50MK3R2J6j30j28k1J90J18k25K35n5Kj56j41N61m22Q0q5K33l3
5422A68p5J61l35J00k89L63p1o9k6K2O9j11J49j61L0K15j85J35l84K16Lj46o0
5445b81L75m34J28J73J82l33R9j59n5J33j00N2L55l95J63K56k00n15K34N13n5
5466A36r1j10j58j22L71n0o5r1J34K81m14J42j41j72N22j54j79m1O25m27K71n03
$$ plain form
5488 -236 -88 -165 -65 95 -1 -468 -149 14 291 -59 84 107 3 210 101 81 184 -368 36 189 314
5509 314 68 -20 -129 64 220 8 10 -43 -265 -30 180 299 111 170 256 177 189 -80 320 25 -289 -14 -3
5532 -3 285 204 128 263 199 376 79 0 92 266 80 11 -107 -125 53 315 211 59 109 -34 211 -90 292
5555 292 -137 -181 202 122 267 -87 91 -233 -102 -61 -173 149 49 -76 -70 -208 63 231 33 -345 220 -101
5577 -101 -225 22 -77 37 26 104 177 139 -97 34 -31 -51 -142 -191 -59 100 -213 -120 52 170 -239 34 -110
5600 -110 159 -256 32 -193 -86 -2 -17 182 -82 -48 21 -238 -72 94 66 -60 104 -139 134 -96 47 -72
5622 -72 1 -387 19 210 -52 124 -157 -130 -209 -56 169 -2 29 -77 -102 -89 -71 178 48 92 4 -185 22
5645 22 -219 -127 -60 -65 1 -47 66 341 95 97 -173 152 289 396 139 196 -300 -76 34 37 -82 20 166 -221
$$ packed form
5488b36J48p7J00J60r6m67L19J63K77l50J43K3j04K07j09k0J03n52M04J53J25
5509C14k46q8j09J93J56k12Kn3k22K35K10J19j88N9Q6p9J2k69M00k95l14K75J1
5532cK88q1p6J35o4J77k97p9R2J74j86o9j18j8J78K62j04j52N0j43K45l01L82
5555B92m29m4L83q0J45l54J78l24J31M1j12L22j00j25Oj38K71J68j98l78N65l21
5577a01j24K47r9J14j1P8P3l8k36J31o5k0r1m9J32J59l13R3J72J18m09K73j44
5600a10K69m15K88k25J07Q4j5J99k64L4O9k59J66J66k8j26J64k43K73k30J43j19
5622g2P3l88M06J91k62J76k81K7p9J53K25j71L1j06k5J3J8K49j30M4q8j89K07
5645B2k41R2O7nO6m8J13K75k46Kk70L25J37J07k57N7m96K24J10Lj19J02J46l87
$$ plain form
5669 -221 -190 -299 101 -33 152 -220 23 11 72 -99 -2 128 -97 11 433 -108 -118 154 290 152 131 53
5691 53 110 -84 -40 -69 59 -173 9 -166 -60 387 71 -249 -181 108 122 15 140 33 56 80 205 64 -50
5714 -50 -291 102 -242 -266 328 -9 -120 -107 -278 -79 40 -45 146 -100 -148 -79 31 13 41 -34 147 -65 -8
5737 -8 -116 -106 -78 -405 -322 -78 -65 -107 -414 157 -427 -382 15 123 29 -59 22 140 122 -53 4 -125 141 227 -28
5762 -28 343 -69 -260 -430 -9 120 -53 120 -73 363 67 -145 -129 -91 27 -34 53 153 -34 27 -63 113
5784 113 -9 76 121 96 141 146 -44 -44 -129 -134 -5 150 91 292 288 252 66 -287 6 -36 370 155 121 175 -71 31
5810 31 -100 103 393 105 41 138 134 14 12 314 -71 -167 123 131 177 157 -43 -98 -220 60 -344 243 3 -193
5834 -193 -56 -166 385 -94 69 5 -108 -36 81 -32 0 -157 -142 -19 -168 -33 19 -191 -127 -103 -222 -20
$$ packed form
5669b21L1j09M00j34J85l72K43j2O1j71R7J30k25J08M22n41j0K72J36j38k1p8
5691E3N7j94M4k9J28k32J82j75J06M47l16l20O8K89J4j07J25j07K3K4J25j41j14
5714e0k41L93l44k4N94l37j11J3j71J99J19q5J91k46m8O9J10j8K8p5J81k12N7
5737hj08J0K8l27Q3K44J3m2l07N71n84M5L97J08r4q8Q1J18j8j75N7j29K66Q6k55
5762b8L71m12j91j70M21J29j73J73j93M36k96k12J6L8J18o1Q7J00j87O1r0J76
5784A13j22Q5M5k5M5Nj90%q5nJ29J55n9K01ml6j86l53K93m2M06k15l4N4k46J02
5810C1j31K03K90k88o4R7mj20kL02l85r6K90QM6k0k00n5j22K80m04N87k40j96
5834a93J37j10N51m79J63o4j13P2J17j13L2j57J5J23j49J35N2k10O4K4j19K02
$$ plain form
5856 -20 -270 -285 -92 -48 -368 -95 146 -93 -104 -273 76 235 79 -116 -413 -180 -226 45 47 -59 44 -241
5878 -241 -281 35 1 -334 -38 -24 -414 90 98 -21 26 5 351 -53 -32 157 -54 125 206 -61 10 147 16
5901 16 -68 76 108 194 50 -79 -10 -23 195 53 226 -115 122 -234 56 -132 -12 86 84 5 -326 380 -137
5924 -137 -289 -251 8 32 66 -29 10 124 -162 -45 86 -125 -110 274 -2 138 72 -148 -4 268 59 50 194
5947 194 -183 74 132 4 158 189 333 -35 332 -85 -51 -384 -221 403 -8 -60 -116 289 -4 -137 103 96
5969 96 -82 -266 170 118 -5 -264 -120 -385 -79 -73 -68 -75 -195 75 -35 1 -101 70 -253 -188 -203 -72 22 -93
5993 -93 -233 -309 -35 -22 203 -27 -219 -58 -243 -104 -2 -155 -131 -104 -479 -293 -232 0 73 166 -242 -171 39
6016 39 103 -19 15 160 -39 186 -34 33 -495 -226 -14 -208 -122 368 179 105 -18 -2 -49 55 180 -377 201
$$ packed form
5856b0k50j5J93M4l20K73K41k39j1j69L49J59j56j95k97K33m6K71Kj06J03k85
5878b41m0L16l4l35K96J4l90N04Qj19M7k1L46m04K1J89k11J79Q1k67P1J37j31
5901A6q4J44L2Q6j44j29O9j3K18j42J73l41K37l56K90j88J20R8kp9l31P06n17
5924a37j52L8K59K4L4r5L9J14k86J17J31k11J5L84k76J40o6k20J44K72k09rJ44
5947A94l77K57N8j28J54L1J44l68L67m17L4l33J63O24m11n2n6M05k93j33K40p
5969I6j78j84M36n2j23k59J44k65L06ONpj20K70j10L6j02J71l23O5j5J31R4j15
5993i3j40p6K74J3K25k30j92J61j85J39J02j53K4K7l75J86O1K32P3R3m08P1K10
6016C9O4j22L4J45j99K25k20O7n28K69K12j94Q6M90j89p4j23J6m7J04J25n57N78
$$ plain form
6039 201 70 200 102 134 -5 -297 -207 -135 312 93 -19 29 -233 -42 66 159 159 -198 160 -3 -67 -154 137
6062 137 232 95 126 -147 87 59 -55 -99 332 -23 235 -158 -203 421 -117 36 -194 80 228 -223 241 -1
6084 -1 -132 148 306 -178 127 -84 169 40 99 131 -94 -132 -390 -108 -495 -11 -222 -86 41 -218 222 29
6106 29 -101 -160 160 -37 -95 149 36 9 -319 -90 38 188 -78 17 -55 -50 172 50 -46 -185 -277 367 101
6129 101 170 -183 -276 -31 134 -84 -308 71 187 -93 -186 45 46 130 51 201 -106 142 -138 -132 -101 -50 -110 -120
6153 -120 224 -36 6 -217 -31 364 27 -14 14 19 288 -113 -102 185 -33 147 -84 78 100 349 -69 -150 78
6176 78 -86 140 157 4 12 36 -263 136 66 -46 26 81 208 69 293 154 48 -241 -139 -99 -112 314 252 -75
6200 -75 -173 223 71 231 -121 53 -141 162 212 30 -93 -12 -82 -222 68 86 -230 76 116 248 -189 -247 -174
$$ packed form
6039B01j31J30r8L2j39k92R0P2M47k19j12M8k62J91J08R3%l57L58j63o4q7K91
6062A37R5j37L1k73K34k8j14m4M31l55K58l93m5O24n38J53k30K74J48m51M64k42
6084aj31K80J58m84L05k11K53j29N9L2k25l8k58K82l87M84k11J36J27k59M40j93
6106B9j30n9L20j97n8K44j13k7l28K29J28J50k66R5p2NK22j22r6j39r2O44k66
6129A01O9l53r3K45J65k18k24L79J16k80r3K31JQ4p9J50l07K48k80OL1N1o0j0
6153a20L44k60M2k23J86L95l37m1K8NK69m01J1K87k18J80k31J62K2K49m18q1K28
6176G8j64K26J7j53QK4k99L99p0j12P2N5J27j39K24j39j06k89J02M0j3M26o2l27
6200g5r8L96j52J60l52J74j94L03N0j82j23Q1p0j40K90J8l16L06M0J32m37n8P3
$$ plain form
6223 -174 -34 55 -5 11 181 52 -67 48 -8 48 79 40 -166 -41 -292 145 190 -179 94 -181 127 -123 -153
6246 -153 150 -305 57 -213 296 206 130 -48 -203 -92 24 -63 143 -361 -211 -47 63 93 -48 -124 -75 -241
6268 -241 -21 -14 19 209 -246 -32 -65 -129 -28 63 -122 81 -112 37 23 219 282 -153 147 -46 -93 -116 124
6291 124 -76 -92 -100 55 30 -180 0 0 -7 199 -90 207 -154 91 -101 154 141 266 -206 -167 93 -193 -35
6314 -35 279 -24 -90 -7 157 22 -24 -17 -103 114 -49 158 -40 259 88 -194 -115 -59 21 112 296 82 104 -89
6338 -89 49 103 58 75 -8 380 125 -30 416 164 -15 101 22 299 -141 -92 107 -195 318 235 -38 -59 22
6361 22 166 -212 185 135 -20 59 -224 -242 -55 194 -47 -231 -113 -137 96 -85 47 -174 -46 110 199 456
6383 456 -117 -309 -67 -169 -75 29 -110 73 -173 -128 -260 82 178 85 -17 -61 -104 -15 138 -19 -40 -189 -118
$$ packed form
6223a74J40Q9o0J6J70j29j19J15n6N6L1l9k06J25k51M37M5l69K73k75L08k50l0
6246a53L03m55L62k70N09r0p6j78j55J11J16q7K06n04J50J64J10L0j41p6M9j66
6268b41K20PL3J90m55K14l3o4J01R1j85K03j93J49j4J96O3m35L00j93m7k3K40
6291A24k00j6qJ55k5k10J80%pK06k89K97l61K45j92K55j3J25m72L9K60k86J58
6314c5L14l03o6Q3J64j35m6Pq6K17j63K07j98K99j71k82P9N6Q0R1J84k14K2j93
6338h9J38N4m5J7q3L88k55j55M46k52j79J16p9K77m40M9J99l02N13q3k73k1Q1
6361B2J44l78L97n0j55P9k83j8J87K49k41j84J18k4K33j81J32k21J28J56Q9K57
6383D56n73j92K42j02R4J04j39J83k46M5j32L42R6r3j02m4m3Q9J53j57k1j49P1
$$ plain form
6406 -118 -140 -136 -135 -228 99 -147 -145 -253 42 49 -272 185 39 23 112 208 -139 -13 83 -94 -66 -99 20 -127 431
6431 431 14 -161 0 56 -204 -168 -84 147 25 -5 246 69 150 -10 18 58 53 88 236 148 222 -30 -408 -142
6455 -142 73 11 38 190 -274 -171 -219 -28 202 -36 -336 107 237 85 294 431 96 82 68 190 237 -199
6477 -199 -6 124 26 -3 305 174 36 -183 201 128 29 64 -256 15 30 -383 66 -53 229 168 8 -53 92
6500 92 9 47 -563 -48 95 -165 -144 -76 -271 -273 51 74 -196 -76 -137 -141 -185 -136 112 68 -49 -11 -22 -6 -132 50
6526 50 236 196 -158 -95 -2 358 -84 -110 -43 48 -127 -199 -121 -226 -330 -238 48 -53 -191 -158 -90 58 79 78 69 -185
6552 -185 -17 82 346 -111 10 -19 -39 -216 37 237 191 -169 6 -116 121 -310 223 187 67 -86 -99 -32
6574 -32 -316 -49 -214 -283 267 -81 110 182 -173 -244 -133 116 165 308 216 169 128 -41 -33 -130 300 169 270 205
$$ packed form
6406a18k2MJr3L27k46Kj08K95Pl21M57j46j6Q9R6l47J26R6j77K8l3J19j47N58
6431D31m17j75J61N6k60L6Q4K31j22l0K51j77Q1j60K8M0nL5J48q8P4k52l78K66
6455a42K15o2K7J52m64J03m8J91K30k38l00M43J30j52K09J37l35j4j4J22M7m36
6477a99J93J30r8k9L08j31j38k19L84p3r9L5l20K71J5m13M49j19K82o1j60o1J45
6500I2q3L8o10N15J43k60K1O8j95kL24K3k70J20o1mm4M9K48m4j17L8j1J6j26J82
6526E0J86m0l54O3R3L60m42k6O7R1j75p2P8j05j04R2K86j01j38L3O8J48K1jrk54
6552a85J68R9K64m57J21k9k0j77K53K00m6l60J75j22K37m31N33l6j20j53j3O7
6574c2k84K67j65o9N50l48J91P2l55p1J11K49M9J43r2m7m1j69Qr7M30j31J01o5
$$ plain form
6598 205 267 91 199 99 16 -140 13 95 -169 128 -78 -63 94 205 -47 25 -18 76 45 201 19 -121 177
6621 177 170 75 50 -56 -15 -230 157 -140 254 91 -95 10 75 -62 127 93 -7 -40 -117 168 -16 -304 -77
6644 -77 63 -184 247 128 251 10 -87 -149 6 -216 82 -82 -241 -549 82 3 -144 -77 -75 362 -288 -476
6666 -476 -7 191 -289 19 -243 48 -9 -6 -87 62 47 52 -147 -121 37 -116 -68 -157 -68 61 -165 -30 -36 182
6690 182 225 89 171 -23 18 -23 -150 -233 74 118 -113 -103 119 -32 36 -162 -30 -128 -224 225 339 343 245 -76
6714 -76 59 103 -203 25 42 146 -74 155 44 119 111 114 134 71 170 -3 398 204 223 23 84 93 -210 -8 55
6739 55 120 186 -64 -10 -451 21 115 -170 33 168 -243 48 23 139 128 306 349 49 -59 57 -25 9 -106
6762 -106 56 117 188 -48 104 146 -13 247 -121 216 272 218 -82 -281 149 -191 -95 -24 -340 -174 171 5
$$ packed form
6598B05O2j76J08j00q3j56J53Q2k64K97k06J5J57J11k52P2m3R4l1J56j82j40K98
6621A77pr5k5j06M1k15L87k97L94j63j86J05O5j37J89l4j00l3p7K85j84k88K27
6644g7J40k47M31j19J23k41r7o2J55k22K98j64j59l08O31p9j47O7KM37o50j88
6666d76M69J98m80L08k62K91n7Lq1J49j5Nj99K6J58j53M8q9Q9J29k26J35oK18
6690A82M3j36Q2j94M1m1j27q3L07M4k31J0K22j51O8j98J32r8r6M49J14Mr8l21
6714g6J35M4l06K28J7J04k20K29j11P5qLK0o3R9j73M01j94J9k00O1Rl03K02O3
6739E5O5O6k50N4m41M72R4k85K03J35m11K91k5J16j1J78M3l00j08J16q2L4j15
6762a06J62O1P1k36J52M2j59K60l68L37N6n4l00j99M30l40R6P1l16J66L45j66
$$ plain form
6784 5 13 -348 -141 9 -195 158 52 14 116 -123 -253 -87 -56 106 -90 -41 -87 -341 2 213 79 -328 -390
6807 -390 -95 -88 212 3 22 -115 131 -256 134 -34 -279 -276 86 65 -54 71 -157 -11 -333 -52 -149 59
6829 59 -120 -50 -38 -48 -110 -6 149 106 -302 250 -19 -74 98 104 -1 20 -7 269 314 199 223 99 -31 170
6853 170 -43 380 -27 -92 199 458 226 110 -333 196 196 209 0 -37 -108 7 -210 169 108 33 84 166 -13
6876 -13 204 270 -181 -98 238 48 -100 -174 234 54 -205 109 54 192 16 31 68 -196 275 118 318 -32
6898 -32 -324 -148 122 40 275 -28 -53 -110 51 2 -2 115 31 -118 -140 10 -211 -195 -191 -123 -154 -4 -157 -452 220
6923 220 -35 -283 -57 -207 -112 -125 187 102 95 -214 79 -29 135 -143 89 -51 108 205 -66 -214 -296 98
6945 98 -40 -60 -280 216 -39 67 371 63 -110 129 -74 75 183 131 203 124 344 -8 354 -63 256 45
$$ packed form
6784EQl61K07J50k04L53j06l8J02k39j30J66L1J62j96M9m6k54L43K11j34m07o2
6807c90K95PL00k09J9j37K46l87L90j68k45LL62k1j19J25k28J46l22K81r7K08
6829E9j79P0J2j0o2J04J55m3m08N52k69n5J72Oj05K1k7K76M5j15K4j24j30K01
6853A70k13M23m07o5K91K59k32j16m43N29%J3k09l7p1J15k17L79o1p5N1Q2j79
6876a3K17O6m51Q3L36j90j48p4M08j80k59L14n5J38j76J5L7k64M71j57K00l50
6898c2k92J76K70q2K35l03k5n7J61m9mJ17q4j49k2J50k21J6MO8l1J50j53k95O72
6923B20k55k48K26j50R5j3L12q5pl09K93j08J64k78K32j40J59R7k71j48q2L94
6945I8j38k0k20M96k55J06L04l08j73K39k03J49J08n2P2p9K20l52L62m17L19k11
$$ plain form
6967 45 60 -170 21 47 70 -57 197 -1 63 198 -152 -65 130 -161 429 201 -106 37 -82 -16 83 188 -169
6990 -169 117 12 71 -177 110 408 101 -29 195 251 -28 63 271 -4 371 118 93 -8 449 335 64
7011 64 183 33 495 176 -193 -35 97 68 -27 46 112 181 -172 -368 30 8 -180 -196 -58 -8 176 37 233
7034 233 -100 -92 -180 -22 -279 65 -189 -195 -113 -48 185 -69 -103 -70 -139 103 134 111 -103 104 -52 -239 -182 -192 163
7059 163 -229 -186 95 53 -121 -43 -158 -67 15 -48 -5 82 6 -243 82 184 173 199 32 -139 -32 -260 279 -89
7083 -89 -176 -98 -41 242 -109 18 -176 -46 255 216 144 29 -25 -221 -224 8 -129 -36 113 239 81 -8 -58 27
7107 27 -57 139 341 -27 25 65 158 166 -263 124 -28 175 134 -18 -12 -54 117 376 -87 335 39 -116 423 -84
7131 -84 109 105 219 -83 -175 103 56 176 99 -145 -353 246 69 47 397 58 -70 -199 32 70 -163 130 267
$$ packed form
6967D5J5k30J91K6K3j27K54j98O4J35l50Q7J95k91N90k28l07J43j19O6R9J05l57
6990a69K86j05N9k48K87K98l07j30K24N6k79R1K08k75L75k53k5j01M57j14k71
7011F4J19j50M62l19l69J58J32k9r5P3O6O9l53j96L98k2j88j6J38N0J84j39J96
7034B33l33Qq8J58k57L44k54oQ2O5K33k54l4L3o9K42L1k3k14K07j56j87N7j0L55
7059A63l92M3K81m2j74P8j15R1Q2o3M3Q7p6k49L25J02j1K6j67j71J07k28N39l68
7083h9q7P8N7K83l51J27j94J30L01l9p2j15n4j96lK32j37R3J49J26j58q9n0Q5
7107B7q4J96K02l68N2M0R3Qm29L87j52K03m1j52Om2J71K59m63M22k96j55N39n07
7131h4J93mJ14l02r2K78m7J20p7k44k08N99j77k2L50l39j28j29K31L8k33K93J37
$$ plain form
7154 267 243 41 23 -110 106 -110 -239 140 -267 -102 -56 -170 -418 -172 -132 -89 -50 -109 -305 235 30 151
7176 151 -126 -5 96 370 80 -45 -155 -82 -286 88 -217 -116 148 -48 -56 102 -65 -6 -18 -51 -75 -178
7198 -178 -144 62 -27 -78 -159 -131 -124 198 92 -329 71 -42 16 110 72 -31 -103 -205 -190 88 115 -64 -45 -85 -128
7223 -128 215 -2 311 102 212 -17 397 33 200 231 60 122 -13 262 382 131 77 208 422 269 66
7244 66 -61 -191 131 232 156 159 103 -98 -38 7 127 -44 7 -90 51 -284 -151 -136 -23 -11 41 -68 -201 70
7268 70 -42 -96 -129 201 -104 -87 -142 60 7 58 -117 -45 -7 -291 76 -90 -97 170 31 243 -68 -60 -156 18 37
7293 37 -8 -109 -248 -176 -132 173 -139 1 -180 -285 -83 -184 -190 -122 197 -114 -316 -27 266 -94 -242 -347
7315 -347 -179 -206 -15 -28 -95 -318 30 -105 -22 -111 -258 -51 -243 -98 21 73 -29 -359 112 138 177 174 27
$$ packed form
7154B67k4k02j8j33K16k16j29L79m07J65M6j14k48K46M0M3L9n9j96N40k05J21
7176A51k77J21J01K74k90j25j10P3k04L74l05J01K64j96qJ58j67N9j2l3k4j03
7198a78L4K06q9n1q1K8PL22j06m21M00j13N8R4l8j03p2j02J5K78K7j79J9m0m3
7223a28L43k17L13k09J10k29M14l64J67L1j71O2j35K75J20k51n4J31K14j53k03
7244F6j27j30L22J01p6Ln6k01O0M5J20j71N1r7J41l35J33J5J13J2N2j09j33K71
7268G0j12n4l3L30l05J7n5K02n3N1j75P2L8k84L67j66pK67j39K12l11Qr6J74J9
7293C7m5j01j39P2M4L05l12J40j81j05K02j01oO8L19l11k02K89K93l60j48j05
7315c47J68k7J91j3o7k23L48j35Q3q9j47K07j92J45J19N2j02l30M71K6L9lj47
$$ plain form
7338 27 147 56 -39 38 -172 157 3 -85 155 181 -219 132 394 30 193 -63 308 39 -71 125 -42 45
7360 45 9 36 20 6 187 329 296 -52 242 128 140 144 155 567 26 125 192 316 369 -203 117 -2 323 5
7384 5 59 390 105 44 192 -118 -64 -64 117 225 -261 -179 197 -116 203 -223 -87 -195 -225 -94 -217 95 295
7407 295 -30 -293 14 152 259 -105 112 -55 82 -126 -239 -33 192 -217 -137 -166 88 17 -77 -87 -156 34
7429 34 -119 46 -7 3 -48 -416 48 -316 15 317 -268 -214 -8 -40 -49 -329 -73 -148 -167 2 -161 64 -56
7452 -56 -283 -171 259 -33 -168 108 22 57 -105 55 -337 178 198 208 -39 -40 -152 -148 148 -90 -366 173 66
7475 66 231 -259 126 2 35 -227 100 176 91 -188 315 186 -11 -173 291 334 -90 -35 139 183 -41 228
7497 228 193 104 158 -114 -95 127 -197 -86 66 -118 65 -145 11 377 159 0 -150 127 165 296 202 204 192
$$ packed form
7338B7J20r1r5P7k10L29j54q8K40K6m00L51K62l64J63k56L71k69j10J96j67Q7
7360D5l6K7j6j4J81J42l3l48K94j14J2MJ1M12n41R9O7J24N3n72L20j19L25l18
7384EN4L31k85o1J48l10N4%J81J08m86Q2L76l13L19m26J36j08l0J31j23L12K00
7407B95l25k63L07J38J07l64K17j67J37k08j13K06K25m09Q0k9K54p1r4j0o9J90
7429C4j53J65n3J0n1l68M64l64L31L02n85N4K06l2rk80K56p5j9J69j63K25j20
7452e6k27J12M30k92j35K76q6L5j62J60l92N15K0J0k47jj12MK96k38k76N39j07
7475F6J65m90L85j24L3k62L27P6q5k79N03j29j97j62M64M3m24N5J74M4k24K69
7497B28l5q9N4k72J9K22l24J11J52j84J83k10J56L66k18j59j50K77L8J31r4Kj2
$$ plain form
7520 192 21 460 189 38 -55 127 107 -159 -141 279 -212 97 -151 86 367 -82 25 169 -51 149 331
7541 331 -117 -142 -87 42 226 53 -238 -298 68 -205 -137 -119 -65 199 -44 -48 139 -77 -186 -482 -458 -41 -156
7564 -156 139 -350 65 -256 -480 -41 32 97 -129 117 168 -361 29 -5 166 -24 -92 83 3 -18 177 16
7586 16 -36 -22 -348 45 -349 -272 -381 -197 -177 128 126 37 -47 79 273 82 203 242 -257 -59 -101 -77 100 205
7610 205 331 -6 247 -74 56 -77 -22 12 78 299 345 266 -21 -100 86 171 190 186 96 111 101 105 -19 36 97 -25
7636 -25 124 327 331 97 -12 120 210 -44 50 4 -202 122 -52 166 118 30 290 89 -158 219 182 114 68 -566
7660 -566 216 227 -113 167 76 -59 -149 -321 125 133 -13 -158 -422 -271 -130 87 13 -137 176 -104 -425 237
7682 237 -61 18 -70 -113 -60 -118 130 -53 117 -308 -223 92 -168 -111 -157 -37 -161 -203 164 242 -82 -131 -159 -215
$$ packed form
7520A92j71M39k71j51r3J82k0k66J8M20m91L09k48K37K81m49J07J44k20K00J82
7541C31m48k5N5J29J84j73k91o0L66k73O8J8N4K64k43mJ87k16j09k96K4M17j15
7564a56K95m89M15l21k24M39P3O5k26K46N1n29L90l4J71j90o8J75q0k1J95j61
7586A6n2J4l26L93l94P7j09J84K0L05kq9q4J26J94j91J21L9m99J98m2K4J77J05
7610B05J26l37K53l21J30j33N5L4O6K21M6p9k87p9J86Q5J9mr0J5j0Mj24N5O1j22
7636b5J49K03Mk34j09J32R0k54R4m6k06L24j74K18m8q8K60k01k47L77l7o8m6o34
7660e66P82J1l40K80r1j35r0j72M46Qj46j45k64J51J41K17p4j50L13k80l21O62
7682B37k98P9q8m3N3n8K48j83J70m25Q5L15k60N7m6J20j24m2L67P8l24m9k8n6
$$ plain form
7706 -215 -398 -82 -192 204 -262 -39 99 -4 62 2 131 175 39 45 -9 -194 58 -130 65 -45 293 -16
7728 -16 104 119 217 139 248 95 -36 -64 -157 243 117 121 -108 246 -88 125 1 223 -145 -253 130 253 9
7751 9 184 319 232 145 -83 228 519 -163 104 8 11 298 360 221 241 -10 333 282 412 59 189 27 -126
7774 -126 -58 143 269 37 231 -336 31 41 427 -33 -2 -35 -85 18 45 17 124 -130 -91 106 26 -240 226
7797 226 0 -54 -30 55 -119 -217 24 5 -17 -88 -108 82 -176 -270 -112 -164 12 -75 -306 -154 -272 -223 -35 131
7821 131 -43 -208 202 20 -321 -204 -89 -29 41 19 84 -160 -190 -245 -248 -359 112 -359 -257 137 40 101 175 127
7845 127 -280 -100 188 30 -83 169 -28 27 -38 21 64 281 -97 185 -196 82 268 -229 -24 -124 -137 -44
7867 -44 -271 196 156 152 36 -206 43 -35 232 164 69 -105 134 195 169 142 94 186 -21 180 151 268 115 210 50
$$ packed form
7706b15j83L16j10L96m66K23J38j03O6o0J29M4j36On4j85K52j88J95j10L38l09
7728a6J20J5R8p8J09j53j31k8r3M00j26Mk29L54l34K13j24K22l68j08L83J23k44
7751IJ75J35q7q7k28L11K91o82K67r6LK87O2j39K0k51L43n1J30l53J30j62j53
7774a26O8K01J26k32J94n67L67J0L86m60L1l3n0J03K7k8J07k54L9J97q0k66M66
7797B26k26n4K4Q5j74r8K41j9k2p1k0J90k58r4J58n2J76q7k31J52j18M9J88J66
7821A31j74j65M10j82l41J17J15O0P0k2O5k44l0n5lj11M71m71J02L94r7O1P4m8
7845A27m07J80K88j58j13K52j97N5o5N9M3K17l78K82l81K78J86m97K05j00j3R3
7867d4k27M67m0mj16k42K49p8K67o8r5j74K39O1k6k7m8R2k07K01k9J17j53R5j60
$$ plain form
7892 50 108 177 -45 55 180 107 73 51 147 410 93 119 17 300 68 -12 176 198 -76 82 116 225 -141 -29
7916 -29 77 108 -57 -139 -59 -154 -65 36 80 27 281 -83 -60 324 -48 -131 10 -392 -341 143 -58 -80 -237 -245 -220
7941 -220 44 -129 -336 -153 19 -198 -207 -101 53 111 -172 -58 -186 -97 -83 219 59 -279 -191 -110 76 -50
7963 -50 -123 -203 -90 -97 167 52 -136 -424 -228 -16 25 194 10 -270 104 -15 -8 255 -129 35 -1 -401 -23
7986 -23 -143 -134 114 -3 -34 -300 11 -326 -55 -149 21 110 -337 -95 207 63 -195 -181 62 -198 6 210
8008 210 88 194 -85 153 -128 215 107 261 104 203 180 150 78 98 235 305 86 3 27 253 2 264 -271
8031 -271 -179 28 -28 -157 207 118 97 135 -56 10 121 88 -181 -95 -272 124 82 -56 125 13 91 149 202 166
8055 166 -280 315 -207 -7 37 281 215 -337 -501 -149 38 -375 -175 295 147 -289 181 109 -67 160 -189
$$ packed form
7892E0N8O9k22J00J25p3l4k2R6K63l17K6j02K83k32q0J88K2k74J58L4J09l66J12
7916b9J06L1j65q2Q0r5Q9J01M4n3K54l64K3L84l72q3J41m02N1M84k01k2j57qK5
7941b20K64j73k07J83J72k17rJ06J54N8k83J14j28Q9J4L02j60l38Q8Q1J86j26
7963e0p3q0J13pK64j15j88k88J96K12M1J69j84k80L74j19PK63l84J64l6m00L78
7986b3j20RK48j17l1k66L11l37K71r4J70Q9m47K42L02j44k58J4K43k60K04K04
8008B10j22J06k79K38k81L43j08J54j57R9k3l0p2K0J37P0k19q3K4K26k51K62n35
8031b71R2K07n6j29L64q9k1L8j91O6J11l3k69Q6j77L96m2j38J81j12P8N8N3l6
8055A66m46N95n22K00M4K44o6n52j64L52J87m13K00M70j48m36M70p2j76K27l49
$$ plain form
8076 -189 -93 -183 -9 -373 14 -149 -219 -55 -19 -211 -193 -196 -124 58 69 -123 -5 99 -347 -108 12 58 -13 13
8100 13 -243 -45 -9 103 -180 124 41 -36 -3 378 -39 -64 333 -159 67 54 486 94 201 324 49 204
8122 204 193 -56 125 50 393 85 74 162 102 49 238 283 302 47 74 82 13 95 54 369 -222 -46 45 66 330
8147 330 78 178 209 -4 -7 -42 394 253 182 233 -41 136 -115 0 24 176 -121 -50 226 1 -153 -74 -172
8170 -172 -50 -83 -86 168 -37 216 18 198 177 45 66 -62 1 -42 236 40 233 7 -58 -6 -10
$$ packed form
8076a89R6r0J74l64L87j63p0J64L6j92J8lP2J82J1j92J18J04m46K39J20M6p1K6
8100A3k56J98L6J12k83L04q3p7L3L81m17k5L97m92K26j3M32l92J07J23k75J55
8122B04j1k49J81p5L43l08j1Q8o0n3J89M5J9k55K7Qo9Q2m1L15n91J76R1K1K64
8147C30k52J00L1k13ll5M36j41p1N1k74J77k51J15K4J52k97P1K76k25j54P9r8
8170a72J22l3lK54k05K53j98J80k1j32K1j28O3m3K78j96J93k26o5N2m
8191a0
$$ Imaginary data points
##PAGE= N=2
##DATA TABLE= (X++(I..I)), XYDATA
$$ plain form
0 0 0 0 0 -8 8 0 8 -16 16 -16 24 -32 40 -48 56 -71 80 -96 116 -136 160 -184 215 -249 284 -325 372 -422
28 -422 477 -540 607 -681 762 -852 952 -1059 1179 -1308 1451 -1609 1780 -1971 2184 -2417
44 -2417 2677 -2972 3303 -3683 4118 -4626 5226 -5948 6843 -7975 9465 -11523 14569 -19530
58 -19530 29027 -53755 249415 529549 -107878 -305656 18995 320678 129582 -50820 36281
69 36281 169873 57500 -41479 30631 123429 39660 -25532 55586 133228 16289 -114576
80 -114576 -55322 109187 117845 -24420 -115023 -40418 64005 58869 -27798 -62623 -27668 2506
92 2506 621 16624 26024 -26776 -92751 -50704 69356 98082 -14731 -99736 -39306 46753
104 46753 17619 -35713 17865 76018 -9772 -117752 -50353 91899 70431 -70362 -78719 54906
$$ packed form
0@%%%qJ6qQk4L2l2M0n6P2q8J04j27J51j76K12k52K96l44L99m64N33o09O97p94
28d22Q99j017J147j288J443j614J804k011K238k487K759l060L389l751M155m601
44b417N094n649O275o986P801q744R852j1174J2791j4818J7440k0988K6092l4099
58a9530M8557q2782L03170K80134o37427j97778L24651L01683j91096j80402Q7101
69C6281J33592j12373r8979P2110R2798q3769o5192Q1118P7642j16939j30865
80a14576N9254J64509Q658j42265r0603P4605J04423n136q6667l4825L4955L0174
92B506j885J6003R400n2800o5975M2047J20060K8726j12813q5005O0430Q6059
104D6753k9134n3332N3578N8153q5790j07980O7399J42252k1468j40793q357J33625
$$ plain form
116 54906 79915 -69774 -146675 -3283 142314 56923 -123390 -126573 12586 59209 -11043
127 -11043 -37068 -6342 -31477 -77441 -23353 65685 21943 -103117 -98785 39019 86419 -29926
139 -29926 -111857 -35644 59006 28710 -46317 -43132 1054 3356 -11031 2157 1350 -40048 -43974
152 -43974 31415 77433 -7348 -116760 -73933 72677 107101 -13661 -100497 -45641 36072
163 36072 26233 -19561 -10075 24990 10135 -36272 -35534 17848 44220 9348 -21881 1610 30967
176 30967 8586 -22288 6400 58474 46416 -15488 -26036 33682 63674 18341 -15691 21003
188 21003 51358 12780 -17669 29887 70183 16001 -49330 -9823 72452 65517 -9612 -35445
200 -35445 -3585 11618 15140 42468 43202 -28413 -75559 -4136 81897 38863 -61385 -47832
$$ packed form
116E4906K5009j49689p6901J43392J45597q5391j80313l183J39159M6623p0252
127a1043k6025L0726k5135m5964N4088Q9038m3742j25060M332J37804M7400j16345
139b9926q1931P6213R4650l0296p5027L185M4186K302j4387J3188q07m1398l926
152d3974P5389M6018q4781j09412M2827J46610L4424j20762q6836N4856Q1713
163C6072r839m5794R486L5065j4855m6407P38N3382K6372l4872l1229K3491K9357
176C0967k2381l0874K8688N2074j2058o1904j0548N9718K9992m5333l4032L6694
188B1003L0355l8578l0449M7556M0296n4182o5331L9507Q2275o935p5129k5833
200c5445L1860J5203L522K7328P34p1615m7146P1423Q6033m3034j00248J3553
$$ plain form
212 -47832 47818 51988 -42940 -70218 15171 72554 20867 -46911 -38422 6445 19678 12964 14622
225 14622 5336 -25242 -30484 14667 51498 21033 -37826 -39714 18324 52738 16523 -34761 -27762
238 -27762 20526 33388 -5139 -28744 -248 27712 4867 -30723 -21229 11614 15235 -3331
250 -3331 -10311 -12635 -25115 -20842 12863 26441 -13275 -49392 -22881 18915 2782 -37232 -21217
263 -21217 25550 11888 -49411 -54377 9824 42638 -2097 -48623 -31734 7640 8370 -15094 -15647
276 -15647 495 -3967 -20736 -12692 9169 3837 -21595 -18727 11401 15182 -19970 -35135 3129
289 3129 39285 10697 -44930 -39567 22018 48730 6348 -35551 -25103 5987 18640 16188 6958
302 6958 -9861 -18665 405 24857 15046 -14772 -11334 24252 29726 -13128 -35190 7235 51089
$$ packed form
212d7832R5650M170r4928k7278Q5389N7383n1687o7778Q489M4867J3233o714J658
225A4622r286l0578n242M5151L6831l0465n8859j888N8038L4414l6215n1284O999
238b7762M8288J2862l8527k3605K8496K7960k2845l5590R494L2843L621j8566
250c331o980k324j2480M273L3705J3578l9716l6117K6511M1796j6133m0014J6015
263b1217M6767j3662o1299m966O4201L2814m4735m6526J6889L9374P30k3464n53
276a5647J6142m462j6769Q044K1861n332k5432K868L0128L781l5152j5165L8264
289C129L6156k8588n5627N363O1585K6712m2382m1899J0448L1090J2653k452r230
302F958j6819q804J9070K4452r811k9818L438L5586N474m2854k2062M2425M3854
$$ plain form
315 51089 29264 -23019 -29964 8130 32270 22022 4942 1210 1097 -2107 5649 26105 28596
328 28596 856 -18261 3280 30079 19027 -6240 959 26626 19636 -13922 -16858 25443 49070
341 49070 12523 -31767 -17210 27715 34350 5372 -7031 3256 5272 -1483 4267 14774 10760
354 10760 -1943 -4216 2558 572 -4502 6340 21985 7400 -27933 -29431 12436 36933 9456
367 9456 -28869 -28060 1384 17538 6540 -10611 -12383 -5970 -4733 -4703 -365 -2671 -11502 -7817 4026
382 4026 -1796 -22777 -20934 10208 24519 -7422 -44080 -29994 17383 29201 -10956 -39334 -19797
395 -19797 6922 3697 -9340 -9422 -9335 -13766 -8989 1052 -4723 -19432 -16090 3828 5833 -20357
409 -20357 -33886 -5876 22463 5100 -31211 -30065 959 12542 -3829 -15702 -8901 -2112 -6501
$$ packed form
315E1089k1825n2283o945L8094K4140j0248j7080l732j13l204P756K0456K491
328B8596k7740j9117K1541K6799j1052k5267P199K5667o990l3558k936M2301K3627
341D9070l6547m4290J4557M4925O635k8978j2403J0287K016o755N750J0507m014
354A0760j2703k273O774j986n074J0842J5645j4585l5333j498M1867K4497k7477
367I456l8325Q09K9444J6154j0998j7151j772O413J237L0M338k306q831L685J1843
382D026n822k0981J843L1142J4311l1941l6658J4086M7377J1818m0157k8378J9537
395a9797K6719l225j3037q2Q7m431M777J0041n775j4709L342J9918K005k6190
409b0357j3529K8010K8339j7363l6311J146L1024J1583j6371j1873O801O789m389
$$ plain form
422 -6501 -9428 -1081 6589 -1491 -11210 -3698 6903 -176 -8651 5193 21096 6406 -20177 -12874
436 -12874 24588 38204 6543 -23243 -5780 29638 27490 -1824 -4328 19700 24001 1861 -5624
449 -5624 12281 25076 15472 3842 4901 6783 3705 9589 26119 22630 -9927 -24710 7808
462 7808 42152 23584 -18601 -20705 12238 24733 3594 -10511 3391 16295 4389 -10555
474 -10555 -2726 11701 9795 2897 4503 1989 -10297 -6618 19464 29323 -377 -30359 -15297
487 -15297 25185 32005 -1989 -25137 -6222 17579 10134 -8925 -5775 8779 6339 -7742 -9693
500 -9693 584 5081 754 -2513 -3766 -11215 -15548 -963 17042 6573 -25842 -33238 -2250 20761
514 20761 3276 -24347 -20799 1795 3775 -15174 -19161 -1871 7335 -7229 -21315 -14598 -2135
$$ packed form
422f501k927Q347P670q080r719P512J0601p079q475J3844J5903j4690k6583P303
436a2874L7462J3616l1661k9786J7463L5418k148k9314k504K4028M301k2140p485
449e624J7905J2795r604j1630J059J882l078N884J6530l489l2557j4783L2518
462G808L4344j8568m2185k104L2943J2495k1139j4105J3902J2904j1906j4944
474a0555P829J4427j906o898J606k514j2286L679K6082R859k9700k9982J5062
487a5297M0482O820l3994k3148J8915K3801p445j9059L150J4554k440j4081j951
500i693J0277M497m327l267j253p449m333J4585J8005j0469l2415p396L0988K3011
514B0761j7485k7623L548K2594J980j8949l987J7290R206j4564j4086O717J2463
$$ plain form
527 -2135 -1749 -6047 -5756 -8853 -17184 -14473 2797 9586 -9178 -27194 -15995 9278 8266 -17234
541 -17234 -24989 -1896 13103 -4022 -23665 -13450 9335 8966 -10582 -17289 -3396 7053 4343
554 4343 665 -57 -5629 -8826 4293 21722 14727 -9178 -12126 11580 23544 5088 -9845 6586
568 6586 26350 15403 -8985 -8819 12616 23398 14730 3648 -1858 -3541 2827 16987 19705 1811
582 1811 -14094 -4079 15889 14601 -3008 -7196 5675 11269 1573 -7324 -1745 10491 13016 2368
596 2368 -8483 -5260 9201 17368 8598 -4711 -5586 5095 13305 12612 7491 1457 -4265 45 14011
611 14011 18640 5411 -2861 6927 11717 -2838 -8745 13330 29417 8509 -21340 -17131 9937
624 9937 19264 5308 -5443 -5298 -7426 -8913 1543 8991 -3812 -17532 -7971 6238 -3739 -21192
$$ packed form
527b135L86m298K91l097q331K711J7270O789j8764j8016J1199K5273j012k5500
541a7234p755K3093J4999j7125j9643J0215K2785l69j9548o707J3893J0449k710
554D343l678p22n572l197J3119J7429o995k3905k948K3706J1964j8456j4933J6431
568F586J9764j0947k4388J66K1435J0782q668j1082n506j683O368J4160K718j7894
582A811j5905J0015J9968j288j7609m188J2871N594r696q897N579J2236K525j0648
596B368j0851L223J4461Q167q770j3309q75J0681Q210o93n121o034n722M310J3966
611A4011M629j3229q272R788M790j4555n907K2075J6087k0908k9849M209K7068
624I937R327j3956j0751J45k128j487J0456P448j2803j3720R561J4209r977j7453
$$ plain form
638 -21192 -14135 7645 7091 -14581 -25530 -11488 5612 4275 -10584 -19423 -13794 -1075 6099
651 6099 -284 -15637 -21548 -8747 7123 6654 -6789 -16119 -13125 -2705 1964 -4068 -10614 -5161
665 -5161 4150 -1606 -15039 -17022 -2299 9721 6035 -7796 -15303 -9967 628 4192 296 -2730
679 -2730 -3346 -2501 -2514 -3259 -3217 992 5969 5535 -1142 -6660 -4817 6058 13456 5539 -7657 -4418 11130
696 11130 12437 -2748 -7505 6503 15760 6287 -4356 -1225 5870 6733 5487 7141 3819 -3201
710 -3201 1946 16959 12782 -10227 -12918 15015 29491 7509 -14120 -6611 11112 14709 9786
723 9786 6426 2897 -858 3346 11234 9315 -156 2555 15684 14861 -4032 -10399 6486 19859
737 19859 12650 720 -2452 -1720 2736 10447 10380 -2446 -8868 2792 13038 2492 -11545 -7001
$$ packed form
638b1192P057K1780n54k1672j0949J4042J7100j337j4859q839N629J2719P174
651F099o383j5353n911J2801J5870m69j3443r330K994J0420M669o032o546N453
665e161R311n756j3433j983J4723J2020l686j3831p507N336J0595L564l896l026
679b730o16Q45j3p45M2M209M977m34o677n518J843J0875P398p917j3196L239J5548
696A1130J307j5185m757J4008R257r473j0643L131P095Q63j246J654l322p020
710c201N147J5013m177k3009k691K7933J4476k1982k1629P509J7723L597m923
723I786l360l529l755M204P888j919r471K711J3129q23j8893o367J6885J3373
737A9859p209j1930l172P32M456P711o7j2826o422J1660J0246j0546j4037M544
$$ plain form
751 -7001 6674 6051 -4240 -5189 823 -3090 -9778 -4660 2783 -1609 -5509 -510 -3117 -16708 -16253
766 -16253 4458 13887 -4124 -20851 -14169 850 989 -8433 -8111 -1844 -3014 -7744 -6848 -5938 -9414
781 -9414 -5857 4260 2800 -13909 -18217 -1827 9285 -2335 -16993 -12030 2897 7845 -1213
794 -1213 -13021 -15343 -6242 6624 10708 -1229 -16360 -14702 1144 8536 390 -6776 -3169 499
808 499 -1527 -4924 -4687 -495 5503 7750 -452 -10949 -9277 4216 13205 7125 -4579 -6440 1346
823 1346 6334 3553 1146 3096 4454 3534 2601 1131 1730 5575 8605 5204 613 2383 6922 7735
839 7735 3733 217 1884 7580 10804 6259 -1989 -1667 7528 12407 5574 -2264 1230 9945 9444 769
855 769 -2119 2983 8801 11083 8011 -1100 -9377 -1769 15374 17903 927 -10284 -2778 7792
$$ packed form
751g001J3675o23j0291r49O012l913o688N118P443m392l900M999k607j3591M55
766a6253K0711R429j8011j6727O682J5019J39r422L22O267j170m730Q96R10l476
781i414L557J0117j460j6709m308J6390J1112j1620j4658M963J4927M948r058
794a213j1808k322R101J2866M084j1937j5131J658J5846P392q146p166L607L668
808D99k026l397K37M192N998K247q202j0497J672J3493Q989o080j1704j861P786
823A346M988k781k407J950J358r20r33j470N99L845L030l401m591J770M539Q13
839G735m002l516J667N696L224m545q248L22R195M879o833p838L494Q715n01q675
855G69k888N102N818K282l072r111q277P608J7143K529j6976j1211P506J0570
$$ plain form
869 7792 6167 1055 1883 4261 2528 610 -1233 -3526 -2265 6900 12732 1213 -14396 -10988 6154
884 6154 12404 2460 -7862 -8433 -3980 1353 5457 2122 -8293 -11267 -1243 5059 -2256 -8015 -2561
899 -2561 762 -6727 -11396 -3339 4219 -244 -8292 -10172 -8885 -6325 -77 4115 -3560 -15756 -13726
914 -13726 -411 3887 -4579 -8801 -3277 -2793 -9768 -10019 -1527 2695 -1966 -6161 -7627 -8821 -5013
929 -5013 4372 6327 -6399 -15892 -6703 8489 7519 -5991 -10771 -3154 2505 1524 510 -1010 -3959
944 -3959 -1672 4478 3282 -5705 -5665 7200 11954 -91 -9674 -2287 9578 10084 2360 -2273 -1756
959 -1756 2292 7374 9792 3390 -4055 -8 10484 9565 -1017 -2496 7673 11483 4987 -286 1143
974 1143 4639 7738 9396 6100 -495 -422 7848 11418 4649 -1440 2450 9923 7319 402 1569 6856
$$ packed form
869G792j625n112Q28K378j733j918j843k293J261R165N832j1519j5609L408J7142
884F154O250r944j0322n71M453N333M104l335j0415k974J0024O302p315n759N454
899b561L323p489m669Q057P558m463q048j880J287K560O248M192p675j2196K030
914a3726J3315M298q466m222N524M84o975k51Q492M222m661m195j466j194L808
929e013R385J955j2726r493R189J5192r70j3510m780P617N659r81j014j520k949
944c959K287O150j196q987M0J2865M754j2045r583P387J1865N06p724m633N17
959a756M048N082K418o402p445M047J0492r19j0582j479J0169L810o496n273J429
974A143L496L099J658l296o595P3Q270L570o769o089L890P473k604o917J167N287
$$ plain form
990 6856 6489 2542 2179 2621 1835 4927 8411 3523 -4738 -2974 6684 9048 1363 -4709 -2394 3111
1006 3111 3287 -321 -1343 -424 -509 -1465 -1653 -2319 -2186 1193 1695 -4753 -10079 -5479 2961 3403 -3173
1023 -3173 -8898 -9407 -3610 2568 531 -8064 -10953 -5009 630 -895 -6946 -8534 -4754 -1416 -4290
1038 -4290 -7551 -5795 -1961 -1245 -3874 -8603 -10183 -3965 4281 2435 -8307 -12953 -5965 2709 2903
1053 2903 -2762 -8644 -7901 -1313 2688 -221 -5369 -5479 -819 1889 -1365 -5367 -2456 3312 2672 -3110
1069 -3110 -3543 -329 1928 2885 3136 -776 -5018 -2 7971 6724 -2618 -5064 2379 8199 4158 -414
1085 -414 1018 5085 3710 774 2875 5962 4218 3379 5350 3266 -642 2389 9069 7566 -23
1100 -23 -1091 5404 8227 4410 268 1427 5304 6535 4425 1850 410 1963 6805 7642 729 -3872
$$ packed form
990F856l67l947l63M42p86L092L484m888q261J764R658K364p685o072K315N505
1006C111J76l608j022R19q5r56j88o66J33L379N02o448n326M600Q440M42o576
1023c173n725n09N797O178k037q595k889N944N639j525o051j588L780L338k874
1038d290l261J756L834P16k629m729j580O218Q246j846j0742m646O988Q674J94
1053B903n665n882P43O588M001k909n148j10M660K708l254m002K911N768o40n782
1069c110m33L214K257R57K51l912m242N016P973j247r342k446P443N820m041m572
1085d14J432M067j375k936K101L087j744q39J971k084l908L031O680j503p589
1100b3j068O495K823l817m142J159L877J231k110k575j440J553M842Q37o913m601
$$ plain form
1116 -3872 1572 8478 5720 -1034 -1542 2170 3496 3543 2831 -571 -2095 2195 6339 2648 -4306 -3875
1132 -3875 4556 7457 -750 -7223 -2590 5290 3999 -1861 -4462 -3815 -1894 2063 4111 -2052 -8268
1147 -8268 -5867 1749 2953 -3325 -6846 -3083 753 -1137 -5553 -5570 -2024 143 -2095 -5652 -7033
1162 -7033 -4571 636 146 -5762 -8929 -5327 -298 263 -2708 -5691 -6748 -3876 -146 103 -3718 -5527
1178 -5527 -2097 -274 -2959 -5623 -2597 2538 677 -6164 -6880 -832 3732 1158 -3044 -4386 -2862
1193 -2862 274 2796 1651 -2774 -4216 -279 3576 2173 -2065 -2269 1675 4065 1205 -2521 -1835
1208 -1835 3662 5519 1699 -3292 -1769 4825 7845 2938 -2782 -2245 3736 6693 4848 365 -1674
1223 -1674 643 5145 5998 2166 -1935 361 5998 7210 677 -3696 651 7158 6815 369 -2478
$$ packed form
1116c872N444O906k758o754n08L712J326M7p12l402j524M290M144l691o954M31
1132c875Q431K901q207o473M633P880j291n860k601O47J921L957K048o163o216
1147h268K401P616J204o278l521L763L836j890m416j7L546K167k238l557j381
1162g033K462N207m90n908l167L602N029N61k971k983j057K872L730K49l821j809
1178e527L430J823k685k664L026N135j861o841p16O048M564k574m202j342J524
1193b862L136K522j145m425j442L937L855j403m238k04L944K390k860l726O86
1208a835N497J857l820m991J523O594L020m907n720N37N981K957j845m483k039
1223a674K317M502Q53l832m101K296N637J212o533m373M347O507l43o446k847
$$ plain form
1238 -2478 1582 5668 4862 831 -604 885 3646 4627 3167 -725 -1641 2310 6533 4575 -1732 -3116
1254 -3116 2644 6869 3972 -1402 -1801 2630 4156 1137 -605 918 1857 1126 583 563 218 -171 589
1271 589 642 -513 -1489 246 1393 -277 -3534 -4014 55 2782 -381 -4759 -4911 -1801 451 -1108
1287 -1108 -4144 -4475 -1446 5 -3085 -6040 -4245 -42 202 -3224 -5782 -5222 -2260 461 -453 -3857
1303 -3857 -6685 -5474 597 3442 -2488 -9340 -6064 2569 4345 -3550 -8114 -4818 538 1422 -465
1318 -465 -2911 -4006 -3369 -573 622 -802 -3814 -3027 1845 1578 -4010 -6219 37 5454 2605 -3235
1334 -3235 -4237 -1173 2453 2743 949 -1387 -1190 679 2521 2930 509 -995 803 3686 3053 858
1350 858 1213 2863 2302 1113 1840 3503 4626 3240 -100 -688 3060 6534 5862 1988 -405 651
$$ packed form
1238b478M060M086q06m031j435J489K761R81j460l892r16L951M223j958o307j384
1254c116N760M225k897n374l99M431J526l019j742J523R39p31n43k0l45l89P60
1271E89N3j155r76J735J147j670l257m80M069K727l163m378j52L110K252j559
1287a108l036l31L029J451l090k955J795M203K44l426k558N60K962K721r14l404
1303c857k828J211O071K845n930o852L276Q633J776p895m564L296N356Q84j887
1318d65k446j095O37K796J195j424l012P87M872k67n588k209O256N417k849n840
1334c235j002L064L626K90j794k336J97J869J842M09k421j504J798K883o33k195
1350H58L55J650n61j189P27J663J123j386l340n88L748L474o72l874k393J056
$$ plain form
1366 651 4658 5825 3033 1371 3328 5495 2753 -269 1017 3913 5351 5322 2206 -1910 -1341 4075
1382 4075 7720 3981 -3051 -3124 4343 7470 1510 -4397 -1176 4582 3995 142 -918 -1108 -961 1965
1398 1965 3917 397 -4921 -3167 3414 4413 -2112 -6765 -1933 4652 1745 -4094 -4624 -1245 -497 -1254
1414 -1254 -994 -2094 -3988 -2888 -802 -2292 -5047 -3492 620 -15 -4310 -7278 -4628 -564 150 -2307
1430 -2307 -3758 -4701 -4969 -3349 -997 -2073 -3631 -2299 -1541 -5565 -7090 -1605 2783 -359 -5689 -6265
1446 -6265 -2557 -226 186 -898 -2897 -4182 -2616 1709 3057 -2608 -5837 -328 4858 1283 -3853
1461 -3853 -1269 3177 2109 -1257 -1270 1590 3441 3433 1920 -1097 -2457 511 5990 7155 1764 -3755
1477 -3755 -1249 4244 5739 3346 1142 1167 1932 3352 2421 842 1709 4661 5006 1114 -863 1458
$$ packed form
1366F51M007J167k792j662J957K167k742l022J286K896J438k9l116m116N69N416
1382D075L645l739p032p3P467L127n960n907L221N758n87l853j060j90J47K926
1398A965J952l520n318J754O581R99o525m653M832O585k907n839n30L379P48p57
1414a254K60j100j894J100K086j490k755J555M112o35m295k968K650M064P14k457
1430b307j451r43k68J620K352j076j558J332P58m024j525N485M388l142n330n76
1446f265L708K331M12j084j999j285J566M325J348n665l229N509N186l575n136
1461c853K584M446j068l366j3K860J851qj513l017j360K968N479J165n391n519
1477c755K506N493J495k393k204K5P65J420r31j579Q67K952L45l892j977K321
$$ plain form
1493 1458 4410 4344 2132 719 1186 2578 3440 2904 1051 198 2323 4723 3275 -934 -1009 3175 4987
1510 4987 1949 -413 618 2981 3089 1645 179 -550 1778 3356 2198 -527 -893 1051 2485 1285
1526 1285 -649 -548 111 932 570 -1274 -2958 -1611 2225 2428 -3034 -6620 -2732 1733 556 -3046
1542 -3046 -3543 -2526 -2370 -2652 -1679 -1514 -3281 -3763 -1905 -2162 -5223 -5099 9 1365 -3837 -7952 -4188
1559 -4188 960 -10 -3819 -4340 -3154 -2018 -1287 -777 -2071 -3869 -2261 585 -203 -3387 -3432 -126 645
1576 645 -1909 -2540 -1182 284 564 -113 -1605 -2806 -751 2983 2648 -2101 -4098 -283 3579 1888
1592 1888 -1502 -808 925 1217 840 1052 270 -721 1260 3768 1821 -2219 -1235 3151 3704 214 -1245
1609 -1245 1563 3227 1424 -312 528 1596 2660 2681 1974 -630 -1176 2674 5116 2405 -932 627
$$ packed form
1493A458K952o6k212j413M67J392Q62n36j853q53K125K400j448m209p5M184J812
1510D987l038k362J031K363J08j444j466p29K328J578j158k725l66J944J434j200
1526A285j934J01O59Q21l62j844j684J347L836K03n462l586L888M465j177l602
1542c046m97J017J56k82R73J65j767m82J858k57l061J24N108J356n202m115L764
1559d188N148r70l809n21J186J136P31N10j294j798J608K846p88l184m5L306P71
1576F45k554o31J358J466K80o77j492j201K055L734l35m749j997L815L862j691
1592A888l390O94J733K92l77K12p82r91J981K508j947m040R84M386N53l490j459
1609a245K808J664j803j736Q40J068J064K1p07k604n46L850K442k711l337J559
$$ plain form
1625 627 3108 2940 1835 2011 2099 1375 2340 3357 2146 1024 2868 4827 2468 -1231 544 5994 6213
1642 6213 853 -1758 1572 4158 3128 2648 2414 8 -1400 2470 4468 1141 -2870 -580 3586
1657 3586 1369 -2899 -2754 970 1860 -1369 -3129 -1783 -1009 -455 139 -1696 -5317 -4747 406 1540
1673 1540 -2964 -5710 -4046 -1187 -964 -1949 -2920 -3915 -3408 -1156 -378 -2861 -4647 -1931 1114 -901
1689 -901 -5136 -3527 911 540 -2910 -3071 -1029 -1427 -1983 -957 -328 -2320 -2276 -307 324 -2933 -4103
1706 -4103 -777 1359 -440 -3537 -2750 112 -97 -1872 -1664 -267 -667 -1122 -438 -1086 -1775 -88 2042
1723 2042 433 -2022 -1825 1129 2488 1573 -860 -1423 670 2897 3215 951 -1009 -64 3174 4634
1739 4634 1692 -884 774 3775 2999 1440 1425 2393 2479 2845 2511 810 1116 3672 4937 2707 -771
$$ packed form
1625F27K481j68j105J76Q8p24R65J017j211j122J844J959k359l699J775N450K19
1642F213n360k611L330K586j030m80k34k406j408L870J998l327m011K290M166
1657C586k217m268J45L724Q90l229j760J346P74N54N94j835l621N70N153J134
1673A540m504k746J664K859K23r85r71r95N07K252P78k483j786K716L045k015
1689i01m235J609M438l71l450j61K042l98n56J026O29j992M4J969O31l257j170
1706d103L326K136j799l097P87K862k09j775K08J397m00m55O84o48o89J687K130
1723B042j609k455J97K954J359r15k433n63K093K227L18k264j960R45L238J460
1739D634k942k576J658L001p76j559j5R68Q6L66l34j701L06K556J265k230l478
$$ plain form
1756 -771 -44 3188 5103 3243 905 659 1165 3127 3798 2169 131 652 2921 3439 804 25 2108
1773 2108 2403 265 258 1604 1139 55 626 929 -836 -1141 1186 2347 -620 -4034 -1917 1918 1019
1790 1019 -2602 -3021 -201 -721 -2646 -1739 -459 -1819 -2529 -981 -768 -2962 -3405 -712 686 -2564
1806 -2564 -4350 -1801 700 -445 -3291 -2933 -1213 -696 -1006 -858 -2519 -4392 -2119 1440 -179 -3875
1822 -3875 -3652 -110 279 -2022 -3030 -1670 -1070 -867 -1047 -1716 -2842 -2669 78 739 -2250 -4501 -1523
1839 -1523 2080 45 -3741 -2227 418 670 -607 -511 -972 -1735 -554 2490 1853 -1415 -2304 1216 2888
1856 2888 642 -938 763 2191 1215 -5 661 1708 1577 1988 2200 837 347 1892 3616 2038
1872 2038 -468 406 3177 3699 1485 459 1059 1927 2597 2727 2098 589 1021 2714 2752 1224 679 2491
$$ packed form
1756g71P27L232J915j860k338k46N06J962O71j629k038N21K269N18k635p79K083
1773B108K95k138pJ346m65j084N71L03j765l05K327J161k967l414K117L835q99
1790A019l621m19K820n20j925R07J280j360p10J548K13k194m43K693J398l250
1806b564j786K549K501j145k846L58J720N17l10J48j661j873K273L559j619l696
1822c875K23L542L89k301j008J360O00K03j80o69j126J73K747O61k989k251K978
1839a523L603k035l786J514K645K52j277R6m61p63J181L044o37l268q89L520J672
1856B888k246j580J701J428r76j220O66J047j31M11K12j363m90J545J724j578
1872B038k506Q74K771N22k214j026O00Q68O70J30o29j509M32J693L8j528n45J812
$$ plain form
1890 2491 3721 1280 -271 832 3194 3107 1107 162 620 989 2351 2659 820 -1087 -212 2482 2495
1907 2495 226 -969 282 1433 1177 -317 -1029 -267 551 297 -612 -1341 -1129 529 384 -1766 -2806
1924 -2806 -1560 412 455 -1221 -2619 -2653 -1189 -135 -432 -2565 -3005 -1332 -41 -1366 -2998 -2679 -1389
1941 -1389 -737 -1702 -2730 -2545 -1608 -1082 -1301 -2505 -2428 -1404 -598 -1004 -2809 -2961 -713 137 -960 -2019
1959 -2019 -2365 -1510 -76 266 -1524 -2347 -1516 72 184 -1015 -1870 -843 375 -405 -1132 -910 305
1976 305 212 37 -13 -320 -626 519 1520 -40 -1687 -591 2474 2484 -73 -1181 315 1611 1608 1062
1994 1062 931 722 468 1191 2044 1394 613 1353 2975 1710 -268 944 3584 3533 1225 896 1382 2259
2012 2259 2634 2702 1661 662 1138 3309 3695 1503 -425 1587 3313 2210 301 1021 2111 1436 710
$$ packed form
1890B491J230k441j551J103K362q7k000r45M58L69J362L08j839j907Q75K694J3
1907B495k269j195J251J151k56j494p12P62Q18k54r09p29K12J658j45k150j040
1924b806J246J972M3j676j398l4J464J054k97k133m40J673J291j325j632L19J290
1941a389O52r65j028J85R37N26k19j204P7J024Q06m06j805j52K248Q50j097j059
1959b019l46Q55J434L42j790q23Q31J588J12j199q55J027J218p80p27K22J215
1976C05r3j75n0l07l06J145J001j560j647J096L065J0k557j108J496J296ln46
1994A062j31k09k54P23Q53o50p81P40J622j265j978J212K640n1k308l29M86Q77
2012B259L75O8j041r99M76K171L86k192j928K012J726j103j909P20J090o75p26
$$ plain form
2029 710 1153 1200 613 1441 1954 724 -1167 -283 1752 2143 -744 -2330 -836 1195 519 -1015 -1205 -265
2047 -265 -822 -727 -306 -1103 -2281 -1084 630 -245 -2698 -2847 -1204 223 -874 -2383 -1654 -634 -742
2064 -742 -1979 -2032 -1236 -901 -962 -916 -1746 -2907 -1579 303 -63 -2243 -2393 -1453 -279 -801 -1751 -2135 -961
2083 -961 -609 -1093 -1653 -1244 -1352 -1366 -908 -1215 -1707 -1354 387 -318 -2552 -2589 -316 1314 330 -1671 -2171
2102 -2171 -880 493 420 -15 -768 -983 -367 994 755 -624 -913 1504 2043 -53 -1386 650 2494
2119 2494 2036 466 -485 649 1549 2145 2198 858 -326 604 2350 2822 469 -431 1742 3081 2078
2136 2078 584 849 1524 1718 1833 1500 1440 1441 1651 1757 1459 642 842 1775 2386 656 77 1255 2007 1080
2156 1080 121 638 1285 1201 633 -58 -299 364 648 905 56 -768 -773 332 497 -496 -1166 -137 280 -639
$$ packed form
2029G10M43M7n87Q28N13j230j891Q84K035L91k887j586J494K031o76j534j90R40
2047b65n57R5M21p97j178J197J714q75k453j49J643J427j097j509P29J020j08
2064g42j237n3P96L35o1M6q30j161J328J882l66k180j50R40J174n22r50l84J174
2083i61L52m84n60M09j08j4M58l07m92L53J741p05k234l7K273J630r84k001n00
2102b171J291J373p3m35p53k15O16J361k39j379k89K417N39k096j333K036J844
2119B494m58j570r51J134R00N96N3j340j184R30J746M72k353r00K173J339j003
2136B078j494K65O75J94J15l33o0JK10J06k98q17K00R33O11j730n79J178P52r27
2156A080r59N17O47q4n68o91k41O63K84K57q49q24nJ105J65r93o70J029M17r19
$$ plain form
2176 -639 -1992 -1190 -100 1035 -134 -1547 -2020 -1533 159 819 383 -1617 -2581 -988 865 100 -1755
2193 -1755 -2014 -187 412 -942 -1200 -646 -168 -868 -609 -987 -1749 -1119 229 236 -1608 -2750 -1625 523
2211 523 150 -2474 -2932 -1409 -797 -1081 -1511 -1366 -1981 -2592 -1372 -487 -1477 -2062 -953 -434 -1509 -2240
2229 -2240 -941 508 107 -1321 -1315 78 270 -199 -304 387 -99 -191 997 1205 -148 -294 1477 2081
2247 2081 955 -626 660 2181 1445 220 641 902 577 1210 1706 1027 -19 543 2312 1647 -334
2264 -334 -142 1579 2539 1028 -450 593 1767 1961 1475 956 335 345 1851 2429 1554 -121 121 1632
2282 1632 2292 1371 606 1067 1627 1011 472 821 1249 1485 1258 408 -327 51 1365 1837 452 -653 -377
2301 -377 599 1187 583 -579 -952 -359 174 -108 -751 -397 -191 -536 -805 -1258 -520 -356 -499 -746 -1592 -1433
$$ packed form
2176f39j353Q02J090J135j169j413m73M87J692O60m36k000r64J593J853p65j855
2193a755k59J827N99j354k58N54M78p00K59l78p62O30J348Pj844j142J125K148
2211E23l73k624m58J523O12k84m30J45o15o11J220Q85r90n85J109N19j075p31
2229b240J299J449m01j428OJ393J92m69j05O91m86r2J188K08j353j46J771O04
2247B081j126j581J286J521p36j225M21K61l25O33M96o79j046N62J769o65j981
2264c34J92J721R60j511j478J043J174J94m86n19o21J0J506N78q75j675K42J511
2282A632O60r21p65M61N60o16n39L49M28K36k27q50p35L78J314M72j385j105K76
2301c77R76N88o04j162l73N93N33k82o43L54K06l45k69m53P38J64j43k47q46J59
$$ plain form
2321 -1433 -826 116 -165 -1974 -2551 -780 63 -1151 -1976 -1683 -1058 -1524 -1816 -959 -1490 -2095 -1671 -744 -1610
2340 -1610 -2528 -2129 -603 -370 -2767 -2895 -826 7 -1771 -2170 -1291 -941 -1663 -1247 -90 -1389 -1854 -786
$$ packed form
2321a433O07R42k81j809n77J771Q43j214q25K93O25m66k92Q57n31o05M24R27q66
2340a610r18L99J526K33k397j28K069Q33j778l99Q79L50p22M16J157j299m65J068
$$ [...]
8191c94
##END NTUPLES=NMR FID
##END=
