##TITLE=1H_EC-3221
 CDCl3, 8 sc, 
 28.1.2020
##JCAMPDX= 6.0         $$ Bruker NMR JCAMP-DX V2.0
##DATA TYPE= NMR FID
##DATA CLASS= NTUPLES
##ORIGIN= UXNMR, Bruker Analytische Messtechnik GmbH
##OWNER= root
$$ XWIN-NMR		Version 3.5
$$ Tue Jan 28 14:17:01 2020 Russian Standard Time (UT+4h)  she@DPX200
##.OBSERVE FREQUENCY= 200.1315
##.OBSERVE NUCLEUS= ^1H
##.DELAY= (6, 6)
##.ACQUISITION MODE= SIMULTANEOUS
##.ACQUISITION SCHEME= undefined
##.AVERAGES= 8
##.DIGITISER RES= 18
##SPECTROMETER/DATA SYSTEM= spect
##.PULSE SEQUENCE= zg30
##.SOLVENT NAME= CDCl3
##.SHIFT REFERENCE= (INTERNAL, CDCl3, 0, 15.7039)
##AUDIT TRAIL= $$ (NUMBER, WHEN, WHO, WHERE, WHAT)
$$ ##TITLE= Audit trail, XWIN-NMR		Version 3.5
$$ ##JCAMPDX= 5.01
$$ ##ORIGIN= Bruker BioSpin GmbH
$$ ##OWNER= she
$$ F:/spectra/data/she/nmr/H-F/1/audita.txt
$$ ##AUDIT TRAIL=  $$ (NUMBER, WHEN, WHO, WHERE, WHAT)
(   1,<2020-01-28 14:16:02.45 +0400>,<she>,<DPX200>,
      <created by zg, POWCHK disabled, PULCHK disabled
       configuration hash MD5:
       00 E9 B6 7A A2 85 ED C7 34 08 36 98 17 FE 4E 26
       data hash MD5: 16K
       63 26 F4 BE 2F AC 34 BF A4 32 0E BD 87 EC 03 02>)
$$ ##END=
$$ 
$$ hash MD5
$$ F5 CD 03 E1 1B 0B 15 1E 09 54 D0 90 23 46 5A 59
##$RELAX= 
##$RELAX= 
##$RELAX= 
##$RELAX= 
##$RELAX= 
##$RELAX= 
$$ Bruker specific parameters
$$ --------------------------
##$DU= <F:/spectra>
##$EXPNO= 1
##$NAME= <H-F>
##$PROCNO= 1
##$TYPE= <nmr>
##$USER= <she>
##$AMP= (0..31)
100 100 100 100 100 100 100 100 100 100 100 100 100 100 100 100 100 100 
100 100 100 100 100 100 100 100 100 100 100 100 100 100 
##$AQSEQ= 0
##$AQ_mod= 1
##$AUNM= <au_zg>
##$AUTOPOS= <>
##$BF1= 200.13
##$BF2= 200.13
##$BF3= 200.13
##$BF4= 200.13
##$BF5= 200.13
##$BF6= 200.13
##$BF7= 200.13
##$BF8= 200.13
##$BYTORDA= 1
##$CFDGTYP= 0
##$CFRGTYP= 5
##$CHEMSTR= <none>
##$CNST= (0..31)
1 1 145 1 1 1 1 1 1 1 1 1 1 1 1 1 1 1 1 1 1 1 1 1 1 1 1 1 1 1 1 1 
##$CPDPRG= <>
##$CPDPRG1= <>
##$CPDPRG2= <>
##$CPDPRG3= <>
##$CPDPRG4= <mlev>
##$CPDPRG5= <mlev>
##$CPDPRG6= <mlev>
##$CPDPRG7= <mlev>
##$CPDPRG8= <mlev>
##$CPDPRGB= <>
##$CPDPRGT= <>
##$D= (0..31)
0 1.2 0 0 0 0 0 0 0 0.06 0 0.03 0 0 0 0 0.0002 0 0 0 0 0 0 0 0 0 0 0 0 
0 0 0 
##$DATE= 1580206561
##$DBL= (0..7)
120 120 120 120 120 120 120 120 
##$DBP= (0..7)
150 150 150 150 150 150 150 150 
##$DBP07= 0
##$DBPNAM0= <>
##$DBPNAM1= <>
##$DBPNAM2= <>
##$DBPNAM3= <>
##$DBPNAM4= <>
##$DBPNAM5= <>
##$DBPNAM6= <>
##$DBPNAM7= <>
##$DBPOAL= (0..7)
0.5 0.5 0.5 0.5 0.5 0.5 0.5 0.5 
##$DBPOFFS= (0..7)
0 0 0 0 0 0 0 0 
##$DE= 6
##$DECBNUC= <off>
##$DECIM= 24
##$DECNUC= <off>
##$DECSTAT= 4
##$DIGMOD= 1
##$DIGTYP= 9
##$DL= (0..7)
0 120 120 120 120 120 120 120 
##$DP= (0..7)
150 150 150 150 150 150 150 150 
##$DP07= 0
##$DPNAME0= <>
##$DPNAME1= <>
##$DPNAME2= <>
##$DPNAME3= <>
##$DPNAME4= <>
##$DPNAME5= <>
##$DPNAME6= <>
##$DPNAME7= <>
##$DPOAL= (0..7)
0.5 0.5 0.5 0.5 0.5 0.5 0.5 0.5 
##$DPOFFS= (0..7)
0 0 0 0 0 0 0 0 
##$DQDMODE= 0
##$DR= 18
##$DS= 0
##$DSLIST= <SSSSSSSSSSSSSSS>
$$ [...]
##$SUBNAM2= <"">
##$SUBNAM3= <"">
##$SUBNAM4= <"">
##$SUBNAM5= <"">
##$SUBNAM6= <"">
##$SUBNAM7= <"">
##$SUBNAM8= <"">
##$SUBNAM9= <"">
##$SW= 24.9337058887773
##$SWIBOX= (0..15)
0 0 2 0 0 0 0 0 0 0 0 0 0 0 0 0 
##$SW_h= 4990.01996007984
##$TD= 16384
##$TD0= 1
##$TE= 0
##$TE2= 300
##$TE3= 300
##$TEG= 300
##$TL= (0..7)
0 120 120 120 120 120 120 120 
##$TP= (0..7)
150 150 150 150 150 150 150 150 
##$TP07= 0
##$TPNAME0= <>
##$TPNAME1= <>
##$TPNAME2= <>
##$TPNAME3= <>
##$TPNAME4= <>
##$TPNAME5= <>
##$TPNAME6= <>
##$TPNAME7= <>
##$TPOAL= (0..7)
0.5 0.5 0.5 0.5 0.5 0.5 0.5 0.5 
##$TPOFFS= (0..7)
0 0 0 0 0 0 0 0 
##$TUNHIN= 0
##$TUNHOUT= 0
##$TUNXOUT= 0
##$USERA1= <user>
##$USERA2= <user>
##$USERA3= <user>
##$USERA4= <user>
##$USERA5= <user>
##$V9= 5
##$VALIST= <valist>
##$VCLIST= <CCCCCCCCCCCCCCC>
##$VD= 0
##$VDLIST= <DDDDDDDDDDDDDDD>
##$VPLIST= <PPPPPPPPPPPPPPP>
##$VTLIST= <TTTTTTTTTTTTTTT>
##$WBST= 1024
##$WBSW= 4
##$XGAIN= (0..3)
0 0 0 0 
##$XL= 0
##$YL= 0
##$YMAX_a= 223342
##$YMIN_a= -88073
##$ZGOPTNS= <>
##$ZL1= 120
##$ZL2= 120
##$ZL3= 120
##$ZL4= 120
##$ABSF1= 10
##$ABSF2= 0
##$ABSG= 5
##$ABSL= 3
##$ALPHA= 0
##$AQORDER= 0
##$ASSFAC= 0
##$ASSFACI= 0
##$ASSFACX= 0
##$ASSWID= 0
##$AUNMP= <proc_1d>
##$AZFE= 0.1
##$AZFW= 0.1
##$BCFW= 1
##$BC_mod= 2
##$BYTORDP= 1
##$COROFFS= 0
##$CY= 11.3945322036743
##$DATMOD= 1
##$DC= 2
##$DFILT= <>
##$DTYPP= 0
##$F1P= 16.9975609425685
##$F2P= -3.02152046262296
##$FCOR= 0.5
##$FTSIZE= 0
##$FT_mod= 4
##$GAMMA= 1
##$GB= 0.15
##$INTBC= 1
##$INTSCL= 1
##$ISEN= 128
##$LB= 0.24
##$LEV0= 0
##$LPBIN= 0
##$MAXI= 10000
##$MC2= 0
##$MEAN= 0
##$ME_mod= 0
##$MI= 1.114404
##$NCOEF= 0
##$NC_proc= 0
##$NLEV= 6
##$NOISF1= 3.799351
##$NOISF2= 2.8
##$NSP= 1
##$NTH_PI= 0
##$NZP= 0
##$OFFSET= 15.70392
##$PC= 1
##$PHC0= -9796.638
##$PHC1= 29.40081
##$PH_mod= 1
##$PKNL= yes
##$PPARMOD= 0
##$PSCAL= 0
##$PSIGN= 0
##$REVERSE= no
##$SF= 200.130013532006
##$SI= 16384
##$SIGF1= 3
##$SIGF2= 2
##$SINO= 400
##$SIOLD= 16384
##$SREGLST= <1H.CDCl3>
##$SSB= 0
##$STSI= 0
##$STSR= 0
##$SW_p= 3612.71676300578
##$SYMM= 0
##$S_DEV= 0
##$TDeff= 0
##$TDoff= 0
##$TI= <>
##$TILT= no
##$TM1= 0
##$TM2= 0
##$TOPLEV= 0
##$USERP1= <user>
##$USERP2= <user>
##$USERP3= <user>
##$USERP4= <user>
##$USERP5= <user>
##$WDW= 1
##$XDIM= 8192
##$YMAX_p= 0
##$YMIN_p= 0
$$ End of Bruker specific parameters
$$ ---------------------------------
##NTUPLES= NMR FID
##VAR_NAME=  TIME,          FID/REAL,        FID/IMAG
##SYMBOL=    X,             R,               I
##VAR_TYPE=  INDEPENDENT,   DEPENDENT,       DEPENDENT
##VAR_FORM=  AFFN,          ASDF,            ASDF
##VAR_DIM=   8192,          8192,            8192
##UNITS=     SECONDS,       ARBITRARY UNITS, ARBITRARY UNITS
##FACTOR=    0.0002004,     1,               1
##FIRST=     0,             0,               0
##LAST=      1.6414764,     0,               0
##MIN=       0,             -88073,          0
##MAX=       1.6414764,     223342,          0
$$ Real data points
##PAGE= N=1
##DATA TABLE= (X++(R..R)), XYDATA
0 0 0 0 0 0 0 0 0 0 -8 8 -8 8 -8 15 -16 16 -24 25 -32 40 -46 52 -60 71 -81 92 -105 120 -136 153 -174 195
32 195 -218 245 -273 304 -338 376 -419 462 -513 568 -628 696 -771 856 -949 1058 -1180 1324
50 1324 -1490 1690 -1935 2240 -2636 3171 -3936 5140 -7305 12476 -53791 7980 91692 -26320
64 -26320 -78535 -9385 73690 19114 -72259 -88073 -23371 5667 -10337 -16204 15241 27512
76 27512 14564 11203 29400 20432 -16919 -31706 6520 37615 7184 -47232 -38807 18650 29357
89 29357 -28416 -55206 -3465 45412 19306 -30175 -26672 8105 897 -45057 -59308 -18852 14860
102 14860 -538 -17266 13390 49884 30852 -21493 -34503 -2918 7644 -26276 -45646 -8510
114 -8510 36728 29249 -4244 -3299 16303 4649 -24016 -27599 -17021 -22334 -28832 -11292 8624
127 8624 -2407 -28175 -24649 4651 10851 -20372 -40810 -16123 18564 12870 -24008 -39470 -13264
140 -13264 18917 13527 -16277 -16189 21896 45436 23584 -7235 -10134 2363 3213 -5253 -10094 -4484
154 -4484 8210 22500 29482 21673 3411 -9449 -5217 16 -13713 -32166 -26725 251 15460
167 15460 4783 -9895 -6043 7027 2983 -18722 -27767 -12720 -2119 -10294 -14331 -729 6830
180 6830 -1593 -7438 652 8634 6198 244 948 5307 5499 909 -5015 -8133 -5884 3254 12831 11161
196 11161 3565 6666 16286 12148 -5598 -18280 -17840 -10712 -3547 -3200 -8277 -4953 10341 18258 4787
211 4787 -16398 -21867 -11020 -4189 -13896 -24698 -17043 3123 12061 2761 -8545 -8885 -555 4106
225 4106 -2717 -13811 -13525 -1510 6846 2609 -5728 -6899 1703 12506 11806 932 -2324 8116
239 8116 14247 4249 -7211 -7274 -875 2055 1315 1549 6394 10330 10453 8557 3489 -5278 -11675 -10074
255 -10074 -7169 -10493 -9441 -45 6553 3412 142 1174 -1927 -8896 -13754 -12255 -8264 -6405 -7596
270 -7596 -6377 -1486 2598 1116 -2978 -5407 -4176 -85 478 -5557 -10174 -5439 1389 -901 -6979
285 -6979 -7609 -1305 5082 5692 -125 -4779 -2202 730 -3702 -11609 -14446 -9995 -2840 2320 1029 -3104
301 -3104 -299 5053 3266 -6255 -14446 -12691 -5353 -1865 -5079 -6370 873 8165 6490 770 -1281
316 -1281 -2765 -2927 -1568 -2041 -5304 -3482 2285 5485 2896 59 1961 4140 3747 823 98 1336
332 1336 1049 -1785 -2015 -724 -1221 -1082 2536 5990 5190 4813 5043 3158 -1021 -2519 -2477 -2776 -1894 29
350 29 3704 7901 8442 5165 3735 4866 2980 -2254 -3970 -1825 141 2076 3679 4000 4500 5869
366 5869 5799 3339 236 -2027 -1270 1286 1761 -1791 -2472 2537 4750 872 -1311 1162 2854 2320 904
383 904 -485 -2265 -2717 -2931 -3118 -2914 -3190 -1731 1940 4064 472 -2592 -843 -582 -5551 -8327 -6692
400 -6692 -4922 -3877 -2238 -698 552 676 95 -2361 -4082 -6076 -7139 -6209 -4526 -4678 -3336 -621
416 -621 -55 -2337 -2601 -1270 -2249 -4301 -4354 -3817 -3789 -3932 -4404 -4838 -3340 -1655 -2470 -2202 -1411 -1546 -2320
435 -2320 -2442 -3178 -5746 -6352 -4279 -4184 -4143 -3481 -1238 616 1135 -1107 -3017 -3227 -3192 -5357 -6006 -4050
453 -4050 -2049 -1179 1135 2779 1261 87 840 685 -1852 -2063 -819 -122 512 1271 1454 2947 3540
470 3540 2362 2322 2849 1898 651 1171 2030 -256 -492 920 1293 603 968 1756 2061 1471 1530 310 -162
489 -162 -875 -2642 -2804 -824 194 505 2223 4072 3612 2829 3165 2088 525 341 1510 2016 3506
506 3506 4159 4821 6543 7517 5272 4075 5055 4603 2091 1391 3023 2561 1996 2783 2804 2083 815 1281
524 1281 1076 -153 -1544 -2067 -1639 -1588 -3771 -4985 -2639 -1457 -2254 -2451 -270 21 -895 -1431 -1893 -2959
542 -2959 -2763 -2141 -1571 -676 316 849 1360 2472 1475 130 220 -250 -1980 -2874 -1913 -1654 -1848 -1730 -1262
561 -1262 -1805 -2258 -2648 -4193 -4207 -4724 -5310 -5728 -4300 -4719 -5371 -4515 -2819 -3285 -3683 -1778 -1067 -1727 -1941
580 -1941 -1603 -1184 -817 -1030 -636 1058 2593 2211 2535 3910 3485 1803 1714 1922 285 -195 866 1207
598 1207 1024 1432 2011 1183 718 772 -549 -2031 -1770 -1768 -1489 -1125 -778 -394 844 1046 -72 -243 1293
617 1293 1710 910 1014 1286 1620 2284 2699 2286 2919 4347 4754 3819 3840 3981 2817 2616 2667 1430 769 1168
637 1168 2094 1545 805 1190 1661 1646 288 -990 -1754 -1092 -1938 -2995 -1494 -700 -1319 -400 604 -365 -1410
656 -1410 -258 -38 -1169 -1339 180 530 -62 332 936 1391 1635 968 863 1487 1238 57 -127 -162 -145
675 -145 -783 -36 -220 -900 -844 -83 -633 -1401 -1452 -2226 -2551 -2439 -3018 -4215 -2940 -1154 -1215 -2274 -1442 -1323
695 -1323 -1795 -2247 -2620 -2634 -2543 -2298 -1690 -924 -1014 -1652 -834 839 -109 -2195 -1639 37 -738 -2299 -1438 -599
715 -599 -636 -491 -395 -712 -1397 -429 -226 -786 -1409 -1515 -1161 -803 -1331 -1923 -1194 -109 -271 -315 164 624 -101
736 -101 374 127 -1218 -717 595 365 129 1325 1777 1663 1519 1745 1199 987 1409 1269 353 911 1599
755 1599 2147 1897 1481 1490 2416 1976 417 80 1412 1112 41 602 990 -10 38 1247 685 -682 -9
774 -9 1226 264 -906 -1092 -492 -84 -194 -636 -481 418 710 903 174 -493 -530 233 276 -1200 -1632 -73
794 -73 864 -594 -735 300 30 -728 -623 -583 -1758 -1774 -1069 -1459 -1593 -1964 -1737 -1356 -1127 -1748 -2133 -1896
814 -1896 -1382 -1734 -2379 -2379 -2252 -1466 -1295 -2116 -2036 -672 -430 -2019 -1728 -553 -731 -1852 -1392 -429 -996 -964
834 -964 -587 -448 -281 -443 318 -8 -411 -1073 -932 60 -497 -1634 -460 233 -65 -238 258 -338 -1340
853 -1340 -288 628 -884 -1700 -274 578 -141 -721 -127 506 1291 609 -149 -79 1187 1060 31 250 810
872 810 1188 1255 1204 845 1104 1876 1496 1311 1728 986 142 1048 1701 472 336 1632 2206 1121 253 1009
892 1009 1388 926 224 373 474 1077 512 221 757 727 611 1148 772 252 11 1027 249 -647 270 893
912 893 254 -467 510 711 -128 -97 159 -6 -321 -202 -514 -586 -475 -1046 -636 43 -486 -1019 -762 -40 -936
933 -936 -1053 -1337 -1653 -1204 -431 -1216 -1945 -1194 -227 -852 -1466 -1180 -812 -1321 -1109 -1246 -1819 -1459 -864 -782 -934
954 -934 -853 -1175 -807 -424 -783 -1759 -992 -486 -1092 -1174 -872 -1183 -1198 149 -101 -1279 -677 145 -396 -1306 -973
975 -973 -714 -684 -517 -582 -45 -18 -67 -456 -406 280 -167 -417 335 -254 -401 200 1009 819 96 995 1236 714
997 714 790 504 478 635 1302 889 394 1362 1289 1359 1104 1248 1385 1376 1644 829 710 1283 791 894 1170 930
1019 930 1248 1493 1667 626 158 1442 1064 -38 392 957 653 514 558 556 640 630 428 481 411 198 -132
1040 -132 208 644 -147 -242 664 888 -49 149 344 -100 -379 288 -140 -556 -113 128 -816 -453 -7 -183
1060 -183 -486 -375 -397 -975 -770 -821 -934 -1209 -985 -863 -1009 -840 -955 -1213 -519 -857 -1682 -1558 -1005 -1903 -1505
1081 -1505 -1073 -1224 -1686 -937 -767 -1124 -1332 -1094 -954 -1496 -1216 -1270 -1097 -647 -754 -1075 -486 -181 -448 -466
1101 -466 81 -720 -698 23 -221 -431 -38 429 260 -63 8 602 -31 58 318 128 66 454 -232 -37 497
1122 497 182 292 601 564 177 452 806 536 -25 788 590 805 581 756 775 992 1472 1049 694 1126 1143
1143 1143 890 778 1271 1118 854 1391 1312 1119 1248 1194 1096 1194 1021 742 1273 1394 852 549 1263 1115 314
1164 314 633 1340 762 234 706 639 254 195 635 127 249 341 175 146 399 -85 -606 168 -87 -722 -377
1185 -377 -78 -639 -779 -181 -242 -920 -372 -447 -846 -556 -526 -940 -1037 -479 -785 -1025 -712 -423 -692 -1167 -555
1206 -555 -739 -776 -1077 -859 -716 -620 -652 -1150 -782 -347 -738 -786 -115 -719 -1046 -555 -405 -1091 -988 -655 -801
1227 -801 -862 -415 -444 -694 -449 -565 -581 -530 -391 -649 -537 -29 -169 -540 -136 150 -345 -91 701 274 111
1248 111 438 405 343 567 652 647 551 1299 950 578 881 840 708 962 770 703 974 1119 643 458 807 907 643
1271 643 651 885 636 348 601 389 510 822 657 321 410 884 751 260 755 836 547 951 736 404 911
1292 911 1065 697 825 960 872 492 900 1110 271 553 787 164 -47 715 607 -61 -74 -33 -213 30 -131
1313 -131 -247 -328 -370 -536 -688 -304 -309 -676 -918 -294 -1246 -1042 -247 -477 -1028 -793 -502 -985 -710 -383 -900
1334 -900 -692 -200 -648 -1280 -707 -139 -627 -815 -606 -337 -481 -551 -688 -555 -599 -740 -881 -616 -447 -1047 -840
1355 -840 -511 -542 -1050 -503 -281 -877 -830 -190 -516 -564 -510 -59 -416 -469 126 -217 -87 247 -94 -11 353 450
1377 450 240 428 563 171 344 580 709 151 824 754 78 497 952 370 697 780 599 166 611 856 304
1398 304 377 610 557 525 768 598 547 854 563 552 831 873 829 844 1044 872 355 833 1233 378 469 1271 896
1421 896 283 1002 830 511 689 707 192 105 323 523 273 590 -107 -90 191 2 -305 -172 146 -344 -570
1442 -570 -105 -237 -685 -260 -342 -460 -482 -265 -267 -411 -290 4 -653 -685 -651 -532 -745 -156 -695 -605 -563 -443 -831
1465 -831 -672 -518 -648 -537 -384 -958 -897 -546 -643 -1057 -620 -443 -755 -875 -375 -303 -862 -862 -137 -378 -788 -632
1487 -632 -258 -668 -494 -436 -314 230 -229 -340 113 -104 -80 -374 495 -2 -252 70 624 -21 -52 241 8
1508 8 576 138 431 79 423 729 196 433 690 495 582 563 330 223 875 578 408 735 509 373 346 1233
1530 1233 574 696 1112 982 686 366 1050 693 553 596 813 695 869 716 665 650 593 498 497 943 521 309
1552 309 731 654 319 587 708 309 109 414 442 -72 262 496 352 89 141 191 5 -94 -101 -214 -124 55 -279
1575 -279 -111 -342 -234 -363 -99 -387 -547 -309 -212 -502 -623 -395 -709 -902 -756 -548 -745 -835 -508 -567 -730
1596 -730 -479 -344 -682 -786 -230 -609 -456 -347 -702 -697 -332 -676 -834 -187 -536 -1006 -429 -475 -499 -650 -75
1617 -75 -86 -800 -359 -95 -552 -527 71 -159 -526 -240 -192 110 -172 -286 -338 169 224 106 31 544 390 45
1639 45 342 409 221 334 512 410 327 838 557 393 466 1020 528 358 698 652 410 656 661 325 632 385
1661 385 410 472 688 529 583 757 613 162 738 1136 298 317 826 948 260 878 964 588 718 773 541 649
1683 649 709 439 524 385 210 226 506 510 44 136 397 -19 -133 153 164 -294 -298 -107 -339 -243 112 -295 -368 -344
1707 -344 -329 -550 -579 -217 -322 -695 -273 -315 -533 -246 -411 -491 -350 -270 -591 -444 -415 -638 -836 -475 -434 -627
1729 -627 -409 -379 -700 -633 -471 -314 -531 -520 -670 -654 -696 -538 -711 -803 -287 -318 -630 -311 -612 -395 -291 -346 -568
1752 -568 -397 -111 -369 -570 -187 335 -274 -97 72 50 -320 173 119 326 -50 317 326 197 361 353 490 586
1774 586 586 189 469 641 503 465 845 414 373 426 661 189 626 584 135 289 995 390 1 435 602 418
1796 418 441 452 373 497 393 768 358 416 677 182 288 606 380 572 862 872 263 610 605 167 522 227
1818 227 439 156 360 336 123 118 256 -342 -60 -99 -104 -329 -54 -212 -537 -378 -350 -301 -388 -311 -647 -481 -396 -227
1842 -227 -639 -362 -88 -207 -653 96 -96 -662 -195 -370 -262 -340 -149 -376 -536 -640 -482 -396 -379 -257 -668
1863 -668 -279 -272 -826 -826 -422 -705 -875 -749 -498 -533 -606 -503 -313 -697 -531 -528 -539 -553 -325 -271 -235 -111 -86 -5 113
1888 113 -165 286 289 413 -116 506 126 260 194 371 282 50 444 579 459 147 581 286 -31 153 558
1909 558 428 522 406 105 91 432 307 421 661 261 492 273 429 243 639 788 409 265 615 942 648
1930 648 746 709 487 884 848 533 615 410 787 450 376 775 456 539 218 76 -19 557 188 -428 395 66
1952 66 31 -430 97 -82 -596 -22 0 -327 -227 156 -99 -266 331 -55 -179 41 -216 -156 -1 -11 -335 -283
1974 -283 -270 101 -194 -206 -393 -446 -337 -127 -529 -557 -411 -617 -620 -771 -477 -891 -382 -413 -653 -546 -576 -487 -600
1997 -600 -681 -629 -626 -588 -289 -1014 -377 -76 -644 -354 -163 -248 -381 -265 -144 -325 -346 208 -99 -227 19 104 36
2020 36 -134 333 31 5 22 402 -71 229 187 13 219 606 -35 29 224 75 -43 306 459 -212 -18 392
2042 392 294 266 471 218 589 641 925 727 601 564 902 682 837 639 283 512 669 281 596 507 387 503
2064 503 618 497 382 423 846 229 51 316 33 69 417 646 149 128 4 81 -249 202 106 288 59 191
2086 191 -73 -65 -420 -82 -118 150 39 -289 255 -317 -217 -384 -11 -153 -376 -258 -61 -454 -279 -227 -509
2107 -509 -279 -388 -863 -967 -205 -466 -369 -263 -298 -422 -480 -228 -603 -592 -411 -506 -555 -526 -162 -460 -408 -217 -273
2130 -273 -652 -480 -443 -385 -559 -468 -319 -202 -38 -191 -339 -122 -482 -431 38 -58 -178 54 170 -358 -259 -69
2152 -69 276 59 158 453 129 146 150 118 126 180 105 42 293 764 362 33 301 390 303 392 346 224 755 558 495
2177 495 254 773 101 185 367 439 246 427 469 458 369 535 522 460 622 295 110 437 298 516 394 467 462
2200 462 300 226 169 264 291 407 272 437 308 59 -113 271 208 -439 72 25 362 -160 -64 15 -140 -307 -102
2223 -102 -290 -140 133 -329 -408 36 -4 -412 -73 -278 -733 -183 205 -200 -475 -220 -183 -370 -227 -334 -449
2244 -449 -568 -264 -153 -624 -173 111 -413 -595 -75 -365 -410 -489 -772 -306 -145 -519 -838 -325 -443 -737 -455
2265 -455 -75 -358 -501 102 -198 -136 -443 -249 -411 -265 -77 -39 -185 57 -129 -237 -152 105 137 64 82 85 8
2288 8 168 20 -40 446 267 317 243 312 147 231 58 263 426 10 119 329 118 613 287 286 294 680 440 442
2312 442 341 407 372 652 464 120 383 770 452 250 383 -39 387 669 296 389 504 504 327 336 625 210
2334 210 240 211 307 -2 306 94 34 260 -194 190 -57 61 104 -229 -18 -238 -226 -295 58 -210 -382 -161
2356 -161 -109 -326 -289 -13 -461 -84 -229 -183 -234 -184 -250 -104 -61 -281 -358 -558 -298 -488 -397 -227 -545 -582 -200
2379 -200 -444 -246 -522 31 -638 -546 -347 -550 -785 -526 -520 -830 -615 -339 -219 -450 -468 -474 -279 -181 -328 -231 -196
2402 -196 -76 -187 -122 354 -33 36 -1 439 -208 41 -11 85 90 132 -41 45 160 246 254 372 375 367 -293 273 387
2427 387 181 347 279 71 76 515 250 84 436 418 419 311 588 220 325 480 549 305 333 636 161 508 339
2450 339 213 529 474 18 479 414 20 121 245 435 416 3 71 232 -237 62 2 188 139 -21 52 242
2472 242 142 -76 -174 -3 -156 -131 -320 115 -177 -264 33 -65 -335 -14 -12 -300 271 -115 -30 -488 -166 -34
2494 -34 -494 -192 -81 -210 -395 -459 -611 -340 -578 -314 -289 -334 -551 -449 -608 -261 -993 -541 -42 -441 -442 -481
2516 -481 -382 -521 -528 -476 -394 -540 -264 -204 -356 -563 -298 -214 -108 -233 -195 -124 -133 -33 -31 -215 -30 -28 13 -34 86 64
2542 64 97 -57 -220 90 147 -232 12 31 260 261 -365 272 146 209 61 404 214 387 16 92 103 94 -79 358
2566 358 480 82 109 477 546 423 410 670 155 143 565 521 97 347 367 247 270 479 242 36 371 391 410
2589 410 158 152 184 355 340 9 -16 263 -232 -59 315 8 -42 246 127 113 -46 -184 -7 -119 254 -284
2611 -284 -110 117 -95 4 -321 -122 -299 -109 -208 -183 -211 -332 -237 -363 -395 -25 -454 -324 -279 -254 -354 -348 -453
2634 -453 -366 -481 -301 -402 -722 -834 -199 -315 -454 -397 -598 -270 -524 -586 -437 -149 -352 -298 -187 -321 -253 -313
2656 -313 -84 -172 -305 -90 -77 -338 -336 -78 -178 -60 279 -34 -171 -20 132 105 207 36 419 -25 254 539
2678 539 -174 269 325 -161 260 499 -25 80 313 478 241 406 746 336 330 447 372 -32 582 438 277
2699 277 515 558 473 474 349 474 461 186 212 372 342 363 305 188 206 164 198 383 352 343 271 326 285 77 186 395
2725 395 55 252 191 278 25 -122 -11 284 120 50 -52 256 -1 -33 -344 -79 -59 -395 -72 -105 -218 78
2747 78 -146 -238 -335 -73 -147 -299 -151 -326 -360 -12 -118 -508 -325 -311 -265 -369 -135 -311 -179 -613 -36 -287
2769 -287 -339 -166 -367 -507 -234 -213 -319 -166 -195 -460 -151 -316 -135 -456 -114 49 -539 -92 -111 -133 -348 -281
2791 -281 104 -126 -350 -251 -17 -3 139 -70 -189 62 -8 -331 274 -204 -363 214 208 -4 56 203 158 -300
2813 -300 230 341 -10 73 100 62 242 158 581 -101 316 368 204 307 415 174 176 440 558 433 259 479
2835 479 192 305 479 299 203 421 351 97 178 271 63 769 254 -110 34 381 528 214 238 134 143 -39
2857 -39 -159 38 23 45 71 -165 321 142 -558 -226 -77 81 -317 4 -70 -304 -112 -8 -134 -38 -379 -160
2879 -160 -136 -119 -149 -200 -156 -422 -194 -532 183 -413 -278 -228 -100 -644 -287 -314 -399 -640 -117 -457 -724 -421 -41
2902 -41 -229 -217 -360 -166 -274 131 -490 -464 22 -83 -218 -106 78 -202 -244 10 -46 -23 193 20 -479 -284
2924 -284 208 -5 -98 239 -73 111 150 72 -39 74 218 -77 38 185 -78 49 83 259 -53 227 306 32
2946 32 270 315 353 40 214 376 286 420 383 307 455 524 51 162 500 139 -56 332 361 237 156 364 554
2969 554 131 351 178 234 197 137 62 199 178 477 64 -68 266 -1 -17 -70 455 280 82 291 53 162
2991 162 -182 82 93 100 -162 -122 38 -97 -92 156 83 -64 -223 94 -17 -116 -85 -25 -182 -310 -83 -277 -293 -98
3015 -98 -444 -446 -370 -180 -513 -269 72 -638 -103 -202 -232 -230 -49 -178 -215 -252 -154 -242 -122 -75 -137 -378 -441 -250 -188
3040 -188 -174 -246 148 -236 2 -35 76 144 -359 -511 -226 61 -34 42 133 -96 -140 239 -12 -39 -209 295 107
3063 107 -255 112 -99 68 -11 -138 296 90 449 225 57 288 -23 -93 99 463 281 470 160 388 26
3084 26 463 563 -151 581 253 260 243 299 325 28 199 121 396 467 -47 34 408 376 186 252 421 265 -69 357
3108 357 453 19 128 519 383 36 259 -192 169 103 123 71 32 -26 158 -210 175 -165 -85 6 -263 -135 -291
3131 -291 -145 8 -205 146 -269 -25 -294 -39 -211 -190 -89 -149 -44 -194 144 -194 -253 -52 -531 -246 -375
3152 -375 -157 -368 -287 -322 -390 -136 -159 -390 -399 90 19 -237 -210 56 -345 -292 -228 -203 -262 -27 -40 -544 -139 -353
3176 -353 -233 -312 -16 -349 -67 99 -241 -381 -207 -184 133 150 114 -216 -29 282 29 -50 161 36 -68 14
3198 14 154 -139 -17 343 -96 281 214 46 199 225 673 101 292 592 235 56 39 113 563 334 420 193
3220 193 101 332 165 166 481 380 79 262 229 113 13 581 363 188 145 425 -91 172 162 224 148 -6 142
3243 142 294 335 253 -213 131 198 -62 -65 -82 -94 101 -114 -19 -260 105 -34 -103 -217 51 111 -258 -242 17 -309
3267 -309 -171 -110 -50 -240 -185 -290 -66 -277 -17 -158 -264 -249 -126 -70 -241 -147 -498 -333 -244 -172 -462 -333 -276
3290 -276 -263 -207 -21 -432 -109 -403 -545 40 314 -183 -433 -374 -113 -122 82 -278 -68 -215 -174 -217 -161 45 -277
3313 -277 -176 -164 236 22 50 223 179 326 429 -2 10 168 194 205 21 315 85 -46 207 59 79 -146
3335 -146 315 48 216 99 -15 534 117 145 154 285 516 193 53 386 265 269 287 175 362 201 189 86
3357 86 181 189 264 403 85 78 -42 185 399 288 45 73 234 206 114 72 88 31 -75 -132 144 -32 29 220 255
3382 255 97 77 188 241 93 -201 225 54 -112 -130 -39 -64 -359 214 49 -268 -255 -76 -272 -152 -77 -234
3404 -234 -273 162 -261 -15 -420 -145 -147 -330 185 -147 -391 14 -296 -348 -145 -324 -381 -490 105 -212 -513 -97
3426 -97 -132 -252 -165 67 -80 32 -171 -185 201 -255 -88 -249 -11 -142 -137 -9 -89 41 -21 313 188 83 111
3449 111 -13 -128 401 -2 33 -68 -147 140 141 -280 326 213 250 429 235 290 130 166 241 98 378 78 179
3472 179 390 105 192 421 168 222 130 431 161 77 61 148 153 271 310 133 107 247 290 71 -121 154 -65 90
3496 90 445 92 402 160 91 -26 17 8 107 -55 -92 -194 -21 59 2 20 56 -183 99 -123 -22 -34 35 -126
3520 -126 -95 -189 135 -112 -316 -240 -51 -65 -170 73 -170 -158 106 -243 -298 12 59 -202 -104 -96 -102 -357 -93 -12
3544 -12 -365 32 -238 -378 -7 -131 -144 -254 -151 6 209 -146 -110 -56 -321 -320 -159 -317 -359 -38 -88 127 18
3567 18 -142 -154 31 -107 -113 49 -200 143 114 261 -274 -19 -134 -106 -156 -37 147 268 309 154 -1 165 81
3590 81 376 160 231 539 -211 232 467 286 55 39 381 278 337 145 -68 110 369 -136 76 123 329 36
3612 36 116 315 192 111 295 -17 102 367 533 547 37 371 248 166 107 -75 100 249 179 213 -42 312 75
3635 75 -83 75 -96 183 38 80 123 -90 -17 -148 -86 -214 -130 -281 131 86 -208 28 -240 -133 -167 -121 -163
3658 -163 58 -164 -77 -156 -77 -44 108 -56 -42 -504 -93 -265 -405 -335 -138 54 -194 -258 169 -376 -272 -36
3680 -36 -63 -129 -317 -180 -278 -522 -393 -186 -233 -106 -96 32 -219 -85 -115 -136 -84 -267 -52 -279 -137 121 -56
3703 -56 196 158 76 165 54 68 87 27 26 40 173 -129 -13 122 -17 -106 183 346 270 43 -101 313 45 84
3727 84 159 224 195 66 13 355 280 75 380 174 276 346 138 15 17 -87 -21 3 171 -21 180 543 112 175
3751 175 257 220 541 172 128 98 96 87 164 402 95 -61 -1 -68 -73 -131 423 -2 124 53 -274 -94 273 104 -73
3776 -73 -203 -71 -234 -311 -177 -157 -55 387 -99 -300 -62 -161 -265 7 -3 -148 155 -154 -165 -180 -29 -221
3798 -221 -442 -164 -153 -342 35 -268 -96 -29 -244 -388 -353 -304 -229 0 -45 -111 -261 16 21 -150 -12 35 -100
3821 -100 35 -242 77 -94 -155 -138 -98 -107 201 -156 46 -124 68 -250 140 46 -70 -190 55 172 89 298
3843 298 -46 92 99 -92 -85 -80 121 233 60 161 -25 330 -3 371 416 111 149 108 278 226 161 45 83 281
3867 281 250 62 94 256 172 77 258 160 -142 -29 427 -114 -90 177 -36 -260 200 -139 -17 141 -7 285
3889 285 -70 72 -44 -132 72 236 -55 81 311 181 354 121 101 168 -138 250 -99 -49 -6 -68 -47 112
3911 112 54 -84 160 -342 -115 -309 -47 -171 -294 -138 -521 -516 94 -86 -390 121 -164 -124 -449 -92 -173 -49
3933 -49 -70 -207 -258 -371 -142 12 -272 -6 -276 80 37 59 -330 -29 -405 167 131 -209 -145 -238 -182 179 -210
3956 -210 -7 352 -78 -306 77 185 -69 92 27 88 -193 236 -255 111 370 172 82 -180 -64 -60 -146 -62
3978 -62 -66 79 246 -5 320 -37 127 54 4 86 166 204 100 29 274 8 -113 83 44 203 231 356 288 277
4002 277 170 200 232 -8 155 157 164 -31 181 331 -76 273 158 -22 75 5 2 245 169 100 44 30 428 125 174
4027 174 7 -74 31 86 -109 13 29 43 -188 -74 66 -16 -155 -65 189 201 -140 19 -266 11 97 228 45
4050 45 29 402 27 -263 -175 -13 -254 -214 -138 -59 25 -246 -450 -196 -303 -4 -100 -283 -242 -65 -60 56 -164 -20
4074 -20 18 143 -193 -228 -26 -102 -304 55 -211 -166 178 -8 -242 -52 226 -26 -170 60 -183 -201 51 -56
4096 -56 27 90 6 -159 37 92 -151 167 374 276 203 327 250 13 232 108 237 60 -20 48 12 99 258 -10
4120 -10 395 6 6 166 103 179 -325 355 0 208 -44 342 535 -20 166 87 139 -2 251 211 -15 -3 225
4143 225 63 -149 104 68 92 192 -26 99 -97 -46 54 -53 147 -299 55 -16 -4 133 257 113 79 -281
4165 -281 -34 63 150 117 -106 40 95 51 59 -145 -124 -27 -44 -233 -348 -159 118 208 -297 106 -227 -123 43 -271
4189 -271 -172 -258 172 -60 -84 -40 -355 10 -380 -390 -127 -275 -110 -128 -105 -374 -124 -259 -174 2 34 118 -112
4212 -112 -36 -137 -278 16 -100 -23 -93 9 2 -284 207 -202 67 36 129 1 187 68 -286 198 348 -122
4234 -122 262 224 -11 45 17 13 62 -109 -54 -15 47 -32 164 83 285 309 299 259 -58 224 46 79 357 45 220
4259 220 107 226 216 94 91 436 441 361 432 -18 247 33 53 282 106 38 363 -115 185 -10 309 260 144
4282 144 71 155 -15 -169 -200 -148 144 -111 -164 243 39 53 189 170 -44 12 100 -343 -494 84 8 -22 -53 -132
4306 -132 -71 -24 -79 -339 26 -242 -388 -188 -176 -181 -484 -124 -266 -158 -88 -299 -186 -31 -359 69 -376 -89
4328 -89 -157 -61 -134 -87 50 -28 -199 -118 -5 4 -146 -68 -158 -115 70 -30 -204 164 74 60 107 -145 -4 418 261
4353 261 -127 7 175 -67 -81 185 -211 149 133 -142 50 10 -62 8 120 10 -52 42 149 102 41 96 80 108
4377 108 201 425 -7 32 217 254 179 61 322 289 -221 -48 160 313 262 106 165 61 199 261 22 361 -200
4400 -200 -338 -86 424 161 171 355 188 -100 267 -56 32 207 57 195 257 109 150 -29 52 225 -54 -160
4422 -160 -118 103 -269 -18 36 186 62 -33 223 -92 -11 -280 -262 39 -117 -28 119 159 -55 -88 209 -118 7
4445 7 -34 -78 -271 -416 -302 -96 70 -35 -72 -171 128 63 -288 -145 113 -235 -119 71 -20 152 -276 -94 121
4468 121 -1 146 96 -122 -78 -179 -57 96 -220 16 19 87 -168 -136 -332 106 -79 42 -194 -136 245 104
4490 104 -5 -66 292 276 74 279 305 -119 -28 170 176 155 -152 202 124 175 117 -99 -13 385 390 327 129 159 205
4515 205 -140 100 -251 234 328 193 93 287 -50 88 57 148 169 -67 -70 303 18 46 484 -232 207 -97
4537 -97 17 -32 23 29 -51 240 289 275 139 340 -147 -92 -10 -78 -195 48 94 -206 -185 24 -60 -248 -87 -4 -177
4562 -177 -93 85 -351 234 235 -356 -322 -62 14 -223 48 -76 -267 -200 -221 -248 -161 -252 9 -143 -26 63 -267 -96
4586 -96 -177 126 -267 34 62 -22 -75 123 -275 -214 -451 -19 -122 -71 -227 -237 -85 -186 120 -296 133 -400 241
4609 241 -110 -346 67 -87 -20 221 73 -93 298 27 109 37 302 203 501 231 -75 -80 -85 -33 116 -67 5
4632 5 389 163 367 132 245 87 -55 -148 282 113 62 75 182 -147 49 64 171 138 321 219 220 233 13
4655 13 -169 44 138 4 128 -18 -35 -88 50 -245 157 480 123 -37 145 261 -50 165 1 24 201 12
4677 12 143 19 87 -181 -151 192 176 -234 67 126 -96 4 -10 71 -73 160 6 246 -18 170 -146 -46
4699 -46 103 -102 -106 -128 -270 -209 -175 -168 -322 -59 -204 -127 -123 35 -275 -85 -203 -81 -269 -395 272 -225 18 -172
4723 -172 -19 -395 -156 115 -268 -186 7 -144 -32 -28 -234 -207 -360 19 -118 118 -606 -99 -19 -11 -68 -233 -11
4746 -11 -95 21 12 -2 -72 123 22 171 174 -98 33 -17 -54 71 141 205 38 13 92 30 24 -52 271 21 81 258
4772 258 46 373 56 -68 290 204 155 13 262 364 174 147 -96 97 91 265 299 -35 -29 -104 132 176 414
4795 414 121 -122 6 164 -30 -17 -157 65 333 -197 41 -128 246 -66 -75 46 238 -46 -50 182 138 -32
4817 -32 35 -17 158 -56 -283 233 -35 252 -275 -74 -152 168 -82 -62 -161 222 70 -279 -111 -268 171 -61
4839 -61 -4 54 7 -162 84 -194 -272 -323 -349 -159 -111 -95 36 258 -149 13 -246 91 49 75 -118 -387 35 -81
4863 -81 -131 -20 -3 -495 -173 -120 66 43 5 149 33 394 71 98 24 30 20 -241 75 215 118 42 178 119 20
4888 20 128 -124 220 202 45 6 222 -126 304 164 102 -62 58 247 -7 347 25 -10 216 330 215 201
4910 201 377 -123 238 -4 85 114 312 293 -281 226 101 226 -51 146 -21 -164 139 -110 42 -21 9 120
4932 120 -140 -66 117 -59 126 319 5 -41 44 124 154 -41 -10 -90 -113 168 -61 -110 -260 -68 -123 -102 -150 -325
4956 -325 -58 -65 144 -216 70 -180 -9 151 -101 -130 -118 183 -48 78 -31 -20 -218 53 -261 -55 -23 229
4978 229 -261 -29 -152 -347 -99 -47 -144 -11 119 200 -158 201 110 39 -29 174 144 -181 152 -28 -290 -92
5000 -92 -123 190 119 48 -122 61 -184 305 -115 43 405 132 140 56 -140 7 -60 345 -51 -275 103 96 -52
5023 -52 -66 391 35 98 271 -109 -59 122 129 75 207 136 311 9 -105 335 231 185 56 9 56 197 69 251
5047 251 6 66 -61 146 113 128 70 0 -112 54 -237 -299 70 26 272 189 341 59 127 6 58 -15 -162 -82
5071 -82 -3 120 -341 -41 -7 -303 20 -37 -71 198 -132 20 -36 -85 -203 -93 43 -34 -98 -2 -186 -199 -107 -292
5095 -292 291 -169 -149 -93 -302 -345 18 -86 -179 -36 -93 -142 -394 -126 -65 -65 -224 45 -202 64 -187 33 -203
5118 -203 -40 -125 22 -8 -320 37 44 296 -126 -47 -19 146 6 -88 -219 262 67 -89 89 -174 -185 -205 447
5141 447 -136 6 -232 -153 21 -30 -124 218 -16 -119 -102 -116 314 92 230 78 157 182 112 169 335 -10 -55
5164 -55 141 41 126 356 224 -30 248 148 303 40 39 -46 90 -132 287 108 307 116 77 23 332 83
5186 83 174 -3 30 104 -9 513 302 -118 170 240 107 -23 187 25 167 49 -82 -122 -60 202 -89 190
5208 190 30 -162 47 161 119 50 135 318 -139 105 -173 -130 -252 111 -9 -148 41 179 12 -62 -54 65
5230 65 -154 -72 27 75 -20 -127 -93 -303 -174 -206 -6 -60 -32 -338 15 -89 86 -154 193 180 140 -140 -245 -12
5254 -12 -97 31 49 -87 -141 -143 -85 191 27 152 -138 25 96 -68 -20 -50 -34 64 78 -254 54 78 -52 120 -208
5279 -208 -128 73 57 122 59 239 64 202 280 345 122 23 232 151 -52 357 79 215 35 -196 138 -103 131
5302 131 24 34 -1 253 -153 -17 -72 610 -78 128 199 154 -33 27 -198 163 -39 272 -16 -77 72 -19 66
5325 66 37 49 -73 -215 -102 184 -210 173 -184 -211 37 -184 -91 240 18 85 46 142 -167 -28 -79 -78 -44 -137
5349 -137 -85 -169 134 295 188 -188 -140 -169 -353 -261 -169 -3 -103 -147 -56 -261 -309 41 -94 -173 -296 -33 -26 -213
5373 -213 47 137 27 -128 26 84 -106 -50 96 166 -42 -173 1 -117 -49 47 105 16 -70 80 180 -83 180
5396 180 -123 -88 26 -25 190 -42 64 258 -155 -21 -68 -58 62 104 148 80 -68 -37 1 -129 -75 27 246
5419 246 -106 -80 162 169 367 107 204 131 356 53 -35 116 298 169 114 -106 33 -32 -239 -24 -140 27 -58
5442 -58 44 80 -124 -112 1 155 116 156 -267 -193 118 27 -64 -152 143 -16 130 -329 -87 49 57 -37 -170 -25
5466 -25 168 -193 -350 277 -71 82 -60 164 -93 -244 -245 -190 160 76 3 -131 -172 71 -136 -204 -18 -302 237
5489 237 -104 88 36 -306 -216 72 -80 10 -8 -195 28 63 -2 49 186 105 21 -172 152 -305 271 -112 -60
5512 -60 -31 156 -355 -111 277 -25 -65 -36 -30 -80 -151 -214 -151 -169 19 2 -31 -30 110 -107 46 -114 12 60 22 -38
5538 -38 -61 -89 197 -168 267 88 145 113 -48 16 84 29 -266 232 130 94 56 141 -277 158 96 -37 122 254
5562 254 -144 -33 57 -237 6 132 123 -170 150 -230 -106 39 289 -52 69 -51 52 222 25 5 -83 234
5584 234 21 -187 92 102 180 129 -230 -99 126 -9 9 -83 208 -208 44 -93 191 123 -52 71 -133 -120
5606 -120 -68 -29 157 -6 -95 -146 -376 103 -40 -90 17 -357 -126 -130 -67 40 -8 49 12 -33 -164 91 100 -165 27
5631 27 69 67 -47 -48 -254 67 -119 64 -316 110 22 258 -111 -120 -28 80 -53 -203 -119 110 -113 144 114 240
5655 240 -18 -150 321 -197 69 44 -309 -32 -266 198 116 46 37 11 124 200 228 -169 234 -16 233 -176 286
5678 286 -221 141 -168 13 24 2 198 181 -144 43 -32 80 61 262 -21 369 186 -98 -43 49 -250 -129
5700 -129 310 -163 -14 200 99 -24 53 130 180 256 217 326 -104 32 -107 -181 19 25 -173 -8 39 127 -74
5723 -74 -37 -54 53 38 -117 -191 67 -105 -348 188 -222 -67 -8 -196 64 114 -112 -65 95 288 -64 53 -167
5746 -167 -138 -248 -282 -80 -202 120 -123 -158 -16 341 151 -111 -290 38 -41 -287 -5 66 -145 -35 234 -18
5768 -18 62 76 -72 -278 -172 -84 -166 -309 -134 108 142 -185 -141 -100 42 22 -16 -51 267 264 169 -74 -17 -70 -273
5793 -273 -73 -195 -49 -47 -105 -232 87 -33 92 -18 286 205 -59 -99 65 -47 165 8 90 46 -59 65
5815 65 -57 16 -174 -12 64 -32 -167 96 63 64 3 -90 -203 139 125 -148 -249 310 120 223 -273 -39 -117 124
5839 124 51 -27 168 99 -58 385 -54 95 -222 -3 -14 112 490 120 52 -132 -6 -221 256 -85 131 -108
5861 -108 -156 158 -159 -86 48 -145 148 -65 -153 -131 -143 15 94 208 -251 -190 -136 58 59 -177 -215 -298 -215 49
5885 49 -277 -281 81 252 -43 -184 157 138 -74 -156 -171 7 -41 68 -86 -144 59 -84 81 -70 48 128 200
5908 200 -44 -67 -238 -179 151 14 -155 -105 22 172 -1 -145 25 -136 -22 145 -25 -81 344 -116 -346
5929 -346 -62 205 50 140 -17 -302 -247 -70 30 80 315 226 186 127 287 202 267 208 141 -232 151 183 292 113
5953 113 129 186 -64 -54 80 103 88 -44 213 -204 45 -27 -58 -88 67 128 81 -55 -34 -15 186 -69 126 223
5977 223 138 202 -49 -154 -7 94 113 220 39 65 146 -130 -53 35 40 38 -102 38 -41 -290 52 -65 -171 -240
6001 -240 -10 -129 -56 -72 96 45 320 -237 -142 -21 -55 -81 -173 -236 -205 -190 115 -51 -304 -234 260 60 -107 -103
6025 -103 -308 124 -33 -155 40 -162 6 -140 -44 107 -157 -65 -71 -30 321 -8 -140 201 -47 -52 126 -314
6047 -314 -121 38 -242 13 -128 -44 191 -133 -81 1 -370 334 59 49 -95 -102 -95 78 -199 122 197 -114 6
6070 6 -133 201 57 174 75 139 40 -32 -276 -127 205 21 163 142 -3 44 181 21 150 163 -83 59 29
6093 29 263 -99 -107 20 102 74 237 -135 35 200 86 -52 114 -85 -56 17 -132 365 20 -220 -28 -138
6115 -138 -251 -188 -147 -153 -111 -137 98 127 -44 117 178 -131 156 19 -187 -50 -43 -122 -20 -107 -262 12 18 147 -20
6140 -20 58 -48 -63 -233 73 38 -334 -17 166 26 -237 -215 -354 163 119 -35 81 -34 196 84 -70 174
6162 174 364 -12 -8 206 -108 5 210 -105 47 -63 137 -14 -108 -235 -154 -77 74 50 26 49 117 -47 115
6185 115 -119 195 92 277 121 -99 5 253 332 95 171 107 108 -15 -363 -114 133 64 95 261 317 -118 18
6208 18 -33 39 -138 214 -116 -95 5 106 34 -75 154 474 -52 158 -25 234 223 20 132 -25 286 -96
6230 -96 140 -28 -30 48 13 -103 14 50 -14 -10 -147 158 -284 -145 317 78 -99 -139 16 -145 25 -128 -277
6253 -277 -80 -85 0 142 126 -74 221 20 -130 -372 -101 -196 -107 -20 -162 142 -78 83 -103 -45 -53 -79 -8 117
6277 117 -170 -101 -69 -153 -98 -124 59 68 -4 171 -170 93 -338 -64 -369 153 125 207 -14 -157 -90 82 164 -126
6301 -126 138 -218 8 -143 84 142 62 -20 -138 -207 154 82 -40 -167 -71 3 343 -132 -43 -93 47 10 89 24
6325 24 3 -81 -10 174 -9 95 399 81 87 192 122 385 239 379 -220 124 43 144 114 -52 247 28 316
6348 316 430 -77 229 47 -317 -2 -15 190 88 9 -49 -24 262 67 155 -2 204 203 -207 170 -263 -143
6370 -143 49 13 -17 -16 181 109 -222 -331 19 19 -72 -71 66 130 -42 169 -42 -231 341 -52 -140 -57 -36 -304 -359
6395 -359 71 -265 -291 -116 266 -57 -212 160 -49 -226 -221 -275 99 -8 81 -96 33 40 -268 -120 -166 93 -23
6418 -23 89 -175 -377 -190 -13 -249 -90 92 -26 -38 -4 49 -51 183 -50 -106 -15 -171 294 -294 21 86
6440 86 362 -13 201 -48 -136 134 -189 34 276 382 156 -24 -255 22 -86 33 237 107 98 300 -108
6461 -108 183 2 33 159 -144 -46 3 86 -93 -159 -57 -106 -185 268 165 -157 110 -9 -65 -211 50 133 -23
6484 -23 187 -119 -9 -241 -123 207 123 -51 -261 17 203 29 300 111 286 133 99 -136 -10 -147 69
6505 69 -18 95 148 -102 -60 73 -1 22 -161 -40 6 -57 -8 -5 87 50 -25 -119 -222 -36 107 -225 34 -271 312
6530 312 -22 -223 110 -201 89 115 13 -58 -175 46 -149 -1 -224 -64 -172 -13 -207 65 135 376 -192
6551 -192 -183 -141 299 -17 75 -393 215 -94 -166 280 -151 -78 -290 177 -113 229 52 89 -15 -88 222 18 94
6574 94 -195 163 61 -51 -53 -264 32 204 101 -184 -68 233 164 -143 -103 -92 -184 162 -62 149 82 33 81
6597 81 -17 -3 84 74 89 -50 -19 -196 178 -11 -29 54 -55 -112 -337 89 153 96 -168 -34 -31 -305 -79 162 89
6622 89 -209 36 24 -65 164 177 237 -73 -207 106 -222 -85 -111 251 54 124 248 59 21 -204 -142 30 -127
6645 -127 40 75 -285 -19 -228 90 -57 -189 -32 -37 -329 39 -216 -81 -116 -252 45 -189 31 401 31
6666 31 114 146 -149 -79 -274 -244 -20 -40 -25 -122 10 84 -86 87 -148 -88 -151 -118 102 -254 6 63 -347 45
6690 45 230 18 -51 12 338 150 -210 -128 -50 -80 100 84 80 48 -69 216 -124 -3 -132 92 134 26 -11 181
6714 181 -67 51 283 -45 -8 80 211 43 -32 138 177 21 -2 31 337 28 16 244 -98 13 -334 -51
6736 -51 289 58 93 73 37 12 131 111 -188 3 62 170 -266 -205 -120 -79 -122 -13 104 -175 347 -25 -89 -116
6760 -116 -215 -95 31 12 29 83 47 -43 -90 -88 29 -29 229 193 325 16 -229 37 -219 43 -266 160 192 52
6784 52 -114 -75 170 0 -40 128 73 -130 -102 -115 -88 -162 -132 15 -231 9 -27 3 -168 110 -33 -127 -75 209
6808 209 -12 163 244 -206 240 138 21 -201 197 95 7 11 -185 -66 -257 121 99 7 239 154 76 -30 82
6831 82 270 93 -114 -131 -58 -41 56 110 -228 -174 242 -119 35 189 212 -32 69 214 38 74 155 247 43 62
6855 62 15 -38 202 400 -61 154 -211 -64 55 -45 -61 -148 -73 -99 -187 -83 -52 153 122 -184 241 246 -101 -63
6879 -63 276 74 169 142 129 117 63 -31 -320 58 -68 283 -34 -54 -239 -5 -287 -253 -390 -144 -284 -48 112
6902 112 106 1 -250 -105 -208 104 137 9 -213 212 -44 -222 63 -14 -198 -238 -115 -156 -61 -287 73 -108
6924 -108 -249 -105 180 -153 -148 -41 -63 122 -124 -74 124 -128 -35 -10 83 -54 41 -100 -69 19 -283 -187 -24 168
6948 168 23 -2 105 104 16 124 4 -127 -25 60 11 -112 -106 -76 -142 297 -53 14 -65 -89 -103 5 -91 -10 -183
6973 -183 210 148 -37 142 148 -10 -51 15 42 4 -13 256 276 28 209 33 -94 400 192 -24 373 180 100
6996 100 -201 -10 203 -41 35 -205 -37 -67 14 -15 -80 60 -130 120 -64 152 170 220 85 -190 10 -141
7018 -141 33 -93 48 130 140 -201 374 -322 102 121 -146 -305 51 80 -63 25 92 125 -106 -247 -252 -28 371
7041 371 -216 -76 18 68 -176 -142 -76 55 25 -118 7 62 -164 -144 43 -109 102 141 -134 -91 -52 -71 96 224
7065 224 -168 -115 113 -93 95 -39 -3 -226 135 17 -1 -44 334 178 -112 39 -276 172 -65 237 -37
7086 -37 -249 -337 -96 65 -284 -121 -46 -125 17 99 319 222 -6 42 -120 120 5 115 -58 233 -173 -160 -106
7109 -106 60 -33 126 114 100 9 181 -154 -38 140 -62 164 -81 297 269 56 -114 -29 -65 103 35 -193 -205
7132 -205 -28 82 -268 43 42 -199 26 -196 -114 129 -20 48 163 -88 -89 -111 13 -150 64 -248 60 -10 103
7155 103 -26 -37 44 -17 -285 154 189 -191 -219 -64 19 -89 -283 -225 -154 -217 -257 120 -144 69 151 -53 -331 -54
7179 -54 29 116 301 -23 -77 76 -118 -131 72 188 107 81 41 -58 122 6 283 -14 226 -39 -6 -44 55 -38
7203 -38 -70 -99 -61 -223 -21 222 15 112 177 98 98 -44 -238 -165 -82 226 73 -18 284 -24 -144 130 -8 133
7227 133 171 -109 22 109 -24 -55 -288 58 -119 -77 198 -96 -70 33 152 -65 126 -7 10 165 42 84
7249 84 -126 -89 -153 264 -200 171 -60 -19 131 -25 209 286 268 74 -13 -213 166 -145 -46 312 60 167 -40
7272 -40 -28 -325 -115 -105 84 180 3 54 20 -75 -244 218 -126 103 -65 -243 320 -207 -140 39 -319 67 -216
7295 -216 -70 45 84 -140 -21 -115 16 178 -318 156 -14 -50 -98 -25 -286 -125 30 178 -97 -68 -337 -182
7317 -182 32 237 -115 -136 -117 -185 -35 -60 16 11 110 53 402 -86 -2 -121 -120 -212 -25 136 -232 -204 -42 -360 6
7342 6 -145 -442 186 -107 7 -42 -107 -75 78 34 112 -84 -71 -99 -19 264 100 335 213 46 -229 105 -49
7365 -49 222 12 12 203 35 151 -99 -78 40 4 83 67 -205 40 108 -231 -172 -33 25 12 -55 18 -148 -32
7389 -32 250 246 -104 165 85 94 184 -150 -115 -30 0 251 -149 13 -60 199 150 -341 4 35 100 -170 -23 53 31
7414 31 -259 187 -24 -269 48 277 -195 202 -148 83 -47 254 -89 41 -45 155 20 -418 293 168 267
7435 267 129 -72 79 25 -199 145 -210 -608 -35 -38 -80 -133 78 -79 171 55 -295 194 181 -160 165 54
7457 54 42 -145 185 -119 -213 -31 -258 131 -104 -171 106 -76 -166 -50 89 -213 -115 -128 -160 -133 -78 -182 -9
7480 -9 14 -343 -226 -2 8 -131 49 -72 43 -71 -163 36 89 267 19 -3 -52 98 166 145 128 -218 112 95
7504 95 -59 -39 -55 53 39 10 -234 -88 -76 -36 135 -3 113 -55 -118 243 137 100 144 -82 388 -123 -93 102
7528 102 167 34 129 94 -12 166 -261 216 158 -455 -85 81 -1 12 -192 55 -16 -117 -102 3 207 -298 169
7551 169 -92 -94 -141 -283 50 -37 71 168 90 -212 10 173 -210 -169 -199 -40 -390 120 -172 -112 101 150 31
7574 31 62 -22 68 299 217 68 66 377 -182 257 235 7 -527 -159 -73 -14 138 -124 117 58 -285 -63 -395 -180
7598 -180 -44 177 64 -207 -105 -10 73 -186 -325 5 -18 -227 -52 -165 -36 260 54 203 273 -100 -212
7619 -212 -182 -35 -157 -102 -8 269 -159 183 -34 77 174 -7 125 267 38 4 29 22 -15 119 -18 87 163
7642 163 156 135 -34 62 293 -71 -126 137 128 301 158 227 -12 73 183 36 121 -58 94 66 -26 175 -155 -36
7666 -36 -163 127 241 -213 251 49 23 -149 228 319 -46 157 18 -34 -84 -11 53 38 -31 77 -201 -162 -84 10
7690 10 229 83 40 -117 101 63 -14 293 -280 58 -43 -78 -256 -143 81 5 -232 -33 77 -245 -42 -274
7712 -274 6 -435 15 -74 -166 204 -116 -127 -153 -87 183 -311 67 184 -11 47 83 -25 -228 -44 -117 -132 -103
7735 -103 -94 -173 85 -28 -93 -12 -228 58 42 156 121 190 -42 -95 -55 234 78 -99 -21 -234 70 43 40 -107 -66
7760 -66 239 186 314 149 -148 -206 -182 148 -77 -203 62 -234 5 48 -62 267 -324 41 -105 -85 -3 -184
7782 -184 -318 -58 285 7 159 -212 -125 -272 226 -60 36 50 -172 -314 -421 -136 -80 -34 -216 59 -98 -73
7804 -73 265 -159 -128 114 -77 -139 193 -196 261 -15 -156 -51 -187 107 -21 -283 -65 -262 149 174 146 100
7826 100 -224 291 -145 -134 168 -24 -299 -39 -331 -111 -1 61 -113 382 -311 45 43 -215 -54 11 19 35 75
7849 75 -28 229 -217 -165 -107 -52 10 -174 41 174 -51 167 77 164 -28 16 -196 129 202 -150 -7 -112 -169
7872 -169 15 -2 -158 37 87 -20 76 -85 -396 200 16 104 235 -156 -45 59 333 -95 -41 105 -70 226
7894 226 99 -150 -24 -25 0 -147 -263 289 203 -18 23 297 -180 85 108 -25 137 216 -70 7 -131 -236 271
7917 271 89 168 68 308 47 57 -129 220 -7 -242 28 -120 -142 164 -209 47 -24 -46 130 143 -157 -178
7939 -178 54 51 71 195 -100 155 192 -267 28 121 131 66 12 -290 -104 110 -41 258 -117 -192 14 1 -17 301
7963 301 89 34 -25 -158 141 -33 180 -47 -111 -56 40 -74 31 -123 -45 2 -234 -9 180 8 -237 -51
7985 -51 115 -358 -72 15 65 153 -17 40 -189 -105 35 -33 155 35 -215 144 -32 140 41 -140 31 133 -263
8008 -263 -15 315 202 320 170 108 -148 101 117 -9 -210 -93 140 11 -99 -60 329 130 -47 -306 63
8029 63 -248 160 423 101 -245 42 -39 -105 289 5 -256 -106 -77 236 154 -147 -94 -177 177 12 71 -139 156
8052 156 164 178 -112 11 136 127 31 -230 114 -174 -234 -71 -115 -38 -33 93 -50 -130 -46 106 -51 284 -114 -110 -260
8077 -260 52 87 -53 3 -132 -149 -228 38 -74 -87 5 -113 -166 -202 115 117 -10 65 134 103 -54 45 102 137 91 -30
8103 -30 -383 -18 -27 102 209 126 -110 192 -109 405 -142 113 87 31 90 63 73 66 64 169 125 -102 -37 -96 386
8128 386 -18 106 257 -167 -140 172 164 311 149 238 -132 -140 8 85 37 137 -211 150 0 -174 -38 -28 22
8151 22 -94 -28 -76 14 121 49 -286 -174 81 32 -60 -105 -244 28 91 19 141 46 169 168 -105 94 -247 -240 92
8176 92 114 -16 171 313 24 -45 6 -201 244 100 128 -42 -33 -89 -140
8191a40
$$ Imaginary data points
##PAGE= N=2
##DATA TABLE= (X++(I..I)), XYDATA
0 0 0 0 0 0 0 0 0 -8 8 -8 8 -14 16 -16 24 -24 32 -40 46 -54 64 -72 84 -97 111 -127 146 -165 185 -211 237
31 237 -267 299 -333 373 -414 462 -514 568 -631 698 -772 856 -946 1049 -1165 1296 -1443
48 -1443 1612 -1811 2045 -2328 2676 -3117 3697 -4497 5677 -7598 11269 -20857 98501 223342
62 223342 47392 -8289 57433 126976 46137 -42764 -33180 54195 77494 44186 20446 42152
74 42152 41110 14283 -3356 5591 -6555 -37191 -42152 -2664 18571 -15894 -59864 -37616 21050
87 21050 26018 -30000 -45597 12276 52847 13179 -37727 -24826 17784 14962 -20887 -18547 32300
100 32300 62965 39321 14405 34739 55623 23176 -28433 -29262 11549 24674 -5912 -18168
112 -18168 19646 52252 25448 -21227 -24755 -5521 -16761 -43714 -41044 -20457 -18005 -23242 -10218
125 -10218 2701 -12642 -36304 -29329 -1345 359 -28987 -40591 -9630 20483 6297 -29139
137 -29139 -31352 4029 32261 19247 -9885 -5978 28881 39466 5512 -25634 -18383 4381 9046
150 9046 1468 1081 10961 21861 26077 19944 2755 -15391 -21445 -12150 -2738 -9901 -19001 -5605
164 -5605 20466 26491 5804 -11644 -7417 3981 -1599 -20041 -21289 -1129 11509 1913 -3590
177 -3590 7477 13373 2453 -4149 4370 10745 5313 -1845 -640 4312 4329 -361 -2963 203 7176
192 7176 15053 20377 14582 5005 5492 11958 6245 -9295 -13505 -2831 10934 17861 16427 11277 13311
207 13311 22570 21592 3140 -13856 -11139 5708 13906 5691 -1565 9233 26067 26445 9213 -3344
221 -3344 -793 8239 10196 2098 -6137 -1951 10933 15754 7256 -1558 40 8831 14641 9453 -2812
236 -2812 -5357 4415 8129 -2951 -12598 -6952 3667 6703 4296 3885 6154 6478 2568 -3115 -7748
251 -7748 -12836 -13510 -6975 -504 -862 -106 7534 9969 2157 -4746 -5029 -6732 -12066 -12340 -7473 -1465
267 -1465 296 -1071 -590 1952 2942 -1411 -7141 -8145 -5813 -3002 -3908 -8661 -10706 -4754 1623 -1311
283 -1311 -7896 -6881 630 4269 1056 -6402 -10493 -6578 -2687 -5915 -11266 -8746 -243 7040 8625
298 8625 4161 -610 462 3953 539 -8532 -10932 -3893 5806 8610 4302 2953 8729 12262 6260
313 6260 -1588 -3434 -1742 -173 1795 2047 1137 3125 8259 9148 3912 632 2508 4587 2886 297
329 297 -438 1382 2209 417 675 3464 4586 4280 7088 8973 6256 3181 2818 1159 -1902 -1515 1386
346 1386 3278 4530 6956 9144 9970 7274 2889 573 1395 454 -2696 -2302 2433 5648 6534 6818 5653
363 5653 4269 4475 3355 72 -2319 -2025 410 3289 3591 901 854 4953 5993 1546 -873 1880
379 1880 3488 1373 -735 -1660 -2220 -1660 -652 -203 315 770 1881 3887 3303 -1149 -4533 -3012 -2478
396 -2478 -5496 -6195 -2634 737 1719 2281 2617 1454 227 -1354 -3726 -4942 -4263 -3374 -1094 1302 1772
413 1772 2050 3386 2963 319 -986 537 180 -1297 -1046 124 717 749 430 398 2015 3224 2078 768
431 768 1305 1217 -1034 -1035 -1271 -2638 -2254 325 1670 1047 1280 2810 3006 889 -1256 -2940 -2347 -1234
449 -1234 -1838 -1316 1613 3453 3518 3803 3834 1400 -155 447 392 -1215 -611 1569 2609 3107 2926 2772 2940
468 2940 2964 1306 407 1374 757 -786 -407 1075 -245 -780 1142 1550 656 852 1714 1126 155 -132 -1013
487 -1013 -1315 -971 -1015 -414 2079 3661 3070 3228 4123 2536 675 -1 -40 -914 -180 1318 2027 2571 2834
506 2834 2484 2409 1764 -531 -2562 -1716 -997 -2800 -3304 -1510 -629 -1733 -1342 -938 -1703 -2637 -2114 -2079 -3145
525 -3145 -3400 -3075 -2091 -1577 -2522 -2515 510 1789 874 622 1879 1761 -43 -457 -443 -734 -583 1184 1612
544 1612 1825 2384 1872 1788 801 -509 -2166 -2098 -1747 -2618 -2773 -1365 -631 -1101 -663 -97 -542 -1455 -1752 -1930
564 -1930 -1694 -630 -324 139 1975 2296 1881 3146 4848 4271 3364 4450 5024 4035 3290 4150 4255 4447
582 4447 4208 4613 5521 5823 4626 3387 3594 2719 699 376 635 -266 -630 900 1406 595 777 995 111
601 111 -817 -771 -1386 -1860 -926 565 472 1179 1880 2399 2848 3059 1570 1181 2611 2785 1747 1202 2279
620 2279 1944 2320 2551 1653 1824 2437 2120 78 -130 -365 -1528 -1816 -1672 -2206 -2818 -2006 -708 -1539 -2232
639 -2232 -1733 -1475 -1447 -2765 -3591 -2835 -1565 -1494 -1768 158 1419 520 504 1304 490 -469 330 1286 436 225
659 225 1572 2094 1035 752 1600 1358 1154 288 -392 -145 -34 -1021 -1472 -817 -1142 -1366 -662 -361 -1022 -1085
679 -1085 -531 -562 -1473 -1496 -1333 -1454 -488 -191 -394 600 2322 2294 970 1501 2116 1424 937 1039 1743 1963
699 1963 2392 2951 3301 2978 2212 2352 3411 2283 517 750 2691 1907 219 1626 2250 2009 1792 1715
717 1715 1138 943 1703 1377 1187 744 824 1208 1953 1337 785 1990 2878 2638 1896 2303 2243 1412 1850 1777 1424
738 1424 1646 3316 3378 2080 2850 3298 2316 1796 1820 1103 643 1095 642 516 384 1535 1247 541 86 33
758 33 212 -258 -1902 -1942 -435 -665 -1720 -1273 -1020 -1308 -1630 -414 -672 -2329 -1385 -617 -1651 -2514 -2140
777 -2140 -1123 -955 -858 -1239 -897 -283 -165 -624 -1236 -1503 -1105 -640 -479 -1779 -2171 -203 414 -669 -1649
796 -1649 -192 -937 -1561 -1770 -1460 -1974 -1883 -783 -515 -999 -922 -1272 -798 -369 -856 -1289 -511 -190 -501 -808
816 -808 -630 -286 490 934 297 230 1197 1490 -137 275 1178 1241 -84 414 1587 1208 822 1515 1409 1136
836 1136 1280 1356 1325 682 391 810 1466 1048 447 1195 2277 1567 1180 1421 1202 506 971 1910 750 -99
856 -99 1684 2827 1675 920 1499 2067 2265 1339 412 860 1822 1597 932 769 1354 1498 1083 1235 473 763
876 763 1497 732 61 267 146 -356 149 1097 -123 -785 762 1348 -336 -1231 -319 140 -434 -951 -1096
895 -1096 -352 -230 -388 -595 -665 46 -461 -386 -585 -1088 -990 -283 -1181 -1320 -803 22 -981 -1298 -601 -509 -1242
916 -1242 -1450 -1030 -1122 -1207 -1295 -1040 -1474 -1292 -1377 -717 -85 -872 -1888 -1356 -460 -1134 -1643 -1150 -1013 -949 -247
937 -247 -391 -1540 -764 445 -209 -940 -552 -590 -262 -500 -645 -574 -358 646 439 207 -31 351 543 315
957 315 269 -309 355 1007 436 259 1023 802 721 1596 1583 433 726 1772 1124 334 908 1739 1518 996 1346
978 1346 1289 1672 1200 775 1118 1592 1116 660 1122 1376 720 944 1661 1335 714 1055 1299 236 583 719
998 719 242 883 1205 644 400 951 988 638 387 676 629 600 476 257 55 348 291 201 399 324 134 116 544
1021 544 -591 -621 260 442 -894 -930 47 -271 -452 -543 -318 -632 -668 -598 -912 -1166 -1363 -1404 -1114 -827 -1519
1042 -1519 -1429 -635 -655 -1647 -1496 -756 -1022 -1281 -1248 -1063 -1321 -1102 -566 -1131 -962 -716 -629 -793 -593 -768 -1090
1063 -1090 -717 -332 -642 -758 -349 -492 -354 -421 -444 -559 108 -135 -711 -687 122 -153 -336 47 186 -14 182
1084 182 290 -523 -595 239 161 -23 -43 429 551 784 603 97 615 683 503 -65 988 453 74 1063 1028
1105 1028 515 694 1542 1069 537 1017 1468 857 1066 1274 1211 823 1367 886 932 1164 1193 977 1331 1155 582
1126 582 690 923 521 396 786 751 372 478 411 115 201 451 -213 -494 148 202 -361 -197 126 -165 -629
1147 -629 -418 -185 -204 -409 -406 -773 -611 -544 -973 -406 -162 -657 -751 -136 -257 -834 -742 -138 -655 -1035 -734 -843
1169 -843 -785 -1082 -589 -838 -631 -761 -1071 -1130 -512 -1227 -1359 -654 -876 -1129 -1023 -835 -900 -1277 -614 -1086 -1123
1190 -1123 -1078 -888 -986 -1218 -571 -1118 -951 -534 -625 -1003 -650 -6 -614 -610 -14 -239 -222 -245 149 -165 301 450
1212 450 295 645 622 566 81 663 914 152 258 919 749 465 790 739 394 730 941 647 538 742 333
1233 333 309 680 567 589 860 804 825 935 1203 597 759 1215 880 769 890 1069 642 809 1096 912 953 908
1255 908 686 566 988 774 490 574 757 682 428 733 432 46 540 432 -153 627 117 -31 -266 157 95
1276 95 -205 338 376 -121 -277 -27 -335 -365 -150 -12 -335 -620 -123 -638 -376 -317 -376 -457 -501 -433 -810 -259 -668
1299 -668 -1099 -668 -394 -981 -1347 -970 -782 -1321 -1325 -722 -977 -952 -863 -906 -1292 -915 -707 -944 -719 -256 -608 -725
1321 -725 -123 -465 -844 -85 -195 -778 -121 76 -252 -6 30 -24 -314 77 215 -528 -377 317 -176 -598 -76
1342 -76 276 12 -479 -60 32 165 227 -151 182 411 357 393 676 375 -24 811 890 595 653 904 864 608 749
1365 749 1057 1123 1195 1038 932 662 1114 976 768 1117 1081 818 713 703 390 388 774 458 286 955 806 477
1387 477 264 573 314 -31 469 374 -185 296 638 84 82 315 418 -157 419 25 -15 332 322 -140 170 379
1409 379 4 -168 -104 -149 -325 -133 308 -410 -524 -134 -527 -1135 -495 -366 -909 -522 -558 -807 -973 -852 -885
1430 -885 -916 -909 -907 -846 -693 -925 -920 -900 -434 -1046 -1147 -661 -415 -938 -810 -681 -613 -720 -732 -310 -684 -569 -172 -557
1454 -557 -863 -103 -365 -783 -435 -530 -567 -364 -185 -115 -421 -240 -176 -285 -231 -163 -309 79 29 -497 -184 394
1476 394 -154 78 284 385 -25 373 499 388 232 448 585 333 615 577 531 1110 749 335 768 849 450
1497 450 640 1135 962 410 523 766 663 367 947 731 502 802 431 71 384 825 707 485 520 696
1517 696 454 535 612 263 267 699 341 484 667 345 313 399 279 -15 218 789 -208 -333 328 61 -179 -50
1539 -50 -46 -195 -501 59 -409 -468 -127 -379 -723 -154 -467 -951 -361 -374 -692 -536 -61 -690 -797 -693 -603 -972
1561 -972 -976 -391 -675 -625 -471 -588 -573 -662 -617 -997 -807 -625 -476 -526 -443 -877 -635 -277 -549 -689 -606 -314 -717
1584 -717 -538 -127 -289 -894 -115 -192 -393 -374 145 11 -145 -23 116 -443 -2 -99 -177 -160 404 -113 107 328
1606 328 37 231 434 371 9 174 247 143 235 523 376 168 401 658 412 423 471 671 367 684 746 803
1628 803 939 790 651 1164 795 369 696 1240 967 323 881 659 438 217 679 707 245 807 701 267
1648 267 636 543 444 -150 281 -99 116 283 324 -13 326 208 208 339 299 -104 197 -70 44 -21 161 96 -366
1671 -366 -160 101 91 -567 -35 -140 -531 -276 1 -327 -685 -314 -639 -601 -582 -476 -751 -392 -500 -976 -472
1692 -472 -624 -637 -1032 -599 -309 -861 -614 -1013 -929 -637 -276 -624 -995 -662 -277 -352 -652 -429 -299 -335 -477
1713 -477 -315 -211 -166 36 -281 -208 -191 -500 -379 -355 -366 -576 -207 17 -150 -218 298 -104 -191 23 295 -89
1735 -89 128 125 -48 -83 162 184 -17 211 247 89 193 519 175 351 597 551 171 720 617 526 833 746 686
1758 686 413 787 1014 623 828 1043 817 854 572 771 938 500 307 439 741 275 209 257 608 324 15
1779 15 390 60 118 145 499 -31 -124 149 168 -215 220 -9 203 -35 366 -242 -51 216 -37 214 368 188
1801 188 54 -63 -109 -101 -160 103 -346 -312 60 -442 -733 -595 -61 -807 -858 -487 -749 -671 -821 -841 -941 -919 -735
1824 -735 -498 -775 -631 -524 -1006 -629 -678 -634 -752 -39 -473 -463 -291 -106 -394 -179 -364 -597 -259 105 -400
1845 -400 -532 -28 -33 -415 -261 -3 14 -436 -93 -503 -535 145 -77 -422 -159 -194 -264 -288 3 -136 -365 -1
1867 -1 -158 -6 177 639 144 472 443 374 303 447 602 483 588 887 557 464 949 725 773 484 614 406
1889 406 720 902 198 637 670 552 281 419 442 173 309 584 14 318 58 588 154 447 179 83 274
1910 274 170 -116 345 701 141 -93 136 511 198 371 193 289 350 598 285 119 195 199 -115 160 -276 -149
1932 -149 -268 -134 -273 -592 -132 -277 -445 -800 -296 -214 -420 -536 -762 -740 -466 -494 -472 -514 -471 -730 -560 -460
1954 -460 -592 -699 -714 -264 -599 -838 -65 -371 -326 -170 -491 -389 -497 -336 -539 -455 -153 -505 -354 -316 -332 -332
1976 -332 -236 -301 -664 -189 53 -279 -471 66 -330 -402 -259 333 -461 -303 265 -101 -86 20 207 197 339 289
1998 289 119 111 443 29 114 496 392 196 510 606 352 401 629 572 481 545 392 499 381 714 485 314 753
2021 753 429 607 740 581 267 464 325 451 429 640 249 341 267 510 213 435 761 403 125 199 412
2042 412 -29 371 247 300 382 301 5 128 38 174 124 244 39 60 110 133 -72 -337 15 -370 -391 -391 -281 -394
2066 -394 -402 -421 -639 -420 -347 -444 -692 -170 -355 -657 -392 -194 -372 -406 -265 -279 -590 -281 -402 -442 -327 -502 -764
2089 -764 -412 -345 -644 -899 -319 -276 -279 -371 -362 -471 -794 -515 -489 -412 -488 -121 -365 -433 19 -227 -411 234 -141 -133
2113 -133 -299 -12 -425 -109 129 10 24 134 198 -292 -77 431 -81 20 463 67 -205 442 625 469 276
2134 276 236 407 243 192 484 211 497 617 676 496 369 240 328 589 330 323 485 543 445 313 699 200 224
2157 224 625 463 343 556 304 309 383 325 424 485 490 447 151 418 345 31 360 153 -18 28 86 -82 48 -24
2181 -24 301 -68 205 480 47 -399 -306 370 -277 -105 -91 -186 -183 48 -200 -149 -453 -251 -127 -432 -419 -405 -170
2204 -170 -317 -711 -300 -205 -455 -795 -542 -361 -794 -641 -121 -793 -685 -266 -420 -167 -689 -534 -431 -613
2224 -613 -146 -238 -345 25 -428 -671 -155 -264 -287 -258 127 -158 -477 -13 -240 -355 -9 3 -198 -67 -88 166
2246 166 89 82 -15 -146 85 210 -111 -31 168 106 125 260 138 109 121 243 152 343 246 248 291 440 443 363 232 508
2272 508 518 477 390 253 540 556 630 722 368 750 631 230 708 403 395 501 583 342 482 539 519 210 284 95
2296 95 153 194 394 27 67 533 249 220 311 182 -82 322 121 -46 150 9 -106 108 153 -65 -64 182 129
2319 129 -263 -418 -65 45 -358 -265 -38 -292 -358 141 -142 -177 -241 -295 -641 -261 -410 -382 -627 -578 -444 -452 -316
2342 -316 -432 -708 -107 -614 -494 -352 -136 -431 -384 -334 -446 -686 -451 -14 -449 -304 -64 -395 -222 -236 -99
2363 -99 -277 -272 -232 -473 -358 -357 -781 -390 58 -269 -212 -325 -59 -532 -215 -31 -262 29 117 185 138 -71 399
2386 399 215 256 563 355 308 370 256 390 317 602 94 387 465 406 626 241 329 288 566 661 264 158 423
2409 423 304 13 542 400 64 382 515 519 303 435 497 -22 681 84 246 288 341 31 206 315 368 236
2431 236 188 612 293 272 286 257 368 558 -71 29 -9 16 -28 -64 194 220 -6 -271 -110 -99 -119 -260 -194 -223
2455 -223 -164 -433 -737 -192 -350 -544 -401 -389 -336 -250 60 -321 -360 -336 -388 -475 -303 -425 -449 -139 -297 -79 -276
2478 -276 -224 -308 -336 -401 -376 -319 -381 -453 -496 -306 -228 -562 -144 -278 44 -119 -114 -137 -253 -186 94 85 -392 -172 -190 -43
2504 -43 -123 -160 -314 107 -122 91 26 255 31 -5 112 201 174 96 379 480 50 272 572 294 156 456 126
2527 126 105 546 619 365 189 389 416 287 519 399 188 341 424 188 450 325 70 270 194 483 -156 422
2549 422 496 206 375 354 241 60 226 81 310 345 214 53 427 263 72 225 596 -174 121 192 100 57
2571 57 96 142 -291 295 41 -43 86 141 241 -261 -233 120 -29 -421 -243 -221 -386 -175 -13 -527 -492 -253 -86
2594 -86 -222 -397 -141 -422 -230 -452 -809 -479 -345 -648 -354 -423 -277 -524 -663 -290 -407 -413 74 -424 -263
2615 -263 -429 -218 -345 -190 -444 -452 -394 -77 -426 -267 140 -293 -161 -198 155 -94 -169 122 -237 -144 -173 290
2637 290 -162 14 175 -176 131 -19 -42 393 55 202 239 555 255 222 34 -41 161 361 370 73 -18 193
2659 193 738 92 101 540 472 156 409 427 51 404 423 299 440 162 450 345 155 290 252 366 463 59
2681 59 561 -6 377 379 517 157 187 172 337 165 267 224 245 190 23 214 44 -124 120 -102 231 153 -168
2704 -168 -51 45 152 -129 13 -112 179 -470 -109 -435 -278 -239 -358 -191 -405 124 -381 -411 -92 -140 -161 -95
2726 -95 -345 -315 -121 -188 -460 -372 -186 -391 -358 -474 -315 -321 -424 -379 -352 -497 -163 -232 -346 -343 -409 -593 -96 -210
2750 -210 -250 -339 100 -191 -311 -212 -39 -276 -361 -241 159 -153 -85 -126 36 48 -54 -139 -40 56 -33 412 49 148
2774 148 -5 242 351 13 51 258 190 35 363 452 426 103 403 416 281 414 152 357 362 376 219 239 587
2797 587 426 94 468 171 89 282 211 -21 468 253 110 123 366 359 15 205 222 62 343 348 -11 680 226
2820 226 361 254 199 130 -233 212 185 -108 -69 82 -137 -52 49 -3 -303 -142 208 -101 -18 118 73 -409 -183
2843 -183 4 -260 -216 -203 -374 -201 -325 -166 -528 -307 -233 -375 -194 -248 -738 -151 -161 -640 -501 -117 -90 9
2865 9 -445 -399 -141 -409 14 -219 -26 -202 -236 -272 -384 -107 -341 -198 -3 -16 -502 -394 -46 -340 -138 100
2887 100 -593 -72 -9 60 -271 -93 -270 -91 -45 -41 212 -130 -149 345 -106 113 129 277 -61 -128 149 53 359
2910 359 254 42 373 548 144 -62 387 311 245 156 283 212 176 511 275 403 121 374 111 179 433 78
2932 78 219 376 -76 390 123 83 314 363 222 118 392 452 167 -3 182 294 130 439 311 58 99 255
2954 255 188 -68 24 184 -107 412 374 14 -258 195 -215 -29 -227 -80 -263 -29 171 41 -313 260 -141
2975 -141 -86 -94 -199 -56 -125 77 -303 -34 -1 -224 -214 0 -320 -83 -347 -268 -309 -79 -186 -378 -325 -94 -138
2998 -138 -429 -523 -122 -680 -481 -162 -196 -56 -285 99 -416 -402 -148 -239 -175 -472 -152 -286 -347 -65 -240 -138
3020 -138 -111 -130 -415 -71 5 -240 283 90 -191 -5 489 -78 -210 316 131 -23 180 405 -133 15 149
3041 149 175 52 307 334 269 108 299 281 310 -91 -17 358 249 336 218 175 266 84 418 361 -25 25 340 382
3065 382 261 56 221 94 269 495 484 238 276 302 143 263 13 66 30 428 60 64 -40 80 -52 -59 180
3088 180 -130 -87 255 161 214 101 136 114 -40 -137 -315 32 -266 -217 -433 -36 -128 -237 -137 -231 -185 -390 -99
3111 -99 -261 -72 -111 -311 -339 -72 -231 -319 -368 -450 36 -429 -147 -290 -399 -371 -139 -299 -367 -316 -199 -131 -131 -341
3135 -341 -582 -409 -1 -354 -317 -331 -99 -296 -142 -25 -208 -287 14 -173 -196 -345 200 121 269 -64 -97 -123
3157 -123 134 -257 168 223 -312 129 38 209 -64 222 100 -155 294 360 107 -112 97 214 216 63 427 400
3179 400 213 318 469 213 77 423 449 108 381 223 276 201 309 82 342 378 389 208 294 -86 3 287
3201 287 423 420 -166 599 125 -74 -19 85 332 356 52 65 98 127 -89 78 -176 -167 -72 -102 -174 -11 45 241
3225 241 -271 -106 -57 -30 -262 -266 102 -294 -245 97 -181 -267 -95 -192 -251 -31 -168 -210 -37 23 -186 -236 -264 -476
3249 -476 -137 -146 -30 -180 -456 -154 -265 -252 -67 -578 -264 -293 -43 -440 -56 -60 -207 -488 108 91 -280 261
3271 261 48 -313 -159 28 -354 -302 -188 -57 -267 -132 195 -182 -50 127 245 10 -166 4 -89 268 -178
3292 -178 -9 102 -105 241 58 17 295 173 205 284 -68 201 630 250 227 327 221 137 423 400 131 169
3314 169 505 49 437 303 407 279 189 249 220 306 161 572 382 392 229 384 118 142 285 6 76 58 44
3337 44 122 135 119 96 211 -282 -307 138 84 111 -136 -1 -288 -85 -8 75 -397 221 226 -129 -115 -145 -124 -365 24
3362 24 -128 123 -174 -454 -264 -308 234 -191 -492 -381 41 -337 -322 -207 -361 -45 -150 -308 182 -146 -238
3383 -238 -349 -55 -13 -520 -306 63 -236 88 -237 -591 -425 -225 91 -388 -158 -258 -233 -140 -244 -300 -233 -178
3405 -178 142 -268 -193 -116 -34 96 -193 -191 283 189 -137 89 -47 180 272 67 216 -80 -62 -148 151 -137 88
3428 88 39 281 178 197 122 277 79 465 246 100 179 149 186 311 142 -77 248 265 148 246 622 12 393
3451 393 257 278 -112 66 380 132 94 246 41 189 167 140 94 154 71 13 240 167 35 108 211 -121 -121 174
3475 174 205 77 37 178 98 44 107 87 -111 59 -12 123 -26 -500 -296 -211 203 1 -41 -207 121 -327 -119
3498 -119 135 -282 53 -250 36 -242 -287 -205 -100 -90 -49 -84 -401 -178 -312 -187 -248 -149 -182 -100 -231 -334 -59
3521 -59 -513 -327 -238 -1 -331 -82 197 -329 33 -353 -8 61 -307 -200 -79 -252 -332 479 -203 -24 -186
3542 -186 45 104 63 90 221 -312 -260 -31 5 215 11 47 120 242 -265 142 191 7 17 15 277 116 226 67
3566 67 63 -18 98 352 -30 230 75 269 89 118 345 106 409 290 219 209 325 223 -52 539 36 281
3588 281 36 63 -67 498 260 -106 137 216 14 -148 358 297 -244 -70 202 -34 121 254 -374 163 209
3609 209 -262 -45 65 -57 -147 -21 101 -64 -154 -178 172 -171 -350 45 -362 -172 -91 -307 -631 217 -160
3630 -160 -247 -148 -404 -399 -238 -107 -163 -441 43 -166 -505 -418 8 -66 -188 160 -269 -381 -126 38 -168 -278
3652 -278 35 42 -286 -189 -422 -384 -467 63 -273 -40 -148 -284 -93 -107 -41 -459 -188 -76 -176 6 -228 141
3674 141 14 315 -40 187 3 207 118 58 305 71 -172 176 201 -21 243 236 18 15 39 210 -32 335 283
3697 283 393 243 32 228 120 318 183 -21 158 277 34 64 228 25 70 603 306 187 252 449 213
3718 213 260 339 209 -9 20 18 -116 363 122 344 263 414 126 117 -40 214 -34 240 155 -192 92 527 -134
3741 -134 -67 -115 423 -189 -393 -70 -15 -172 -154 -115 -231 122 -41 3 13 28 -252 -118 95 -164 14 -237 -153
3764 -153 -295 -183 -48 -301 -224 71 -94 -448 -97 -153 -277 -386 -94 -23 -226 -82 -265 -35 175 -200 -75
3785 -75 -271 -136 43 -174 -186 119 -41 -125 -187 -55 120 138 -335 -110 -27 -45 336 103 78 -18 119 -26 131
3808 131 93 -66 -225 -92 122 9 75 79 -26 112 200 495 130 -21 412 164 399 91 290 246 114 131
3830 131 146 351 185 155 359 23 256 -43 138 115 -235 -164 62 81 47 50 278 141 532 401 106 -15 30
3853 30 182 209 -164 89 63 -233 76 -56 -81 96 398 68 -19 178 -123 -106 34 7 4 -63 230 -142 -160 155
3877 155 -174 -77 -3 89 144 -43 -88 -463 -64 -120 -84 -316 63 -219 -103 -211 -144 -480 -64 -144 -237 -6 -204
3900 -204 -416 -333 -193 -88 -180 -296 -389 -158 -262 -32 -205 16 -18 -234 188 -47 -165 -34 52 -254 64 -213
3922 -213 -120 -163 76 72 168 -98 -109 12 -407 97 -49 -96 86 -334 -200 71 91 169 360 90 14 10 -88 -64 374
3947 374 246 -120 107 125 147 155 293 54 321 326 52 43 -159 614 75 163 352 143 122 355 317 -127 198 -61
3971 -61 228 209 191 -78 121 210 232 206 579 325 38 91 122 38 -171 -58 -196 132 -109 180 -9 120 -93
3994 -93 -42 15 -13 -171 -253 -148 53 174 -175 102 -174 5 -51 -98 -62 -268 -161 110 16 1 -100 -80 -224 -241
4018 -241 -400 42 59 7 -396 -152 -453 -372 -432 -173 401 -234 170 -54 -172 -182 -104 -258 60 -311 -291 -28
4040 -28 -203 -359 -262 -102 -28 -56 -86 -209 -270 -138 -124 -548 -144 -62 35 60 -120 167 -209 71 -97 -158 275 -197
4064 -197 -299 220 39 -48 -9 -47 180 60 109 438 185 -13 181 0 226 288 380 44 49 140 384 95 152
4087 152 144 44 221 34 -62 121 412 177 363 132 184 -59 266 298 265 35 146 161 139 185 580 198 139
4110 139 226 321 122 48 120 -34 224 14 308 162 9 212 -21 127 -85 -92 -9 -141 81 -79 -9 -204 -129
4133 -129 212 -74 -7 -210 -128 92 -37 -194 117 -388 94 153 -173 91 -26 -249 -228 -185 -317 138 -114 -287
4155 -287 -305 60 129 -237 -540 -114 -260 -9 -152 -128 -263 -206 -30 32 -277 -101 76 -215 -202 -205 -116 9 -34
4178 -34 -149 131 -9 -221 -3 8 -276 -22 -198 -102 12 -291 2 213 -96 300 50 -116 -294 -16 47
4199 47 36 -180 -223 310 231 -94 -139 78 172 119 106 134 107 360 257 321 -171 156 271 193 329 318 195 310
4223 310 255 251 309 18 243 235 131 -96 58 -355 -204 89 46 368 186 153 -115 273 120 -191 289 183 260
4246 260 -89 249 20 287 -6 141 -58 112 -153 52 50 56 95 51 -93 -433 -7 19 -374 -278 -329 -71 452
4269 452 -115 -42 200 -401 -179 2 -322 -107 -365 -256 -195 -166 -90 -140 -96 -150 -127 75 91 56 -65 -318 -61
4292 -61 -114 -108 -320 -157 -212 -24 -191 -153 33 152 -41 -292 162 18 -101 73 -180 -335 -9 -252 -146 -75
4314 -75 -92 -37 -204 -128 67 -72 -227 57 -248 -137 -380 -12 162 199 -24 95 254 258 64 -5 76 -39 -38 25
4338 25 177 -51 194 -120 100 -14 387 -91 126 -121 331 171 16 329 -8 57 213 -83 168 230 318
4359 318 -220 -185 105 121 60 189 -167 20 0 124 -126 404 276 262 367 204 222 111 40 334 21 341
4381 341 16 -42 -88 -172 -181 124 37 -228 -248 -233 -121 -216 23 -75 -22 -317 59 19 114 -104 85 -56 154 -71
4405 -71 -154 -180 -23 -28 -300 27 -63 -79 -161 -130 -203 -329 82 -195 -38 -170 -126 34 -338 -47 6 47 39 -170 -208
4430 -208 -230 -179 -84 129 -465 -128 -308 -226 -136 9 -179 -172 52 -254 -129 55 -64 -298 72 -108 -199 60 -182
4453 -182 53 -171 275 -14 320 22 36 -218 261 234 95 230 62 -66 -143 -93 -49 33 417 418 83 165 50
4476 50 129 -115 215 470 278 187 101 122 27 442 92 42 27 73 110 368 157 240 -42 -75 60 4 -67 90 331
4501 331 183 154 78 144 116 -50 -98 409 142 -84 -64 198 -102 -180 -233 294 13 -289 171 -41 -87 99 -30
4524 -30 -100 196 -24 -158 -8 39 -165 154 -49 -207 241 -26 -137 -26 -324 -212 -118 38 -2 -295 -208 -177
4546 -177 -192 -92 -145 -212 -403 -280 -29 23 -303 64 -89 114 122 -107 -55 198 265 -263 -108 167 -71 132 156
4569 156 -36 -272 39 21 -354 -97 -288 -21 -77 132 -274 -120 -111 -216 113 -39 210 -99 -160 339 11 -171
4591 -171 41 294 -9 177 -115 223 118 179 114 -198 178 175 -9 183 -84 296 -34 -83 -140 81 239 -85
4613 -85 144 -109 361 446 -133 68 -94 174 156 42 288 -213 426 11 142 342 143 187 45 -102 27
4634 27 -131 52 145 68 62 -117 -218 -143 74 149 -133 42 -90 -58 -23 172 78 -123 -94 195 -27 -126 12 -253
4658 -253 -276 -69 -28 -108 -94 -227 -97 65 -11 -214 -301 127 -47 57 -67 -53 -239 39 389 -209 174 -247
4680 -247 -357 158 -136 -227 -26 38 230 -264 -224 -251 95 210 -16 -65 -86 152 111 -459 -26 88 -321 -36
4702 -36 -158 215 -50 93 54 -206 46 -186 114 -135 99 -251 -142 110 64 -307 39 69 51 29 -103 -38
4724 -38 -140 157 157 102 172 -237 111 -207 153 303 61 264 139 192 -90 -110 190 -67 -8 140 -43 266 283
4747 283 -149 181 8 -222 -41 -19 219 -286 156 180 160 84 33 -433 -201 -20 133 -335 105 -131 172 168
4769 168 208 -74 -74 -65 180 34 -34 230 -253 10 -110 -109 217 498 -49 -188 67 -237 -156 -127 -372 -62 -193
4792 -193 104 197 -26 162 -26 41 -110 77 -263 -42 177 -52 -349 122 -208 -235 -135 19 -97 4 -41
4813 -41 -203 -176 -157 32 -53 56 48 -216 146 -147 -448 174 63 15 21 -119 -123 -113 41 162 7 -387 -46 203
4837 203 -174 -255 167 342 78 -88 72 -250 -174 83 -43 29 -108 -118 -41 66 -100 21 -124 306 -329 165
4859 165 -2 195 -346 357 170 -242 57 39 33 -107 17 110 19 -143 175 114 72 -17 -37 -73 202 173 217 284
4883 284 202 14 223 -242 -44 166 339 -92 185 616 -16 -39 78 116 -55 0 92 -12 -155 -123 199 -59
4905 -59 -34 -245 -35 -77 172 -179 -258 64 97 -16 -54 54 33 -13 263 -150 -364 57 -134 -18 -110 -269 -100
4928 -100 -176 92 113 -266 -4 112 -70 -217 -19 -35 -172 -87 107 -121 -58 -34 4 -213 101 -42 -210 324
4950 324 232 24 -534 -152 -46 -4 -21 63 99 -98 -169 -147 58 -10 157 40 -130 -19 19 270 46 -389 118
4973 118 -140 -124 -315 -7 -45 -81 -124 -112 120 -145 144 -241 -254 91 -229 -116 77 -76 -22 -94 315 23 -154
4996 -154 10 -36 184 76 378 -109 262 -39 76 21 158 -81 334 18 125 189 332 49 248 55 28
5017 28 16 -135 258 -37 12 -126 -37 -35 -77 141 43 240 -260 -196 145 54 451 171 162 206 -117 33 105 332 -270
5042 -270 -75 -97 37 279 -257 -47 34 23 106 154 54 -6 -67 -277 -11 -46 -91 -193 -241 -318 -450 178 -28 -74
5066 -74 -67 -90 1 -141 -118 -134 -85 137 -9 -125 0 54 42 -177 -229 245 -137 -320 136 -198 -140 -363 -381 -54
5090 -54 -345 29 -53 -319 -205 -281 -185 -31 -286 -191 -234 58 -151 -159 -158 22 114 165 -75 -329 -205 -404 -82 85
5114 85 243 -27 48 177 193 -127 267 -102 11 105 104 197 282 322 79 280 -23 -204 59 9 -37 -50 136 -19
5138 -19 208 192 340 104 -72 -106 213 284 464 174 -107 272 209 29 -34 230 55 218 -251 -354 114 239
5160 239 -362 -170 60 77 10 -47 121 160 163 353 142 8 -65 -51 129 157 151 -315 -72 -194 100 26 104 -146
5184 -146 -101 -172 -131 -318 -93 29 9 88 -174 -375 -113 -60 84 -3 -202 -76 -206 -66 -287 -64 52 -73
5206 -73 -197 -249 -18 -142 178 -95 -285 -169 -588 96 -117 53 -55 -181 -39 -4 244 157 -281 -236 111 -222
5228 -222 -218 -46 34 -3 -327 -228 -57 -292 -398 -3 -295 34 -52 -141 -1 132 158 -66 -19 -34 51 119 57 44 -159
5253 -159 141 -142 237 110 77 -20 338 207 39 -58 -183 514 -21 161 195 46 -84 143 223 -51 134 239
5275 239 197 60 249 -125 32 65 3 180 -46 -34 -12 182 -8 256 87 -52 -153 18 18 154 148 33 -439
5298 -439 -3 102 -42 61 163 -307 65 -90 152 69 23 -283 -221 94 89 4 102 -115 -430 -124 97 21 64
5321 64 30 -301 -185 -138 -359 -219 -48 18 -254 -63 -247 -151 -256 -184 153 -47 238 -322 -139 -169 -97 350 41
5344 41 -168 -321 -260 -7 -119 -26 -480 5 12 -36 -5 3 20 89 -85 -197 -36 96 157 -49 -76 -35 -214 -121 -64
5369 -64 -173 -82 253 -127 216 203 -102 -117 17 -132 8 -167 127 155 357 -69 5 194 169 -60 6 -50 236
5392 236 219 101 164 -415 -53 150 230 -17 121 -90 272 -182 200 28 -163 25 216 36 -13 249 53
5413 53 26 17 41 -62 21 2 44 49 -49 -21 3 -169 230 -97 -147 54 33 146 129 5 -153 -252 -131 -212 -146 -120 -87
5440 -87 -257 -126 -65 -167 -280 -27 198 -121 29 -96 -34 -169 -25 -163 -209 -35 -295 113 198 -196 -269 -103
5462 -103 191 -134 -53 -301 -378 73 -122 -184 -165 -173 -257 -166 -215 -458 -192 -133 -119 -46 -106 260 -25 -91 -226 -270 -152
5487 -152 -139 -29 -295 -21 67 125 -145 -86 74 211 -129 -210 38 -153 19 9 2 121 112 39 -59 -30 255 -95
5511 -95 -164 -173 -111 -101 267 377 -126 332 163 207 -39 75 -140 17 127 138 313 144 -218 158 164 -302 157
5534 157 69 218 -318 237 64 -173 -140 -100 72 35 140 18 -270 -53 -132 279 84 125 149 -166 -250 421 234
5557 234 139 3 245 -25 -131 30 30 241 54 -113 -25 36 144 -110 229 -16 -162 -96 74 -99 -64 103
5579 103 22 -194 -178 -318 -259 -88 -77 156 -115 21 22 -92 -34 -256 89 -112 22 -75 -181 62 115 -294 193
5602 193 256 -249 -247 -143 235 -174 175 -57 51 -112 -226 319 -199 -320 -18 289 141 114 86 79 -106 25
5624 25 9 -85 1 72 -4 318 -1 61 -69 2 -96 165 23 -88 109 75 13 -146 149 -103 -42 212 280 -119
5648 -119 203 -88 139 -48 -119 262 73 202 221 -137 106 140 -238 -48 72 40 493 266 57 -126 -184 199
5670 199 -30 21 -125 79 39 -71 -269 125 -46 211 -96 -386 -102 6 -33 61 86 -75 55 123 112 -21
5692 -21 -8 29 -273 94 -181 274 60 -232 77 -104 -163 119 -52 -98 -219 260 -81 -56 3 -100 -195 -115 -86
5715 -86 -82 -82 -227 -193 -40 -189 23 103 -174 -277 4 -128 -1 10 192 -214 224 -232 -100 -98 -19 -185 -319 -195
5739 -195 -51 15 3 54 -145 -241 -9 -108 164 61 100 -78 -58 158 -157 -172 43 -62 -38 246 -334 167 -95
5762 -95 306 244 19 40 178 269 -133 111 246 -68 -142 171 -1 10 1 -52 42 157 -82 44 202 56 88 84
5786 84 174 255 165 -162 81 61 198 -29 -96 101 -50 224 6 86 35 272 90 -143 -467 75 248 98 -335
5809 -335 248 104 -251 -100 -409 -9 -149 -106 164 20 -116 -82 156 106 -227 54 -41 -74 -165 -61 32 50 66
5832 66 -65 -15 7 -2 -280 -246 -273 -24 101 -7 135 -161 -131 -44 -61 -362 -293 -81 -221 -16 -26 109 -44 -35 73
5857 73 -340 -150 63 -36 -162 -97 -72 -157 152 -173 52 -206 187 -178 -170 -96 -6 -5 84 115 54 -109 -25 62 14 -274
5883 -274 -11 -100 -276 82 -14 -73 151 -92 -24 137 212 22 -30 157 77 197 93 -6 -75 60 -83 45 50 149
5907 149 45 -41 3 -39 4 33 293 135 -100 221 97 129 311 142 -23 158 -361 -148 288 264 -8 111
5929 111 -29 27 -118 129 -181 138 231 172 185 -152 -420 267 -62 205 127 131 92 -95 -56 5 176 48 -229
5952 -229 139 52 -89 -188 11 -81 -14 34 376 4 215 131 -59 -258 120 -146 23 250 -87 230 34 -137
5974 -137 -61 -99 -144 -55 22 -116 106 -75 -145 -47 184 -112 27 -112 182 -108 33 -151 -333 -350 -257 148 -368
5997 -368 -77 -20 105 151 -216 23 121 -244 20 127 60 -331 -386 -186 27 -289 -51 -7 126 5 -207 60
6019 60 287 -20 -263 229 104 -184 269 236 177 43 17 -123 245 -35 -192 8 312 -120 -242 73 -28
6040 -28 267 59 -29 393 -92 149 -24 -2 210 -63 281 5 120 310 -46 -47 181 -42 5 -96 54 -171
6062 -171 -73 -13 -202 -77 83 26 -121 -159 -15 -11 83 67 171 45 168 71 213 -48 -8 -8 -161 92 368 -135
6086 -135 103 -44 17 50 108 101 -73 33 -189 -262 -119 372 -294 426 -95 -8 -149 -258 -140 -151 -53 85 -217
6109 -217 37 -180 233 -89 89 10 -178 -215 117 -24 57 -51 -32 -253 61 111 -359 -93 21 102 60 -128
6131 -128 -268 -245 238 48 55 -142 243 -68 -234 28 -100 161 -114 -112 -65 201 141 45 -44 -152 129 -68 400
6154 400 226 11 43 333 313 304 271 45 -69 154 142 244 -257 251 217 89 276 -167 186 125 -95 -22 38
6177 38 -167 10 -35 -8 11 174 219 132 113 122 184 218 73 -81 -34 230 315 16 37 -128 2 -53 -166 29 -185
6202 -185 118 23 60 309 167 -77 46 -70 -60 -19 -41 -184 218 -87 -300 16 -37 -177 -95 7 26 -306 33
6225 33 139 -259 58 3 -81 -118 49 -134 -94 -168 187 229 -82 -255 -339 224 188 -4 -302 -153 157 311 533
6248 533 -115 -243 226 81 -303 -32 -55 -230 85 -146 -173 -186 -430 105 -340 -135 -206 39 19 -154 454 -149
6270 -149 -66 -83 -121 -5 198 -98 46 249 125 -304 -32 245 -75 150 182 -147 168 -21 124 -143 -262
6291 -262 160 -103 342 13 100 46 217 159 184 193 91 -33 -16 -45 -35 16 32 18 96 115 -58 -42 144 114 -64
6316 -64 190 308 -17 131 95 121 -328 154 216 -113 -92 -37 108 -86 18 190 300 5 -24 -231 -109 -225
6338 -225 73 357 -288 -127 -196 -21 -337 -157 156 2 -15 104 102 -240 -44 -246 -277 378 -56 1 121 -173
6360 -173 -40 37 172 -3 -69 -75 137 -83 -71 -159 -181 78 -247 -195 -44 -303 -87 -203 -169 -186 112 -167 -314
6383 -314 -71 -16 -84 34 114 166 113 57 149 1 -82 -252 -130 -155 96 193 -157 7 -100 -82 -351 -125 -115 -292
6407 -292 64 74 75 -141 52 -123 185 83 -59 -9 56 257 154 247 -255 -8 -24 -130 -27 -186 64 71 216
6430 216 -155 -6 61 248 3 -170 85 -93 128 -94 -65 303 352 439 -63 58 293 -26 140 132 271 -156
6452 -156 62 122 116 132 -236 50 258 139 -122 -211 89 106 -209 64 105 -161 119 26 129 107 -126 146 15
6475 15 -149 -61 34 -210 253 33 -23 -193 172 141 -88 208 -174 32 -160 -365 -194 227 155 -38 34 -53 52
6498 52 47 -299 -94 -92 -146 -74 -58 321 223 -18 219 -218 338 170 -52 -217 -105 67 -158 -134 55 -100 -24 10
6522 10 70 -373 -43 -48 351 89 -154 293 -174 -232 105 13 -291 301 232 -19 263 -59 -54 69 -10 165 191 13
6546 13 -185 148 -2 308 -343 92 -143 59 23 -166 187 21 186 -111 -25 17 -84 88 53 -29 19 -134
6568 -134 -76 -349 362 236 263 10 73 -40 94 118 29 77 49 -154 -128 113 28 -94 -187 -61 -252 -26 -120 332
6592 332 243 -27 -132 244 -198 1 -139 25 -29 -186 201 -152 121 -96 51 -160 -297 66 13 -33 87
6613 87 -134 55 -205 147 -72 -22 -197 -66 -86 -28 179 36 -59 -275 -279 -269 -162 15 -9 -144 -235 188 200 -105
6637 -105 9 68 -127 -176 -65 234 369 -71 117 10 -251 -69 -94 -19 205 -289 200 -142 128 57 -176 -108
6659 -108 248 84 35 -389 20 -156 71 76 -2 -315 -180 143 137 11 245 -74 136 -61 -214 35 -200 -78
6681 -78 -150 126 76 157 94 -35 12 -24 -10 52 263 34 166 -104 -2 -48 -36 173 290 71 267 -139 175 123
6705 123 -45 294 118 83 373 -296 194 252 -19 -13 -18 -35 205 50 -53 -172 31 52 167 13 179 -293 -134
6728 -134 324 -34 -106 190 7 -102 -214 -246 185 -281 -183 -277 112 -98 -272 25 33 -53 51 39 -39 -76 -231
6751 -231 130 336 -28 -290 -201 89 53 64 -122 5 47 -110 -102 -112 -153 -74 216 25 -149 -129 -27 114 -22
6774 -22 -28 -195 -71 56 -131 16 -44 -81 -232 92 38 -99 -88 71 161 8 -291 181 -88 10 28 -172 -130 77
6798 77 -154 19 209 389 90 -61 -214 -260 47 -264 190 -193 150 -55 140 -96 35 74 -18 59 338 -145
6820 -145 -154 25 191 54 16 57 239 55 -28 26 -128 -114 30 -49 155 124 -150 -45 23 -6 -102 142 211 206 163
6845 163 10 26 -137 21 -20 83 -7 -279 -1 -181 -105 119 -163 -580 -183 -122 200 59 73 27 80 -124 98
6868 98 25 78 309 78 269 -29 -363 -83 -128 111 -248 77 -55 -66 23 -189 203 -378 -199 -68 -100 -105 -197
6891 -197 162 122 103 -30 -101 27 -208 -274 81 190 88 -66 -160 33 -78 -154 287 64 131 116 -76 0 17
6914 17 36 114 313 114 -121 -156 142 -318 246 135 -87 -159 110 -59 -46 170 -208 19 -14 57 80 -297 30
6937 30 37 -105 27 1 108 -151 -448 44 -13 233 22 -28 186 -216 92 -66 129 -110 102 -14 -104 -75 -74
6960 -74 -93 73 -92 -39 124 -91 -5 107 -62 -281 175 114 20 81 158 190 0 154 -67 -31 -182 -99 -5 -198
6984 -198 98 236 50 80 65 -32 124 52 44 -51 -23 104 -43 157 -138 -77 18 182 -276 -250 327 -176 -93 -345
7008 -345 -373 -256 -72 -161 165 21 128 -192 -38 12 -186 82 -27 -197 -96 -194 -153 -99 -164 56 159 -276
7030 -276 -153 -220 -79 144 21 39 -144 -161 -163 -52 -65 -72 22 11 -65 -26 50 -90 28 -185 92 -39 122 101 -8
7055 -8 22 282 -24 109 -104 6 12 104 -99 101 133 -10 -4 -2 72 13 -3 164 31 -102 100 73 -124 106 111 196
7081 196 69 68 271 -106 -239 8 141 -665 -94 92 131 -114 57 45 59 90 4 49 -172 61 31 87 116 201
7105 201 17 5 80 -1 -102 163 -82 -241 160 -100 -102 125 176 152 228 -71 58 225 -78 -85 -233 -238 -68 25
7129 25 77 -24 -43 -119 104 108 -37 114 -20 333 -23 -30 -28 -54 -84 -294 -119 -172 74 -93 42 -22 -194 -226 -348
7154 -348 57 -185 -194 94 -323 142 63 257 97 38 106 -183 -197 50 18 193 333 -228 88 -60 -21 0 77
7177 77 146 167 37 -166 169 21 275 107 70 33 -125 105 -172 13 4 457 18 268 -287 31 -51 -200 63
7200 63 138 247 -195 165 -20 59 -187 12 101 260 168 -201 86 -63 -29 50 -196 -124 174 27 -5 -82 0 151
7224 151 -89 119 -133 162 -85 176 247 237 -173 309 -36 -286 390 -221 -182 -35 209 -24 -152 125 165
7245 165 -90 172 333 79 25 -94 29 -82 71 -11 106 -28 -169 193 50 -154 41 -73 -231 -223 -74
7266 -74 -84 55 -14 22 227 175 23 140 -87 -91 -38 68 -304 -219 109 -214 -32 96 -257 -28 -144 -17 285
7289 285 56 7 44 98 -70 -108 -122 75 -119 132 1 258 74 310 215 -1 250 149 -71 -28 -274 112
7311 112 -113 -64 224 -81 -101 -157 246 -21 -257 86 -230 169 -179 -85 -172 -512 -100 66 242 -115 40 -24
7333 -24 89 86 67 -101 35 -81 -41 445 -108 193 -100 16 -49 -67 192 30 -33 31 21 -34 304 249 180 50
7357 50 46 -102 -161 -43 -103 22 210 172 -304 32 85 -219 -44 395 -114 -39 -178 101 -127 -77 14 31 -139 133
7381 133 -73 124 -347 246 -39 -33 -128 -25 -254 148 -181 -195 65 23 -254 -22 -199 89 372 -177 63 18
7403 18 276 -38 321 185 -116 -281 -236 173 283 -112 41 165 192 -218 223 -105 -455 -138 204 208 -43 -20
7425 -20 -528 -26 -62 61 -93 -198 312 -7 -11 -108 -56 16 -205 213 -70 -58 155 77 17 -184 -96 -45 -427 -96
7449 -96 -30 285 -92 109 -80 -55 -12 -57 -24 94 -192 226 23 -326 -255 -177 190 51 67 16 -101 210 173 69
7473 69 -71 -113 -181 -120 161 37 -66 60 -45 -12 20 -23 334 -82 218 124 64 59 45 110 103 16 73 118 -82 94
7499 94 144 -178 -61 307 -89 -124 -277 -22 178 -190 68 13 -46 136 261 -129 104 -18 -50 2 -197 162
7521 162 -232 14 -40 -26 179 126 226 165 154 16 37 -286 -43 -157 45 42 -226 88 -186 -20 8 -52 -4 -165
7545 -165 89 141 208 172 19 -186 50 -138 -354 127 -276 28 108 93 248 -156 -173 187 -210 78 -257 177
7567 177 -209 -169 -134 -79 -44 -276 -220 114 397 -64 -104 -20 -191 72 -386 222 295 150 52 -193 3 255 153
7590 153 218 -24 -25 175 -102 88 184 187 31 -251 77 -34 267 183 103 -99 -12 -1 169 -336 244 93 -123
7613 -123 54 -162 -48 -74 35 280 -248 -164 10 52 181 -26 -89 46 -121 -38 -31 27 81 -63 -18 -12 -52 91
7637 91 -99 -175 58 -207 71 82 -57 -176 64 181 -142 -120 2 -32 16 222 84 -80 27 -184 -49 -183
7659 -183 -329 -115 198 165 94 79 -250 -2 -212 -50 43 7 48 253 -2 -276 35 5 -80 168 121 -66 -265
7682 -265 12 79 -122 35 117 -48 243 168 168 -44 174 -99 -321 52 293 122 -23 -69 -198 -169 -81 -159 69
7705 69 55 273 64 158 -142 -2 205 137 1 -63 153 -38 369 134 357 -55 46 -130 287 293 -87 -25 102
7728 102 62 160 6 137 186 48 -46 -108 174 132 -225 18 -42 5 310 -3 -285 -4 155 278 3 -12 -152
7751 -152 -408 -127 -318 201 233 90 154 212 66 -50 179 0 -24 276 -15 208 -90 -157 87 -2 -124 243
7773 243 -57 3 102 -151 96 100 130 -356 -161 -287 236 -18 96 87 -200 155 -122 -145 -306 107 -230 -274 175
7796 175 -331 357 -398 -39 120 -77 14 73 0 -2 -210 -110 -101 -184 141 -57 -149 116 -33 -4 19 -129 -108 105
7820 105 -85 -13 356 112 163 -31 127 -337 235 -2 -52 221 123 -232 -222 14 -202 14 283 -130 -74 -261
7842 -261 97 44 87 -198 -86 35 64 -86 17 70 36 274 -7 102 -389 -229 -37 4 -79 66 -107 168
7864 168 40 123 250 166 -136 197 -74 7 76 -99 -147 -240 -186 269 67 8 89 -101 -48 135 53 83 -403 18
7888 18 141 111 -115 158 82 72 248 27 -8 -264 309 -48 -2 -271 99 229 -8 -111 -251 269 71 41
7910 41 -47 -1 -71 -59 -177 242 138 -368 -208 -29 77 -165 294 -96 -184 -55 -158 -223 -116 75 -139 -20
7932 -20 -74 -250 65 -83 32 110 -130 -34 -145 72 -92 52 -66 1 19 -65 168 -101 -323 -23 119 -158
7954 -158 19 -79 -144 -68 -229 45 279 179 -284 108 -9 -135 146 67 -46 -172 -107 -231 -239 17 -4 -155 -143
7977 -143 92 -51 -110 483 132 -205 109 241 -341 239 75 -108 107 -298 203 -119 -250 -38 7 138 74
7998 74 -23 -6 167 251 134 -56 190 -46 -65 222 -56 -54 -44 -26 320 438 184 -380 -203 109 387 149 272
8021 272 -48 3 -162 -168 206 120 76 108 -100 -102 82 -59 -110 -148 -39 -133 -123 -471 273 27 124 171 -29 74 -386
8046 -386 -222 -202 214 175 -167 -63 -170 -11 230 -224 -3 -138 211 199 16 182 237 -47 227 -142 -3
8067 -3 -45 59 83 -152 101 382 -250 19 -164 85 93 -248 375 -7 216 -175 -214 -86 84 -6 -176 -74 178
8090 178 144 113 53 -134 -68 -252 -9 -229 -91 27 69 -113 82 -61 -192 110 -142 -8 247 58 67 23 -149
8113 -149 147 -94 -10 86 -9 390 106 20 -9 25 -162 25 -133 64 238 117 -48 -73 107 67 125 -224 -38
8136 -38 70 87 114 221 43 240 100 -147 38 114 154 116 -185 97 294 -64 78 165 -41 92 -81 -339
8158 -339 -56 -73 -33 323 -154 39 -154 -41 14 -255 417 215 -84 -42 27 192 59 82 67 -88 112 304
8180 304 114 -125 217 229 -32 -125 -220 273 -41 54 50
8191E0
##END NTUPLES=NMR FID
##END=
