##TITLE=1H_EC-3221(II)
 CDCl3, 8 sc, 
 6.2.2020
##JCAMPDX= 6.0         $$ Bruker NMR JCAMP-DX V2.0
##DATA TYPE= NMR FID
##DATA CLASS= NTUPLES
##ORIGIN= UXNMR, Bruker Analytische Messtechnik GmbH
##OWNER= root
$$ XWIN-NMR		Version 3.5
$$ Thu Feb  6 14:17:49 2020 Russian Standard Time (UT+4h)  she@DPX200
##.OBSERVE FREQUENCY= 200.1315
##.OBSERVE NUCLEUS= ^1H
##.DELAY= (6, 6)
##.ACQUISITION MODE= SIMULTANEOUS
##.ACQUISITION SCHEME= undefined
##.AVERAGES= 8
##.DIGITISER RES= 18
##SPECTROMETER/DATA SYSTEM= spect
##.PULSE SEQUENCE= zg30
##.SOLVENT NAME= CDCl3
##.SHIFT REFERENCE= (INTERNAL, CDCl3, 0, 15.7039)
##AUDIT TRAIL= $$ (NUMBER, WHEN, WHO, WHERE, WHAT)
$$ ##TITLE= Audit trail, XWIN-NMR		Version 3.5
$$ ##JCAMPDX= 5.01
$$ ##ORIGIN= Bruker BioSpin GmbH
$$ ##OWNER= she
$$ F:/spectra/data/she/nmr/H-F/1/audita.txt
$$ ##AUDIT TRAIL=  $$ (NUMBER, WHEN, WHO, WHERE, WHAT)
(   1,<2020-02-06 14:16:56.12 +0400>,<she>,<DPX200>,
      <created by zg, POWCHK disabled, PULCHK disabled
       configuration hash MD5:
       00 E9 B6 7A A2 85 ED C7 34 08 36 98 17 FE 4E 26
       data hash MD5: 16K
       95 9E 21 3E B7 32 F8 6C 6F 29 DA 80 A8 BB 46 01>)
$$ ##END=
$$ 
$$ hash MD5
$$ AF 55 2B A3 B4 79 F2 2F EF 02 A0 44 1E 42 40 15
##$RELAX= 
##$RELAX= 
##$RELAX= 
##$RELAX= 
##$RELAX= 
##$RELAX= 
$$ Bruker specific parameters
$$ --------------------------
##$DU= <F:/spectra>
##$EXPNO= 1
##$NAME= <H-F>
##$PROCNO= 1
##$TYPE= <nmr>
##$USER= <she>
##$AMP= (0..31)
100 100 100 100 100 100 100 100 100 100 100 100 100 100 100 100 100 100 
100 100 100 100 100 100 100 100 100 100 100 100 100 100 
##$AQSEQ= 0
##$AQ_mod= 1
##$AUNM= <au_zg>
##$AUTOPOS= <>
##$BF1= 200.13
##$BF2= 200.13
##$BF3= 200.13
##$BF4= 200.13
##$BF5= 200.13
##$BF6= 200.13
##$BF7= 200.13
##$BF8= 200.13
##$BYTORDA= 1
##$CFDGTYP= 0
##$CFRGTYP= 5
##$CHEMSTR= <none>
##$CNST= (0..31)
1 1 145 1 1 1 1 1 1 1 1 1 1 1 1 1 1 1 1 1 1 1 1 1 1 1 1 1 1 1 1 1 
##$CPDPRG= <>
##$CPDPRG1= <>
##$CPDPRG2= <>
##$CPDPRG3= <>
##$CPDPRG4= <mlev>
##$CPDPRG5= <mlev>
##$CPDPRG6= <mlev>
##$CPDPRG7= <mlev>
##$CPDPRG8= <mlev>
##$CPDPRGB= <>
##$CPDPRGT= <>
##$D= (0..31)
0 1.2 0 0 0 0 0 0 0 0.06 0 0.03 0 0 0 0 0.0002 0 0 0 0 0 0 0 0 0 0 0 0 
0 0 0 
##$DATE= 1580984215
##$DBL= (0..7)
120 120 120 120 120 120 120 120 
##$DBP= (0..7)
150 150 150 150 150 150 150 150 
##$DBP07= 0
##$DBPNAM0= <>
##$DBPNAM1= <>
##$DBPNAM2= <>
##$DBPNAM3= <>
##$DBPNAM4= <>
##$DBPNAM5= <>
##$DBPNAM6= <>
##$DBPNAM7= <>
##$DBPOAL= (0..7)
0.5 0.5 0.5 0.5 0.5 0.5 0.5 0.5 
##$DBPOFFS= (0..7)
0 0 0 0 0 0 0 0 
##$DE= 6
##$DECBNUC= <off>
##$DECIM= 24
##$DECNUC= <off>
##$DECSTAT= 4
##$DIGMOD= 1
##$DIGTYP= 9
##$DL= (0..7)
0 120 120 120 120 120 120 120 
##$DP= (0..7)
150 150 150 150 150 150 150 150 
##$DP07= 0
##$DPNAME0= <>
##$DPNAME1= <>
##$DPNAME2= <>
##$DPNAME3= <>
##$DPNAME4= <>
##$DPNAME5= <>
##$DPNAME6= <>
##$DPNAME7= <>
##$DPOAL= (0..7)
0.5 0.5 0.5 0.5 0.5 0.5 0.5 0.5 
##$DPOFFS= (0..7)
0 0 0 0 0 0 0 0 
##$DQDMODE= 0
##$DR= 18
##$DS= 0
##$DSLIST= <SSSSSSSSSSSSSSS>
$$ [...]
##$SUBNAM2= <"">
##$SUBNAM3= <"">
##$SUBNAM4= <"">
##$SUBNAM5= <"">
##$SUBNAM6= <"">
##$SUBNAM7= <"">
##$SUBNAM8= <"">
##$SUBNAM9= <"">
##$SW= 24.9337058887773
##$SWIBOX= (0..15)
0 0 2 0 0 0 0 0 0 0 0 0 0 0 0 0 
##$SW_h= 4990.01996007984
##$TD= 16384
##$TD0= 1
##$TE= 0
##$TE2= 300
##$TE3= 300
##$TEG= 300
##$TL= (0..7)
0 120 120 120 120 120 120 120 
##$TP= (0..7)
150 150 150 150 150 150 150 150 
##$TP07= 0
##$TPNAME0= <>
##$TPNAME1= <>
##$TPNAME2= <>
##$TPNAME3= <>
##$TPNAME4= <>
##$TPNAME5= <>
##$TPNAME6= <>
##$TPNAME7= <>
##$TPOAL= (0..7)
0.5 0.5 0.5 0.5 0.5 0.5 0.5 0.5 
##$TPOFFS= (0..7)
0 0 0 0 0 0 0 0 
##$TUNHIN= 0
##$TUNHOUT= 0
##$TUNXOUT= 0
##$USERA1= <user>
##$USERA2= <user>
##$USERA3= <user>
##$USERA4= <user>
##$USERA5= <user>
##$V9= 5
##$VALIST= <valist>
##$VCLIST= <CCCCCCCCCCCCCCC>
##$VD= 0
##$VDLIST= <DDDDDDDDDDDDDDD>
##$VPLIST= <PPPPPPPPPPPPPPP>
##$VTLIST= <TTTTTTTTTTTTTTT>
##$WBST= 1024
##$WBSW= 4
##$XGAIN= (0..3)
0 0 0 0 
##$XL= 0
##$YL= 0
##$YMAX_a= 199396
##$YMIN_a= -75624
##$ZGOPTNS= <>
##$ZL1= 120
##$ZL2= 120
##$ZL3= 120
##$ZL4= 120
##$ABSF1= 10
##$ABSF2= 0
##$ABSG= 5
##$ABSL= 3
##$ALPHA= 0
##$AQORDER= 0
##$ASSFAC= 0
##$ASSFACI= 0
##$ASSFACX= 0
##$ASSWID= 0
##$AUNMP= <proc_1d>
##$AZFE= 0.1
##$AZFW= 0.1
##$BCFW= 1
##$BC_mod= 2
##$BYTORDP= 1
##$COROFFS= 0
##$CY= 11.3945322036743
##$DATMOD= 1
##$DC= 2
##$DFILT= <>
##$DTYPP= 0
##$F1P= 16.9975609425685
##$F2P= -3.02152046262296
##$FCOR= 0.5
##$FTSIZE= 0
##$FT_mod= 4
##$GAMMA= 1
##$GB= 0.15
##$INTBC= 1
##$INTSCL= 1
##$ISEN= 128
##$LB= 0.24
##$LEV0= 0
##$LPBIN= 0
##$MAXI= 10000
##$MC2= 0
##$MEAN= 0
##$ME_mod= 0
##$MI= 1.114404
##$NCOEF= 0
##$NC_proc= 0
##$NLEV= 6
##$NOISF1= 3.799351
##$NOISF2= 2.8
##$NSP= 1
##$NTH_PI= 0
##$NZP= 0
##$OFFSET= 15.70392
##$PC= 1
##$PHC0= -9796.699
##$PHC1= 30.40081
##$PH_mod= 1
##$PKNL= yes
##$PPARMOD= 0
##$PSCAL= 0
##$PSIGN= 0
##$REVERSE= no
##$SF= 200.130013532006
##$SI= 16384
##$SIGF1= 3
##$SIGF2= 2
##$SINO= 400
##$SIOLD= 16384
##$SREGLST= <1H.CDCl3>
##$SSB= 0
##$STSI= 0
##$STSR= 0
##$SW_p= 3612.71676300578
##$SYMM= 0
##$S_DEV= 0
##$TDeff= 0
##$TDoff= 0
##$TI= <>
##$TILT= no
##$TM1= 0
##$TM2= 0
##$TOPLEV= 0
##$USERP1= <user>
##$USERP2= <user>
##$USERP3= <user>
##$USERP4= <user>
##$USERP5= <user>
##$WDW= 1
##$XDIM= 8192
##$YMAX_p= 0
##$YMIN_p= 0
$$ End of Bruker specific parameters
$$ ---------------------------------
##NTUPLES= NMR FID
##VAR_NAME=  TIME,          FID/REAL,        FID/IMAG
##SYMBOL=    X,             R,               I
##VAR_TYPE=  INDEPENDENT,   DEPENDENT,       DEPENDENT
##VAR_FORM=  AFFN,          ASDF,            ASDF
##VAR_DIM=   8192,          8192,            8192
##UNITS=     SECONDS,       ARBITRARY UNITS, ARBITRARY UNITS
##FACTOR=    0.0002004,     1,               1
##FIRST=     0,             0,               0
##LAST=      1.6414764,     0,               0
##MIN=       0,             -75624,          0
##MAX=       1.6414764,     199396,          0
$$ Real data points
##PAGE= N=1
##DATA TABLE= (X++(R..R)), XYDATA
$$ [...]
2034G93R1k46k17L76k60J7L26q2%j16m3k39L7L8K7K78m69P0K9J07j62k0p2O2j84
2059A41MJ65j23j53J37J32l74L01J26j90m95K89J75J10n32K57K73k68j97L0K97
2080A05n8k44N8j49j53P9L78k15om77N81j02l96l4L22K43q91N20J13l52J22o9
2102f25J94m08K67J04K15k09J28J82k86l30J9J87k4k72J67N64l23m33N79J97q55
2123i62P78J23r5k67L92q1k21j65Q07l07j86Q5J63J47r2j01L17l9m01K65J6R4
2145B70k6j23M51k3o67L22M38n52l89O52K03j25o9L81l22p8J71J45k56R0R2J38
2167G23j47j37K03R2j12n68M70L70k44m30O75r1o49Q1J38L64o68N12p3k83J90
2188D16P8N5k98j88K44j34q2K30k06R2k70J22L43n55j88K26L48m94m1K68Q5k36
$$ plain form
2034 793 884 638 421 797 537 554 880 798 798 682 639 400 437 475 502 780 311 381 410 517 355 335 263 325 141
2059 141 145 310 187 34 171 303 -71 230 356 166 -329 -40 135 245 -287 -30 243 -25 -222 -192 105
2080 105 47 -197 -139 -288 -441 -362 16 -199 -205 -682 -101 -203 -599 -633 -311 -68 -959 -439 -326 -678 -556 -625
2102 -625 -431 -839 -572 -468 -253 -462 -334 -152 -438 -768 -749 -562 -586 -858 -691 -127 -450 -883 -304 -107 -962
2123 -962 -184 -61 -156 -423 -31 -112 -333 -498 309 2 -184 -99 64 211 119 18 335 296 -105 160 176 270
2145 270 244 121 572 549 -118 204 642 90 -299 353 556 431 362 743 421 343 514 659 403 493 585 723
2167 723 576 439 642 734 622 54 524 894 650 220 895 804 155 236 374 738 70 582 509 226 416
2188 416 494 549 251 63 307 173 91 321 115 207 -63 59 402 -153 -341 -115 233 -261 -302 -34 51 -185
2210a85k13M11k23p6K28J14l69k82K02R6P5j82k22M97j03m82J64M33j93J42j65
2231c33N09o37m92O41J71m50j33L73K7j05K21j04k80j16M03j19j72P8L68j19k48
2252e17N7L35j13K5QK54k70j25K10L49m44j58N23J05l70j25M55Q7m12M0M84m77
2274g9L38j31K38j54l15K25K52J12m41O7j08K95k46L42K10m29R2L55k95j9k1K74
2296E62m68L9P04k08m09k7J56jj48N72o1m75J92p5L28k57k52L43j37j9k58K62
2318C63M80o51j60L85j8k52k23N46m75RjL39m66j39L24j98O2rq1K78k99n84N12
2341b58K42j62j22K63Q2l31k44N87m37m57O48J16j91j00N6j16j87J26J19r9j54
2362f19J12K78j69k14L0J81J14j94l65O24M0n60L79J96m89Q4J84m3J44m1Q0l3
$$ plain form
2210 -185 -398 13 -210 -286 -58 56 -313 -595 -393 -297 -222 -404 -626 -129 -232 -714 -550 -117 -310 -168 -333
2231 -333 176 -461 -953 -312 -141 -591 -724 -351 -324 -429 -208 -312 -592 -708 -305 -424 -596 -518 -150 -269 -517
2252 -517 -460 -125 -238 -213 -205 49 -221 -346 -136 213 -231 -389 134 239 -131 -256 199 286 -126 -86 398 -79
2274 -79 259 128 366 212 -103 122 374 486 45 112 4 299 53 395 605 176 268 623 328 309 288 562
2296 562 94 133 837 629 220 193 349 348 200 772 711 236 428 353 681 424 172 515 378 359 101 363
2318 363 843 192 32 417 399 147 -76 470 -5 4 3 342 -124 -263 61 -137 -75 -84 -165 113 -186 -770 -258
2341 -258 -16 -178 -300 -37 45 -286 -530 57 -380 -837 -189 -73 -264 -364 -308 -424 -611 -485 -366 -465 -619
2362 -619 -507 -229 -398 -612 -582 -401 -287 -481 -846 -222 -182 -742 -363 -167 -656 -572 -388 -431 -287 -328 -248 -281
2384b81N0k37K1L94k60K56k78K78M63m49k1P3k6R3j12J72O9P6j97j83K80L01k72
2407B10l52L75N9o4k68N24r7l17J91L36n05J31M13o5n2j61r2O4K26k51P1J3Q9
2430D78m7J90K26m34J12J82j85l00K20L99l96L2j94L8m7l1Q5M5j62j32R0O9k19
2453A9j7m8p8J89l25K32r3k6O0L23m03o5p6M31k71j6j1K10j44n9J49k43o3K38
2477h7Q5k88k5J15K78j00m02K29L64l95l99K89o7j85k08L81L01p09M46J24l17
2498e70k59N70J01l63J00L26r1k44o5K1O7k9J57K91o5n54J35M52l02J25J28K60
2520A91k14L2M5O4j71L10j86m2J13j59l9J99k30K62j12k50J88j10M28r9j86J34
2542A68K69j73J35k16N8k0k07N38r8l04R6L15J80n05J53J06l54K33n8k3L9J52
$$ plain form
2384 -281 -231 -468 -447 -53 -313 -57 -335 -57 406 -43 -64 9 -17 76 -36 136 205 281 84 -99 181 482 210
2407 210 -142 233 292 228 -40 484 387 70 261 597 92 223 636 571 519 358 266 330 556 305 376 389 478
2430 478 431 621 847 413 525 707 522 222 442 841 445 477 283 321 274 243 328 373 211 79 169 238 19
2453 19 2 -46 -124 65 -260 -28 -121 -147 -87 236 -167 -232 -308 123 -148 -164 -175 35 -109 -168 -19 -262 -325 -87
2477 -87 -2 -290 -315 -200 78 -22 -424 -195 169 -226 -625 -336 -403 -588 -796 -415 -114 -823 -377 -253 -570
2498 -570 -829 -259 -158 -521 -421 -95 -186 -430 -495 -474 -407 -436 -279 12 -53 -607 -472 -20 -322 -197 -69 191
2520 191 -23 9 54 118 -53 257 71 29 142 -17 -56 143 -87 175 63 -187 1 -109 319 220 34 168
2542 168 437 264 399 183 241 221 14 552 454 150 246 561 741 236 389 495 141 374 316 293 332 484
2564D84j19j46L7L13k92L74k40m13N51l86k62M51K4n78M38J30m08j00K3L12l4
2585A59j27L2j0M7k1j46K00l44mL85%l96J58K17L8n24m4J26P6oJ8j7j90Qr7L00
2611a62j40j57L76j12q4%rk58K39r4J64r8k5j11K41%l8J36l47K04l02N79n04P0
2635d32k17M39k0pl4jL6J43L02j94k92K09R9l31R9L70l04J59Q2j30k97L86j02
2658c7k14J95K48j58l77N99q6k45L55J8L7j47J58M2k16k63N08k9l13K22q2L01
2680E16k20j3J39j17k9k19O89k14j97q3K73m04K98r3m1j75J19q3J41P2K45l76
2702B28K06n8k45O2jl6P3k61L01m16L83j71o46M72M82k34k65J73J12m32P5K72
2724G4q2k72K51L4k57OJ45oJ81j68k06K56N9l51l8O6j30j4J46J27m68J88K68j13
$$ plain form
2564 484 365 219 256 569 277 651 411 -2 549 163 -99 352 376 -202 236 366 -42 -142 -119 193 159
2585 159 32 64 54 101 80 -66 134 -210 -214 171 171 -225 -67 150 188 -336 -380 -254 -178 -184 -166 -183 -373 -365 -462 -162
2611 -162 -302 -459 -83 -195 -279 -279 -288 -546 -307 -401 -237 -335 -360 -471 -230 -230 -268 -132 -479 -275 -577 2 -502 -432
2635 -432 -649 -210 -230 -237 -271 -272 -236 -93 209 15 -277 -68 31 -300 -201 169 -135 24 106 -24 -321 65 -37
2658 -37 -251 -56 192 34 -343 256 170 -75 280 298 335 188 346 388 172 -91 417 388 75 297 215 516
2680 516 296 283 422 305 276 57 746 532 335 252 525 121 419 326 285 110 229 146 287 359 604 228
2702 228 434 376 131 193 192 156 229 -32 269 -147 236 65 -581 -109 373 139 -126 47 159 -273 -198 74
2724 74 -8 -280 -29 5 -252 -246 -101 -107 74 -94 -300 -44 15 -336 -374 -308 -438 -452 -306 -179 -647 -459 -191 -304
2748c04l49N42k62R0l79K58q1J15m6J84k14L11j21k48M06j87M2J18LN2m2k20J25
2771b07k06K56K93k37k50L61j04o0K8L66l09j82K97O9k37J19J77k36l5P3j81N94
2793C89j15J8k25K96l48L5K37q7j21J35J80ll13J52R1k96J26K42r1j70O9O2j07
2816A56K29l18M81j5o0j25o4J67k57j95J80J95l57J86J62k13k39K08p6m3M56n66
2838a08J73J49j72j76R7P6o9j5L04k08K35m67Q8j99K51l4K76n17M25m64j47N52
2860E0j4k26p6k32L68j3j87k4J18M9m6J48Jm3l01J00r9J72K19k85K6Q8p3P4J18
2885h8j23p9J64l97M55k5j46j24J99k31L19k94o2L76j97j58J65J91P1l0j10r2
2907b16J70j29L63k3k65K1M94k79J17j82J6j47K10J21q8j49J94j27K35q9j37J58
$$ plain form
2748 -304 -653 -111 -373 -283 -662 -404 -485 -370 -416 -232 -446 -135 -256 -504 -98 -285 -243 -125 -122 -70 -112 -332 -207
2771 -207 -413 -157 136 -101 -351 10 -94 -154 -126 240 -69 -251 46 115 -122 -3 174 -62 -97 -24 -205 389
2793 389 274 292 67 363 15 50 287 200 79 214 394 391 78 230 321 25 151 393 302 132 201 263 156
2816 156 385 67 548 533 473 348 284 451 194 -1 179 374 17 203 365 152 -87 121 45 2 458 -108
2838 -108 65 214 42 -134 -37 39 -30 -45 259 51 286 -181 -93 -292 -41 -75 201 -316 109 -355 -502 50
2860 50 36 -190 -266 -498 -130 -143 -330 -354 -236 -187 -233 -85 -84 -127 -428 -328 -427 -255 -36 -321 -295 -207 -280 -206 -88
2885 -88 -211 -290 -126 -523 -68 -93 -239 -363 -164 -395 -76 -370 -432 -56 -253 -411 -246 -55 16 -14 -124 -216
2907 -216 -46 -175 188 165 -100 -79 415 136 253 71 87 -60 150 271 183 34 228 101 336 247 110 268
2929B68q7J28l67M97r7l33K23O9l40J3L83J2oj55R7J4l96L65Q5L50p79K03o9J32
2953B10On3L45k19p4q3k2j10N32l89k4k66M65k44J35k84%J16k23Q2L26l21J74
2976G9J37o7l24k00M87l69K01r6K32J07m33Kl8K85n7k76K30p9j01q5O8O7l72L74
3000b28p8J12k35K18P6j2k06j25L99l6k06K08j99J6K4J86j40p8J23K1l7j40N3
3023b84k07N78m78Q7L26o0j60J78j75J60qJ45k94j57L60JK67J3o8k90l44M82j3
3046E9K97n47J22o9L53j97J44O9k78J23K53J63k48k79L99N6N1k39J56l05K11J43
3068D37Mk79j7j12K11jj3J85j82M1r7K96j78J57n61M90J7k20r2L16k59J05Qj28
3092A28n2j09K03qr6p2M1j17o4Q2J06Jj20k79O9L41q1m6P2o7j33L33j10k63p5
$$ plain form
2929 268 181 309 -58 439 342 9 232 301 -39 -26 357 369 363 208 305 319 -77 288 373 723 -56 147 78 210
2953 210 216 163 508 289 215 132 110 0 532 143 119 -147 318 74 209 -75 -75 41 -182 -100 226 -95 79
2976 79 216 149 -175 -375 112 -257 -56 -152 80 187 -246 -244 -282 3 -54 -330 -100 -179 -280 -365 -297 -230 -602 -228
3000 -228 -306 -194 -429 -211 -135 -147 -353 -478 -79 -115 -321 -113 -312 -296 -272 -86 -226 -304 -181 -160 -197 -337 -284
3023 -284 -491 87 -391 -304 22 -38 -198 -20 -195 -35 -43 102 -192 -349 11 12 279 292 224 -66 -410 72 59
3046 59 356 -191 -69 -138 215 18 162 231 -47 76 329 492 244 -35 364 420 471 232 388 83 294 437
3068 437 441 162 145 33 244 243 230 415 233 274 177 473 295 452 -109 381 398 178 86 402 143 248 256 128
3092 128 76 -33 170 162 66 -6 35 -82 -146 -64 42 43 -77 -356 -287 54 -27 -73 -1 -68 -201 132 22 -241 -316
3117c16K17K96n81J99J76n12M89o2j07K35n9n8n2m4o7l23L87j25K85j52m6l08
3139e28J64J64k10J02P5J4L78m89K63k61L3M4J95k25K25p2J40J1j9p2l8J31j63
3162a38m1L12K65l33k59K84qk56K82J15k14k48J74j94L21J66K01j52j31j42M41
3183D45k68q3O3J23n2j77J94J72k09n4N1K41k95J58k8k68j3r7R2q3L23n8J85l34
3207B8K5J44N3p8l04K75L30m04K55o4k12m5J39J42k8l37N4P9J78l04mN91m36l8
3231C9j11L3P6k30K01j10j18L76j23q8l46L47j1J94j50k20M3L91n19R5K17J07
3253I3k30j15o2J64J03Q2o4k33K21R4k19j50r0K41k93kJ60ML79m29J85M0K1N4
3277d6J57l47j13L48l26L72l76M37L6k88J26K28k65Nj2L1O5j78K1J45J88P7k04
$$ plain form
3117 -316 -99 197 -384 -185 -9 -521 -32 -94 -201 34 -25 -83 -135 -179 -246 -569 -182 -307 -22 -174 -220 -528
3139 -528 -364 -200 -410 -308 -233 -219 159 -330 -67 -328 -295 -251 -56 -281 -56 -128 12 23 4 -68 -106 25 -138
3162 -138 -179 133 398 65 -194 90 82 -174 108 223 9 -239 -65 -259 62 228 429 277 146 4 445
3183 445 177 94 157 280 228 51 245 417 208 154 205 446 151 309 281 13 0 -97 -5 -88 235 177 362 28
3207 28 53 197 250 172 -132 143 473 69 324 260 48 3 142 284 256 -81 -27 52 230 -74 -78 513 77 39
3231 39 -72 -39 37 -193 8 -102 -220 156 33 -55 -401 -54 -65 129 -21 -241 -198 193 -326 -231 -14 93
3253 93 -137 -252 -314 -150 -47 35 -29 -262 -41 53 -166 -316 -406 -165 -458 -460 -300 -296 83 -346 -161 -121 -100 -46
3277 -46 111 -236 -349 -1 -327 45 -331 106 142 -146 -20 208 -57 -52 -64 -33 32 -146 -125 20 208 285 81
3300H1L6o4m7J29r5J6q6J06q1K71k15L21l41k8Q5J63p7k86O08Kl67R2m1MM78n35
3326A29J2k7R4J52l00J17N8m00L04J26J0o9k63L20l69M29j73J10l42L90j88j65
3348d5K76p2j95J53J93k55J61l75L10j51j5M9k80K57j33J49j82K74m33L29Pq9
3370f7j91K3J98n01L32j7J79k89Q7j42M47l07J86N2M1J92o76L95k69J84N8P6j5
3393b4l78P0lN6R1n93O62j52n1J71r0L18j98L4k32R9r4K7R2k76M88j32j34J04
3417a45M08k46l42N27Ol14r3L27q7Qj04K09J63m3o59M17K87p9l01J8K27lj35K19
3441B65k14J13p5j29L84k69L22l0o3r8M6j06r6L18j89p9lK07L6p2j76M18n54K27
3465A83o8r7K81J9m01J55L68m86m7j30N78k34k94N52m1l21o1M2k0L5K90m79R6
$$ plain form
3300 81 117 53 6 135 40 56 -30 76 -5 266 51 372 31 3 88 251 174 -112 496 498 131 223 182 186 664 129
3326 129 141 114 208 360 60 177 235 -165 139 265 275 206 -57 263 -106 323 150 260 -82 308 120 -45
3348 -45 231 159 -36 117 310 55 216 -159 151 0 -15 34 -246 11 -122 27 -155 119 -314 15 22 -67
3370 -67 -258 -235 -37 -538 -206 -223 -44 -333 -246 -388 59 -248 -62 -10 31 223 -453 -58 -327 -143 -85 -9 -24
3393 -24 -402 -332 -335 -279 -188 -781 -119 -271 -322 -151 -241 77 -121 -87 -319 -220 -314 -287 -195 -471 17 -115 -249 -145
3417 -145 263 17 -325 202 208 -106 -199 128 41 49 -55 154 317 274 -385 32 319 240 -61 -43 184 181 46 265
3441 265 51 164 89 -40 344 75 397 367 304 206 252 146 50 368 179 100 97 304 340 268 92 510 -44 183
3465 183 115 18 299 318 -83 72 440 -46 -93 -223 355 121 -173 379 338 17 -44 -2 -22 13 303 -176 -80
3488h0j69L42j24L21l33J35j81J22R6l78J37j13K1K05k73j97L55j42L1K2J38Q6
3510B1P9k14k03J72l1L23j82o12M84k3L74j59j23J51k19j02K81j3J41l23Q1p1
3532a68J38l9K7Q7m39M09Q4k97K5K42J0K75m33p5K65N8M0j8k69Ql2n0K64o6n4
3557hK03k2M1l26L69r4l73O23j33j2M9l23M26k06j64J7K5N0J41r5k24L22p0M2
3581B58k05J45J27j51K25m05L4J01K0o3J05P0j3j39j7mo4K14k89M40n70J02P5
3604dQ2j26L46l30j13J49K68P9m67J03O3O6r0R6l46L60j68J12J31l81J21L7P3
3627F1n0j99K71l84n2K3J0J20J59j82O3j43K7J30mJ31p8K5r4J50k60L39K5n36
3651d48L87o6o7N1pP0j7j49J73k9o4J29q3R6r3J45j76Q4j20j21r2L11K48k70N16
$$ plain form
3488 -80 -249 93 -31 290 -43 92 -89 33 129 -249 -112 -225 -204 1 -272 -469 -114 -256 -225 -203 -65 21
3510 21 100 -114 -317 -145 -176 147 -35 -647 -163 -186 188 29 -94 57 -162 -264 17 4 145 -178 -97 -168
3532 -168 -30 -69 -42 45 -394 15 99 -198 -173 69 79 354 -79 -154 111 169 209 191 -78 -70 -102 -152 112 46 -8
3557 -8 195 173 214 -112 257 163 -210 413 280 268 317 -6 420 214 50 67 92 142 283 188 -36 286 216 258
3581 258 53 198 325 174 399 -6 28 129 149 86 191 261 248 109 92 88 24 238 -51 389 -181 -79 -4
3604 -4 78 -48 298 -32 -145 4 272 351 -116 -13 50 116 26 122 -224 136 -32 80 211 -170 -49 -12 61
3627 61 11 -188 83 -301 -353 -330 -320 -200 -41 -223 -160 -303 -276 -146 -150 -19 -97 -72 -166 -16 -276 63 88 -448
3651 -448 -61 -127 -194 -143 -150 -80 -97 -246 -73 -102 -166 -37 -120 -24 -117 28 -148 -64 -184 -305 -397 -86 162 -108 408
3676D08k19o4k75J14k62K18K53j48m8L4J87k38jn4Q5L40k05n2K28k74k18j1O57
3699D55k13l07J14K35j10N2o08P03m16J36N7q5J20n8K3J79L7n4j05J20k80K77
3721B72j7j36M3O8J18n89K63K99j64k14J33nM2k78J80L67l78KO8K09k49K71k84
3744B1J46k85L79j26m0m57N43l46J01l04K53L0k41M75m60K81k18N9K74m26J74
3765a67j37J11L81l87p5K03K3R7J1l59J55k28J92l8o2Q7j76L00n1r1J75N9j57
3788a34q8L82l18K14p1L7O2J6N8l76p2K38j59K30k12M8Nk2n2pJ11J68p6N9P2J15
3814B28k20J52j82j66P8K27P2j6k85N82m25j60K28J64j01N0j32j02R2KO0MM6P8
3838B74Q9l89J71N0o1P3j31M06j49l65J90%j17J60p3k08Ol5L66l71M7k20K39K37
$$ plain form
3676 408 189 125 -150 -36 -298 -80 173 25 -23 11 198 -40 -41 -95 -10 330 125 73 301 27 -191 -202 455
3699 455 242 -65 49 284 174 226 -382 321 -95 41 98 13 133 75 98 277 314 260 155 275 -5 272
3721 272 255 119 162 230 348 -241 22 321 157 -57 76 71 113 -165 15 382 4 6 74 283 34 305 21
3744 21 167 -118 261 135 95 -362 181 -165 -64 -368 -115 -85 -326 149 -311 -30 -248 -189 85 -341 -167
3765 -167 -304 -193 188 -199 -274 -71 -48 49 60 -299 -144 -372 -180 -218 -280 -193 -369 -69 -120 -211 -36 23 -134
3788 -134 -222 160 -158 56 -15 22 84 100 158 -218 -290 -52 -211 19 -193 -145 -140 -162 -214 -221 -110 58 -18 41 113 228
3814 228 8 160 -22 -188 -110 117 189 173 -112 470 45 -115 113 277 176 226 94 -8 84 86 146 150 196 274
3838 274 363 -26 145 195 134 207 76 482 333 -32 158 158 41 201 128 -80 -74 -109 257 -114 -67 -287 -48 189
3862A89l0J7k13J81r2j57pL09k91K11j9j52k5N5L43j69m57M65k76n7J70j82L4
3885a53q6J10J68j48j26J02K3m8J38l11K94Op3J33j11O5k93N3L04j13k08J51p2
3908a95n1J74j06L48l71k06J43K0J14O4k53K25J2j54m6L63j76o0k56L06j09O3
3930a51L33l05J28j25J51L6Kr4O6j33J0l5J99q4P3R6l77M59k45P6N9mp4j8J91
3955B34J4M7k51l6K47m7N1l81J86Kj40J50O3J15o4M9o7k42J41J35K5r2K94m49
3979a6J36l21J38R2O9J03l32J50J32j68J05Nj88J23K56j87K0j61p2J41lj19L6
4002f1m9j2K10k12m4O2M9k03L90m95K39M4j09J44j16oJ19N4q5j69J61M9k22J56
4026a06K9j87K2j7K7q6L31j42J4j69O4K87k52J26J9P6p1J33k97N6k2K6K60k53
$$ plain form
3862 189 159 176 -37 144 52 -105 -112 197 -94 117 98 -54 -79 -24 319 150 -307 158 -118 -175 -5 -187 -153
3885 -153 -239 -129 39 -109 -235 -133 -110 -158 -20 -331 -37 -31 -104 29 -82 -17 -310 -257 47 -66 -274 -123 -195
3908 -195 -246 -72 -178 170 -201 -407 -264 -244 -130 -66 -319 -94 -82 -236 -282 81 -95 -155 -411 -105 -214 -151
3930 -151 182 -123 5 -120 31 67 69 -25 41 -92 -82 -117 82 -2 71 167 -210 249 4 80 139 135 61 43 234
3955 234 248 295 44 8 255 208 259 -122 64 66 -74 76 139 254 190 239 172 -70 71 206 231 139 433 -16
3979 -16 120 -201 -63 29 98 201 -131 19 151 -17 88 93 -95 28 284 97 117 -44 -116 25 22 -97 -61
4002 -61 -110 -122 88 -124 -168 -106 -57 -260 130 -365 -126 -82 -191 -47 -163 -169 -50 4 -81 -250 -89 -40 -262 -106
4026 -106 -77 -264 -242 -259 -232 -318 13 -129 -115 -284 -220 67 -185 -59 -40 36 -35 98 -199 -143 -165 -139 121 -132
4050a32R2J52j59R6ql43K53j5J89j4nMl01M21j62m12K47K2J3J72k60J11j62J79
4074b2K12m03L18o0q3J74l22K03K96j79j02R6j13o0J37K07j87p1M23k26k18Q3
4096A03k35K66r2o7L08r3j44Q9k43L53j83J8R1l79L36J29l15M38j59k19J7k44
4118b25K07o8M33J32m18O8j61o7J4L60j92k48M08m18L39N8m4j45k81K17k3l09
4140c63K98j01J52p7M0J54j33R1l12K34j68O9j97K48k18L83n4L3j02m7L84l57
4162d3M1j09j13L23l30Q7K4KK51k88J16k09L13R6J28k51l36J29L51m28K3J61J20
4185E8k59nK78j95j6K85l83K73k70K50J80j48j98K49K9j84Q5o6J08k2j46K11M5
4208A59k83L34k05j5J09J14JJ4j01R2J36k23J44O7l25K34o2Pj73J64j63M08k3
$$ plain form
4050 -132 -40 112 -47 49 41 -302 -49 -64 125 111 106 110 -191 230 68 -344 -97 -75 -62 110 -150 -39 -201 -22
4074 -22 190 -213 105 45 -38 136 -186 17 313 134 32 128 15 -45 92 299 112 41 464 238 20 103
4096 103 -132 134 42 -25 283 190 46 135 -108 245 62 80 171 -208 128 257 -58 380 221 2 19 -225
4118 -225 -18 -86 347 479 61 129 -32 -99 -85 275 83 -165 243 -175 164 222 178 33 -248 -31 -54 -363
4140 -363 -65 -166 -14 -91 -51 103 -30 61 -251 -17 -185 -116 -313 -65 -283 100 46 79 -23 -70 314 -43
4162 -43 -2 -111 -224 99 -231 -144 -120 -118 133 -155 -39 -248 65 161 289 38 -298 -169 182 -246 -223 -62 58
4185 58 -201 -206 72 -123 -139 146 -237 36 -234 16 196 48 -150 99 128 -56 29 -37 71 49 -97 114 159
4208 159 -124 210 5 -10 99 213 214 228 127 219 355 132 276 343 18 252 190 197 24 188 25 433 410
4231D10n1Q3j32j69j79Q2j62J70K13k86K16j9j4J11m31k61M93N1j36L7J60l30
4253a44J42po8p7J07J16J02k52K86k75Q1o3P0n0KJ72l15MQ2K19n03K82J37r3r3
4278a38J19j32J59o3k2J41m2k09J39r7n7R8r5K25l9k20M3P2l6k7K54m17K13L75
4302B44m83k7J02m5J19L20K6k56j24j5J69j72K75p0j67J82J10k87m5L7n6J07N7
4325Aj96N90l23J01j67l5m1n9k31M60j9o5M4J21j5r9pOM05j98k74m6J96j65k5
4350d1L64L5m10j79M16J60k37J9k03L79j99k07J61l5J18M25o17k41NO90l59J44
4372A88j27m6L54k59k45p0K00PR2j04J50k6j7J63N5l43J16K12l66J92j99r0K02
4395C9M0k56J12j13J74j31mL47m59M05k62m8J91j32q0J23l64J56J8K36l22J83
$$ plain form
4231 410 359 442 310 141 -38 44 -118 52 265 -21 195 176 162 273 -158 -419 74 125 -11 26 186 -144
4253 -144 -2 -9 -77 -154 -47 69 171 -81 205 -70 11 -52 18 -32 -30 142 -173 -169 -87 132 -371 -89 48 -45 -138
4278 -138 -19 -151 8 -55 -77 64 22 -187 -48 -145 -202 -104 -199 26 -13 -233 -190 -118 -154 -181 73 -344 -131 244
4302 244 -239 -266 -164 -209 -90 230 256 0 -124 -139 30 -142 133 63 -104 78 188 -99 -144 -107 -163 -56 1
4325 1 -195 395 72 173 6 -29 -70 -129 -360 100 81 16 60 181 166 67 60 66 471 273 -1 -47 149 -16 -41
4350 -41 323 358 -52 -231 185 345 108 127 -76 303 104 -103 58 23 141 566 -51 -292 -287 403 44 188
4372 188 61 15 369 110 -135 -205 -5 2 94 -10 140 114 97 260 315 -28 88 300 -66 126 -73 -163 39
4395 39 79 -177 -65 -178 -4 -135 -139 208 -251 154 -108 -156 35 -97 -177 -54 -418 -262 -244 -8 -330 -147
4417a47M5J53l46J68Lj25oJ03lj07J0J42M27m42K7N7j08j23J29M3K4J09r2J21
4441F2j31K03k38J54K5lk96L07J28j44k69J18J81q7j25L7J80j65k11Q3K02K01
4463B12p6K1QLOQ5K2k69L05l92L72k26J12J4M4j26j56K91k66K51k68p9K70k35
4487g7K43J12j39o0n6O2j54j00M23m22N53m32O3L24l58L92k66k50M78k85l2k3
4509dK3k00J97l70L51M6j43j23M63j90l49M15M1m6l66K40J54k43J5K15k14j75
4531b63M98l06mj28p3nJ06J89l6J19j31O5k29R7Q9k21j97K03J14L4N9l11K78k3
4555g6J23R0l01p5J98k40J74K20k29J62k84K33j18L61k76K8q1N6O8L0k45N00l62
4578d4j4J72K7K7p6k79K09j77L98m56J13J41k48J00J68j35J16q5J17R6j10j12
$$ plain form
4417 -147 -102 51 -295 -127 -124 -249 -255 -152 -155 -262 -252 -110 317 -125 -98 -41 -149 -272 -143 -100 -76 33 -59 62
4441 62 -69 134 -104 50 75 72 -224 83 211 67 -202 -84 97 10 -115 -78 102 -63 -274 -191 11 212
4463 212 136 157 165 168 174 259 281 12 317 -75 297 71 183 197 241 115 -41 250 -16 235 -33 -112 158 -77
4487 -77 166 278 139 79 23 85 -69 -169 254 -168 385 -47 16 340 -18 374 108 -142 336 51 19 -4
4509 -4 19 -181 16 -354 -3 43 -100 -223 240 50 -299 116 157 111 -255 -15 139 -104 -89 126 -88 -263
4531 -263 235 -71 -75 -203 -276 -281 -175 14 -22 97 -34 31 -198 -101 -12 -233 -430 -227 -113 -79 -20 -331 -53 -76
4555 -76 47 137 -164 -239 -41 -281 -107 113 -116 46 -238 -5 -123 238 -38 -10 -91 -35 33 63 -182 318 -44
4578 -44 -58 114 141 168 92 -187 22 -155 243 -213 -100 41 -207 -107 61 -74 42 -43 74 170 60 -52
4600e2j8J51K83k80m8J25k96J73K31l33L25R1j49j29p2P3J79k00k79K34Q3R5j1
4623A76M3l90K21P8j05J4O2J54J04l29J06M8j21j89J0M25rl89q2J84N7l6p4P7
4647C5Kk04K10q4j96J53j44L09j72l6j58J06K30k32K7j19K53r6J07l7K12l59M02
4670B09k59j70K30K9R5j42Q5M9k81p4M86m53K55q4l8K51l78R8q7k90K60J92J49
4693A32k48p9q0L15N4n7j06k52K05K99j97p2J2L08l19O2j88K96NJ98l48J73m1
4716G2o3j78K52k25K27J67k46J95k58J80r0j63M2K93l36L0L22k70M53k10m7k56
4738a09K39J39l47K95J5n7q7j28j34J89j29J90K1j35q6K18j46n5K76k4p9j22L0
4761b6k43J95J14J92M4k62o3J57k46L38n68K04K77n4r0k41K09k06L34k57L95k01
$$ plain form
4600 -52 -70 81 364 84 36 161 -135 38 269 -64 261 352 203 74 2 75 254 54 -225 9 92 187 176
4623 176 219 -171 50 128 23 37 99 253 357 28 134 182 61 -128 -118 307 298 -91 -173 11 68 32 -42 35
4647 35 37 -167 43 -41 -237 -84 -228 81 -91 -127 -285 -179 51 -181 -154 -273 -20 -116 -9 -46 166 -193 209
4670 209 -50 -220 10 39 134 -8 77 126 -155 -229 257 -196 59 -25 -63 188 -190 -92 -179 -469 -209 -17 132
4693 132 -116 -195 -275 40 94 37 -69 -321 -116 183 -14 -86 -74 234 -85 -23 -211 85 90 288 -60 113 72
4716 72 9 -169 83 -142 85 252 6 201 -57 123 33 -130 -88 205 -131 -101 221 -49 404 194 147 -109
4738 -109 130 269 -78 217 232 175 88 -40 -174 15 -114 76 97 -38 -124 94 -52 -107 169 145 66 -56 -26
4761 -26 -269 -74 40 232 276 14 -49 108 -138 200 -368 -164 113 59 -31 -272 -63 -269 65 -192 203 2
4783BN7l13J72k25J1O7J07j5K5J2K13l87K69J47l55%L86k74J83m13J88K47n01
4806c97m9J72K42M7j64QN7r0L80j06k65Q7o2lJ25k59J27k9k4R7pJ59j94P9N1k28
4832b46K26p7L05l18K43k29P2K57l86%J90J65L5k44j59L98l38P7j42N02j85j49
4854cQ4Q0J47l43K01%L05p57J78K62j91M01k76L3q5J80j92j79l3J09L06l81L14
4877A60k33K99k09L7J5Lq2O0N4L4j73j89J73M2Q1l2k50K23n0K24j63M02p24K73
4901b5r1j00O1J96J84n9j37l71L99l89K39qK79k58p3J01j96J68Q7l26J43K58j70
4924h8Q2l04L87K5j1j33p5Nm6q2K10K08K5p22M09o7l7O2pK48l23K41J6n1j89K40
4950B3J26j75k01J69k39K57r4J16oP5m8n21L42K58k74M21n2j31K44l03K09j55
$$ plain form
4783 2 59 -254 -82 -307 -296 -229 -122 -137 -112 -100 113 -274 -5 142 -213 -213 173 -101 82 -331 -143 104 -397
4806 -397 -446 -274 -32 15 -149 -141 -84 -174 206 100 -165 -78 -140 -143 -18 -277 -150 -179 -203 -106 -113 46 -148 -69 -18 -246
4832 -246 -20 -97 208 -110 133 -96 -24 233 -153 -153 37 202 237 -7 -166 232 -106 -29 -171 331 146 -3
4854 -3 81 161 308 -35 166 166 471 -286 -108 154 -37 364 88 121 36 216 24 -155 -188 -79 227 -154 160
4877 160 -73 226 17 54 69 72 -10 50 104 138 -35 -224 -51 -9 72 40 -210 13 -37 187 24 426 -298 -25
4901 -25 -116 -216 -155 41 225 166 29 -342 57 -332 -93 -101 178 -80 -153 -52 -248 -80 7 -319 -176 82 -88
4924 -88 -6 -310 77 102 91 -42 -117 -112 -158 -240 -30 178 203 -519 -110 -177 -214 -152 -159 89 -234 7 23 -28 -217 23
4950 23 149 -26 -227 -58 -297 -40 -134 -18 -24 51 3 -518 -176 82 -192 229 177 46 290 -13 196 41
4972D1Kk4l8J12j18n1J71l02K85k37J43m0L46j63r4J42k3J0k27j2j15j84O28J9
4996B71N9j44m48O44k86L6j07n6j3N80l56j45o9J96K78m16L14j93Oj94K95k27
5018B5p9K72j01p7l9R3j28K46j2m00k3K87Q2l18N07l05j04k12K99k11K04n1o0
5041a05l4K42l15K28j49J56O0k56R4R9m06M30l50J08M4K63n5j46K95k23K38l12
5063i4P9j61P4O8J83J29n87K53NK3j6j07p8M20j95l15K48J61j13k07q0K04N26
5086D20m91j32L70n5j90J14k10K75L9p2n7r6j3L86k25k54N24l61J57j29J5J1J3
5109C9jj5L1Q8j20L6k19J19L15m5j76q7j03J97K30k04n6O3j0RK2j96N5J19K08
5134B99k37r8k4Q7J44mj02k94r9L55p0j22J50J84r2k9j04j47J45R8j26K05k01
$$ plain form
4972 41 43 19 -19 93 -25 -76 95 -207 78 -159 -16 -56 290 127 33 175 152 162 -65 -77 -192 -376 252 271
4996 271 330 186 -262 382 96 132 25 -31 -44 536 180 35 -34 162 440 24 338 145 151 -43 252 25
5018 25 -54 218 117 40 1 94 -34 212 200 -200 -223 64 146 -172 335 30 -74 -286 13 -198 6 -45 -105
5041 -105 -139 103 -212 16 -133 23 83 -173 -79 20 -386 44 -306 -198 -154 109 54 -92 203 -20 218 -94
5063 -94 -15 -176 -102 -34 149 278 -309 -56 -51 -28 -44 -151 -229 191 -4 -319 -71 90 -23 -230 -310 -106 420
5086 420 -71 -203 167 112 -78 36 -174 101 140 68 11 -85 -98 288 63 -191 333 -28 129 0 15 26 39
5109 39 38 23 54 142 22 58 -161 -42 273 228 52 -35 -138 59 289 85 29 92 82 91 113 -83 -28 91 299
5134 299 62 -36 -60 27 171 167 65 -229 -328 27 -43 -165 -15 169 77 48 -56 -203 -58 40 -86 119 -82
5157h2m8K4RJ82m23J67R5J7k27L03j25K82n18L27J53j1j90m2L25l67L6K43L0L1
5181A91j84k1L6J70l83O3K67j99L1q4l14K40J0L83p6l40J91j43J04Q0k59R5P9
5204f3J25j30J98p4k08j9K22r6n2j79L78r9M2k9J4p4L9k27K72P8Q3N1l65K16r7
5229FK1J66j55n0J04j01pj1L00k00rN0p1j30L42j53m3kO7J5J6k50O2J24j62J81
5255A10kJ89o7q6j06R3k54J22J12p3J68K0j51p4P8K45l18J93k99rl7J08J12k92
5279b18J31J03j44L71l30M1K83k51R5k95J26n2M03k73O4m2M8p3J20j69P4l05O61
5302C68m24r6N6k11j1K92k72j02K02j50K57o8lk03L13J75j92K25p8J02j74j04
5324i8N6k20J82J7q9q4J90J85k83J91P5k35J18P3k97K41K8k37J65j38J08J28K09
$$ plain form
5157 -82 -130 -106 -97 85 -338 -171 -76 -59 -286 17 -108 174 -344 -17 136 125 -65 -107 218 -149 -113 130 160 191
5181 191 7 -14 22 192 -191 -128 139 -60 -29 -113 -427 -187 -177 206 130 -210 -19 -162 -58 22 -237 -142 -63
5204 -63 62 -68 130 56 -152 -171 51 -45 -97 -276 102 3 45 16 30 -44 -5 -232 40 118 201 252 -113 103 6
5229 6 27 193 38 -12 92 -9 -16 -27 273 73 64 114 43 -87 255 102 59 57 124 139 155 -95 -33 91 -71 110
5255 110 108 297 230 144 38 131 -123 -1 111 38 206 226 75 1 79 324 6 199 -100 -109 -146 -38 74 -218
5279 -218 -87 16 -128 243 -87 -46 237 -14 81 -214 -88 -140 263 -10 54 12 60 -13 107 -62 12 -293 368
5302 368 -56 -152 -96 -307 -318 -26 -298 -400 -198 -348 -91 -159 -162 -365 -52 123 -69 156 78 180 6 -98
5324 -98 -42 -262 -80 -63 -152 -236 -46 139 -144 47 122 -113 5 78 -219 22 50 -187 -22 -160 -52 76 285
5347B85m96J77o0Q5K32k68J34J27j11n2J13j28J61j99k90J60K15j9j53L93l68
5368f2K53p9j34K47R5l30J86j20K37l06n8N8p4K91n5Q7k40L17m58O8rn2L06j62
5392FK22k35j39L15m09J88J09k3n9M03k23j32O0J52o7P3l02Q6k2J75p4K23j98
5415A29k25O5Q6Ok42k10M84n3j52R8J14J04p9k06K31l9Ro1k24Q9K48j44k57L8
5439a91L55j76j52O1Q2O0m1Mm4j09J40j76J96n18N16J4j75K19j37K82j77j3k02
5462a82J87n2o7M1K0j18O8J00K9j28R1q7o3k0J60K38n24K16R7K74l39J39r9K67
5486B48k41Q5L7j75Q3n0Q0k6K81l17J8P5k26K91J03l62P6K61n39K87K58m0m4n5
5510A08k13R4o1oL53O8j91P5j01k09O3k37L97k75J89J18j50q1J30o1J30j82Q6
$$ plain form
5347 285 -211 -34 -94 -9 223 -45 89 216 105 53 166 38 199 0 -290 -130 85 66 -87 306 -62
5368 -62 191 112 -22 225 320 -10 176 56 293 -13 -71 -13 -87 204 149 236 -4 313 -145 -77 -86 -138 168 6
5392 6 228 -7 -146 169 -240 -52 57 34 -25 378 155 23 83 235 168 241 -61 25 3 178 104 327 129
5415 129 -96 -31 55 61 -181 -391 93 40 -112 -14 100 204 125 -81 150 111 120 59 -165 -76 172 28 -229 -191
5439 -191 164 -12 -164 -103 -21 39 -2 2 -42 -151 -11 -187 9 -509 7 21 -154 65 -72 210 33 20 -182
5462 -182 5 -47 -114 -73 -53 -171 -103 -3 26 -102 -11 -98 -161 -181 -21 217 -307 -91 6 280 -59 80 -19 248
5486 248 7 92 129 -46 37 -13 67 41 322 5 23 98 -128 163 266 -96 -20 241 -298 -11 247 207 163 108
5510 108 -105 -11 -72 -78 275 343 152 227 126 -83 -20 -257 140 -135 54 172 22 -59 71 10 140 -42 44
5533D4p8L37j90r8o4j20J63o7L1j25L32k80p0K24j48J14K40m96K75n0l6r0j15
5556b67M3J95k94L05m3p8k3L20k79N8K55l19J34j40j47J88l2k11J98J75k32J58
5578c6R5pl44J22J42k34J25J74j01k35J9K16O9K25k91j18K55m0k38J35J34r8J66
5601A35j22j34K0P2Q0L45m63K16J8n0O3k44J34j29j61N12j90j25M1j90k75N19
5623G2j20L93m90J19K22n1O1j34K4k60K13J50k47L62o4k1r1l2j19%K07j73M8k
5647F7j29K32l37L48J03k71J34q6k00n8J34L59l40J00j49K61m79O16l01k3K3K0
5669B4k47K72l6o4lJ82k70K54j00K25j96j26K5N4o6J09k26K63m22L31J21n0j08
5692e4J31k83L26l20p5J57J63M7K0j23j72K40k47K69q7j2Q3j57K09l88M63k77
$$ plain form
5533 44 -34 303 113 15 -49 -169 -6 -73 -42 -167 165 -115 -185 39 -109 5 245 -251 24 -26 -62 -152 -267
5556 -267 -224 -29 -323 -18 -61 -139 -162 158 -121 -63 192 -127 7 -133 -280 -92 -124 -335 -137 38 -194 -36
5578 -36 59 52 -292 -170 -28 -262 -137 37 -64 -299 -280 -64 5 230 -61 -179 76 36 -202 -67 67 -31 135
5601 135 13 -121 -101 -29 51 396 -67 149 167 117 180 -64 70 -59 -220 292 102 -23 18 -172 -447 72
5623 72 -48 345 -145 -26 196 145 206 72 96 -164 49 199 -48 314 250 229 138 106 -13 -13 194 21 69 67
5647 67 -62 170 -167 181 284 13 147 61 -139 -197 -63 296 -44 56 -93 168 -311 305 4 -19 4 24
5669 24 -223 49 13 -51 -54 128 -142 112 12 237 41 -85 -60 -6 -72 37 -189 74 -348 -17 104 54 -54
5692 -54 77 -206 120 -200 -275 -118 45 92 112 -11 -183 57 -190 79 -8 -20 63 -94 115 -273 190 -87
5714h7n6m7q7L67k77J56K94k07K4j13M4k52J91n1K43mj74m6Q9J28r0r4N3P2Q5
5739A61p6l45J51j7J00j25J40k4k03M2J69Q2J39p2o7p8M15l64n9j46K01j17J98
5762A05j71K09L5K76k28j47o9J38m31L60o9l3K79l84K57j74K26l8L1qL1j65j13
5785h3p7L45m12M43j05l2j94J43k44N6R0n2L70m60L73k26J70j70rL95m19K8J28
5808E8p0K7j75K04r8p8p5J09j52K65N9j21J0J48M3l4r3J24k69J36k16J44O2j35
5832a27M1j25K46O8o1q0q5J43j64n8j26K30M29k65j7j36J36j22j55J99J30O4k38
5855g3L1j2j55J3L56l25N8L63j06l0m21J81R5L92j22l66J03J54l1n1k09J09l09
5878c55L44k1q9K28J2p3R8k00P6o2R9J52l38J89rJ62k66L2m3o7N1K02j90J87N0
$$ plain form
5714 -87 -143 -190 -277 90 -187 -31 263 56 80 -33 11 -241 -50 -101 142 138 -36 -82 7 135 45 -49 4 76 161
5739 161 85 -260 -109 -126 -26 -151 -11 -35 -238 -196 -27 55 194 122 55 -23 392 28 -31 -177 24 -93 105
5762 105 -66 143 178 454 226 79 10 148 -283 77 8 -25 254 -130 127 -47 179 141 172 164 195 30 -83
5785 -83 -160 185 -227 216 111 79 -115 28 -216 -160 -70 -122 248 -212 161 -65 105 -65 -74 321 -98 -70 58
5808 58 -12 15 -160 44 -54 -132 -207 -98 -250 15 74 -47 -37 111 154 120 27 151 -118 18 -198 -54 8 -127
5832 -127 -86 -211 35 103 42 -38 -123 20 -144 -202 -328 -98 331 66 49 -87 49 -73 -228 -29 101 165 -73
5855 -73 -42 -54 -209 -196 160 -165 -107 256 150 120 -301 -120 -25 367 245 -121 -18 136 105 54 -155 -46 -355
5878 -355 -11 -32 -121 107 119 46 144 -56 20 -42 57 209 -129 60 51 213 -53 -21 -64 -131 -80 122 -68 119 169
5903A69n4K78j97k35j25N19l02j19K15k06k17K71K6o6M5L24k49p7K89j10j29K62
5925C12j92j62J19j3J33k58K9j31l3L38k91J31l3O3J80k32j20R2p0M5R9k14K92
5948H4k21J8K09L1m9l64M52k75L89k32Rk85K16k82P9L73l56L14p8j47K59k92J60
5971A2P7J02j28q4j74J16j99P3K03k15K74o0k67J94L32k26PJ86l63R4J50K53l47
5994A0n4l2M1KJ11j38N5pQ7j79J20l42K71K0K7Q6p2l4K01J44m39m0K98j00k01
6019a65Q1J01rJ32j6j20J25O9q6m4Rk44K86j65J4MR0q4j90J71k2J00l12K95Q9
6044A09j25K71l06q9q9K30j07j7L01j92Nk5R8k16K3L68m15K87j72j6J00j45K15
6067I3l68J35L22k86J51j1k34L44o62M73l7n9NO5J07k11K64j63j39L25j47k45
$$ plain form
5903 169 115 393 196 -39 -164 355 53 -66 149 -57 -274 -3 23 -43 2 326 77 0 289 179 50 312
5925 312 120 -42 77 64 197 -61 -32 -163 -196 142 -149 -18 -51 12 192 -40 -160 -68 -138 -93 6 -208 84
5948 84 -137 -119 90 121 72 -292 160 -115 274 42 51 -234 -18 -300 -221 152 -204 110 32 -115 144 -148 12
5971 12 89 191 63 -21 -195 -79 -278 -205 -2 -217 57 -3 -270 -76 256 30 37 223 -140 -46 104 357 10
5994 10 -44 -76 -35 -33 78 -60 -5 -12 75 -104 16 -326 -55 -35 -8 78 6 -28 173 317 -122 -162 136 36 -165
6019 -165 -84 17 8 140 124 4 129 198 112 68 77 -167 119 -46 -32 -28 62 -22 -212 -41 -63 37 -275 20 109
6044 109 -16 255 -51 -140 -229 1 -106 -123 178 -14 -9 -34 64 -152 -129 239 -176 111 -61 -77 23 -122 93
6067 93 -275 -140 182 -104 47 36 -198 146 -516 -43 -80 -139 -134 -69 38 -173 91 -72 -211 114 -33 -278
6089b78K49q9J75R1k52R1j75K34k29p0K43p0J21J65k1j27l81M51n06M65r6L06
6111B97k95J04m3k98J67J90r9j43L31o7R6m05o4k4L90l57M31J4k61P6r8J71Q0
6134A93l6l15K19J68m32M76j89l20K45O5j56J57O2r5r6J68j37R9O3P5k10L5m0
6157ap7o0J88n9O9j04ml02j4N70l07k6L58j10l03M18l69K90k28oL0p3J98j89J20
6182IK4P7j33J16M3j75O6oj0j58J95j83j51K62P4q9J56k22P7p3nk8l6Q4j04J00
6208i0o7K53q5k2j51J28j83K87N3n3o9nl6r0o8K70k64J03K05l0k61J34J94L7k43
6233e3l2J01N2N9k76Q5J05l8j44l3J16l04L31J43p4k45K06lL6Q0o4l29j7R4J49
6258e5nk02K34J87k49K19N8M6j51j99K43p4k8j04j74L19j55j09K64Q9j8k4M2j04
$$ plain form
6089 -278 -29 -118 57 148 -104 -13 -188 46 -183 -253 -10 -80 41 206 185 58 -323 128 -378 87 -9 297
6111 297 2 106 63 -235 -68 122 23 -120 211 144 240 -165 -229 -253 137 -220 211 225 -36 40 -58 113 193
6134 193 157 -158 61 229 -203 273 84 -236 9 74 -82 75 137 42 -54 114 -23 76 139 214 4 39 -1
6157 -1 -78 -138 50 -9 60 -44 -48 -350 -364 206 -101 -127 231 121 -182 236 -133 157 -71 -77 -47 -120 78 -111 9
6182 9 33 110 -23 93 136 -39 27 21 11 -147 48 -135 -286 -24 50 -39 117 -105 -28 -101 -106 -134 -170 -86 -190 -90
6208 -90 -157 96 11 -11 -162 -34 -217 70 123 70 1 -4 -40 -130 -198 72 -192 -89 116 86 -175 -41 153 190 -53
6233 -53 -85 16 68 127 -149 -64 41 3 -141 -174 -58 -362 -31 112 38 -207 -1 -4 32 112 48 -281 -298 -204 -55
6258 -55 -60 -262 -28 159 -90 129 187 233 82 -117 126 52 24 -80 -254 65 -90 -199 65 154 136 112 154 50
6282E0o4O7R8j52jK07k8j25J2k31K50P0j16L6k05J62R8R1l73L00l0j00n4Q9j68
6307a17J25p4N8J98m63K54j50J1Q2J73l41L51l95J64J5O1j99J87N3J7l74M85k48
6330a27n3K38j0J64m28M67k30k27K72l71K36j25L32o1k49NK17J35m26L7n0K60
6352FJ81k57J64l88K14Q7j40J50K38j59j70P1l12L90j33m3K15m4j00J16o2j92
6374a68j04L64j34O0K59j37r7R6j34L03l06R6r2J25j0OJ03j15k3l8k3K36Ok21
6398E2r7P6R6p0L06k19j46j99J43J20L10m18o1K09l5M8rNk20L37k71j31J86J20
6422A32M3k56R0O8Q3n5l4k6K37k39o4j08J7J12k85K34M26n82J46K43P0j62j34
6445d4k7L66j88k00j09J90J64k04o8L00k89J86j3j82r5M26N2m27J39M6j26K23
$$ plain form
6282 50 -14 53 151 -1 -2 205 177 52 64 -167 83 153 37 73 -132 30 128 219 -154 146 116 16 -38 51 -117
6307 -117 8 -66 -8 190 -273 -19 -169 -158 -76 97 -244 107 -288 -124 -109 -48 -247 -60 -7 10 -364 121 -127
6330 -127 -180 58 48 212 -216 251 21 -206 66 -305 -69 -194 138 77 -172 -167 50 185 -241 -204 -254 6
6352 6 187 -70 94 -294 -80 7 -133 17 255 96 -74 -3 -315 75 -58 -101 114 70 -30 86 24 -168
6374 -168 -272 92 -42 18 277 140 43 139 5 308 2 98 6 131 121 127 230 115 92 54 31 267 273 52
6398 52 -45 31 127 57 363 144 -2 -201 -58 62 372 -46 -107 102 67 115 106 111 -109 228 -43 -174 12 132
6422 132 175 -81 9 77 160 105 71 45 282 43 -21 -129 -112 0 -285 -51 375 -207 -61 182 252 90 -44
6445 -44 -71 295 107 -93 -202 -12 152 -52 -120 180 -109 77 64 -118 -213 213 265 -162 -23 23 -103 120
6467A20j58m5Q1q5P3j67J35k85O58j50m7j75K49k39M2q6j50K51j12Oj06M7J61
6490A8M1N3j61j15M6J23j61K96j94J75q9j37R8j6k42L01m4P2J15k78K96m6P1k67
6514d5O8Q8j14J93j33j21N42l05k67j57M54j10l29L23J1j88K07j06j95r6M65P1
6536B56m26J8K09J72j40k50K02J09l45K5K03K46l38J0Q2P5j20K88k56j52J00N3
6558B1J91l10P5l3P5J28n25K56J86j16L5K16l7k08L09k34k83J86l0N5j60K01k66
6581b68K32k12O2J48l69N14k49j10L94k49P0O7k18M00m86J39k38L75O6k32N7J49
6603D2K43l40j61ln0L07N6N2j81o9K84k56k07J89P6Mq5p8J0Q2K42r4J55q8j81
6628e1L48k83L01m30J70N6m2p2RK26j10N5l92L06n5J63k45J25K40m22K33j55j15
$$ plain form
6467 120 -38 -83 -2 -87 -14 -181 -46 -331 327 177 130 -45 204 -35 7 -79 -229 22 -90 -84 -190 -143 18
6490 18 59 112 -49 -164 -118 5 -156 140 -54 121 32 -105 -7 -23 -265 36 -8 64 179 -99 197 151 222 -45
6514 -45 23 111 -3 190 57 -64 478 173 -94 -251 203 93 -236 87 98 -90 117 11 -184 -280 185 256
6536 256 -170 -152 57 229 89 -161 41 150 -195 -170 33 279 -59 -49 33 108 -12 276 20 -132 -32 21
6558 21 212 -98 -23 -56 19 147 -378 -122 64 -52 -17 199 162 -46 263 29 -254 -68 -98 -43 -203 -2 -268
6581 -268 -36 -248 -186 -38 -407 107 -142 -252 142 -107 -37 30 -188 212 -274 -135 -373 2 68 -164 -107 42
6603 42 285 -55 -216 -219 -269 38 94 146 -35 -104 180 -76 -283 -94 -18 -14 -99 -177 -167 -85 157 63 218 130 -51
6628 -51 297 14 315 -115 55 111 69 -3 6 232 122 177 -215 91 36 199 -46 79 319 -103 130 -25 -140
6651a40J93L1K07k14J26k43m8J26k18L57k35K51l30k8J36J05k10Q4J32nK7k08
6673a04J59K3N1k0J69j47j15M0J4j42q8m1N31p8l78n7M8J9r0L29k58j89L41J4
6697C1J57k79j57J44P7j2K66k61K48o3k84J55m4j04j95K75j7K97r1j81J18K35
6719C15o13o2L48k6Pm29K53L3M1j03J34N2k21L62k27K10j83j31o9J42K99r2q3
6742d3j23K85J53j86j14j80L66k74Q6k03Q8K70k06j61L19j5j2r8q4K33L4j54P3
6765E4p7n6n2N9N4m1M75l99j53K30RP3ol6m8Q8j83R8J9p5l4J91q2L7k37m7J43
6792DJ77k20j56Q1n9L87j60r3J12k24L17j87k18L97k30J54J4J64l84L94k77m0
6814d7j08L83L7l67L05k81J27j63K31k89L79k8L3k67M6J24j5J24k76O3m4k3o1
$$ plain form
6651 -140 53 84 291 77 203 -40 -88 38 -180 177 -58 193 -137 -165 -29 76 -134 -50 82 77 104 -104
6673 -104 55 78 129 109 278 131 16 56 70 -72 -160 -201 330 252 -126 -183 -135 -116 -206 123 -135 -324 17 31
6697 31 188 -91 -248 -104 -27 -39 227 -34 214 151 -133 22 -22 -126 -321 -46 -63 234 143 -38 80 315
6719 315 -298 -360 -12 -38 -31 -460 -207 -174 -133 -236 -102 -50 -271 91 -136 74 -109 -240 -309 -167 132 40 -43
6742 -43 -166 119 272 86 -28 -208 158 -116 -30 -233 -145 125 -81 -242 77 62 50 -48 -132 101 135 -19 54
6765 54 -23 -79 -131 -72 -18 -59 416 17 -136 94 103 176 170 134 86 174 -9 89 108 33 -1 190 108 145 -92 -139 4
6792 4 181 -39 -195 -114 -173 214 54 -39 73 -151 166 -21 -239 158 -72 82 96 260 -124 270 -7 -47
6814 -47 -155 228 265 -102 203 -78 49 -114 117 -172 207 179 212 -55 -9 115 100 224 -52 11 -33 -56 -117
6837a17N2L12j79j04K23k45j7kK79l65K59j11O4O8k68R6J92j66j97Q6N3O3J16
6860I2j60O1J56j92l9J57O9k06K3l80M11M2J51k84j79K29M2J13k08K06l44K23
6882a7K03l46J24k1j93K43O2j84K29j47j45J54R7q1j29J29J09j7K22k42j15J46
6904H1l07K69p0R5k71K63k88N58l41K48k47Q0J24l73J35k1R7L93n18j70L86k3
6926A00k11J0K75r3k2j77L14m94M49k60K36r1K22n3k16M2k26M24m46K35l58M16
6948G6K3j62M66j86l24J80P2j92K36j52P8L8l46L2K59k09R6K31l53J0Q3n5k99
6971c98J13K3M91l5k90l2l9K48j13J24j01O9m7N1k52M7l8J30M3k24q2M35j19J46
6995A50k19P2kj4J24Q5j17k33OL8J63k88M9L37o06O95k74k6Q8J3k0r1K30n39P30
$$ plain form
6837 -117 -65 247 68 -36 187 -58 -75 -77 202 -163 96 -15 49 117 -151 -55 137 -29 -226 -140 -87 -24 92
6860 92 -68 -7 149 -43 -82 75 144 -62 -39 -419 -8 34 185 -99 -278 -49 -7 106 -102 104 -240 -17
6882 -17 186 -160 -36 -57 -250 -7 55 -129 100 -47 -192 -38 59 -22 -151 -22 87 70 292 50 -65 81
6904 81 -226 43 -27 68 -203 60 -228 330 -11 237 -10 70 194 -179 -44 -65 32 425 -93 -263 123 100
6926 100 -111 -101 174 81 59 -118 196 -298 151 -109 127 36 258 205 -11 31 -195 229 -217 18 -340 76
6948 76 99 -63 403 217 -107 73 145 -47 189 37 115 153 -193 -161 98 -111 -15 216 -137 -127 -44 -99 -398
6971 -398 -285 -262 229 194 -96 -128 -167 81 -32 92 -9 60 13 64 -188 -141 -179 -49 -6 -230 -312 123 4 150
6995 150 -69 3 1 -13 111 196 79 -154 -148 -110 53 -235 -186 151 -455 240 -34 -60 28 41 21 -70 160 -379 351
7020C51n59K30jj3L47l52J05j17N5K89j37j28k04J25N2J21n0J2k41K33j62N1J51
7043A58K5p6J03k15j7j1R9r6R2n6J9J09m1o4k2J01N7m4k52l7L2L91j23K3j68M4
7069C1P6j7J01j00o1J62j72r3J51l3j11L29l55J40L2k15K58j91p9k01M89j22k03
7092a84J65j01j83L1L01R4j50ro0J40j14K74j50l72J39R7R6l28J58Jk8K16j60
7115a27J19j10K97r7j60L17l31n9J67p8R8k8k43J94l7M0K26k67J37N7l51L36j41
7138d1j19n8J44j93K66J85j39K36l39n6O0j80J59J42K05k39K7k30J5o3L9M74r9
7161A96k64J52n9L06k48P2n7O2k05MK49K2k01n9J49k17q5K55m7j12K55j57L07
7184C18n00J1L53N0l60J4J65nL4j67Q3l44N66l87K2M2K88j74K73k44L2O0P0j60
$$ plain form
7020 351 -208 22 21 8 355 3 108 -9 46 335 198 70 -134 -9 43 164 114 126 -115 118 -44 7 158
7043 158 183 107 210 -5 -22 -33 66 -30 62 6 25 134 93 29 7 108 165 121 -131 -168 -136 255 132 155 -13 31
7069 31 107 90 191 91 30 192 20 -73 78 45 -66 263 -92 48 80 -135 123 -68 -147 -348 141 19 -184
7092 -184 -19 -120 -303 -272 29 123 -27 -36 -96 44 -70 204 54 -318 -179 -82 14 -314 -156 -155 -183 33 -127
7115 -127 -8 -118 179 82 -78 239 -92 -151 16 -62 36 8 -235 -41 -78 -38 188 -79 58 115 -236 100 -41
7138 -41 -160 -218 -74 -267 -1 184 45 281 -58 -114 -54 -234 -75 67 272 33 60 -170 -155 -218 -179 295 196
7161 196 -68 84 25 331 83 155 98 160 -45 -41 208 230 29 -30 119 -98 -183 72 25 -87 168 11 318
7184 318 -182 -171 182 232 -128 -114 51 46 80 -87 -4 -348 218 -169 -147 -105 183 9 282 38 70 130 200 40
7208D0n8j30N1K09K8l52J19J20m6K5K34m66J32J43k96K3J28K88j11j53K29N1k40
7231c2N1q8N2Q3k44L20m11O8N66n53J12j14R7j3L8o9J36k1Q4r6j52n4M64k55j85
7256b16L38j25N7k28J70J53j81J62l28M26j66j71J87P4q2P6ro8K1q6J29K0q2l09
7280b38J25k9M22l57L09n7k00O8J67l96P1L06k11P3J18J0k24j17L73k35p7q2L26
7303A45j79O2L04l38K81l92K46j68K0J21m07M95q2k36l9K07m6J01J46l3k98o7
7325a57J90m9K28J9k72J69k16Q6j39L25k34M7P9l3k3j31J16j39K32J6R0l30j60
7348b86J52M41j82j89r5J82P5j83k4J25o3P3j85ro3O22j21j43j38J28q5j14K03
7371A21k54L60k57m8J46n9k36j7K02n3K1K2j22o9J85K76j25J02j39J03q0j25J50
$$ plain form
7208 40 -18 -148 -97 112 140 -212 -93 27 -19 6 240 -226 -94 49 -247 -224 -96 192 81 -72 157 208 -32
7231 -32 19 -69 -17 66 -178 142 -269 -201 365 -188 -76 -190 -93 -106 -68 -137 -1 -22 62 -34 -186 -240 224 -31 -216
7256 -216 122 -3 54 -174 -4 149 -32 130 -198 228 62 -109 78 152 70 146 137 69 90 4 133 153 71 -238
7280 -238 -113 -142 280 -77 232 175 -25 43 210 -186 -115 191 -20 53 171 181 -43 -160 213 -22 -99 -181 145
7303 145 -34 28 332 -6 275 -117 129 -39 -19 102 -305 190 108 -128 -167 40 -6 95 241 208 -90 -157
7325 -157 33 -16 212 231 -41 128 -88 -2 -141 184 -50 -3 76 43 20 -111 5 -134 98 114 204 -126 -286
7348 -286 -134 307 125 -64 -159 23 98 -85 -109 16 -47 26 -159 -168 -231 391 270 127 -11 117 32 -82 121
7371 121 -133 227 -30 -78 68 9 -227 -244 -42 -95 -74 -52 -174 -243 -58 218 93 195 56 159 79 -46 104
7394A04j87J34O2k98L60l25J57J96k40K16k39J70j69J94p8j13J69j1j91O9K51
7415B31l75O2j97M09J04k30j46J12j9J93l03K17k08O5n2M37k90q4N0N01k03m5
7437B29m1k50L44j78k81K42j56Q1q4Q8O3k8j21J43J33k22LR6J06J7o9j41j71M26
7461B29l31qM0j38L58l33k1K08j20K06P5l62M9L95l87J40k13J83Q8k48M9L50j1
7484A98l71M49m20J53k17J94l6lJ8J96k36j69M8J22L8k7O0j77J08L2Q7K85l88
7507e6Q7J13k37j7J94k11ML19j11j26j86M46m37P2J83o1J53q2j05l7R2J94J61
7530C52l18P7O0j43K90l60K92J77m27K49j86j66N00n93M23j01k31J23J73M1l90
7551a58L72l20K33l31K12q7K76j33m6k32J22K00j22J00J39m13L85k93J60j39R6
$$ plain form
7394 104 -83 51 113 -185 175 -150 7 203 -37 179 -60 110 -59 135 57 -56 113 102 -89 -20 231
7415 231 -144 -82 -279 130 234 4 -142 -30 -49 144 -159 58 -150 -85 -137 300 10 -74 -24 477 274 229
7437 229 188 -62 282 104 -177 65 -91 -10 -94 -6 57 29 -92 51 184 -38 -35 61 167 184 115 -26 -197 229
7461 229 -102 -110 -70 -208 150 -183 -204 4 -116 90 165 -197 -148 247 -140 0 -213 -30 58 -190 -141 209 198
7484 198 -173 276 -144 9 -208 -14 -50 -53 -35 161 -75 -244 -196 -74 -36 -63 -3 -180 -72 -40 47 332 -56
7507 -56 31 144 -93 -110 84 -127 -123 196 85 -41 -227 219 -218 -146 37 -24 129 47 -58 -95 -3 191 352
7530 352 34 111 171 28 318 -42 250 427 0 249 63 -103 397 -196 227 126 -105 18 191 232 -158
7551 -158 214 -106 127 -204 8 -79 197 64 18 -214 -92 108 -14 86 225 -188 197 -96 64 -75 21
7572B1j88J01J72J14m26J62L54l28R2J24J2j71J50R3o2N0j38m47K17K28J9q2j86
7595a19L42qk2l27k0Q7J16j73q0OK38j04L7R0n9L1j67J75j98J82j44K19l16L62
7619A48j58j15K94o4k93J75j47K9L02k96j67R3K50j1r1p4J08mj47L05m07J0oJ11
7643a55L71j17P9j72L5J56m42K82m21N75L6k65J17j27L54j61k76J84J74l28J38
7664C7k08K99l27K46k8o4R9J66k13J33l80K30L1oK6N4l1m7j90L51j2p2J23r9K5
7689A43j16o7m6L28k96K4l1J84p9Q2r2o7j24K76J55l94K35k6j56J05l8j97J92
7712ej33p0M56lo9j79k6J3l0J65j59O2K2P4K6J8l95Q3N6K46j4j03k27K0J40J51
7738A19j17p6J66O2o0K5l26J92J8o0j12o7K63l09J18K23k34K23Qk39K68l04J71
$$ plain form
7572 21 -167 -66 106 220 -206 -44 310 -18 74 198 210 39 189 282 220 270 132 -315 -98 130 149 67 -119
7595 -119 223 215 193 -134 -154 -67 49 -124 -204 -198 40 -64 -27 63 4 35 -132 43 -155 27 -117 102 -214 148
7619 148 -10 -125 169 105 -188 -13 -160 -131 171 -125 -292 -199 51 40 -51 -125 -17 -21 -168 137 -270 -260 -266 -155
7643 -155 216 99 178 6 41 197 -245 37 -384 191 227 -38 79 -48 306 145 -131 53 227 -101 37
7664 37 -171 128 -199 47 19 -45 54 220 7 140 -240 -10 21 15 41 95 64 17 -173 178 166 94 217 118 143
7689 143 27 -40 -86 242 -54 -30 -61 123 44 126 34 -33 -157 119 274 -120 115 89 -67 38 0 -197 -5
7712 -5 -138 -208 248 245 176 -3 -29 -16 -46 119 -40 22 44 118 144 162 -233 -150 -94 152 138 35 -192 -172 -32 119
7738 119 2 -74 92 154 94 119 -207 -15 3 -57 -169 -236 27 -282 -164 59 -175 48 56 -183 85 -219 -48
7761d8J62j23J04j13N2k45m0L02m4j73J24J54j63J00k44K86l6n88Q26j72O9m01
7783b11L9J29j37J86n9M3o9J51m56L60J2K85k77k38O12m43o5K20l7l4O4j03N0
7806B2j6K26j26j57j83M07m10J51jo8J52J0PJ53N4j99o9J65k8q4J12k18L37j07
7830A30J66j59j22J21k49M8K57l33L95m59O0L12l27L33j14k16K13k82o6J64Q2
7851d6J56l14K46j19j08K88L0p8j06J00j10J36R2j68O1MQ9l61j53M59n1j56n7
7874a66K86N9k33k4K33k89J38P8k67L10j42P1j41j79R9K21j38N1j48N01o12J32
7896a60ml9N05j76N2l02M35n34M29j34m52L91q9P7L5J2J11j86P7J8l6j21J43J9
7920G1p0o9M1k55N92r66P34p8k5L30m03j8M73l25r8L26l27N6m1PK22j04j91J47
$$ plain form
7761 -48 114 -9 95 -18 34 -211 -251 51 7 -166 -42 112 -51 49 -195 91 55 -533 293 121 190 -211
7783 -211 -172 -43 -180 6 -53 -10 -79 72 -384 -24 -12 273 -4 -242 370 -73 -138 82 45 11 75 -28 22
7806 22 6 232 106 -51 -234 173 -237 -86 -87 -155 -3 7 14 167 221 22 -47 118 90 6 118 -100 237 130
7830 130 296 137 15 136 -113 -65 192 -141 254 -205 -145 167 -160 173 59 -157 56 -226 -292 -128 -46
7851 -46 110 -204 42 -77 -185 103 133 55 -51 49 -61 75 167 -1 60 64 153 -208 -361 98 47 -109 -166
7874 -166 120 179 -54 -78 155 -134 4 82 -185 125 -17 54 -87 -266 -167 54 -84 -33 -181 320 -292 -160
7896 -160 -164 -203 302 126 178 -124 311 -223 206 72 -380 11 -78 -1 34 46 157 -29 48 66 30 -91 52 71
7920 71 1 -68 -27 -282 310 -656 78 0 -25 305 -98 -116 357 32 -66 260 -67 -11 -52 -45 177 73 -118 29
7944B9J1J71o5k41m2K86k00j42O01o04M55l3k07J5J59j12j0m3j53K2M1J33k64
7967a93M21Mj66m9k07J33K06r0R1r4J85j28j05r1J53j52J45l12J16J37k24L34
7989A14j88l8j14J04L62l24J34P9J15Om01j38L18l7m2j8k91M72k20k69M29j42
8011h9j71j68L46j6P1j14j9M50n63K55J39m0k37K99k38J15L7p7j3J53l26j08M89
8034A75j26k3J6m17M59J9k7j01j24L73j46j38J48j61P2%p3Q0J55l76M25p9r6k82
8058b47J24QJ28K74m23J39m3l11K50kq9L96o3j23j23J33k0K45n5oj79J61j21n8
8082eP1J50n87O01k70K10j40L5lj99M23l22Q8J21l18J46L3N5j73N3J09m4k84K14
8106c6l2K13m7j97J7J6j09L14l3m40L28R1k20O1O0j29L31l58K90M2j59K79k33
$$ plain form
7944 29 40 211 146 -95 -137 149 -51 -193 408 -196 259 226 19 34 193 81 71 28 -125 -103 -62 71 -193
7967 -193 228 232 66 17 -190 -57 149 59 150 56 241 113 8 -83 70 -82 63 -249 -133 4 -220 114
7989 114 -74 -112 -226 -122 240 -84 50 129 244 250 -151 -289 29 -8 -50 -68 -359 113 -107 -376 53 -89
8011 -89 -260 -428 -82 -98 -27 -141 -160 290 -273 -18 121 81 -156 143 -95 20 57 -20 -33 120 -206 -314 175
8034 175 49 26 42 -375 84 103 76 -25 -149 224 78 -60 88 -73 -1 -1 -74 6 161 -215 210 131 35 -247
8058 -247 -123 -115 13 287 -136 3 -40 -351 -101 -103 -192 204 141 18 -105 28 8 253 198 192 13 174 53 -5
8082 -5 66 216 -371 230 -40 170 30 65 62 -137 286 -36 52 173 -145 1 34 89 -84 -31 78 34 -250 -36
8106 -36 -68 145 98 -99 -82 -66 -175 139 106 -334 -6 85 -135 -74 -14 -143 188 -170 120 162 3 282 49
8129D9J4l04J35J42o2k63L03j65K50P4k46j95J47K7L0R0J06M2k02O4J97r1j43
8152ar8j3L1k7j44L3M4K84j28r6l7K33k43M1N6J53k62K36n9j43L90j96K05l65
8176a06N9J81Mp6j18J16k6m8L6P0j72L96l93j8k29
$$ plain form
8129 49 63 -241 -106 36 -26 -289 14 -151 99 173 -73 -268 -121 -94 -64 26 132 174 -28 36 233 142 -1
8152 -1 -99 -112 -81 -108 -252 -219 -175 109 -19 -115 -152 81 -162 -121 -65 88 -174 62 3 -140 250 54 259 -106
8176 -106 -47 134 138 62 -56 60 34 -14 22 92 -80 316 -77 -95 -324
8191c24
$$ Imaginary data points
##PAGE= N=2
##DATA TABLE= (X++(I..I)), XYDATA
0@%%%%%%%qJ6j6J6j6K4l2L8m6N6o5P3q8J04j21J41j65J89k16K48k81L19l62M08
31B16m59N14n75O43p16P98q88R84j091J208j338J483j641J817k015K237k488K779
49A468l117L511l981M556n276O205p462R268j2098J7204k9296J07467J10947j72290
63B7106m2483P7339N4953q9352o9650K7656O7675J507k0776k761J0984j5583j6117
76A0498k502J195k0809j9093L542K7546J2037k2153l4127J1664M5820J0483m4905
89b0804j8530M6595L8915k9909m4768P076L4042k71k7335j737L8050L0388j1961
102C9751k4420R494K2478j8452n1870j4233M1591K4897l3856k5742M1843M5169
114E6650l0019n6533M827L0157j9969l8445J1790L0036j0116j4899K6433K3571
$$ plain form
0 0 0 0 0 0 0 0 0 -8 8 -8 8 -8 16 -16 22 -24 32 -33 40 -48 56 -65 76 -89 100 -116 132 -149 170 -192 216
31 216 -243 271 -304 339 -377 421 -467 517 -574 634 -704 779 -862 955 -1060 1177 -1311 1468
49 1468 -1649 1862 -2119 2437 -2839 3366 -4096 5172 -6926 10278 -19018 88449 199396 27106
63 27106 -15377 61962 116915 27563 -42087 -14431 53244 54751 33975 31214 42198 26615 10498
76 10498 7996 9191 -11618 -30711 -27169 377 12414 -9739 -43866 -32202 13618 24101 -20804
89 -20804 -39334 7261 46176 16267 -28501 -21425 12617 12346 -14989 -16726 21324 51712 39751
102 39751 15331 24825 47303 28851 -23019 -37252 4339 29236 -4620 -30362 11481 56650
114 56650 26631 -29902 -25075 5082 -14887 -53332 -41542 -11506 -21622 -36521 -10088 13483
126A3483k7025l3202J9071L4742j0019l5445m87L3852J8456j4449k1390l459K0292
139e580K6817J873k7086j0086L2009K3889k7708l9035K563K6282N820j1176j828
152c246J1067J0171M095k925j2789j7909q528N882Q300m631r766O651K3702J4028
166B4102j3698k2559o16J7415j228k5375p258K5682J5752j5974p351K0634Q572
179A8098j9346q403J7454P973j4357o943J0977K920q700j397P027k811n353J2939
193A0078J7313q662j9747M996J7042q165k4440l598J4893O951J138N051J218m409
207I659N131Q475j0584k4218o959J7788J3554q946j2085R016K0533M174j5306
220A0232j3484J66Q305L110o909q275K453J0217N859l463n935l472L920J0144
$$ plain form
126 13483 -13542 -46744 -27673 7069 -2950 -38395 -38882 -5030 13426 -1023 -22413 -25872 -5580
139 -5580 21237 23110 -3976 -14062 17947 41836 14128 -24907 -22344 3938 9758 -1418 -3246
152 -3246 7821 17992 22087 19162 6373 -11536 -20064 -14182 -5882 -10513 -20279 -13628 10074 24102
166 24102 10404 -12155 -12771 4644 3416 -21959 -29217 -3535 12217 -3757 -11108 9526 18098
179 18098 -1248 -9651 7803 15776 1419 -5524 5453 8373 -327 -1724 5303 2492 -2861 10078
193 10078 27391 18729 -1018 3978 21020 12855 -11585 -15183 -290 6661 7799 12850 14068 9659
207 9659 14790 23265 12681 -11537 -18496 -708 12846 3900 -8185 831 21364 25538 10232
220 10232 -3252 -3086 5219 8329 1420 -6855 -4402 5815 11674 8211 2276 -1196 2724 12868
234A2868K296j4207r462J1134J0846j2029j4648N419J2228N43n631M448O512m205
248F112o281J996o43j2769p651J0286Q923o193k486J3981O982j1570p889N729
262a473p33j2237m611R249O759k811j411N688M198k225k771j204l152l237L918
277f053M791n139p318M791J1047o30r167j871P654O760j613p538m534L773L451
292a596l879n177M55N458N870N558K38n926k850M896K574r045j0343L719J3004
307B956M415p004j228R267M797o956n142Q87k385m220L903N414m056l291P922
322E279P210n575p166K055N472l095n866J273M770j709m727K356N399k324l745
337c93N173N190l363m343K106L41n295k884K877K675n88K7M138M688j278n897
$$ plain form
234 12868 15164 957 -8505 2629 13475 1446 -13202 -7783 4445 4988 -643 3805 10317 6112
248 6112 -169 1827 1184 -11585 -19236 -8950 -27 -6220 -8706 5275 12257 687 -7202 -1473
262 -1473 -2206 -14443 -19054 -9805 -3046 -5857 -7268 -1580 2618 393 -2378 -3582 -6734 -9971 -6053
277 -6053 -1262 -6401 -13719 -8928 2119 1489 -7678 -9549 -1895 4865 3252 -4286 -8820 -5047 -1596
292 -1596 -5475 -10652 -10197 -4739 1131 6689 6927 1001 -1849 3047 5621 -3424 -13767 -10048 2956
307 2956 7371 367 -861 8406 13203 6247 1105 1992 -393 -4613 -710 4704 648 -2643 5279
322 5279 12489 6914 -252 1803 7275 4180 -1686 -413 4357 2648 -2079 277 5676 3352 -393
337 -393 4780 9970 6607 2264 4370 4711 -584 -3468 -591 2084 1496 1523 5661 10349 9071 3174
353C174j907K444j719n554j739M028K962R19J910R84o35j816l03k70l090m042
369d654PN996K078n545k040O836L667n508m237M376K173l622k523J551q49k853
385e147J24L634J234l767l9O422K260p043m095M351J318o703k900N031L252k108
401d176J168M845N39k751j525K03j596l417p55L478K504j026Q92M445J126m438
417d84j476K838L05l457j462K453J586j019r45J015K762j5j491K81J607j820k253
434a575J128Q47k895k224L029K836j341j229K395L431j078l540q86J135j203k996
450d166R22M292J88j209L648K978l086l487J732J379k817k594K612K425n76o41
466A600J733K064r71k445M78J584k749l031K063K121k497j890K580J386k043j242
$$ plain form
353 3174 1267 3711 1992 -3562 -5301 -1273 1689 2608 4518 5502 4867 3051 2748 2478 -612 -4654
369 -4654 -4647 1349 3427 -2118 -4158 2678 6345 837 -3400 976 3149 -473 -2996 -1445 -2294 -5147
385 -5147 -5023 -1389 -155 -3922 -3961 2461 4721 -2322 -6417 -2066 -748 -7451 -10351 -5320 -2068 -4176
401 -4176 -3008 1837 2376 -375 -1900 -1697 -3293 -6710 -7465 -3987 -1483 -2509 -1617 2828 3954 -484
417 -484 -1960 878 1183 -2274 -3736 -1283 303 -716 -1661 -646 2116 2101 610 891 2498 678 -1575
434 -1575 -447 400 -2495 -4719 -1690 1146 -195 -1424 971 4402 3324 -216 -1102 33 -1170 -4166
450 -4166 -3244 1048 1236 27 3675 6653 3567 80 1812 3191 374 -2220 392 2817 2241 1600
466 1600 3333 5397 4426 1981 2459 4043 1294 -1737 326 2447 -50 -1940 640 2026 -17 -1259
482a259J584J135j655j659j03M02p24k499N38K943R52j117J986K421p35k066k80
499a36O49j500j800J224K678O51r90M38L359L60l742k035K592N8m448j032L315
516c59J67k318L25K739j042l136N93J548p34l337j07K871J28l425k13M170J429
533g01k678K82L689k6k725M81J721j459r90N89K250N73k46O34J823P93k157j495
551C58Q71j8k588r14J739P77q47PJ806N2j250j481m43R05n84k053J274K814k96
570A29k249K118L112r74k214K417K333k121j311J426K171j190j057J549K611p16
586F034j743J579J813k163k583J056J081l266k120K247J142j857k08J871k42j744
602H97m78n20j335j443P73R27L18q04J49K322J109j771j087J584R45p88j069L40
$$ plain form
482 -1259 325 1460 -195 -1854 -1957 -1555 -2279 -4778 -4240 -1297 -345 -1462 524 2945 2210 144 -136
499 -136 513 -987 -2787 -1563 1115 1766 776 1214 4573 4933 1191 -844 1748 1806 -2642 -3674 -359
516 -359 -192 -2510 -2185 554 -488 -3624 -3031 -1483 -2217 -5554 -5661 -2790 -2662 -6087 -6300 -2130 -701
533 -701 -3379 -3097 592 566 -2159 -1678 43 -1416 -2406 -1817 433 1006 760 1394 3217 4010 1853 358
551 358 1229 1211 -1377 -2291 -552 225 -622 -615 1191 1243 -7 -1488 -1931 -1026 -1610 -3663 -2389 425 129
570 129 -2120 -2 3110 2136 -78 2339 4672 2551 1240 2666 4837 3647 2590 4139 6750 6034
586 6034 4291 5870 7683 5520 2937 3993 5074 1808 -312 1935 3077 1220 1012 2883 2641 897
602 897 419 -101 -1436 -2879 -2106 -1179 -861 -1665 -1516 806 1915 144 -943 641 1586 798 -271 69
620F9K59J114k0q55P39J679q34j442Q67K80k703r37K037q03k989K36K488n08j946
639c269k42K150J35k714j763J562J65k159m10L496K78j803J303K970j607k642
655d550J867K306k039j574J901K161j525o53J838J790p05j492Q45O38j053j408
671a653M22J184j122o06J189Q34j405r3Q32j9o3k08j551k67J692m4k208L47L620
690H81J15j897N40J894p45j237M70J035j177r91K046K145q42k581J774L515j535
707C410l793J311K462j869k325K252J005j996n8K643k97k533q2K244p3k674m16
724g89J793J23j498m44J651J039j381J8J694p27j547O37O93j647L03J487l83j429
742d07J261R67q20J21L40q03q56O42J92j401j169J649J287p98j663J069J372j162
$$ plain form
620 69 328 1442 1422 567 1306 2985 2151 709 1576 1856 -847 -1784 253 -550 -3539 -3303 -815 -1323 -3269
639 -3269 -3511 -1361 -1226 -3940 -5703 -4141 -3976 -6135 -6545 -3049 -2771 -4574 -3271 -301 -1908 -4550
655 -4550 -2683 -377 -2416 -3990 -2089 72 -1453 -2106 -268 1522 817 -675 170 808 -245 -1653
671 -1653 -1231 -47 -1169 -1775 -586 248 -1157 -1250 -418 -437 -500 -708 -2259 -2526 -834 -878 -3086 -2739 881
690 881 996 -901 -361 1533 788 -449 21 1056 -121 -1112 934 3079 2237 -344 1430 4945 3410
707 3410 -383 928 3390 1521 -804 1448 2453 457 399 3042 2745 212 130 2374 2301 -373 -789
724 -789 1004 1127 -371 -815 836 1875 494 512 2206 1479 -68 569 1262 -385 -82 1405 1022 -407
742 -407 854 1821 1001 1122 1462 659 -197 445 637 -764 -1933 -284 1003 205 -1458 -389 983 -179
760a79k393N38J649j570j468K266K97l045L61L064l88l008M03K722n01k489R5
777c646J639n79o91Q78N81p75k81J911R46k359j665K691J417k758j331K294J663
794f5k117K97J651l25j613J057P73j526j051R12N31p4k72M14K7L55L96n62k26
813a418j25R13O5r72n08J935P04j732j11L095j47k332J99K733r32j731J275J435
831B346j341j176K339M98j530l41J981O35j811j740J601J492k138j357K397R51
847B806k304Q2K435j057k668J626K261j854k838J359K807q36k036N82J236L48
863A949l25j102p5M38j74K76n04j53L16N22m02p87Q60O05j456J25Q79o66j813
882a487O07J512j302j198J699J268j554j023R90K90j134j56N22p9j096J93J281
$$ plain form
760 -179 -2572 -2034 -385 -1955 -3423 -1157 -860 -3905 -3544 -480 -868 -3876 -3473 -751 -1252 -3741 -3646
777 -3646 -2007 -2586 -3277 -2399 -1818 -2593 -2874 -963 -17 -2376 -4041 -1350 67 -2691 -4022 -1728 -65
794 -65 -2182 -1885 -234 -559 -2172 -1115 -342 -1868 -2919 -2007 -1476 -1550 -1822 -1408 -1381 -1026 -630 -1192 -1418
813 -1418 -1543 -630 -565 -1537 -2045 -110 594 -1138 -1249 1846 1699 -633 -434 2299 1367 -364 911 2346
831 2346 1005 -171 2168 2666 1136 795 2776 3411 1600 -140 1461 2953 815 -542 1855 2806
847 2806 502 584 3019 1962 -706 920 3181 1327 -1511 -152 2655 1819 -217 365 1601 1949
863 1949 1624 522 447 885 711 987 483 330 646 1168 766 -21 839 1444 -12 113 992 326 -1487
882 -1487 -880 632 -670 -1868 -169 1099 -455 -1478 -488 -198 -1332 -1488 -966 -1045 -2141 -1948 -667
899f67p4j629P28J576l10k654R67K103j403k084J404J846j552q66J525N88j719
916b221J25J012J40p83j014J493O64j111j054J608P61p26m31L44j5P1M25r7j357
935b166N42J759o8j942P42J409l30n90M79J94o01L23M26m55r57J466R54l45r64
954a24O12P65k69p86K45J365j015j005J318P47j484o64K483O30k601k15K386m88
972A900j829j78J665pj181k19J123O78r25m44J082J7j150n5J258r08r17J070O88
991A668p91m13J097j30l96j11J9l02j97P20m69r05M44N94k36l36M41j97m00j37
1011c7L16j82j021O5R53J24j314l00J477M08k019m54J400M99j859K22J327q56
1029a251j264J055J159r29r28O33J132k73j242j59J196L2r38P6J071k93j018Q10
$$ plain form
899 -667 -741 -2370 -1642 -66 -376 -3030 -2063 40 -1363 -3447 -2043 -197 -1749 -2615 -1090 -502 -2221
916 -2221 -2096 -1084 -944 -1727 -2741 -1248 -584 -1695 -2749 -1141 -380 -1106 -1537 -1193 -1208 -1137 -712 -809 -2166
935 -2166 -1624 135 67 -1875 -1133 276 -54 -644 -165 29 -572 -249 177 -278 -1235 231 1185 840 -124
954 -124 488 1253 984 198 443 1808 793 -212 1106 1853 369 -295 2188 2818 217 2 2388 1900
972 1900 71 -107 1558 1551 370 151 1274 1952 1027 583 1665 1682 532 477 1735 827 -90 980 1668
991 1668 877 464 1561 1431 1035 924 943 641 444 1164 695 -210 234 828 592 256 697 500 100 -37
1011 -37 279 97 -924 -859 94 218 -1096 -1396 81 489 -1530 -1984 -584 -85 -1944 -1722 -395 -1251
1029 -1251 -2515 -1460 -301 -1230 -2158 -1525 -393 -666 -1908 -2067 -871 -839 -1777 -1701 -630 -923 -1941 -1131
1047a131N05l94m59R19J06j138M93M70k49J28j8J67r0K08j36l57K02L56j77l42
1067i37L45j63N91m00j29K99N01j55p11R37J0r25M29J053p76p23J260R80j064
1086D22p17J495J83n82j35M84L08j82n64M44P44o23l45J049K76j070n50J310K03
1105B150j410J49J380n68j224N53R79p83k88L51K28m24l16m39N82p9m57K14K16
1124H14p4p11M67P31p37l28K49J49j13k58J54j13J52K68q27j41J088n91m14k22
1144d57J070p06p58O26O11m6o61l16L93N7o47l51P66J65j072k66J232l48j120
1163a828R78Q08j089r24Q41N75j087l46R54J80k69l11l9N55J33n20J21N96k41
1182i13p83O76K49n65M4R05J8o25O14K01j33J23rl95J07J000l25r22Q69N19n95
$$ plain form
1047 -1131 -626 -1020 -1479 -560 -454 -1592 -1099 -629 -878 -750 -768 -601 -691 -483 -619 -976 -774 -418 -595 -937
1067 -937 -592 -755 -164 -564 -693 -394 107 -48 -759 178 188 -737 -308 745 -31 -754 506 1486 422
1086 422 -295 1200 1383 801 666 1150 1458 1276 712 1156 1900 1277 932 1981 2257 1187 637 1947 2150
1105 2150 740 889 2269 1701 477 1030 2009 1226 938 1289 1517 1093 777 338 920 841 384 598 814
1124 814 740 29 496 1227 490 162 411 560 447 189 343 230 382 650 -177 -318 770 179 -235 -457
1144 -457 613 -93 -851 -225 386 340 -321 -637 -244 -187 -834 -1185 -419 -254 -1326 -1592 -360 -708 -1828
1163 -1828 -850 -42 -1131 -2055 -1214 -639 -1726 -2072 -1118 -938 -1207 -1518 -1557 -1002 -869 -1389 -1268 -672 -913
1182 -913 -1696 -1020 -771 -1336 -1292 -387 -369 -994 -380 -179 -312 -189 -198 -593 -486 514 189 -733 136 655 60
1203F0k71K65N99j90l87L06P4N7m43j03J054q1r58M36Q93o68n82N83R71j450o0
1224A05J416k33q84n2Q68J85n56M9L49r5k12l40N64J62n86K8Q73k74j021L98P63
1245A507k43n10N52J71p38lL43m11J74K06j13n01L57o2m13M3J86r8J00n34J45
1266A58r1L15m42n36Q14m47k41j94L45l97n75J060m8j387O09R13o72o69N45L02
1286f38l10n80Q30J25o37j3M03K21Lm42L06R93q33r89J008O91j466n8J062M6j043
1307a321O8Q21j1o85K77J01p3k43l01M77m09J68p2M74L88n33k6J59k43L70J54
1328d60K71k81K02M81m06j59Q90k26k94M75N88p85l49O07O84o09k36L08O76m81
1348H96l82O31L27p58j2O4O62p59r22J134N52j159l0R72l3j051L71P96o26m30
$$ plain form
1203 60 -211 54 653 463 76 382 456 513 70 -33 1021 940 -18 418 1311 643 61 644 1615 165 105
1224 105 1521 1288 404 352 1220 1405 849 898 1247 1152 940 600 1164 1326 740 768 1641 1367 346 744 1507
1245 1507 1264 754 1306 1477 739 736 1079 668 842 1048 935 434 791 729 316 359 545 447 547 13 158
1266 158 67 382 -60 -596 218 -229 -470 -664 -319 -716 -1291 -231 -279 -1666 -1057 -144 -816 -1485 -940 -638
1286 -638 -948 -1528 -698 -573 -1210 -1223 -820 -599 -596 -1038 -732 261 -572 -1561 -553 138 -1328 -1386 -324 -278 -1321
1307 -1321 -1253 -432 -443 -1128 -851 -750 -823 -1066 -1367 -890 -1299 -1131 -1203 -729 -341 -874 -900 -741 -984 -614 -460
1328 -460 -189 -470 -268 213 -193 -352 538 312 18 493 1081 296 -53 554 1238 629 393 701 1377 896
1348 896 514 1145 1472 714 702 766 1428 669 -253 881 1433 274 244 1216 1183 132 503 1299 673 243
1368B43L34L97n5p4L1K25K1l93L02L7k11K0P6J23j14l88L16n7l94K54L41p54k68
1391A2P90k61o38K84L12m94o2N7P3p22L66L1l8j62l07L44k0k50m59P88L87q98
1413h67j61J257p14r46O59R90j015n80O98O46p90n35O86K37l32k51M85k46k80
1432a059J46J46L85p00j72M87R0n65k53J053O4r11L28P41p82k07P35j35j8k5M05
1453b47r6l91K65L32j77j3J80L18j04m58R14o4l90M7N92j3q60L14Q32m94m05O56
1475G38N09q73k06P84J03o96P2N81Q8o60j24N35j2o05L87M70L23q79Q7P51l91
1496I82p59M01N30m65o00J078K70q01l30P03q4l35J64p8k11m8j6j04K01j3J54
1517F39j91l77k2L32j9n04l6N95j92n98J52M14m70l64O03J21q76M2Q37l61n93
$$ plain form
1368 243 577 974 919 845 876 1101 1122 729 1031 1068 857 877 953 1076 962 574 890 833 439 693 1034 280 12
1391 12 802 541 -97 187 499 5 -57 0 73 -649 -283 -252 -290 -452 -759 -415 -435 -685 -1144 -356 31 -867
1413 -867 -1028 229 -485 -1431 -772 218 -797 -1377 -679 -33 -823 -1358 -672 -435 -767 -1018 -533 -779 -1059
1432 -1059 -913 -767 -382 -1082 -1254 -767 -677 -1242 -1495 -442 -378 -1289 -961 -220 -1002 -1209 -474 -609 -627 -652 -247
1453 -247 -343 -734 -469 -137 -314 -327 -147 171 67 -391 523 459 69 116 708 695 -165 149 981 487 82 738
1475 738 1247 374 168 952 1055 359 431 1012 1100 440 316 851 839 234 621 1091 1414 535 622 1373 982
1496 982 223 624 1154 689 89 1167 1437 636 306 1009 925 590 754 676 465 417 401 297 498 485 639
1517 639 448 71 49 381 362 -142 -178 417 225 -373 -221 193 -277 -641 -38 83 -793 -751 86 -275 -868
1538h68M0L73K87p10J63M47l06o71L25K15K98p64N57N2l71q3K5O78p21k14N65
1559f83K76q61K20O82q7p46L42N31n13j92N23Q4l63L0M18j21J58l8q7J21o21L22
1581f05P29n21m43L62M66l84j81K99M75o23rN71l83j4K57N65j24n93L86L17o18
1602g1J61O38J32k63j09J35N58n99j67J246m00q42Q6J043o90l23L50M63p56n71
1622B1Q95L1Mn73K61N3K0n95L01M55m43k80J28N38l05k62K42Q5l36o7N74k78k00
1645B69K40J43n39R8M43l92j49J0L26m10Q4j24m2J30k45J08P5j43o11P67k6p83
1667g71P6M68o7q63L42N77n19l50O53J5k94k87N37J05o04J7O84k25l52j65O88
1688c35J22n26l1J43rk98J73L49k31q9M04J77o71kP37m73k23P4L31L2m77N85m3
$$ plain form
1538 -868 -828 -455 -168 -878 -715 -268 -574 -1245 -920 -705 -407 -1171 -614 -562 -933 -1016 -991 -313 -1034 -1248 -683
1559 -683 -407 -1268 -1048 -366 -453 -1199 -857 -326 -839 -1031 -508 -424 -787 -757 -339 -460 -302 -340 -427 -306 -927 -605
1581 -605 124 -397 -840 -478 -12 -396 -577 -278 197 -426 -435 136 -247 -261 -4 561 437 -156 230 547 -71
1602 -71 90 728 860 597 488 623 1181 582 415 1661 1261 419 505 1548 858 535 885 1348 592 21
1622 21 916 947 951 378 639 692 712 117 418 873 430 150 278 816 511 249 491 576 240 173 747 469 269
1645 269 509 652 113 211 654 262 113 123 449 39 123 -1 -43 87 -158 -50 25 -118 -729 38 12 -771
1667 -771 -695 -227 -294 -1157 -815 -238 -757 -1107 -454 -439 -733 -1020 -483 -378 -982 -965 -281 -506 -858 -1023 -335
1688 -335 -213 -739 -770 -627 -636 -934 -761 -412 -643 -732 -328 -151 -822 -824 -87 -560 -783 -709 -378 -346 -823 -238 -281
1711b81k80k40O28J42m14QkO63k52j13K81O4j82N5L43n8l09K85O22o24m24O28
1733E40J19m08j21P69q0n13J91M25m58J7K40M5k05k90M20K54j50m19O3N79m99
1754E19m24K95J79l07j76P84n32k80O55J0m34j26P9K81k30R0L18Ol45p1k08M99
1776E82j47l61R2N53m40n6J46J67o40K10J12m37J52J85J9j008P66o6j99l10K47
1797d33m8r6k46L82n5j19j48M6O7q6m30L43N21m33l71P69Jq10K40L84o6O6j12
1820f34M32m73J23O2J84J16l86L68j73J23l17J0K88k09j49K81k46p1l0L77k12
1841e36j61N96J04n11P7L36J20j73q1L03k28kL39qLn8J94L25q7j48L78P2l26j22
1865D06K68M76o94k34N88j12o24K86K72n0l31L07K92n63Q8K10k54K8l20J53L37
$$ plain form
1711 -281 -561 -801 -173 -31 -445 -437 -439 224 -28 -141 140 204 22 77 420 362 53 338 960 336 -88 540
1733 540 659 251 130 899 819 306 497 922 464 481 721 766 561 271 691 945 795 376 439 1018 519
1754 519 95 390 569 262 86 870 338 58 713 723 289 163 242 523 293 383 701 707 362 291 83 582
1776 582 435 74 166 719 279 223 369 536 -104 106 218 -219 -67 118 137 -871 -105 -171 -370 -680 -433
1797 -433 -481 -577 -823 -441 -496 -615 -763 -717 -650 -736 -1166 -823 -302 -735 -1106 -337 -336 -1146 -906 -522 -588 -522 -634
1820 -634 -202 -675 -552 -490 -306 -190 -576 -208 -381 -258 -575 -565 -277 -486 -635 -354 -600 -671 -701 -324 -536
1841 -536 -697 -101 3 -508 -431 -95 25 -148 -229 74 -154 -156 183 175 178 120 314 639 552 404 782 854 528 406
1865 406 674 1150 456 222 810 698 74 360 632 582 251 558 850 287 375 585 331 359 39 192 529
1886E29j70r9j37M76l86l9M25k8k20m1K47J26l98J83M75m88l0O65m89m34l7N49
1908F79l29L1k76J69j22r3l0l04r2P5J8ol1k78J10L40m41j07nL70o53M48K42m4
1932c29k21m6L08j81K95o2m25j50L63J77J00k59N4K30k89r4r9N43j23n71M4O32
1954a03n09k56L81J89n26J48J50j72j17N86j00j22J40k29K38r6L3k35L79J7k06
1975d10J35M58l0m39M94N0n52L91L41k28l22Q19j79l62K23K27j01k04j37L29N3
1996E56j62j17L47k69j65pK11L08q83M72N27k41n01M31L27p70K56K90Q9k09k0
2017D70K73j78j70R1J3K8J14m7m05J93l7O6N66o70k16R8K67m81k4M54j05k44J78
2040B34o5n04K52K01q8m42o6L54J36n52M28k52l19K46K77n01K79N5N5k82L06l14
$$ plain form
1886 529 359 260 123 599 213 174 599 571 351 310 557 683 285 468 943 455 425 1090 601 167 130 679
1908 679 350 381 105 274 152 59 29 -275 -367 -292 -274 -280 -311 -589 -479 -139 -580 -687 -692 -322 -975 -527 -285 -329
1932 -329 -550 -596 -288 -469 -174 -236 -661 -811 -448 -271 -171 -430 -376 -146 -435 -529 -628 -85 -208 -779 -735 -103
1954 -103 -612 -868 -487 -298 -824 -676 -526 -698 -815 -229 -329 -451 -311 -540 -302 -398 -365 -600 -221 -204 -410
1975 -410 -275 183 153 -286 208 258 -294 97 438 210 -112 707 528 166 389 616 515 311 174 503 556
1996 556 394 277 624 355 190 183 394 702 -181 291 818 577 76 507 834 64 320 610 699 490 470
2017 470 743 565 395 486 499 527 641 594 189 382 345 411 977 307 91 189 456 -25 -49 405 300 56 234
2040 234 169 -335 -83 118 30 -412 -478 -124 12 -540 -112 -364 -683 -437 -160 -661 -382 -327 -272 -554 -248 -562
2062e62L80r6j75j22R3M70q11N50L62n78q5n0M80k25j87k5k14L12K4j75M72k08
2084c70p0M2KJ41m52J91L86o04K61K91P5m26J45K19k00l9K28K39j78K9L3N5r7
2107i9k0M81l45J13JJ4J22j86K42J24k64j96M08L02m84p3M37j7l52J42K87l97
2129B40M1L6J47j51J7J72O5j91j0J8L71l90j80K00j4J71k13L39M1o18J39K94k33
2152B91k9K96j14k47k46M42r2k25K81P8Q4n66J86J09n7r7k11K56kj2j72Q6l4n78
2176e73K86L77l35k45O40l13m27J75K02j93P3j3J54l44J76l4N4j21j39M65l97
2197e32O0n6K19j15n3k29O58k30l42L42K5l81J08M41j36n60J30N62N8k79l26L23
2219c13k58o7L24N5m7j84J86K22l31j11J72J67k9j15M45J77l30j94M71j75j71
$$ plain form
2062 -562 -182 -278 -453 -575 -482 -12 -823 -273 89 -489 -574 -624 -144 -369 -556 -581 -795 -483 -459 -634 -162 -370
2084 -370 -440 -398 -396 -255 -707 -516 -130 -734 -473 -182 -107 -533 -388 -169 -369 -408 -180 59 -119 -90 -57 -2 -99
2107 -99 -119 362 17 130 131 145 267 81 323 447 183 -13 395 697 213 140 577 560 208 350 637 240
2129 240 281 317 464 313 330 502 567 376 366 384 755 365 185 385 371 542 329 668 709 91 230 524 291
2152 291 262 558 444 197 -49 393 301 76 357 435 519 -47 139 248 191 94 -117 139 137 125 -47 39 5 -573
2176 -573 -287 90 -245 -490 150 -163 -590 -415 -213 -406 -333 -346 -192 -536 -360 -394 -340 -461 -600 -135 -532
2197 -532 -472 -528 -309 -424 -477 -706 -48 -278 -620 -278 -253 -634 -526 -85 -221 -781 -651 -89 -31 -310 -636 -313
2219 -313 -571 -638 -314 -259 -306 -490 -304 -82 -413 -524 -352 -185 -214 -329 116 293 -37 -231 240 65 -106
2240a06J68J02K8k08J51n0p6M41J10j76j02J65L3j16k4K16q9R5l84K82L10m32
2262C38R2R2K9k20r0N15r8m53J26K89j50k10K14j33P1k96n7K62R5j00J19p2P1
2285D34k41P4J45k43J97K2j35k58J94N31n42m56N94j03k70j5M17k47Nk41K05j47
2307h0k25K64K65m12l80L42J48j30k02J1L17n17j84K70L91n37j81O52l48j81M5
2328f72L53Q9l41J08n5L96k48O3j80p1j28L50J59q6k25N77j99l52J41O12m71n18
2350f98L15M82k03q4P3j54J21p8L51j54k90J96r0L30l85K21N4N16q75J34J20K04
2372A06k19j90P13l7k65L17j43r8K26K62n34J79K49n9m5k41L33l31M41j35o8n
2394D56m2k49K44P1p3j26J3R1k46L6L53j16n43K24P67k97l67L14o5nn44J94K76
$$ plain form
2240 -106 62 164 192 -16 135 85 9 450 560 384 282 447 480 364 340 556 467 562 178 460 770 338
2262 338 430 522 551 331 241 756 658 205 331 620 470 260 474 341 412 116 59 321 416 316 435 363 434
2285 434 193 267 412 169 366 388 253 -5 189 720 178 -278 316 213 -57 -72 345 98 103 -138 67 -80
2307 -80 -305 -41 224 -188 -568 -226 -78 -208 -410 -399 -82 -599 -783 -513 -122 -659 -840 -188 -536 -717 -672
2328 -672 -319 -230 -571 -463 -518 -122 -370 -307 -487 -558 -686 -336 -177 -263 -488 89 -110 -462 -321 291 -180 -698
2350 -698 -383 99 -104 -188 -115 -269 -148 -226 125 -29 -319 -123 -213 117 -268 -47 7 523 -352 -218 -98 106
2372 106 -113 -303 410 373 108 425 282 184 410 672 138 317 566 507 462 221 554 223 664 529 461 456
2394 456 414 165 409 480 407 281 294 385 139 175 528 412 -131 93 860 563 196 510 445 440 -104 90 366
2417C66k37k4J73j44k67K31J03r9J20l79M55p3l66M2Mm6R3L39k94l76M03j95m5
2440b16l67J26M60l46l1j34l0j18R2K9K24J46k04r5L3r8K0L84R4l58k7L07k40
2463c49k76L39K94m47p7K61l5K92l60j93L75k24k3M7J9K12p9k1j3p5K91K3j54
2486a73k9J19q7n6j88M29l3J4J3K65k44k83L45K13k03P6j23m6L92l82q2M28k9
2509C36Q4O2n2J06m1J35j54m70N12j49K88m71K72j63PM0j27M0l93L41Q2J07l28
2532F4Q0K43J77l39J25J84l23k01K14L03m94J07K70J71n13k13O20m72K7J76k6
2553A80l4j79J94R0j51j37L09k60P6m46R2L20m41J67K99k54k32O2L05j92l00K29
2575c03l9J29k07L58j42l68K32l5j88J5P6J00k6j80J75J5k41o4K68R1m7j98P2
$$ plain form
2417 366 129 105 278 134 -133 98 201 102 222 -157 298 225 -141 -99 -95 -141 -48 291 -3 -379 24 -171 -216
2440 -216 -583 -457 3 -343 -374 -508 -538 -656 -564 -535 -311 -165 -369 -464 -431 -529 -509 -125 -31 -389 -416 -109 -349
2463 -349 -625 -286 8 -439 -516 -255 -290 2 -358 -551 -176 -400 -423 -376 -357 -145 -224 -245 -258 -333 -42 -19 -173
2486 -173 -202 -83 -170 -226 -414 15 -18 -4 9 274 30 -253 92 305 102 178 55 9 401 19 -63 365 336
2509 336 420 482 430 536 495 630 476 6 518 369 657 186 458 295 302 342 215 255 -138 203 285 392 64
2532 64 144 387 564 225 350 534 211 10 224 527 33 140 410 581 68 -145 475 3 30 206 180
2553 180 146 -33 161 251 100 -37 272 12 88 -358 -266 54 -387 -220 79 -175 -407 -345 -40 -232 -532 -303
2575 -303 -342 -213 -420 -62 -204 -572 -340 -375 -563 -548 -472 -372 -398 -578 -403 -388 -629 -693 -425 -334 -381 -579 -507
2598e07N22l56r3m0K35j81J89K2Nl76N01L47m69J07j92N2j21J26L35j25j13j77
2620c09L40j67l35J61O75j37l12L42M15n51j12M68m93O6N2L63k45l78K84J72j44
2641A55K64j23m5K44M5j44P3k81O2K94j29k1k42J52J89j79j3K48j8j80j88L53
2663E16j97o2L52j03l69q9K56K19m52J54L04k14r6K38m49J05l09L13m1r5j93L39
2685A27O6m91J73m1Qj98J12K30j43j09J03r5K28j91L3OJ48j19j91m8J53n4j88
2708d81K72j9j99L98k63j56J15N2ql4J0J83k03K2L53k69r0n7K35l6k48M10j72
2731a85OJ5k01L37J76m08l3R3Q7j7j71K38n7l46M45J89m19J26K12Q2r3JP4o8l10
2756b27L43Q2r5K99m24l6O4L21q7r0j63J76J56L1m26K5O05j50l23J52K28k72P2
$$ plain form
2598 -507 15 -341 -434 -474 -239 -420 -231 -209 -204 -580 -79 268 -201 -94 -286 -234 -355 -229 106 -19 -132 -309
2620 -309 31 -136 -471 -310 365 228 -84 258 673 122 10 478 -15 51 103 466 221 -157 127 299 155
2641 155 419 296 251 495 540 396 469 188 250 544 415 394 152 304 493 314 301 549 531 351 163 516
2663 516 319 257 609 506 137 48 304 523 71 225 529 315 219 457 8 113 -196 117 76 -19 -212 127
2685 127 193 -298 -125 -166 -158 -356 -244 -14 -157 -266 -163 -258 -30 -221 -188 -182 -34 -153 -344 -392 -239 -293 -481
2708 -481 -209 -228 -427 -29 -292 -448 -333 -281 -289 -323 -313 -130 -333 -311 42 -227 -317 -374 -139 -175 -423 -13 -185
2731 -185 -179 -164 -365 -28 148 -260 -293 -200 -113 -130 -301 -63 -120 -466 -21 168 -251 -125 87 169 76 77 151 83 -227
2756 -227 116 198 103 402 -22 -58 6 327 240 150 -13 163 319 350 -76 -51 554 404 81 233 461 189 261
2779B61L03l87j9J26J65j60l2j63J42K80k94o0J50J40n76O31K18p93J61K88Q3
2800D64l31k57M24Mj61L12l49%j94P6R0K47j91Q5k04k51O5j37L73j21m41P09l23
2823a11k98J88Q9P4m17J19M9J44l19K94k15J13p4M6N8k7m3K31k44K65k90K22j27
2846b73l1n5JR1r0J28J16j96m40P44k96L0j0K13j23m63O09k0P7p7j10%p7K75q2
2871e9l9j17J35l11K38J46J49l38K38l4j22J96j91q6M62Lj44j82J46J84K12l78
2893A08m2p2O9L14j49P1q0K80k31l3K10j36j55L8K47n06N51k18k2O3J16k55J87
2916C55k3R2o42N47Q2m05M03r4k11K00r6p6J24j1k59M86k80l60Q2K08J28Pk82
2939b5M28q8k38R1K20m29l1L66m48m7L50n1k62K50q2j43r9n7J99L7j36m4K19M3
$$ plain form
2779 261 564 177 158 284 449 289 257 94 236 516 222 162 312 452 -124 507 725 -68 93 381 464
2800 464 133 -124 300 304 143 455 106 106 -88 -12 78 325 134 219 15 -236 -171 -308 65 -56 -497 212 -111
2823 -111 -409 -221 -132 -58 -475 -356 -307 -163 -482 -188 -403 -290 -364 -318 -260 -287 -330 -99 -343 -78 -368 -146 -273
2846 -273 -304 -359 -358 -267 -357 -229 -113 -309 -749 -5 -301 -271 -281 -68 -191 -654 -45 -65 12 -65 -175 -175 -252 23 -59
2871 -59 -98 -215 -80 -391 -153 -7 142 -196 42 8 -114 82 -109 -195 267 270 126 -56 90 274 486 108
2893 108 66 -6 63 377 228 299 219 499 268 235 445 309 154 192 439 -67 484 266 244 307 423 168 355
2916 355 332 424 -218 329 411 6 409 315 104 304 208 132 256 245 -14 472 192 -168 -86 122 250 257 -25
2939 -25 403 315 77 168 388 -41 -72 294 -154 -201 149 98 -164 86 4 -139 -238 -295 -96 -59 -195 -239 -20 23
2963B3l07r4K31K09n21N9K70K17l99J60K9j47j65K05p9n7J2L84j02j76L28n36
2985d56m9K85J93l07N7Q5k51K42L12l47J96J32k33j61N99m51j43K1K08j45J37
3006g6J09KJ11k51J08J03r2oM0Q1l0P4rK02m20K38J44l41K44l3K7r3K25L4k27
3031A64K61j36l1P1q5O1J34j29j77J95r4r3K0K00o3K65o18J68O1j8r8J89J10J72
3055E29m54K54Rl63J14k5m0r6L21Mr1j83M5lp7j63J17l3L45k11L5l27%J34J11
3080d8K0j73J47R7j48L9K2J53l83J32k4P7n47N99L5o4j91K5O1K20p9k16J31j01
3104b16Q6j62J34R4k57n7K5O1N1o3K25k86L61j29K0KL00m24K44k05L45k43k00
3127b94K26lK05k75L06k16R8j53L5J59O8n10N94J33k12l37K16J67J72m34L60l80
$$ plain form
2963 23 -284 -378 -147 62 -459 -400 -130 87 -312 -152 -123 -270 -435 -230 -309 -366 -354 30 -72 -248 80 -456
2985 -456 -505 -220 -27 -334 -277 -192 -443 -201 111 -236 -40 92 -141 -302 297 -154 -297 -276 -68 -213 -76
3006 -76 33 35 146 -105 3 106 14 8 48 129 99 173 164 366 -54 184 328 -13 231 198 225 132 357 391 164
3031 164 425 289 258 329 244 305 439 310 133 328 234 141 161 361 298 563 -55 113 174 156 58 247 357 529
3055 529 75 329 338 -25 89 64 24 -72 249 253 162 -21 24 21 -56 -219 -102 -135 210 -1 34 -293 -293 -159 -48
3080 -48 -28 -201 -54 43 -105 -66 -44 109 -274 -142 -166 -89 -636 -37 -2 -66 -257 -232 -171 49 -30 -246 -115 -216
3104 -216 -130 -292 -158 -64 -321 -378 -353 -292 -241 -304 -79 -365 -4 -133 -113 -111 189 -235 9 -196 149 -94 -294
3127 -294 -68 -71 134 -141 165 -51 47 -106 -71 88 156 -354 240 373 161 -176 40 207 379 -55 305 -75
3149g5K11k98K49k86K54M06j29l66J98QJ6J49j59P7N0J0k57L28q6Q7p1j98M44
3172E62m78R2M77p03K51J45j68n2j28O3L43j98j14J41n5k05J10J01j00k52M96
3193C28q0j47l80L24K26m15q0K44P3O9l71K84l63k9M61j77j81J9O1j18J79p3R9
3216d7J01j12m79N06j43l85N32k25l7j33L66J06n45K2K01l8m8K03K24o88N27l5
3238a27J18j22j0j92J72O8k66K79J90P9o80L83j29j21M20j84J74j37k05M78j33
3259E5m7K5K1M1j55J18O3j69J97l58K35K37k29J16ok00K09J70k80J37q4J80p4
3282B02j21qM3M4R2j61L4O5j59L21k13k51J63K71n3j62J97N2n31M82j37O5k33
3305BJ13N8K2Q1k59M0K85m7j45MP9N5l90K95Pn6J00k85K72J07l39j1Q8k18J48
$$ plain form
3149 -75 136 -162 87 -199 55 461 332 -34 164 172 188 337 178 255 305 315 58 386 300 387 316 118 562
3172 562 84 176 653 -50 201 346 178 126 -2 61 404 206 92 233 178 -27 83 184 84 -168 328
3193 328 248 101 -279 45 271 -144 -224 20 93 162 -209 75 -288 -317 144 -33 -214 -195 -134 -252 -73 -146 -47
3216 -47 54 -58 -537 -31 -174 -559 -27 -252 -289 -422 -56 50 -495 -473 -272 -310 -358 -155 69 -619 -92 -127
3238 -127 -9 -131 -141 -333 -161 -93 -359 -80 110 189 -491 -108 -237 -358 62 -122 52 -85 -290 188 55
3259 55 8 33 54 95 -60 58 121 -48 149 -209 26 263 34 150 144 -56 153 323 43 180 96 276 202
3282 202 81 73 116 160 252 91 125 190 31 352 139 -112 51 322 269 107 304 356 -175 307 170 235 2
3305 2 115 173 195 276 17 57 342 295 150 154 233 288 -102 193 200 144 244 -41 231 338 -1 -12 76 -142 6
3330Fr3J07r7k23L18m14j0M19j98K10j2j59j51J23R2k99K25O4R6r8k45Q3%J44
3354a12r8J07N6k00J29k74M22j51j48J94j87M8K09j08p1l04L69J36j30KQ9M6j57
3377a33j76j8K17L5j1k13L23J49n48L13j30mL06R8j22k13L47k83K36l93J63N0
3399gM5j24L50l73K06l9k9j44M87j79o9J65j96Q2L66ok52k5J41o3j45k28L58R0
3423D11m86K80J32k22j20P0L93l40n8N4L8n6J03N0j70K34l26N17m67K17q4P4j48
3446I6l17K82p3k21L19J20l39J61j6J30o4l27K97k43K35n4l54M08J60j54N2j1
3468H7k84j46K30J33m63L32J15oj97K20j76O9j14L18j63l48L06k35J62M7k16K5
3490c04K06k83K68J40k34j16L28k8j81K65l03L62o27K44L34Mj76oJ47m21M29n7
$$ plain form
3330 6 -87 20 -77 -300 18 -396 -406 13 -185 25 13 -146 -297 -174 -82 -381 -156 -92 4 -94 -339 -256 -256 -112
3354 -112 -210 -103 -47 -247 -118 -392 30 -121 -269 -75 -262 -214 -5 -113 -184 -488 -119 17 -113 -111 -22 24 -133
3377 -133 -309 -327 -110 -75 -86 -299 24 173 -375 -62 -192 -196 110 208 86 -127 220 -63 173 -220 -57 -7
3399 -7 38 -86 264 -109 97 58 29 -115 372 193 124 289 93 175 541 535 283 258 399 336 191 -37 321 411
3423 411 -75 205 337 115 -5 65 458 118 60 114 152 96 199 249 79 313 -13 504 37 254 170 244 96
3446 96 -221 61 -12 -233 86 206 -133 28 12 142 78 -249 48 -195 40 -14 -368 40 200 46 98 87
3468 87 -197 -343 -113 20 -443 -111 4 -2 -199 21 -155 -86 -200 118 -45 -393 -87 -322 -160 -113 -329 -304
3490 -304 -98 -381 -113 27 -207 -323 5 -23 -204 61 -242 120 -507 -263 71 75 -101 -107 40 -381 48 -9
3512ij42Qp5M10j48k8k5j46N5M24l26J52k11J40K82k72j5j84K31J57n7l28K47
3535A40k70J62L78l03k6j50K80m3J77l05L29l60K59k20j7J24j16j4J71L2l3O2
3557B57L02j45l58K7l7l7K7NK19l18j91M99k53P1k40L36o6nJ19p4J42n98M06j34
3581d6K40J51m05j64m8lj3K45k56j4L29j22n1j24J55J17j67J74k09L0J07L0j28
3604a72k8m2j63M71k49m6n7L39k07j5J07r6k5k45J5L20j00Pj35K7L04K7j36J23
3628B4J2l36K51l33J19J97J57j5l66j37J46J61K32j66J8j94L95k32J62k12J26
3649IJ24p9l9J81l93J96j30J20Q6o9k5%J21J13K08l66J81J7k86K76n1j03l51J37
3673a23K08o5N02m10r7K84l04P4K46j24l62K35K52m0k1N4j95J74k69J10k1J60
$$ plain form
3512 -9 -151 -143 -218 192 44 16 -9 -155 -100 324 -2 150 -61 79 361 89 74 -110 121 278 221 -107 140
3535 140 -130 32 410 107 81 -69 211 168 345 40 369 9 268 48 31 155 39 25 196 228 195 257
3557 257 559 414 56 83 46 9 36 41 260 -58 -249 250 -3 68 -172 164 98 93 212 138 280 -318 88 -46
3581 -46 194 345 -60 -224 -272 -275 -288 -43 -299 -313 16 -106 -157 -281 -126 -9 -176 -2 -211 -181 -74 -44 -172
3604 -172 -200 -242 -405 66 -183 -229 -286 53 -154 -169 -62 -158 -183 -428 -413 -93 -193 -186 -321 -294 10 37 -99 24
3628 24 36 -300 -49 -382 -263 -66 91 76 -290 -427 -281 -120 112 -54 -36 -230 165 -67 95 -117 9
3649 9 133 54 15 196 -197 -1 -131 -11 75 6 -19 -19 102 215 423 57 238 255 -31 245 194 91 -260 -123
3673 -123 85 20 522 112 15 299 -5 69 315 191 -171 64 316 276 255 309 114 288 19 129 108 268
3695B68l11J31J37j33J9j19K33N2k15K11l86J39j4j05J38l07J79J92m87M96o0
3716E8l36J99J74o8j06L3p0oK08l20M7J38o5J04j11j80K45j52o3K45l77K77m5
3739a71J47l98K7J19O8J5o5Q9j02L1L03k14j07k00K37Q9R7l16J82j2Q0kj9L05
3763A83n80N34j86K33l69J27k35p9M10Q7m19J5M47l62K54r1j1k02L02K46l50J36
3785I0p2K02k10JR2j52J53L6J09k37J50N4j56N7J04M7P4j32L5j63m9K62n7k8j43
3810F7K92k35J07j36J41L33n93o4Q5K49l52J19l2M50l04p0N6j56J49j50J1j25
3832a58o7L75j03M9k26N6J95k13M87k06j62J52l11J55k72J6K84j2j58J8Q5K2O2
3855F8n02M71l03J32J03K3n5j76J44P2j19K42l24K99j11k31K2K94l9j99O9J72
$$ plain form
3695 268 -43 88 225 92 111 -8 225 277 62 273 -113 26 12 -93 45 -262 -83 109 -378 118 58
3716 58 -278 -79 95 27 -79 -46 -116 -122 86 -234 -187 -49 -114 -10 -121 -301 -56 -208 -271 -26 -403 -126 -171
3739 -171 -24 -422 -395 -276 -208 -193 -258 -169 -271 -240 63 -151 -258 -458 -221 -132 -35 -351 -169 -181 -101 -103 -122 183
3763 183 -397 137 -49 184 -185 -58 -293 -372 38 125 -294 -279 168 -194 60 -31 -42 -244 58 304 -46 90
3785 90 18 220 10 11 103 -49 104 140 249 12 162 216 60 117 221 268 342 210 245 82 33 295 238 210 67
3810 67 359 124 231 95 236 569 -24 -88 -3 246 -106 13 -19 431 127 57 113 -43 106 -44 -33 -158
3832 -158 -225 150 47 96 -130 -74 121 -92 395 189 27 179 -132 23 -249 -233 51 39 -119 -101 -16 6 68
3855 68 -434 37 -266 -134 -31 -8 -63 -239 -95 -23 -142 100 -224 75 -36 -267 -245 49 10 -189 -120 52
3877E2k49K08j90r6q7J25K05J21l4k72O5K15k51O7m5K07k44L0j23J33M64j06m73
3900b78L60L9j8J08o4K62k45K8l94L36l3m6J33J29k80p7J26J37k71r2J57N6Oj03
3924b4L7L42m10j53L14r1J78q7M18m10k9j59O5M8M2L69K00l30j66L7l54K13j9
3947C1P7l52J68K09j20J76j04j57K73j77j31J96q8J62r1k9o6K26k07K11j5k15
3969b3J09k48n9J30L32m04j96N87n30L66j14r5J81j42m6R2P2l25K68J0j54J33
3991e6j3k16K99m2j14j48J49j74M02l41j31K02j52L99j70k9n4J5k4J77m4R9k10
4014a76J64j25j33J82J30j36k7m4j14J94K16m98M68J04k49K75k59K4K86k37Q4
4035A29k94K85o7P0l2m4O1k11J38N6J28j10J47O9k53J74k04j6J02k81K08l4J15
$$ plain form
3877 52 -197 11 -179 -275 -362 -237 -32 89 55 -217 -152 63 -188 -121 -166 41 -203 -173 -296 -163 301 195 -278
3900 -278 82 121 103 211 147 409 164 192 -202 134 101 55 188 317 37 -40 86 223 -48 -140 17 73 79 -24
3924 -24 13 355 -55 -208 106 15 193 106 524 114 85 -74 -9 39 81 450 650 320 154 191 -163 50 31
3947 31 108 -244 -76 133 13 189 85 -72 201 24 -107 89 1 163 72 43 -23 203 -4 207 192 -23
3969 -23 86 -162 -221 -91 241 -163 -359 228 -302 64 -50 -145 36 -106 -152 -60 12 -313 -45 -35 -189 -56
3991 -56 -69 -285 14 -28 -142 -290 -141 -315 87 -254 -385 -183 -335 64 -106 -135 -189 -174 -198 -21 -65 34 -176
4014 -176 -12 -137 -270 -88 42 -94 -121 -165 -279 -85 131 -367 101 205 -44 231 -28 -4 282 45 129
4035 129 -165 120 53 123 91 47 108 -103 35 91 219 109 256 325 72 246 42 26 128 -153 55 21 136
4058A36m7K6j27o8J83n2J24P7lj33J22k43K21q9J32j06j25M3J62k50J58j07J97
4081B31j65j30M15%k79j90J49q3K52j60n8L05k11j14j1J46Q3q7j25k5j53N33k13
4104A10k21o4J89k25J29L14k93j61j20J05K42j98lk14L17j96K73l29L9J48L6K05
4126H3m48K95l1j2m9nj1J23j59K66l53K48j0R7p2l96J44J33l4J3Q4k00J38pJ1
4151a52K1J47N2r4P3j60K34J6m03J78r5L52k10k4l01N40j23j21L13k27l19O78
4173C75k13j36k52M49l7J70k64k8Np6op9J73Q9l67L14R3K23k80r6J63r5K4m1j54
4198d6J54j33J22l3kJ1p5l2L17l76J67Q4K99j89l12L12r2k42J40J20j42o5M10
4221C97j86m0j47n2M6Mj3M2m0J78j14j31l6j77L77J11o5l06R5r4l0M9K17j34N
$$ plain form
4058 136 89 115 -12 -80 103 51 175 252 249 116 238 -5 216 127 259 153 28 71 233 -17 141 34 231
4081 231 66 -64 351 351 72 -118 31 -52 200 40 -18 287 76 -38 -49 97 180 93 -32 -57 -210 323 110
4104 110 -111 -175 14 -211 -82 232 -61 -222 -342 -237 5 -193 -196 -410 -93 -289 -16 -345 -306 -158 -122 83
4126 83 -365 -70 -101 -113 -162 -167 -178 -55 -214 52 -301 -53 -63 34 -38 -434 -290 -157 -191 -178 -94 -294 -156 -163 -152
4151 -152 -131 16 68 -26 47 -113 121 137 -266 -88 -183 169 -41 -65 -366 174 51 -70 243 16 -303 375
4173 375 162 26 -226 223 186 356 92 64 69 -7 -13 -92 81 170 -197 117 210 433 153 57 220 125 149 108 -46
4198 -46 108 -25 97 64 62 73 -2 -34 283 -93 74 158 457 268 -44 268 176 -66 74 194 52 -13 397
4221 397 211 171 24 -28 18 22 9 51 11 189 75 -56 -92 -269 108 219 154 -152 -57 -151 -181 -132 85 -49 -44
4246d4N2j25Q2l49J38J70j73J26J69k59K97l07j10L61k19k3l2L26l17l5K20l21
4268c73K47J75J71l56M4m6J07k37R0J13p2M46m79L85l32k34L78Jo2r4J60J25o0
4291I7j45J50k16Q0K05J6K36n5k00k60K08l8Q2J27m31K48mQ1j49L4K81k48L63
4314D62k30j80M1q4J63l7J54N1k04j43k6L14l54M33j98J39L28p02J81j09L63k18
4336A44J56K8o19M30m98O71l0r2k47O9J10J20k37l5q2K00l30J64O4j85M64k88
4358b3J58j76J03j65L74l79K34l88J04L06p2k32K5k3j20N3mL65j26j45j43J73
4380a01j97q5j02M94J23k29K4J04r2l19O3J32P4k08M09l2o6j25j4m2K1J28J35
4403I5l10M2P2j73N29j94k5j06n4q3K46J40l43j7O21n30K23j9L04m40L03k63k2
$$ plain form
4246 -44 8 -117 -35 -384 -246 -76 -249 -123 46 -213 84 -223 -333 28 -191 -214 -246 80 -237 -272 -52 -373
4268 -373 -126 49 220 -136 -92 -138 -31 -268 -178 -65 -137 309 -170 215 -117 -351 27 28 -34 -128 32 157 97
4291 97 -48 102 -114 -34 171 187 423 368 168 -92 116 78 160 287 -144 104 100 181 32 66 347 99 462
4314 462 232 52 93 9 172 135 289 340 136 -7 -33 281 -73 360 162 301 629 -73 108 -1 362 144
4336 144 300 328 -291 139 -359 312 282 190 -57 12 122 242 5 -30 -112 88 -242 -78 -14 -199 265 -23
4358 -23 135 -41 62 -103 271 -108 126 -262 -158 148 76 -156 -131 -154 -274 -221 -225 140 14 -131 -274 -101
4380 -101 -298 -383 -485 9 132 -97 -73 31 -61 -380 -317 -185 -111 -319 90 58 -8 -133 -147 -189 -168 -40 95
4403 95 -215 -173 -101 -274 255 61 36 -70 -124 -207 39 179 -164 -181 440 -90 133 114 418 -22 281 18 -4
4426dL5n0q7K89p7m91N04o5l5J18k73Q9q8N2L03j49l62L86J43l20N1J88ok0q7
4451D4J92j22P7j24N6J94j78j69K01Q6j4k90q2K75k63L29M5j46r8K09j26J07j83
4474B0l42K92L7m8j20L93l54J93k77N2O3j0j63K48k06N2O5pJ22J75j39l37J02
4497a89Q6j4J76R1l54J39k6LJ55j87r7J44k36K76n8RJ65j41J42Q0l90j1K33N0
4521D6j37J15m6l58J41l5K19J8j16M04L1m59J84K6q9J86j87J4j12J05l1J18M5
4544H2k39O4M7l14M17mK09k83o4K59n4l7K16j42r7l01J95m2n1L27k72L56l24L32
4568B80l44K63P6N5m27M84l00K6k25L05k1j44k6L4M1L14k79k66J29K4J65l05L96
4591B55j81J62j80j25K06l01M63m58J27K39k31p4K51r7M5p6j74J83j49M9K04l55
$$ plain form
4426 -4 31 -19 -106 183 106 -385 119 54 19 137 -136 -47 -135 -83 220 71 -291 95 238 -82 -31 157 151 131 44
4451 44 236 114 191 67 123 317 139 -30 171 257 243 -47 -129 146 -117 212 257 111 13 222 96 203 20
4474 20 -322 -30 7 -41 -161 232 -122 71 -206 -154 -91 -101 -264 -16 -222 -170 -105 -112 10 185 46 -291 -189
4497 -189 -103 -117 59 150 -204 -65 -91 -88 67 -120 -217 -73 -309 -33 -91 -82 83 -58 84 164 -226 -237 -4 46
4521 46 -91 24 -22 -380 -239 -274 -55 -37 -153 251 282 -177 7 33 -56 130 -57 -43 -155 -50 -81 37 82
4544 82 -157 -93 -46 -360 57 53 262 -21 -85 174 120 83 299 157 60 -241 -46 -88 -139 188 -84 272 -52 280
4568 280 -64 199 275 330 -97 387 87 113 -112 193 172 28 2 36 77 391 112 -154 -25 -1 164 -141 255
4591 255 74 236 56 -69 137 -164 299 -159 -32 207 -24 -98 153 56 101 25 -149 34 -115 -66 138 -217
4613b17K15nj60M1N9j3p4m3J51J95o1rk41J61R1l39J02P9l0q5L8jJ65k73L36J4
4639I6m04J14J54n9J02k65K15j86J28J48m9l54R3Q7j67j02M29j06J11j89J84m3
4661f3k23J60K64k17j58Q6J65o9m6k6l9J21J7K23K7j82q3J32J0K4j60K11p3n6
4685D5J46k01O2O5m1j37J53J26l86J43J76K7l65L27j47J46m5J97p6j77J72R1m16
4708a15J85L42m52M5L9J10k86P0K19j82L8o8J53j17L5o3m1K27J14l49L58m37j80
4731c55J70K17l8K69o8o9j93J30m4q3K52R9o10L88p2j26J43J51l96J27K10o67
4753e65M33j3j83J40J83n0n3p0j01J64o5J12m5J87M4l5k08L0o4j11l8J91pn3q3
4778b60L81r8o2J78j64l80M38l3M9j86L7M2l6P7K9k60J96K83k82N1Q4l8k21K25
$$ plain form
4613 -217 -2 -7 -167 -126 -67 -80 -154 -197 -46 149 88 79 -162 -1 90 -249 -147 -68 -98 -183 -145 -146 19 -254 82 96
4639 96 -308 -194 -40 -99 3 -262 -47 -233 -105 43 -6 -360 -267 -180 -347 -449 -20 -126 -15 -204 -20 -63
4661 -63 -286 -126 138 -79 -237 -151 14 -55 -101 -127 -166 -45 -28 195 222 40 -43 89 99 123 -37 174 101 45
4685 45 191 -10 52 117 76 -61 92 218 -168 -25 151 178 -187 140 -7 139 94 291 215 38 210 301 -115
4708 -115 70 412 -40 5 44 154 -132 -62 157 -25 13 -55 98 -19 16 -47 -88 139 253 -96 262 -175 -355
4731 -355 -185 32 -6 263 195 126 -67 63 19 -64 188 287 -323 65 -7 -133 10 161 -235 -108 102 -565
4753 -565 -132 -145 -328 -188 -5 -55 -108 -178 -279 -115 -180 -68 -113 74 118 83 -125 -95 -159 -270 -308 -117 -124 -177 -260
4778 -260 121 23 -39 139 -25 -405 33 0 49 -137 -100 -58 -94 -17 12 -248 -52 231 -51 0 84 46 -175 50
4802E0j25J0M5j00o2K36o9L5J40k64q8J14N3J42K9R1Kl78J59N9q6L17j91Q9j28
4827H0l30L42J02j52J03J12M1l26j21J92n2L52j84pj94K27l93J45M3J28M3j86
4849c5J88J30l10J72k08M3M12n14k1J17l5j17L01o8j68J19J44l14Q9N6k8j0r7
4872a54J87mKm9L3k7J41RJ41j27k91O6K43l65M1P8j2K7P9J9k41j71N55j93N0j89
4898a52j3j84K15J37m6L9j71J83k81K68j50K99m31L51k11L5L00k27o5M2K3j24
4920a63J2J10N6n8J26Q2j37q9J25J78l86K19J4k03K68O6j41k73J17j8k0J46M2
4943G3N6r7J14j12n6l49P28j92J8j41M7k52j5J41L72o08M26J92l23K08j10k32
4965a12K3J67J37k9m18NQ5Q4R5K86j82j9n5jJ32k24J55M7m43K94r5K66r9k56K51
$$ plain form
4802 50 -75 -65 -20 -120 -182 54 -15 20 160 -104 -192 -78 -25 117 146 237 239 -139 20 79 -7 310 119 208 80
4827 80 -250 92 194 42 145 257 298 -28 -149 43 -9 343 159 152 -42 185 -208 -63 -20 108 151 -35
4849 -35 153 283 -27 145 -63 -20 392 -122 -143 -26 -61 -178 123 55 -113 6 150 -164 -75 -19 -47 -57 -154
4872 -154 33 29 31 -18 15 -12 129 138 279 152 -139 -73 170 -195 -154 -76 -88 -61 18 37 -204 -375 180 -13 37 -152
4898 -152 -165 -349 -134 3 -43 -4 -175 8 -273 -5 -155 144 -287 64 -147 -112 188 -39 -104 -62 -39 -163
4920 -163 -151 -41 15 -43 83 165 28 -61 64 242 -144 75 89 -114 154 220 79 -194 -77 -95 -115 31 73
4943 73 129 32 146 34 -22 -371 357 165 183 42 89 -163 -178 -37 335 -273 153 345 22 230 120 -112
4965 -112 -89 78 215 186 -232 -227 -142 -58 37 323 141 122 67 66 198 -26 129 176 -267 27 -68 198 99 -157 94
4990I4j37J5L8J4K3rK1q1k89N36r0n90M69q4k86K06J02p3o0J55J78j29J10k16
5014h3j08Q3j55qJ87K13k10J75o9j69K1J56j56P4l3k2L4k6J24oj77N9J95j92K08
5039A15k63L76l07K01j74k39KM08j55J43j38r0J51N1J38n25K20j03K55lp9j10
5061a26J08M3K2J07l73M32m90K54N66m44j70J38J65q2N4o6J08j26j95L00L6j1
5083B50k21J00L6l04J43k4N3J98J57r3r6M3k7J18l00j05k2K49j38J86j56K47k65
5106B9k2R1j22K22l98L03p2k7J15j62L7L9N2j69L47m41J07j09K2J08m0j41K55
5129B4R1m13K49j71K10L6p7K04k61K7J43k00O3J13k96J40L8K4Q8j11p2J33Lj77
5153a92M41n18L76l21J88J83l17k42M74J15l36K34k86K27RM9j45J90m33M33rl12
$$ plain form
4990 94 -43 -28 10 24 47 38 59 -22 -311 225 135 -455 14 -70 -356 -150 -48 -121 -181 -26 152 23 133 -83
5014 -83 -191 -108 -263 -271 -84 129 -81 94 25 -144 -123 33 -123 -49 -82 -104 -70 -96 28 22 -155 -96 99 -93 115
5039 115 -148 228 -79 122 -52 -291 -289 119 -36 107 -31 -121 30 81 219 -306 -86 -189 66 63 -16 -126
5061 -126 -18 25 47 154 -219 213 -277 -23 543 99 -71 67 232 150 204 138 246 120 -75 225 261 250
5083 250 29 129 165 -139 4 -20 33 231 388 295 199 242 215 333 33 -72 -94 155 17 203 47 294 29
5106 29 7 98 -24 198 -200 103 31 4 119 -43 -6 33 85 -84 263 -178 -71 -180 -158 -50 -90 -231 24
5129 24 115 -298 -49 -220 -10 26 -51 153 -108 -81 62 -138 -75 38 -258 -118 -80 -56 32 -79 -151 -18 -15 -192
5153 -192 249 -269 107 -214 -26 157 -160 -402 72 187 -149 85 -201 26 35 84 -61 129 -304 129 120 -192
5175a92m3M95k01l0q2J31l12J91J66j52K40k84p6J81pl7k40L12k35J5M6M46N5
5198C87j11k08k28j3M66j17k26J71r2J11k26J37O1mj48K20k05J30j56K22j09Q0
5220A42p6P7k13N18j40m03L88k45o2j22K29l62K46J51k76L69k4l64N32n18M0L13
5242B00l15N3L83j80k6k09J05lj07K76k77J95M1j52Ll4k57L08J28l41K16r4J20
5265C3k65M07l18J59j12r7K86m48L52P9L8l02l7Q8K02l16%K31K46k66m6J8m1j54
5289b63K19j86K14J31l80J8M13l35Mo3J44K36m54K35J28m10J45K08j26J84k61
5310a99L8K9R8K03j13o2K25l21J98p7j48J65K04k29l1J30l16L97j76m1K05j55
5332B4J60j43ML7r9J15Ln6r5l4J30o7j2J16k59K36N5%o1l08L76j14O3M5j64M9
$$ plain form
5175 -192 -235 260 59 29 -53 78 -234 -43 123 -29 211 -73 -149 32 25 -12 -252 60 -175 -160 -114 332 387
5198 387 276 68 -160 -173 293 176 -50 121 29 140 -86 51 112 108 -40 180 -25 105 -51 171 62 142
5220 142 66 143 -70 448 308 -95 293 48 -14 -136 93 -269 -23 128 -148 221 197 -167 365 -153 -113 200
5242 200 -115 -62 321 141 115 -94 11 8 -99 177 -100 95 136 -16 -13 -47 -304 4 132 -209 7 -87 33
5265 33 -232 175 -143 16 -96 -193 93 -355 -3 76 114 -188 -225 -137 65 -251 -251 -20 226 -40 -86 -68 -109 -263
5289 -263 -44 -230 -16 115 -265 -247 166 -169 -165 -228 -84 152 -302 -67 61 -349 -204 4 -122 62 -199
5310 -199 -161 -132 -34 169 56 -6 219 -102 96 19 -129 36 240 11 -20 110 -206 191 15 -26 179 24
5332 24 184 41 45 82 -17 98 101 45 -50 -84 46 -21 -33 83 -176 60 115 115 54 -254 122 8 71 116 -48 1
5358AR2j87K94m2L23o09J12K20j22m4p2J98j03k60L55j06L0l08K49J4J46k84p3
5381a76K41j70Q7jk25ML05j10P2j11J88m37K16K34m71L81N0o5O6k52q5P9L18k25
5405h7k14J63j21L05l31K30j32P5RP0O0j91k39J71j67L12l1L97j97Q7k66j9J37
5428B1p2k36M17P9k77O6J89k42J0K12k86p4K65j04J29P1k53J72j0K0j03j87J24
5451f9l5K17O9j30j51M58j75j08M9o5Q4k70J83N0J2m0L6m89N76o7j23J49Q4k21
5475B4j08J90k41M47k29k80K12Q2j11L21k22j1j62J18P1j29k0J97Q3l38n8M00
5497B36k36j71L50j20k66J37J39r2l6Q4n6J06k1j43J62k55J03p5K20r1l1k51K58
5520d9P8oL6p8R5j98r5J36N9q4J83k48M9M5N7RR9l81m7J45K47l05mJ2L05l56K61
$$ plain form
5358 1 93 -94 200 158 481 -128 -16 204 82 38 -34 164 61 -199 156 50 80 -228 21 35 181 -103 -176
5381 -176 65 -105 -18 -19 -244 -240 65 -45 27 -84 104 -333 -117 117 -354 27 77 12 78 -174 -259 -180 138 -87
5405 -87 -301 -138 -259 46 -285 -55 -187 -112 -103 -33 27 -164 -403 -232 -399 -87 -118 279 82 169 -97 -116 21
5428 21 -51 -287 130 209 -68 -2 187 -55 -45 167 -119 -193 72 -32 97 168 -85 87 77 97 -6 -193 -69
5451 -69 -104 113 182 52 -99 359 184 76 125 60 144 -126 57 107 119 79 115 -374 202 135 12 161 245 24
5475 24 -84 106 -135 312 83 -197 15 97 -14 307 85 74 -88 30 101 -28 -48 149 232 -106 -164 236
5497 236 0 -171 179 59 -207 -70 69 -23 -59 25 -31 75 54 -89 73 -182 -79 -154 66 -25 -56 -307 -49
5520 -49 29 23 59 -19 76 -122 -217 -81 -22 -106 77 -171 -122 -77 -20 -11 88 -293 -340 -195 52 -253 -257 -245 60 -296 -35
5547c5J32l04L84m83L63L57n43J85J12j29J10l05K44K5J39k81K02j13N1K7k88
5568a50J09k21K53O8n9M2r5m3J38k81M20k80J77n6k1K6P5l62J67L31k22K52j75
5591I3R1n3p5l5j16J87q8K17n6k01K77k44N8j75K63k10k7Q2Mq1K70p0l5Q2r8Q6
5617A46n2o1J9Q1k2m6J75K1l35MK44k79L35j51l6r4MJ61j71j25M17k48k35L19
5641G1j5J29l6j15O7k01L69l64J93j3k24J74j9r7J00k07P5K64k52j53m9J58J27
5664a8j54K11q2O1j52K9j04J18k0M2j10J89JQ1j67J34n2K23k50Q3k22j65K42L40
5688B58m28r9L79l49L32l19J31L41j95J3j99J55j6J62j26J55k39J86Kj99O7J8
5710C0J65m56K94P7O6L4l07J89M26m21j7q3N5J52J08k26k70L42M3l06J77m2J27
$$ plain form
5547 -35 97 -207 177 -306 57 414 -129 56 168 39 149 -156 88 113 252 -29 173 60 111 138 -150
5568 -150 -41 -262 -9 59 0 42 -53 -96 42 -239 181 -99 78 22 1 27 102 -260 -93 238 16 268 93
5591 93 184 131 56 21 -95 92 4 221 165 -36 241 -3 55 -120 143 -67 -94 -12 -8 -89 181 111 76 158 60 146
5617 146 94 33 52 133 111 65 240 261 -74 -70 174 -105 230 79 43 -51 -47 114 -57 -182 235 -13 -248 71
5641 71 56 185 149 34 101 -100 269 -95 98 85 -139 35 16 -81 19 -188 -113 151 -101 -254 -303 -145 -18
5664 -18 -172 39 -43 18 -134 -105 -209 -91 -111 -69 -179 10 11 92 -75 59 7 230 -20 63 -159 -324 -82 258
5688 258 -170 -269 110 -239 93 -226 -95 246 51 64 -135 20 4 166 40 195 -44 142 144 -55 12 30
5710 30 195 -261 33 110 176 210 -97 92 518 97 80 -3 52 204 312 86 -184 158 201 -105 72 30 157
5733A57M5j63L69m59R2L95n75P6K46j50k0L02o2j21r9lj46J80L11m57K15J75l21
5756a3q8K79k64K56j54L11j31R5l49L16j45k17M14k44j65Nq9K03R8lj85j06J11
5779f5p2K86l05J93q5O5q9p7J54l16r6K47O0L9J69l5j53K91l32p9q9R4K68j73
5803a00r0L07j69J09l97K77O8j79qJ36K51O8n01K91q4J89q0O2K3m78L69J16k31
5826e1o2L12k63LP8O4J98m33R3O9N5J46j61K51m56L72pl33K27L4l2j39K60l34
5850a09j9J53J50j72J33k23J97j47K43j58K77j87j76K98Ok17j2j19K35j23jN6
5872H5K3j43Q7m1J31j04j62J68N9j55R3j12J1J26j9P1k29J04o8J75j71p0K02j33
5896g2J98l44J76m3L5p6O4j14O5K3l4R0J35k25R7J22k4q7j7j30K26j82o6J77m1
$$ plain form
5733 157 202 39 408 -51 41 436 -139 -63 183 33 13 315 253 132 33 30 -116 64 375 -82 133 308 -13
5756 -13 -101 178 -86 170 16 327 196 291 -58 258 113 -104 310 66 -99 -94 -183 20 118 115 -70 -176 -65
5779 -65 -137 149 -156 37 -48 17 -72 -149 5 -311 -407 -160 -100 -61 108 73 -80 211 -121 -200 -289 -195 73 -100
5803 -100 -190 117 -52 57 -340 -63 5 -174 -182 -46 205 273 -228 63 -21 168 88 150 173 -305 64 180 -51
5826 -51 -113 199 -64 -61 17 81 279 -154 -61 8 63 209 48 299 -157 215 208 -125 102 136 104 -35 225 -109
5850 -109 -128 25 175 3 136 -87 110 -37 206 48 325 138 -38 260 266 49 37 -82 153 30 29 85
5872 85 108 -35 52 11 142 38 -124 44 103 -52 41 -71 -60 66 47 118 -111 -7 -75 100 -71 -141 61 -72
5896 -72 126 -218 -42 -85 -50 -126 -62 -176 -111 -88 -122 -32 103 -122 -25 97 73 -14 -31 -161 65 -117 -183 -6 -47
5921d7n4K12k75L19k43L00j81j30J70p1k07j8K04k8J10m04K19N98k74n4l25L67
5943A88k34J57q0k3J97l00K37k19J68k06J06o1o2k2L26l33Q4k96K67P1Rk8r8K93
5967A41r4q4J97j23K38l64K47N6j39mk02J29M3k16J84L34m62K44k39J28j10J35
5989C9k2j01N8K29j44k96L98l75K25j43M9M4k6N16l02j05k3J7J8J43k33M7K30
6012B43k86k33K12j18L6L09J0n3l63J10J38J59k69P4K0l7K35k60J62j74J42Q3
6034A40m1KJ42l33J66k87J43k84K37Q3M2j01j65L61l9j41n0NQ5J03Q7m32L9j5
$$ plain form
5921 -47 -101 111 -164 155 -88 212 31 -99 71 0 -207 -225 -21 -49 61 -343 -124 474 200 146 -179 188
5943 188 -46 111 31 8 205 -95 142 -77 91 -115 -9 -70 -132 -154 172 -161 -77 -373 -106 -35 -26 -54 -152 141
5967 141 47 -37 160 37 275 -89 158 214 75 71 -131 -2 41 -175 9 343 -119 125 -114 14 -96 39
5989 39 17 -84 -26 203 59 -237 161 -214 11 -132 -83 -39 -65 451 149 44 21 38 56 199 -34 13 243
6012 243 -43 -276 -64 -182 -146 163 173 120 -243 -133 5 164 -105 -31 -11 -48 187 -73 89 -85 57 140
6034 140 99 101 243 -90 76 -211 -68 -352 -115 -32 10 -91 -256 105 66 -75 -125 -120 -35 68 155 -277 -238 -253
$$ [...]
8191I8
##END NTUPLES=NMR FID
##END=
