##TITLE=1H_EC-3221(1)
 CDCl3, 8 sc, 
 29.1.2020
##JCAMPDX= 6.0         $$ Bruker NMR JCAMP-DX V2.0
##DATA TYPE= NMR FID
##DATA CLASS= NTUPLES
##ORIGIN= UXNMR, Bruker Analytische Messtechnik GmbH
##OWNER= root
$$ XWIN-NMR		Version 3.5
$$ Wed Jan 29 14:02:48 2020 Russian Standard Time (UT+4h)  she@DPX200
##.OBSERVE FREQUENCY= 200.1315
##.OBSERVE NUCLEUS= ^1H
##.DELAY= (6, 6)
##.ACQUISITION MODE= SIMULTANEOUS
##.ACQUISITION SCHEME= undefined
##.AVERAGES= 8
##.DIGITISER RES= 18
##SPECTROMETER/DATA SYSTEM= spect
##.PULSE SEQUENCE= zg30
##.SOLVENT NAME= DMSO
##.SHIFT REFERENCE= (INTERNAL, DMSO, 0, 15.7039)
##AUDIT TRAIL= $$ (NUMBER, WHEN, WHO, WHERE, WHAT)
$$ ##TITLE= Audit trail, XWIN-NMR		Version 3.5
$$ ##JCAMPDX= 5.01
$$ ##ORIGIN= Bruker BioSpin GmbH
$$ ##OWNER= she
$$ F:/spectra/data/she/nmr/H-F/1/audita.txt
$$ ##AUDIT TRAIL=  $$ (NUMBER, WHEN, WHO, WHERE, WHAT)
(   1,<2020-01-29 14:01:47.20 +0400>,<she>,<DPX200>,
      <created by zg, POWCHK disabled, PULCHK disabled
       configuration hash MD5:
       00 E9 B6 7A A2 85 ED C7 34 08 36 98 17 FE 4E 26
       data hash MD5: 16K
       C5 84 E3 97 BF DE 1A FF F7 07 62 9A AE 62 69 CE>)
$$ ##END=
$$ 
$$ hash MD5
$$ 2A 40 BD AE 9D 4B EB 13 B4 19 41 01 58 16 E6 C1
##$RELAX= 
##$RELAX= 
##$RELAX= 
##$RELAX= 
##$RELAX= 
##$RELAX= 
$$ Bruker specific parameters
$$ --------------------------
##$DU= <F:/spectra>
##$EXPNO= 1
##$NAME= <H-F>
##$PROCNO= 1
##$TYPE= <nmr>
##$USER= <she>
##$AMP= (0..31)
100 100 100 100 100 100 100 100 100 100 100 100 100 100 100 100 100 100 
100 100 100 100 100 100 100 100 100 100 100 100 100 100 
##$AQSEQ= 0
##$AQ_mod= 1
##$AUNM= <au_zg>
##$AUTOPOS= <>
##$BF1= 200.13
##$BF2= 200.13
##$BF3= 200.13
##$BF4= 200.13
##$BF5= 200.13
##$BF6= 200.13
##$BF7= 200.13
##$BF8= 200.13
##$BYTORDA= 1
##$CFDGTYP= 0
##$CFRGTYP= 5
##$CHEMSTR= <none>
##$CNST= (0..31)
1 1 145 1 1 1 1 1 1 1 1 1 1 1 1 1 1 1 1 1 1 1 1 1 1 1 1 1 1 1 1 1 
##$CPDPRG= <>
##$CPDPRG1= <>
##$CPDPRG2= <>
##$CPDPRG3= <>
##$CPDPRG4= <mlev>
##$CPDPRG5= <mlev>
##$CPDPRG6= <mlev>
##$CPDPRG7= <mlev>
##$CPDPRG8= <mlev>
##$CPDPRGB= <>
##$CPDPRGT= <>
##$D= (0..31)
0 1.2 0 0 0 0 0 0 0 0.06 0 0.03 0 0 0 0 0.0002 0 0 0 0 0 0 0 0 0 0 0 0 
0 0 0 
##$DATE= 1580292106
##$DBL= (0..7)
120 120 120 120 120 120 120 120 
##$DBP= (0..7)
150 150 150 150 150 150 150 150 
##$DBP07= 0
##$DBPNAM0= <>
##$DBPNAM1= <>
##$DBPNAM2= <>
##$DBPNAM3= <>
##$DBPNAM4= <>
##$DBPNAM5= <>
##$DBPNAM6= <>
##$DBPNAM7= <>
##$DBPOAL= (0..7)
0.5 0.5 0.5 0.5 0.5 0.5 0.5 0.5 
##$DBPOFFS= (0..7)
0 0 0 0 0 0 0 0 
##$DE= 6
##$DECBNUC= <off>
##$DECIM= 24
##$DECNUC= <off>
##$DECSTAT= 4
##$DIGMOD= 1
##$DIGTYP= 9
##$DL= (0..7)
0 120 120 120 120 120 120 120 
##$DP= (0..7)
150 150 150 150 150 150 150 150 
##$DP07= 0
##$DPNAME0= <>
##$DPNAME1= <>
##$DPNAME2= <>
##$DPNAME3= <>
##$DPNAME4= <>
##$DPNAME5= <>
##$DPNAME6= <>
##$DPNAME7= <>
##$DPOAL= (0..7)
0.5 0.5 0.5 0.5 0.5 0.5 0.5 0.5 
##$DPOFFS= (0..7)
0 0 0 0 0 0 0 0 
##$DQDMODE= 0
##$DR= 18
##$DS= 0
##$DSLIST= <SSSSSSSSSSSSSSS>
$$ [...]
##$SUBNAM2= <"">
##$SUBNAM3= <"">
##$SUBNAM4= <"">
##$SUBNAM5= <"">
##$SUBNAM6= <"">
##$SUBNAM7= <"">
##$SUBNAM8= <"">
##$SUBNAM9= <"">
##$SW= 24.9337058887773
##$SWIBOX= (0..15)
0 0 2 0 0 0 0 0 0 0 0 0 0 0 0 0 
##$SW_h= 4990.01996007984
##$TD= 16384
##$TD0= 1
##$TE= 0
##$TE2= 300
##$TE3= 300
##$TEG= 300
##$TL= (0..7)
0 120 120 120 120 120 120 120 
##$TP= (0..7)
150 150 150 150 150 150 150 150 
##$TP07= 0
##$TPNAME0= <>
##$TPNAME1= <>
##$TPNAME2= <>
##$TPNAME3= <>
##$TPNAME4= <>
##$TPNAME5= <>
##$TPNAME6= <>
##$TPNAME7= <>
##$TPOAL= (0..7)
0.5 0.5 0.5 0.5 0.5 0.5 0.5 0.5 
##$TPOFFS= (0..7)
0 0 0 0 0 0 0 0 
##$TUNHIN= 0
##$TUNHOUT= 0
##$TUNXOUT= 0
##$USERA1= <user>
##$USERA2= <user>
##$USERA3= <user>
##$USERA4= <user>
##$USERA5= <user>
##$V9= 5
##$VALIST= <valist>
##$VCLIST= <CCCCCCCCCCCCCCC>
##$VD= 0
##$VDLIST= <DDDDDDDDDDDDDDD>
##$VPLIST= <PPPPPPPPPPPPPPP>
##$VTLIST= <TTTTTTTTTTTTTTT>
##$WBST= 1024
##$WBSW= 4
##$XGAIN= (0..3)
0 0 0 0 
##$XL= 0
##$YL= 0
##$YMAX_a= 497649
##$YMIN_a= -224081
##$ZGOPTNS= <>
##$ZL1= 120
##$ZL2= 120
##$ZL3= 120
##$ZL4= 120
##$ABSF1= 10
##$ABSF2= 0
##$ABSG= 5
##$ABSL= 3
##$ALPHA= 0
##$AQORDER= 0
##$ASSFAC= 0
##$ASSFACI= 0
##$ASSFACX= 0
##$ASSWID= 0
##$AUNMP= <proc_1d>
##$AZFE= 0.1
##$AZFW= 0.1
##$BCFW= 1
##$BC_mod= 2
##$BYTORDP= 1
##$COROFFS= 0
##$CY= 11.3945322036743
##$DATMOD= 1
##$DC= 2
##$DFILT= <>
##$DTYPP= 0
##$F1P= 16.9975609425685
##$F2P= -3.02152046262296
##$FCOR= 0.5
##$FTSIZE= 0
##$FT_mod= 4
##$GAMMA= 1
##$GB= 0.15
##$INTBC= 1
##$INTSCL= 1
##$ISEN= 128
##$LB= 0.24
##$LEV0= 0
##$LPBIN= 0
##$MAXI= 10000
##$MC2= 0
##$MEAN= 0
##$ME_mod= 0
##$MI= 1.114404
##$NCOEF= 0
##$NC_proc= 0
##$NLEV= 6
##$NOISF1= 3.799351
##$NOISF2= 2.8
##$NSP= 1
##$NTH_PI= 0
##$NZP= 0
##$OFFSET= 15.70392
##$PC= 1
##$PHC0= -9792.896
##$PHC1= 21.00081
##$PH_mod= 1
##$PKNL= yes
##$PPARMOD= 0
##$PSCAL= 0
##$PSIGN= 0
##$REVERSE= no
##$SF= 200.130013532006
##$SI= 16384
##$SIGF1= 3
##$SIGF2= 2
##$SINO= 400
##$SIOLD= 16384
##$SREGLST= <1H.CDCl3>
##$SSB= 0
##$STSI= 0
##$STSR= 0
##$SW_p= 3612.71676300578
##$SYMM= 0
##$S_DEV= 0
##$TDeff= 0
##$TDoff= 0
##$TI= <>
##$TILT= no
##$TM1= 0
##$TM2= 0
##$TOPLEV= 0
##$USERP1= <user>
##$USERP2= <user>
##$USERP3= <user>
##$USERP4= <user>
##$USERP5= <user>
##$WDW= 1
##$XDIM= 8192
##$YMAX_p= 0
##$YMIN_p= 0
$$ End of Bruker specific parameters
$$ ---------------------------------
##NTUPLES= NMR FID
##VAR_NAME=  TIME,          FID/REAL,        FID/IMAG
##SYMBOL=    X,             R,               I
##VAR_TYPE=  INDEPENDENT,   DEPENDENT,       DEPENDENT
##VAR_FORM=  AFFN,          ASDF,            ASDF
##VAR_DIM=   8192,          8192,            8192
##UNITS=     SECONDS,       ARBITRARY UNITS, ARBITRARY UNITS
##FACTOR=    0.0002004,     1,               1
##FIRST=     0,             0,               0
##LAST=      1.6414764,     0,               0
##MIN=       0,             -224081,         0
##MAX=       1.6414764,     497649,          0
$$ Real data points
##PAGE= N=1
##DATA TABLE= (X++(R..R)), XYDATA
$$ [...]
2528d483L234M991q17n616j526M905L573l110m737N54N435J502m317l875K342
2543a945N527m26n055j880M017M140k205n092m09N369K394l917m431K154N297
2558C538n6m461k832L765M062j363n286q45M723L270l523m403R90N233R27m301
2574e62l129K761M672q48n219j286M409L475k687m933L27N292J866m285l689K269
2590a567M846J02n263j866L720M122k033n126j14M674K450l497m229J915M714
2605B848L17m531k664L295M148j327m703r18M278L036l390m312J340M629J164
2620C210m009l478K934M538o85m923j363M231L272k701m630M65M800J764m032
2635f07l616K440M775l04m694j810L566L692k003m422m00M511K707l798l789J686
$$ y = [-4483, -1249, 3742, 2925, -2691, -4217, 688, 4261, 1151, -3586, -3032, 2403, 3905, -412, -4287, -1945, 3582, 3156, -1899, -3779, 238, 4378, 2173, -2919, -3328, 2041, 4435, 518, -3913, -1759, 3538, 3482, -979, -3811, -46, 4016, 2653, -2633, -3478, 1245, 4515, 992, -3411, -2421, 2812, 3739, -562, -3691, -930, 3742, 2894, -2325, -3611, 798, 4273, 1586, -3347, -3020, 2272, 4138, -147, -3836, -1567, 3279, 3381, -1882, -3748, -28, 4094, 2061, -3065, -3179, 1495, 3945, 448, -3781, -1866, 2848, 3165, -1366, -4030, -735, 3413, 2086, -2617, -3535, 743, 3779, 389, -3923, -2583, 2046, 3210, -799, -4277, -1343, 3195, 2510, -2413, -3776, 455, 3727, 1026, -3604, -3139, 1661, 3425, -607, -4223, -1783, 2992, 2688, -2006, -3816, -250, 3442, 1439, -2983, -3383, 1128, 3835, 37, -3752, -2066]
2651b066M223J041m494k741L484M406j643n149p40M748K575l063m176J083M711
2666B199J170m009l287K670M862p81n077j072L872L354k542m442N36M589J668
2681C710l495l733K158M628k15m589j740L546L734k052m505l98M889K133l799
2696B72l529J400M448O28m033k534K916M128j322m525q89M240K624k652m251P73
2712b306M599J193m003l172K904M167p94m404j395M012K837k449m337M08M329
2727A589J950l551l700K263M443j90m532j988L798L585k232m545j03M209K669
2742C665l459l678J743M314J90l789k606L066L677j198m526o90L889K947k912
2757F33l927R45M293Q79l805k888K800L948m81m399j498L659L397k780l902N17
$$ y = [-2066, 2157, 3198, -1296, -4037, -553, 3853, 2210, -2939, -3679, 1069, 3644, 581, -3595, -2512, 2199, 3369, -640, -3927, -1257, 3605, 2824, -2253, -3325, 547, 3901, 1359, -3083, -2547, 2042, 3710, 215, -3518, -1360, 3268, 3053, -1536, -3276, 270, 4004, 1952, -2553, -2951, 1938, 4071, 272, -3257, -1857, 2591, 3219, -814, -3348, -432, 3696, 2374, -2151, -3040, 1200, 3824, 1172, -3079, -2306, 2293, 3486, -517, -3689, -785, 3382, 2588, -1816, -3211, 801, 3638, 1189, -3148, -2740, 1589, 3539, -12, -3712, -1449, 2994, 2804, -1728, -3716, 82, 3667, 1435, -3110, -3213, 996, 3665, 206, -3472, -1729, 2585, 2775, -1014, -3620, -554, 3123, 1925, -2601, -3291, 598, 3545, 633, -3294, -2349, 1944, 2823, -982, -3870, -1070, 2878, 2397, -2002, -3500, 159, 3556, 776, -3126, -2609]
2773b609M007J993l859l030K085M332o67l739j874L176L392j503m484j3L938K137
2789C282l133l567J776M004P46m258k252L013L723j175m471p70L927K659k739
2804G65l791R88M040J373l786k836K318L684l42m342p99L335L026k160m042M22
2820b147L783J939l567l186K089M025k09l930j664L104L214j797m213O0M115J806
2836C422l192l606J827M075M89l765k509K917L616j110m001j103L882K516k734
2851G24l761J324L785R48l551k726K350L773p78l749j449L695K610k074l684K51
2867b312L957J595l372l235K214L491j19l742j926L147L025j362l920k28L378
2882E91K289k586l396J294L843N18l598k028K501L324j049l808r53L394K655k405
$$ y = [-2609, 1398, 3391, -468, -3498, -1413, 2919, 2252, -1487, -3361, -185, 3207, 1704, -2780, -2793, 1145, 3282, 149, -3418, -1642, 2362, 3108, -1150, -3402, -389, 3334, 2159, -2312, -3082, 845, 3504, 765, -3026, -2038, 2002, 3375, -411, -3247, -929, 2755, 2413, -1929, -2728, 607, 3633, 1473, -2569, -2147, 1636, 3575, 8, -3178, -1089, 2936, 2727, -1203, -2867, 237, 3451, 1654, -2559, -2499, 1616, 3422, 230, -3376, -1549, 2526, 3015, -750, -3259, -342, 3274, 2164, -1837, -2940, 942, 3458, 724, -3037, -1713, 2072, 3020, -531, -3257, -907, 2866, 2088, -1661, -3110, 585, 3195, 1121, -2563, -2312, 1645, 3240, -132, -3367, -1153, 2338, 2219, -1523, -3449, -302, 2723, 1361, -2559, -2787, 591, 2880, 294, -3102, -1808, 2035, 2553, -1045, -3073, -572, 2752, 1703, -2105, -3058, 336, 2991, 586]
2898E86l465P29L581J264l123k605J853L768m07m064p97L028K547j823m000M34
2914b494L990J346l339k687J717L953J60l940j721K710L226j278m015j06L550
2929A072K014k964l158J611L723K65l251k241K482L229p92l714j008L682K045
2944B995k135l321O71L621J152l175k565K154L190k72l391j706L273K506j733
2959A264l556J88L543J734k903l094J443L790L8l674j393K750K728j457l548k44
2975b391L466J843k396l269J193L519O33l488j808K243L140q76l648o02L067K368
2991B994k258l297M56L428J611l463k535K181L008l51l325j341L099K509j815
3006I01l298K00L306J442k699k673J075L926J76l616j887K531L153j122l600k54
$$ y = [586, -2879, -2150, 1431, 2695, -428, -3033, -1180, 2588, 2181, -1883, -2680, 348, 2895, 1072, -2928, -2494, 1496, 2842, -497, -3184, -1467, 2486, 2646, -1294, -3015, -305, 2921, 1643, -2372, -2478, 1072, 3086, 122, -3036, -1425, 2298, 2563, -688, -2929, -447, 2782, 1990, -1724, -2732, 950, 2995, 860, -2461, -1790, 1831, 2983, -192, -2757, -603, 2587, 2315, -1076, -2782, 491, 2997, 1264, -2292, -2104, 1439, 3173, 270, -2824, -1381, 2409, 2447, -1227, -2620, 130, 2858, 1401, -2147, -2391, 1075, 2918, 522, -2747, -1554, 1965, 2598, -890, -2698, -455, 2685, 1809, -1839, -2441, 626, 2994, 736, -2561, -2105, 1323, 2934, -529, -3064, -883, 2125, 1774, -1551, -2892, 207, 2716, 901, -2397, -2197, 1109, 2551, -148, -2821, -1746, 2180, 2356, -1260, -3147, -616, 2537, 1415, -2185, -2439]
3022b439L221J855k383k933P95L436P52l681j445K333L093j143l213q69L031K237
3038B647k193k884O97L032J253l005k242J684L255n42l445q93K783K632j662l232
3054b115j13L329J428k236k684J200L336J30l307j373K113K770q83l335n37L219
3070I42J801k204k934J160K888Q97l206j852K200K655p46l461o26K971K172j695
3086I62l143O67L199R53k624k467J598L229k43l234j319K955K266j606l097p6
3102a980L246J346k463k651J206L188N01l073j813K456K512j001l050l29K946
3117A041J401k033k821Q48L060R38l283j689J899K686n35l303n95K786K103j887
3133F16k733K26L047R27k492k104J464L153n4l340j067K404K031j097l013m7K853
$$ y = [-2439, 782, 2637, 254, -2679, -1884, 1552, 2304, -1377, -2822, -489, 2604, 1461, -1752, -2621, 410, 2647, 454, -2430, -1733, 1299, 2552, -453, -2695, -1011, 2244, 1702, -1743, -2636, 147, 2779, 1117, -2115, -2228, 1101, 2529, 293, -2391, -1191, 2145, 2275, -1032, -2405, -292, 2478, 1595, -1740, -2277, 942, 2743, 539, -2395, -1235, 1653, 2550, -656, -2508, -308, 2347, 1601, -1860, -2486, 485, 2657, 962, -2181, -1514, 1685, 2638, 14, -2453, -855, 2374, 2131, -1103, -2422, 533, 2799, 1193, -1904, -1980, 1266, 2612, 149, -2502, -1296, 1892, 2393, -680, -2493, -37, 2475, 1474, -1576, -1905, 1041, 2442, 409, -2412, -1564, 1496, 2434, -849, -2538, -639, 2047, 1512, -1791, -2386, 400, 2503, 616, -2117, -1891, 1156, 2083, -409, -2513, -1049, 2104, 2050, -1290, -2357, 47, 2078, 981, -2032, -2079, 774]
3150G74J305j937k741J359K914L22l034j634K541K380r77k840o32K966J708k286
3166A88k443O45L450J96k733j817J744K830n87l008p39K715J677j302k969M99
3182a654K882R17k587j824J251K994l14k795j137K459K288j635k741QL136J069
3198B317k141k202P96K740M56k662j506K275K240r68k954m49L097J402j883k371
3214a813M89K844O01k464j824J737K509m12k874p59K777J797j699k775M04K804
3230A342Q43k614j667J136K827K2k791j404K723J894j155k963J30K688J201k176
3246C6k080R41K894L3k832j112J935K451j062k574q04K739J930k170k470O32K966
3263A453L69k418j573J580K353l80k713p64K130J847j133k671M58K622O70k261
$$ y = [774, 2079, 142, -2599, -1240, 1674, 1996, -1038, -2672, -131, 2249, 1272, -1568, -2200, 766, 2474, 188, -2255, -1610, 1840, 2036, -697, -2514, -770, 2060, 1473, -1535, -2274, 441, 2118, 816, -2153, -1654, 1228, 2145, -442, -2266, -1015, 1979, 1665, -1130, -2267, 192, 2480, 845, -1896, -1888, 1248, 2317, 176, -2026, -1230, 1510, 1966, -696, -2202, 73, 2313, 1345, -1609, -2058, 1039, 2441, 558, -1813, -1324, 1520, 2121, -343, -2167, -430, 2079, 1667, -1207, -1966, 811, 2608, 909, -1866, -1462, 1342, 2185, -429, -2096, -960, 1867, 1889, -902, -2306, 417, 2311, 1156, -1807, -1677, 1011, 2212, 36, -2044, -1103, 1791, 1824, -1008, -2120, -185, 2266, 1204, -1370, -2174, 565, 2495, 325, -2145, -1513, 1453, 1822, -596, -2169, -589, 1764, 1384, -1329, -2093, 37, 1884, 751, -1920, -1462, 1160, 1830, -431]
3279d31j696J432K360nk713j084K188J800j142k376k35K746J044k083k242J454
3295i83K358L26k554j115J681K516j169k535n64K402J978k089k417Q00K725P34
3311B094k404j751J607K071J80l003o84K310J496j444k376K36K973M65k100j424
3327a754J256K425k77k472r98J788K406j606k035l03K136J462j941j926P83K933
3343A877p0k583j349K273K060j069k326o27K505J235j406k459N92K720L53k068
3359c42j340J013K771q74k148j000K480J740j926j950L35K240R42k141j391N88
3375a003K583l93k258j023K172J886j137k222k19K395J433k154k118Q71K603q4
3391A332k128j169J695J942p88k169l69K083J419j475k179O52K321L10j978j583
$$ y = [-431, -2127, -695, 1665, 1660, -1053, -2137, 51, 1851, 709, -1667, -1902, 844, 1888, -195, -2437, -983, 1375, 1701, -853, -1968, -287, 2229, 1060, -1475, -2039, 363, 2341, 252, -2165, -1365, 1360, 2094, -310, -2061, -454, 1617, 1797, -1206, -1890, 420, 1916, 472, -1904, -1668, 1305, 1770, -330, -1754, -498, 1927, 1650, -822, -1820, -32, 2374, 768, -1267, -1570, 566, 2028, 87, -1839, -1056, 1877, 1807, -776, -2125, 148, 2208, 1139, -1187, -1814, 691, 1926, 520, -1939, -1347, 1373, 1726, -342, -1682, -669, 2102, 1228, -920, -1920, 560, 2300, 374, -1576, -1241, 999, 1941, -200, -1591, -1003, 1580, 1187, -1071, -2094, 78, 1964, 827, -1395, -1614, 781, 2214, 60, -2058, -1187, 1416, 1332, -796, -1965, -270, 1672, 884, -1285, -1654, 429, 1848, 373, -1806, -1154, 1167, 1477, -501, -2084]
3407b084J261K233k47k517m86K288J351j209k399K68K772N57j996j834J352K103
3423A413j88k131j004J798K130j514j934P0K133J376k177j817Q83K058O71k436
3439f69j142J515K315j108k329j30K098J255j374k207O34K421K54j587j689J644
3455i9J732l29k380n14J951J585j572j896L89K048Q31j793j619P81K491r3k298
3472g85p26J703J389o73k272l8K312P53j519j887P11K476K49k392j058J733J820
3489A796q66k029k58J838J411j412k039M16K381M17j881j537J457K131o42k207
3505a024p43K127J377j343j616j25K433M04j499j665P81K264m1k205o65J334J764
3522A558p94k021k02K092J011j557j695O70K184J91k166r59J394K005j079j860
$$ y = [-2084, -823, 1410, 1163, -1354, -1840, 448, 1799, 590, -1809, -1541, 1231, 1788, -208, -2042, -690, 1413, 1225, -906, -1910, -112, 2018, 504, -1430, -1360, 773, 2149, -28, -1845, -962, 1096, 1767, -669, -1811, -296, 2019, 911, -1418, -1548, 550, 1805, 431, -1776, -1142, 1279, 1533, -54, -1743, -99, 1633, 1304, -1076, -1590, 361, 1946, 374, -1522, -1133, 915, 1746, -47, -1666, -885, 1606, 1513, -785, -1511, 192, 1581, 908, -1364, -1402, 910, 1663, 144, -1743, -1032, 1444, 1693, -699, -1757, -24, 1796, 930, -1099, -1357, 481, 1892, 480, -1559, -1143, 1238, 1655, -226, -1763, -306, 1825, 1183, -1024, -1767, 360, 1737, 394, -1222, -1347, 1086, 1490, -9, -1674, -893, 1371, 1330, -875, -1540, -206, 1558, 764, -1257, -1459, 633, 1644, 87, -1608, -938, 1246, 1437, -729, -1688, -294, 1711, 632, -1228]
3538a228p22K346J165j351j659J82K206L79j466j569J258J971k55k552m80J916
3554A41J350j174j765M76J737P44j951j352J006J983J35k199q18J761J586p40
3570I20k401J89K222Q00j544j900Q28K135L27j989j098J410J416l00k368j01K027
3587E73J111j405j891N95K014M72j506j584J462J764n07j866o38J466J795j224
3603F31k167N08K154K66j456j342J234J739l07j772q68J658J080o51j896O3K122
3620I96M60j582j275Q70J826k05j691q75J340J504n72j692m66J876J160j517j455
3637a298J73J762J026j609j384R06J587j71j863o87J812J472j441j555K7K002
3653G59P59j791j654J058K297l09j699q68J417J489r85j735Q0J741J016j636j504
$$ y = [-1228, -1950, 396, 1561, 210, -1449, -1267, 939, 1318, -148, -1717, -459, 1512, 1257, -1295, -1775, 141, 1491, 317, -1448, -972, 765, 1509, -442, -1794, -788, 1195, 1330, -869, -1687, 74, 1660, 920, -1481, -1292, 930, 1730, 186, -1714, -886, 1249, 1576, -413, -1511, -101, 1315, 1015, -1353, -1454, 573, 1684, 279, -1612, -1017, 997, 1469, -37, -1621, -159, 1605, 1098, -768, -1406, 60, 1855, 631, -1536, -1028, 1126, 1392, -64, -1406, -172, 1567, 1260, -512, -1380, 278, 1358, 707, -1189, -1126, 996, 1456, -126, -1401, -531, 1295, 1090, -601, -1476, -136, 1368, 796, -896, -1362, 514, 1674, 157, -1298, -1125, 637, 1663, 54, -1330, -424, 1163, 992, -871, -1558, 254, 1726, 285, -1270, -1243, 759, 1518, -273, -1927, -869, 1428, 1119, -580, -1448, -31, 1458, 473, -1262, -1182, 559, 1575, -61, -1565]
3670a565P23J720P0j439j038J327J340m75j460o62J753J155j113j852O55J734
3686H73O59k034j072J342J492m21j818j18J295R63j178j408K71J850N77j243j452
3703a422J090J471N4j969p29J614J356p72j626k30J673R60j664j088N98J748J01
3720A165j512r50J227J549m92j854j94J126J303j189j314N26J284O95j585j041
3736a256J085J508l83j783k39J299J321j009j494j07J693J086j679j292O59J578
3752I87o8j670p87J895Q38l15k005J63J502O93j201j222O59J461M04j864p21R08
3770c43J458k69j659o79K033P61q45j780M98J320P18j348j274J226J339k83j687
3787h14p13J762J149j091j459Q5J681O68j314j287R91J375l40j052j142J158J373
$$ y = [-1565, -842, 878, 948, -491, -1529, -202, 1138, 663, -797, -1459, 294, 1449, 336, -1516, -861, 873, 1532, -502, -1574, -232, 1260, 839, -979, -1097, 198, 1161, -17, -1425, -1154, 696, 1273, 30, -1422, -332, 1139, 1193, -776, -1505, 109, 1465, 693, -933, -1163, 510, 1470, -194, -1282, -684, 1064, 1165, -347, -1297, -70, 1479, 987, -867, -1061, 65, 1368, 179, -1135, -609, 675, 1370, -215, -1256, -171, 1337, 954, -829, -1068, 231, 1552, 543, -951, -1058, 635, 1721, 42, -1250, -591, 987, 919, -751, -1538, 357, 1195, 880, -1125, -962, 540, 1233, 32, -1190, -531, 930, 1334, -530, -1251, -343, 1115, 846, -813, -1492, 541, 1302, 457, -1323, -825, 495, 1213, -135, -1409, -183, 1156, 873, -814, -1527, 235, 1384, 293, -1166, -1081, 600, 1268, -46, -1333, -342, 1033, 693, -359, -1501, -343, 1030]
3804A030k93j587j16J288Q52j124j187N05J594N9j536q64J142J619q98j326l48
3821a190J344J135j015j423L12J423M89j283q88R23J329k42j536o77J459J012
3837A172o56j432M7J398N54j178j391J059J746l12j449o59J238J344p26j662M5
3854h62J591M25j193r44L76J350J23j524o42J219J151n91r21o35J204J324j290
3871A61j209M24J301M25j180j209J050J295k53j313l87J022J112q25j407Q5J567
3888F59L50p82j197K80J750J11j654o97J118J239p25j491J3J439M43j020j136
3905a300N91J600O3j422r22R98J346m65j196j20J005Q16p20j415J48J266P00j125
3923a52j041R35J163l48j062p09J419Q94o39j541L88J268N33j141r72P49J037
$$ y = [1030, 737, -850, -966, 322, 1174, 50, -1137, -632, 962, 1021, -515, -1379, -237, 1382, 484, -842, -1190, 154, 1289, 274, -1149, -837, 586, 1075, -208, -1096, -173, 1156, 914, -622, -1299, 160, 1172, 516, -916, -869, 529, 1083, -95, -1486, -427, 1319, 1007, -442, -1101, 137, 1481, 755, -907, -862, 729, 1154, -39, -983, -607, 743, 866, -658, -1300, -81, 1070, 479, -442, -1077, 127, 1451, 161, -1048, -624, 677, 1102, -78, -1287, -237, 1058, 805, -508, -895, 127, 1239, 414, -993, -908, 659, 1009, 227, -970, -690, 1060, 1171, -483, -1180, -62, 1177, 452, -1039, -1026, 413, 856, -164, -1300, -709, 891, 954, -468, -1390, -392, 954, 489, -707, -827, 178, 994, 274, -1141, -993, 273, 973, -152, -1193, -258, 905, 557, -505, -1214, 205, 1099, 460, -1081, -693, 575, 1108, -33, -1005, -256, 781]
3940G81k34q73o21P09J256m53j364J76J003O13r83r68M63J314J25j184q17J111
3958E4J206p84q60m52J135P78o65j435K25J415L44j041r85L89J797l78j347k36
3976h40J078N95k23j476l2J411O84j389n42M10J133J06j211n30R89Q98p10j085
3994g34j81J319P68q99j093L63J341K57j274r27P82J329j93j486l04J401M23n25
4012C67j147Q9J178O65j368r73R61J182l1j397n26J049J036n64j442K87J487J2
4030H65p44j072N31J139N9j131p84J136R20o77r81m0R21R65p61j271N42R38K66
4049H21j223o89P81J126m81j046q7P75R73n06j390R2J385q7n92q37M71J255k72
4068D69j117m81J239P33l67j604M5J594L40r04r86O99J070j60j147j80P00N13
$$ y = [781, 547, -326, -947, -238, 1018, 565, -799, -623, 380, 993, 10, -958, -495, 819, 944, -240, -1057, 54, 1260, 476, -384, -836, 299, 1077, 412, -1023, -798, 617, 961, -80, -1065, -676, 1121, 743, -604, -840, 238, 833, 610, -866, -898, 513, 1197, -192, -734, -324, 809, 915, -296, -826, 163, 1061, 351, -734, -915, 404, 1172, 273, -820, -457, 884, 1141, -133, -1060, -278, 1051, 858, -628, -932, 469, 892, 367, -780, -691, 487, 1152, -216, -1189, -228, 954, 923, -474, -1000, 49, 1085, 521, -921, -634, 853, 865, 121, -951, -420, 719, 778, -353, -1137, -1, 919, 242, -739, -779, 142, 1107, 346, -925, -383, 555, 821, -402, -1091, -310, 816, 335, -711, -798, -23, 950, 444, -946, -854, 531, 444, -148, -985, -514, 741, 469, -648, -1129, 110, 843, 476, -1128, -1083, 511, 851, -53, -1039, -340, 730, 570, -577, -757, -57, 456]
4086D56l66r19n4J145Q74r42j145K10J282J78j028m80P21Q00j63j216l10J274
4104C17N70o07j125L89J040K76r02o27O05P49P2r14o82R20Q66n17r94rR66K48
4124F41l52j266N22J009L77j291n17R22N65k61p69l51P74Q75p40p61J25J275j19
4143F58p98m32L72R59k35j094k1Q48P37n90j256M16J209j69n25j118O64J000j55
4162D70r47j68O31Q30k52j336K9J091N17r05p92M62J091k19n16q02P37N80jj123
4182f23k82J112M16n64r47N31O53K45q31n28Q09N34p0j225k89J439L62m61j168
4201h87N42O55N74j102p82R15N22J74j240k75J249N56l04j097k81J090M36r68
4219b23n13M20O97P9q40m45R24Q57o62o77p0O27P31m08j056M14R03K8r27k23K04
$$ y = [456, 90, -829, -883, 262, 1136, 194, -951, -741, 541, 719, -309, -789, -68, 732, 569, -647, -957, 317, 887, 280, -845, -456, 584, 860, -42, -669, -64, 685, 757, -157, -839, 81, 947, 430, -564, -573, 393, 641, 289, -977, -455, 554, 931, -360, -877, 45, 610, 349, -420, -771, 3, 878, 138, -623, -498, 777, 658, -140, -572, -200, 759, 524, -570, -591, 257, 994, 404, -852, -436, 773, 604, 79, -1039, -375, 625, 470, -477, -645, -14, 816, 564, -772, -743, 348, 865, -40, -832, -370, 721, 502, -14, -816, -79, 501, 500, -623, -905, 207, 623, 59, -888, -357, 296, 541, -290, -818, -9, 525, 455, -770, -1059, 380, 742, 281, -887, -345, 310, 884, -218, -1000, -85, 437, 611, -629, -904, 345, 901, 597, -500, -781, 309, 745, -223, -736, -316, 381, 460, -380, -825, 99, 956, 294, -383, -453, 174, 905, 497, -559, -145, 758, 786, -141, -364, -160]
4240a60J146o80p41n4R26L05n71l55j75N69L96p19o16O19O32j72j031o3P57O13
4260F26k34q53P3Q17L85r67p46P22J077k06q41n28O42Q41l93j031J36Q24L73p19
4280bn13Q0J140j16q24l76J34J235m76n95m37Q71L21j82j001M03P00J21n17r39
4300i73L77J038n6p19n43R04M73Kj212j20J002N83r60l57J15J001k6r01m61L69
4320d64R64l77m66m76R61M10n10q94N29Q39R6q44n68N40R95l54r89O1O84K74n3
4341C58j087M72M54L89o86n80M58Q45l49p35o6M84P26l26r77L3J011K94p92n82
4361f56L95R14j38q16m91O42N80N0r46O9M78N62n39o48J21R97Q0o34m83J36Q47
4382E20J5j024o6O64O62n69m84J6M76L12m90m97J70J049l16r84n2O13N76k67q14
$$ y = [-160, 986, 306, -435, -489, 437, 742, 171, -184, -359, 210, 606, -113, -729, -110, 522, 350, -681, -744, 13, 626, 392, -461, -388, 429, 814, -153, -899, -177, 900, 694, -147, -675, -33, 808, 415, -616, -480, 344, 717, -2, -515, -435, 705, 589, -235, -611, -477, 758, 282, -313, -750, 121, 442, 260, -741, -338, 362, 483, -34, -973, -596, 442, 386, -333, -876, 28, 501, 503, -709, -829, 173, 756, -204, -561, -446, 555, 529, -372, -833, -464, 500, 123, -343, -819, 142, 552, 42, -852, -323, 516, 612, -232, -800, -260, 735, 381, -608, -547, 137, 411, 358, -729, -257, 197, 586, -100, -680, -222, 623, 274, -461, -527, -43, 683, 357, -620, -587, 424, 718, -74, -656, -261, 653, 515, -301, -792, -150, 430, 480, -466, -397, 81, 643, 104, -544, -423, 574, 654, 20, -463, -327, 520, 535, -489, -555, 109, 771, 202, -282, -266, 210, 522, 32, -465, -295, 754, 438, -546, -598, 15, 591, 324, -490]
4403d90K53M63L01k45p48J92O59L01p51o49O20P03j07r17j72R67K13p75k03L30
4423e5L95J17q09j30M28Q55m16m78n37O77N77l56n40k09O63L50n97l31J38N75
4443C17J77r18J52n1J153o22m92m70J134K25p40k34m5N51L38o38l43J94O97j11
4463B74n31j87O08O13r32l48K31N78L36j027l43L32R96k00o91m66Q21L81l09n26
4483c90K44M85K91n94o56M50P04K2p42m02N20P83n47n45j62Q52M53o60o05Q6M51
4504C8L60m93o28R52O2j79o7q50J221J54p17j55K21M16L80o31o53N90L97j64m0
4525B14m91L45N47n88k79P2N67k98j52l34O8P17J5o60l04L98O63n10l08j86N77
4546G3L26l44n30K34M82K72n34m66L71N61l53l07j5M42M04m55o53L57M32L20p95
$$ y = [-490, -237, 226, 527, 282, -466, -274, 385, 686, -65, -714, -94, 609, 502, -415, -587, 380, 593, -182, -385, -55, 340, 457, -352, -482, -54, 801, 385, -93, -630, 47, 624, 268, -272, -481, 182, 532, -65, -396, -258, 317, 494, -424, -272, -323, 830, 208, -284, -754, 380, 605, -135, -369, -414, 137, 475, -163, -506, -312, 385, 274, -257, -444, 164, 777, -155, -503, -272, 306, 642, -385, -728, -396, 600, 400, -291, -757, 64, 445, 136, -390, -146, 339, 630, 36, -620, -170, 534, 556, -186, -588, -68, 715, 168, -377, -539, 313, 766, 106, -499, -413, 38, 398, -95, -723, 229, 291, 112, 45, -805, 416, 570, -147, -302, -81, 335, 715, 84, -569, 21, 418, 254, 214, -277, 68, 615, 27, -252, -180, 387, 89, -63, -397, -329, 388, 403, -257, -561, -163, 500, -10, -318, -504, 73, 399, 55, -475, -241, 241, 513, -21, -487, -116, 445, 92, -215, -230, 212, 616, 161, -492, -135, 297, 617, -178]
4567a78n06N90N56k7q99m6O04N77m60n27j1L83K45m72m64M75M59j60k40j90L05
4588A4M19j19l68k01J14P17m73o08L94P06l17k80k03K38L15J14n87j09N7L66Q9
4609B78q55J59O64K76p22k16K11M94j48m58k61O01L91k82n32N9K18Q94r10k21
4629c60K10L04J14l91j17J67N01l07k33j18K78K33k99m05K88L54M9k67m78N70
4649I3K65J84p69o9K20K37j14m81L94K88K8k63j78J43M68k54l25k13K73P1K54
4670B52k37k71L93L45o35l34L05K38M22n93j66M16L15k11j69l55O66J19n77k62
4690c39J84N01r9l80l5j57Q19j86q91L21N95J19l84m55J92L54M69o37o59L48N87
4711B67p7j52j84J99J79l96k37J24O08M2m70l16J10N66J12n57j43P18j50j10m08
$$ y = [-178, -684, -94, 462, 435, -464, -510, 94, 671, 211, -316, -327, 56, 301, -171, -635, -160, 299, 139, -101, -291, 14, 433, 314, -54, -255, -141, 576, 103, -505, -111, 595, 278, -2, -205, 33, 348, 462, -125, -234, -177, 189, 278, -577, -418, 246, 522, -200, -416, -205, 289, 141, -317, -578, 23, 414, 132, -400, -341, -123, 771, -139, -360, -150, 154, 268, -123, -240, -73, 428, 121, -112, -230, 48, 281, -18, -423, -135, 219, 268, 1, -477, 93, 358, 542, -227, -296, -76, 161, 47, -434, -40, 248, 276, 13, -165, -22, 446, 192, -133, -346, -73, -2, 252, 15, -256, 137, 482, -153, -487, -182, 56, 478, -115, -281, 135, 450, 239, 70, -285, 381, 500, -77, -339, -155, 346, 247, -133, -168, -325, 494, 308, -583, -262, 333, 452, 68, -387, -195, 159, 628, -9, -668, -320, 267, 190, 38, -146, 53, 232, -164, -401, -277, 331, 373, -97, -413, -303, 263, 375, -182, -325, 393, 243, 133, -275]
4732b75pJ82O82q35k06L22M92Kl52n32N49L66k87l79l2K16L95l91j95L55J90J41
4754D01l98n52L60K30R5m47N4M53jj64k18K7M52Q2k15n57K74N23j00l32k10J47
4776i6N83o36J70m37N35J08l76j39J91J24K17n52L0L41J10L8l99K6O16j60m6m80
4798b32j4N20j25j49l90K12N76K0l29l48M77n4j57j98k84Q36j96k77k41q5P57
4819C19K6n03j34N76r0K7k27L5M2J21l14j40R9N20M4n09m1J81J74j4l74l0J87
4842b5L06p3o04L90J10P6n4m06L37N46n34k05j28J90L50j52k12k4M06k6j79k47
4864a58R7M08k20K6j56p3Q1L6j46m77P82l9o8o06L36L64p9l39k15L47L24N5l19
4887c9l93M15M11j30o10J0O35m4j89l35L00J33K11m93n11O24K77j42k44l59N46
$$ y = [-275, -282, -100, 582, -253, -459, -137, 355, 357, 5, -527, 22, 388, 101, -278, -310, -94, 301, -90, -285, 70, 260, 401, 3, -549, -189, 41, 136, -311, -257, 196, 195, 31, -187, -160, 292, 374, 159, -398, -124, 399, 299, -33, -243, -96, 487, -149, 21, -416, 119, 227, -149, -288, -97, 27, 244, -308, -278, 63, 173, 211, -188, -162, 454, 294, 248, -232, -246, 274, 149, 0, -390, -178, 398, 418, 89, -259, 218, 164, 7, -191, -475, 361, 165, -112, -353, -438, 319, 345, -158, -292, 284, 194, 221, -6, 29, 71, 192, -122, -262, -163, 357, 401, -108, -149, 32, 206, 192, -182, -212, -25, 281, 208, -396, -6, 104, 180, 126, -280, 57, 603, 69, -136, -264, -74, 276, 124, -88, -112, 294, 268, 89, -158, -61, 347, 127, 153, -3, -76, 5, 41, -105, -582, 200, 161, 93, -513, -177, 187, 108, -231, -446, -99, 225, 280, -39, -432, -17, 394, 264, -346, -336, 299, 255, 66, -269, 31, 164, 375, -118, -629, -5, 272, 130, -114, -473, 73]
4908G3K94k49l00J11R9J95m18l3N87J6j68l11m4J30M81n45q4lJ04L38k95l13O24
4931B89N1j96j83o4l9J93q1l17J72L13L15m11Rk37L18M3k76J56l70M95k23k49
4953b92RK28L17k84Oj64K74N8l09R4J16R9k09r8n1o7O24k33n43M76lK12l06l14
4977c60K05K53n2j13R9Q1O2j2k51m2K99l17L77k28j46J69L0L3m30L36K88Lm86
5000b02q6J07L38k4k19L0K63j97L7n09M40L14m25L9M2k23L88K95m52o9K38J13
5022B38l71l4J29J27j00j40%J61P0K19j64r1P7J71m97J6J97J6J29k5o29N88l0
5045E7J74k71k8j40L40K68n85J09K41p4j72k3L7J34r8J36l66L77j25o6J18j4J7
5068D6J02o2k89O7L72o3k12J71l92L20k49n7j73N57k16L29n04J13J89m0J5k63
$$ y = [73, 367, 118, -182, -71, 28, 223, -195, -228, 359, 375, 207, -104, -148, -18, 463, -82, -166, -169, -65, 273, -22, -335, 289, 340, 144, -39, -103, -142, 51, -30, -347, -175, 138, 453, 42, 51, -186, 132, 175, -101, 55, -315, 180, -43, -292, -283, -55, 262, -22, -16, -180, 94, 152, -157, -63, 53, 152, -57, -155, -206, -273, 351, 118, -425, 51, 48, 260, -46, -360, -155, 98, 46, -67, 32, 113, 175, 163, -88, -130, 169, -148, 229, 1, -145, 24, 54, 87, -343, -7, 281, 284, -202, -288, -181, 157, 133, -86, -56, 207, 10, 47, -462, -22, 292, -133, -94, -52, -275, 113, 408, -44, -113, 125, 238, -133, -167, -38, 89, -11, -151, -151, 10, 80, 299, 135, 44, 121, 292, -205, -189, 8, 24, 153, 128, -501, 87, 57, 231, -40, -68, -208, 132, 400, -185, -76, 165, 91, -81, -104, -67, 67, -31, 105, -261, 116, -9, -75, 43, 29, 46, 148, 86, -203, -136, 236, 173, -39, 132, -260, 60, -189, -246, -419, 138, -78, 251, -253, -140, 49, 9, 24, -239]
5090b39J71K26j76l21L71q8K55p7m89K6J83K27k02j15l3O07j14k08j43k16N62
5111B07o2m80K84L12k79j98k78M54J49J2l37J78l6K04J19o36Q1K63N9k35R0R9
5133c0j23J25K11o03K74P3MJ73l23J59K17O1j44K7l0J44k64k07J05N01m87J64
5155B7j88J87J02P6j14l55L53J3J19m03j5L30k43M41o52M06mn0k73K92l10M98
5177B37n16n1K63K99q4j69r5J36n0O4m7j70K84k43L57k77j00J50l69L53J07j6
5199F3J33j34j64K7qL85j80k97n5L52j32J59l03K75j60Q5J35l39M17l50L98j12
5221A95k94l27M54o0j71J71L63l86J88k18k95J78L82j12L3k58O5J39K1r3p5L10
5243B10l03J76k60L0L84j96J9J22J11k19l1J55p0o2q5j33J29O0N8l81K67nj26
$$ y = [-239, -68, 158, -18, -339, 32, -56, 199, 122, -367, -341, -158, 69, -133, -248, -281, 326, 212, 4, -139, -355, 207, 145, -335, -51, 261, -18, -216, -494, -40, 109, 121, -216, -38, -74, 130, 249, -387, -306, -43, 16, -219, -129, -30, -153, -28, 183, -420, -146, -73, -69, 104, -219, -60, 157, 218, 74, 101, 71, 215, -49, -256, -151, 350, -137, 27, -161, 26, 128, 204, 90, -265, 88, 101, 220, -183, -198, 132, -111, 330, -322, 84, 80, 30, -243, 49, -261, 237, -279, -330, -67, 232, 148, -21, -116, 20, -30, 34, -13, -183, 101, -142, 215, -62, -162, -12, -381, -28, 79, 63, 196, 62, -102, -75, -83, 302, 122, -175, -230, 122, -10, 149, -154, 121, -39, 46, 181, -158, 259, -91, 307, 195, -99, -426, 28, -32, -203, -32, 331, -55, 133, -85, -380, -202, 180, 68, 101, -157, -92, 47, 68, -25, -100, 210, -93, 83, -177, -147, 237, 41, 60, 182, 293, 74, 43, 198, 128, 66, -19, -152, -23, 37, 95, -286, -19, -24, -150]
5266a50Q3NJ82o0K91k88j38J1K78k23J8R4j40K7j24J66k13k8L72q2l9k89L67l5
5290H5j98j1PJ52r2L23l05p1J58K0J00k01o0O7K55j45j26L4j53M14m47J77J34
5313A17j25q7k2r3M57k26l4J14j41L21o0m02n3L47q7j57J18j1J77j65oJ6j10J18
5337Fr8L9K60l19J40j42p9K85K0q1j0k35K41K17n7r5j74L9K25j26j10k3J24L16
5361C63j96l26j07K22J62j42j94L91q5l65N29j38J33j7m98K71J77p3J90m28l8
5382a69K55R9J9k08r5K82R3J39m93j96P9O78l03J38l82j05K96j87l9k6J34L03
5404C12l13m05M70N6k03o3r5K10L27k76j52k77O04j01k06J01j74L83j92m75J21
5425c48K95L53l15j69m0K86K07k40j39M6K1J17l5k04K61J38j21r3j43K07J90m05
$$ y = [-150, -67, -62, 120, 60, 351, 63, -75, -64, 214, -9, 9, 103, -37, -10, -134, 32, -181, -209, 163, 81, 42, -247, 120, 85, -113, -124, -117, 35, -57, 266, -39, -110, 48, 68, 168, -33, -93, -26, 229, 84, -42, -8, -161, 253, -194, -17, 117, -8, -95, -117, -210, 247, 21, -13, 101, -40, 281, 221, -181, -234, 113, 26, -131, -13, -24, 153, -12, -18, -2, -112, 6, -92, -53, 207, -112, 28, -114, -193, 92, 112, 31, 21, -214, 27, 244, 187, 92, -82, -43, 182, 56, -54, -77, 47, 363, 167, -159, -266, -44, 118, -24, -218, 173, 88, -277, 252, 114, 247, 230, -268, 3, 180, 107, 297, -131, -169, 86, 185, 204, -4, -99, 183, 276, 415, -78, -274, -195, 483, 180, 318, -64, -169, 127, -60, -99, -125, 9, 312, -1, -406, 64, 120, -83, -146, -241, -31, 296, 20, -132, -409, 195, 94, -112, -11, -185, 198, 6, -469, -348, -53, 300, -15, -184, -224, 62, 269, 29, -110, -64, -43, 74, 39, -165, 96, 234, 113, 20, -123, 84, 274, -131]
5447a31O7j04J99O4q9N2m4n8L8J55m50L70k8K20j68l01J45L2k66RK33M21O3n50
5471a21J18N4K39l16M7m3O2J29k82n2K80m30L40k22k8Q9M51n59J96j22J31J6j22
5494a45j13l8K31J42p5k27J96Q6Pl56K26j19O70o63M7j37R1P2J48Kn4K39j86m6
5518bm47M62l7J15l22M26k16J35l1l28J11K0Rq9k5J60J85j48r2j63K54l6J14m85
5542d30M94J69Q2k29k7j11J05P8J72n32L29o3j60M1r9K51oN6k44j13L28P6j79
5565a2j15K67k16J94l69J86K39K12r9j77q0j44K22J12k48j61J54M4J50l29J11
5586e9P4k8j20J85o0J26k90r0Q5K56r6l17K49P4K41j12j61j41M05l21Q1kj91M61
5610B49J57l88j61q1M05j19j72q3M15j26O2l4j65l4K75p0p25N19o8K67j45j38
$$ y = [-131, -64, -168, 31, 95, 6, 58, 14, -44, -6, 149, -301, 69, 41, 261, 93, -208, -63, -31, -297, -288, -55, 366, 429, -121, -3, 51, 290, -26, 21, -22, 40, 169, -113, -165, 115, -315, 25, -197, -225, -136, 315, -244, -48, -170, -39, -23, -145, -258, -296, -65, 77, 2, -225, -29, 57, 64, -292, -66, -185, 485, -178, -131, -268, -177, -105, 43, 45, -9, 230, 44, -2, -449, 13, -24, 91, -231, 195, -21, 114, 83, -245, -134, -114, -105, -194, -219, -59, 126, -22, -114, -277, -23, -59, 55, -430, 64, 233, 315, 86, 59, -52, 53, 131, 303, -229, 100, 37, -123, -82, -181, 70, 64, 120, -124, -237, 91, 167, -12, -127, 140, -76, 118, -251, -65, 174, 386, 287, 110, 30, -114, 108, 220, -28, -189, -35, 9, 159, -170, -59, 15, -13, -133, 52, -8, 118, -172, -262, -177, 79, -17, -334, -85, -11, 230, 118, -43, -184, 221, -100, -19, -21, -212, 249, 406, 18, -143, -224, 181, 62, -110, -193, 222, 96, 158, 124, -41, -75, 200, 130, -595, -76, -144, 123, -22, -160]
5632a60mL09n6j31P8K13p2m14J23r9M89j83j47k26K63J44J38l58j60L01K24k40
5654C2k78J57N2M00k60K6J3k2k85M18m00Q8J13K14o37J01j0M44m6k15R3J48J21
5677B67m51J79j40P6N5l61K32K19o7K17l22j24L60Pl07k36O14l65J19m4J39J6
5699H3j54k4J20k56J63R1p0j86J26m7K38k54K4K12J66k71L7j17M86q5m1m45l03
5722e07N09J53O0k47K9J01j69K61l13M5M25k96k69N6L09J39j68j43j6J15o2R1
5744A03J0l30J64J59k01j20N4J48l67M52l51N36R3k44l04K18J67J0k71N6j1K31
5766B02k77j29k2M97pk72rj61N29j58j7n13L90J66p8n01L98kL21k9o32R4K79q0
5790a1j33j39M29o7l4l73R5N02l08L2k52J05J66J35k03k12L34j96M19l69k0O2
$$ y = [-160, -164, 145, 89, -42, 36, 249, 177, -237, -114, -213, 276, 93, -54, -280, -17, 127, 265, -93, -253, 48, 272, 32, -246, -89, -37, 363, 103, 129, 142, 120, -165, 253, -147, -59, 54, 268, -369, -268, -278, 166, 120, -95, -2, 146, 267, -184, -5, -145, -69, -14, -375, -143, 76, 9, 226, -96, -220, 140, 147, -160, -396, 218, -147, -28, -72, 67, 83, -71, -95, 25, -231, -68, 23, -47, -233, -107, -154, 84, -170, -146, 66, 232, -39, -2, -119, 367, 282, 241, -204, -507, 2, 155, 215, -32, -3, 98, -71, 190, -123, -78, 347, 51, -218, -162, 147, 286, 118, -25, -41, 74, 12, 103, 113, -217, -53, 106, -95, -215, -161, -13, -380, 72, -279, 257, 350, 106, -198, 20, 187, 197, -74, -18, -29, 202, -75, -204, -226, 271, 264, -8, -17, -178, 351, 193, 176, -337, 53, 219, 141, -360, 38, 36, 357, 328, -304, -210, 69, -11, -144, -283, 146, 79, 45, -328, -233, 269, -39, -7, -259, -154, 12, 147, -56, -268, 66, -130, 289, -80, -100, -38]
5812c8K29l4n23L27K92R9m62J00N7L10l58o7k61K58K57Nm48M19j37rj01P3J59
5835A47l41K19j56j21K55P2k18oP3j56L49p8j46J30QK5k00K2J96K07l52O8k51
5858b54L80j76J45l00j19K41K36q9k64K69NK55m05k30L63J25k86K67l83M28j87
5879B1q9m5K27j37K00j54k78K30M53l32j90Q0mK34k84j62L04K4K12K5o53M79m0
5902A21L0n16L87M1P4p0j9o6Q1o0j63P7J48r3L06m52o3K01M6P1m94N65j94J46
5926A04P8n21K40K41k9j30r7M0K64n7l15K71Kj3k39J2J31J24j16o2j25K28K58
5949B89k79J49l60M0K61N5l1j31K2J93m04j94L31L20j78NJ2l7O4j59Pj20J54J71
5973A80k91l5K46J12k67J31j14o9L76k04j41k6j30L65j68l9p3K60L08m07j41%
$$ y = [-38, 191, 157, -366, -39, 253, 352, -110, -10, 47, 357, -1, -68, -329, -71, 186, 191, -257, 162, 25, 16, -85, -12, 147, -194, 25, -131, -252, 3, 75, -143, -149, -76, -232, 117, 39, -107, 23, 31, 56, -144, -122, 74, 281, -71, -3, -254, 126, -50, 95, -205, -324, -83, 153, 64, -200, 69, 74, 329, -76, -306, 57, 182, -104, 163, -220, 208, 21, -68, -113, 114, -23, 177, 23, -255, -25, 428, 96, -94, -14, -18, 216, -68, -230, 74, 98, 310, 335, -318, 161, 121, 151, -365, 22, 63, 137, 67, 48, -18, 63, 3, -160, -83, 65, -28, 278, -174, -237, -36, 10, 81, -413, 152, -42, 104, 182, -339, -99, 142, 113, -17, -114, -74, 190, 133, -182, 89, 91, 78, -161, -149, -18, 106, -10, -72, -197, 31, 289, 10, 159, -201, -161, 100, 155, 124, -7, 15, 208, -196, -390, -59, 261, 83, 88, 100, 63, 127, -32, -25, -145, 9, 180, -111, -146, 100, 212, -55, 76, -38, -107, 269, 65, -76, -102, -232, 133, -35, -74, -147, 113, 421, 14, -127, -127]
5995a27K23Q6m08j01L60O4q1J5k93L96o5k66L75l30K89K5m00J36KL02k03O9J78
6018B46m09K45k31K58j64m3K90j96j1L00k2j29m79J55K53l5J31o05M01nL58l11
6040ck18L92J6J4j35j78l7K47Rj65P6K41j22j2j27l48M53k12n4j05L05J44k5l76
6064b20N1J01K3L43l94j70N75k40k59M0L09j80J86l17J05J43K84m60k8m1L06N2
6086B09j34l27L41j02O5K35n02K36M5K8k96PL50K56l11j34J46O7J64m41j20l2
6108b50K99L4m29J25K0L84j64j63k54J20M34k62k39M25M85o62j77k2L44K44j65
6129A27k93j43M03q1R3l4q2L28k11k09K35j71J73j20m8k58M68o3q5k75j83L74
6151e5l7K47n61K14J27J21K4j68M81m6n16k10K33J68L15n42K3R0K82j17N8l61
$$ y = [-127, 96, 182, -226, -327, 33, 97, 16, 31, -262, 134, 69, -197, 178, -152, 137, 162, -238, -102, -100, 202, -1, 68, 246, -163, 82, -149, 109, -55, -98, 192, -4, -15, 285, 263, 134, -345, -190, 63, 28, 159, -446, -45, -50, 308, -3, -221, 171, 187, 201, 66, -112, -149, 98, 107, -58, 18, 259, 137, 125, -2, -350, 103, -109, -163, -268, 37, 181, 156, -220, -169, -68, -45, 298, -96, -266, 309, 69, -190, -150, 159, -21, 165, -152, -47, 96, 380, -80, -108, -149, 157, 209, 75, -252, 89, -13, 52, 287, -215, 21, 66, 94, -202, -195, 155, 411, 100, -34, 112, 179, 343, -98, -218, -250, 49, 83, -346, -221, -201, 183, 19, -144, -398, -278, 156, -106, -345, 80, 565, -97, -274, -296, 48, 292, 127, -166, -309, 94, 13, 106, 72, -10, 318, 107, -102, 133, -38, 135, 15, -33, -291, 177, 114, 29, -246, -429, -55, -92, 155, -406, -192, -65, 56, 80, -88, 393, 347, -169, -379, -146, 22, 337, -205, -182, -92, 190, 73, 131, -230]
6173b30O0M24k80k11n1M89j70J4j4j23J75L5m70R6L71J3K53l74l70K91J51r1l0
6196d2R8K44pm46RJ66P4o5j16j0J05M2R3l50r9O08p1l16j54O8J87J01k42J45j94
6221a72L88j92j56RJ69J68l51j25L13L41O5n66K34j41L13q5l44M4k41M05j7j16
6243e7j46m6K86j16p2L52j0k66N9j33P3K88L8n32K01K79n0j60j13J00J4N4l14
6266b71J43J42R4J35n10m4L85Q8j13k24R5M31l00p8k22K06L78m06j42K7q0P84
6288E18m26m54N27L0O2l34j9J58K37j31q9p7n1L34k58k51p2K81K62l16k27L57
6310F1L12j65l08K8k42M15m2o4k53K17O9j36k90N8N24m1k82j49L07n8J82q8l03
6333b48j43M30j61j59P0N14j91q8l4j56K86J78n21J14K32K99M4o50k23O76o9o2
$$ y = [-230, -170, 254, -26, -237, -288, 201, 31, 45, 31, -92, 83, 118, -352, -256, 115, 128, 381, 7, -363, -72, 79, -12, -42, 56, 300, 293, -153, -144, 22, 96, 31, -85, -95, 10, 52, 145, -205, -304, 304, 233, -83, -237, -169, 18, 119, -123, 22, -172, 216, 24, -132, -123, 46, 214, -137, -262, 51, 392, 457, -109, 125, -16, 297, 212, -132, -88, -329, 76, 59, -57, -203, -249, 37, -79, -151, 201, 191, -75, -16, -149, -76, 212, 250, -282, -81, 198, 148, -12, -125, -25, -11, 43, -271, -128, 14, 108, 243, -267, -311, 74, 162, 49, -175, -80, 351, 51, -27, -249, -43, 335, -71, -213, -186, -266, 518, 92, -362, 165, 195, 257, -77, -96, 62, 299, 168, 79, 2, -49, 285, 27, -224, -296, -15, 247, -69, -296, 61, 373, 208, -100, -72, -314, 101, 59, -5, -258, -41, 28, -108, -398, -340, 184, 143, -139, -288, 19, -39, 143, 55, -248, -391, 39, -122, -281, -211, 303, 112, 24, -10, -166, 120, 298, -223, -109, 123, 422, 466, -184, -407, 269, 200, 138]
6355A38j37r8K66q9l4r9J02J28M5j22k60J89L84l96k89O4L91n7nk32J38j03M6
6378c0j05j28M67j14J85l09p3J67L14l93k9J98M7K72m68k02L07L9j93m24M31J89
6400A48J22k47k23O7L73j57k81nJ59K61j08m65K37L30Q5n57Q2j88N45j7l83j35
6422c57J42Q29k79k90l55K46L4k36J13j26L21K90l49j11M8lK36m12j11P81k56
6443A55R2l33j40K09L7k08K5R2R7L73k63k07l4K39p5o3j29K07p6l5j32J80K25
6466B36j17j31j66M03L15k43n06K31lQ2R6m98J12J37K25N0j30q6J33K53p76J13
6488b70L46M6K2l39R1L99m16O0j21o5L51K04m15p1P1J77J73m98J90J62J81l37
6510e9l1k47L31J63j86j31J9M95m8n89N2K18L40m51k48L34K81k52k37L3K74n2
$$ y = [138, 1, -97, 169, 80, 46, -53, 49, 177, 222, 100, -160, 29, 413, 17, -272, -208, 183, 126, 121, -111, 27, -76, -30, -135, -263, 204, 90, 275, -34, -107, 60, 374, -19, -48, 150, 197, 469, 1, -201, 106, 145, -48, -472, -41, 148, 270, 23, -200, -133, 240, 83, -198, -203, -44, 217, 109, -356, -119, 211, 296, -261, -179, -367, 178, 161, -222, -357, -215, 614, 335, 45, -310, -64, -30, -266, -153, -279, 42, 332, -17, -128, -80, -83, 153, -259, -370, 411, 155, 247, -86, -226, -17, 20, -188, -163, -71, 26, 399, 136, -71, -105, 134, 59, -4, -133, 74, -2, -37, -169, 11, 236, 119, -12, -178, 225, 540, 297, -209, 22, 19, 101, 197, -301, -189, -52, 173, 223, 93, 7, 140, 393, -383, -270, 76, 122, 144, -195, -104, 295, -121, -61, -182, -247, 104, 308, -107, -178, -107, 70, 243, -255, -65, 97, 278, -59, -90, -337, -6, 157, -29, -160, -141, 354, 306, -283, -231, -13, 327, -124, -372, -38, 243, -9, -246, -213, 61, 9]
6532IK24j86m25K49J2L38k80Q1o8J58k06qL9P7K96k46n05L55J21M6l30J05K52
6555A08l6l9m43L96L45O2m18j50j29L31r8l62K66K83O4k47J0j42K2N51j79m11
6577b16O2K94m9l45Q9J56j2K04l91J39m5M94l72l52K47K95k49J35l62LK14J07
6599D6l86r4L46K13K6k41j68L24K7M4n55L57L53k71j65k5J31L66j06k69j17N11
6621C47j00n93L5J71N88m79K11m34J0P41o20o6RK81J38n34n9J28L83m0j79n2j5
6644a29M74m18j16J60k38K52J41l68L00l4K30n48j94K36J79K52l81r8J82L12j99
6665ej42r6O46J93n55L4J29j59P9k36k78K37L55j1m63N1M56J3k78j42O2L57r8
6688A49l34l5N66k25k21J45k76J56K16j24l07L02K7K3m41K16J26J34J00l28N0
$$ y = [9, 233, 47, -378, -129, -117, 221, -59, 22, -46, 112, -94, -102, -63, 14, 310, 64, -441, -86, 35, 81, -249, -144, 108, 72, 33, -410, -14, 331, 393, -25, -175, -304, 27, -71, -433, -167, 116, 180, -67, -57, -199, -177, 374, 195, -216, -154, 140, 91, -254, -165, -9, -21, 183, -208, -69, -114, 380, 8, -344, -97, 198, -51, 84, -278, -275, -61, 46, -340, -434, -88, 125, 151, -90, -258, 66, 93, 137, -418, -61, 292, 21, -144, -169, -38, 328, 222, -47, -164, 347, 247, -346, -311, -140, 448, -31, 180, -254, -244, 497, -123, -189, -180, 101, 239, -295, -354, -226, 157, 117, -62, -114, -129, 345, -73, -189, -29, -267, -15, 126, -242, 58, 24, 254, -294, -488, -252, -73, 179, -202, -300, -118, 194, -5, -147, -243, 403, 596, 41, 75, 204, 45, 124, -112, -390, -153, 202, 191, -272, -221, 235, 248, -30, -172, -110, 247, 149, -185, -220, 346, 121, -100, 45, -231, -75, 141, 17, -290, 12, 39, 62, -379, -163, -37, 97, 197, -131, -81]
6709h1J20n0j7k40j05O05k66J55l19J3M14p6j99k3m5N02l17k65M1R2J86j18j89
6732a82o8M45J48k83j77J84N7l9k34m0K58J87l22j42Q2N2O8o5q9J94J71j23k50
6755a68R9k2j91M09j73j98M13Rn3m22J38K74k97j3Q3L0L06l5l90j6K86j3l6n9
6779c9p2K24K60k53l59J35L26N7m03J18J88J06m4o62K66J06K51k20k98K11K45
6800A43R0l24j4j58N07Qm29L6N34k25j2m14K68J61n1l09J2L15M30l30m41L3L72
6823B02J57m12j89o9O19k5j89m64K65K15P7j32k10j82N84m76j87M37J04j81Q5
6844B9l13N70j4j89p1j5N1R3m44K54O3J05K0l9k82L51K8k44oj98J65L23Jn98L02
6869e8k2j79L83k41k06M10L35j06o33J01L40o4j65j36L28L05l59k40n1L0J63J59
$$ y = [-81, 39, -11, -28, -268, -373, 232, -34, 121, -198, -185, 229, 153, -46, -69, -114, 388, 71, -194, -153, -61, 125, 7, -182, -250, 195, 343, 60, -117, 67, 124, 85, -149, -189, 69, 256, -66, -208, -126, -74, -6, -71, -160, 34, 205, 82, -168, -69, -91, -282, 127, -46, -244, 169, 178, 125, -297, -159, 115, -182, -195, -112, -82, 224, 189, -201, -217, 69, 56, 20, -39, -111, 113, 373, 120, -239, -104, 222, 279, -124, -6, 182, 288, 244, -418, -152, -46, 205, -15, -313, -102, 143, 233, -91, -105, -263, 244, 252, -177, -141, 393, 168, 156, -258, 10, 171, 120, -189, -177, 138, 568, 238, -203, -170, 202, 359, -53, -242, -311, 308, 283, 94, -370, -105, 110, 187, 55, -155, -337, 247, -229, -416, 21, 125, -56, 29, -284, 286, 272, 83, 12, -3, 48, 141, -303, -49, 14, 119, 139, 100, -182, 169, 197, -47, -53, -251, -86, 237, 238, -360, -58, -80, -259, 124, -117, -323, 87, 422, 316, -317, -216, 124, 60, -105, -241, 87, 392, 33, -207, -258, -228, -65, 94]
6891I4j81M0L45k92l42K1L67L12k75l04J12K28J10l00j20K63k5K17k47l77N11
6912A57J1j9m51R6k11O60j87j37k00N30P1l29k16J6J66j05j00j56O65k65J55m85
6934c34N09P1l3nn72M34K23j23m90J03N10j29O4m83J25Q8L06l65j46m7M74K31
6956D11m31k54M17P0k73j99k48M87L29R8o95K00K69J55o93K04K11K16q3k71n19
6977e99R24k2m50j11K12N22k63l50k55K46L20j24j67l0K52k7K13l65k15N60k34
6998C7K12o67K16M51j3k22R4J64j22j08r4J47k17M83j88n11K79K63j63j36l8P9
7020e4K58k66j9l41K57L72k5n46L9M16K96l84J06l82O67j8m31j50R0N14l05m24
7042c30L0M38J15k92j34j46L41j42K41m65L21K06r6m9k40M6L01r2k67N9R9J47
$$ y = [94, -87, -47, 298, 6, -336, -315, 52, 364, 89, -215, -103, 125, 235, -65, -185, 78, 53, 270, 23, -354, 157, 168, 149, -302, -206, -417, 243, 56, -81, -281, 249, 320, -9, -225, -209, -43, -148, -248, -404, 261, -4, 151, -334, 175, 246, 213, 208, -364, 70, 293, 170, -320, -217, 293, 164, 228, -255, -130, -42, 264, -101, -247, -294, 180, 411, -20, -274, 143, 213, -60, -259, -507, -20, 309, 407, -288, -88, 181, 336, -357, -153, 58, 274, 191, -80, -599, 325, 303, -147, -258, -46, 476, 213, -137, -392, -146, 174, 50, -117, -147, 105, 78, 291, -74, -289, 271, 37, 249, -418, -202, 249, 236, 14, 108, 272, 150, 42, -52, 95, -122, 361, 173, -338, -59, 204, 41, -95, -133, -54, 204, -62, -81, -422, -165, 207, 182, -364, -325, 91, 387, 3, 109, -273, 394, 376, -55, -205, -115, 399, 94, -330, -300, 138, 253, -39, -173, -319, 22, -120, 121, -344, -23, 183, 87, 38, -202, -156, 145, 53, -214, -155, -56, 91]
7064I1l49J36J14M5N01p17j55M35J2j07j86M9J77L00m75j54K48R4K12m79j71M14
7086C5J55j17l21l9L48K2m23K45p3L90r1j63j19J52L01Ql86o4K62J18k48l2m65
7109e05M82J40J6l05L7L53ol17m4R0L14k5l67l27M87J81j80m02O19j10k58L01
7131A74l86K50K14Q3p01L64J17k13l12K67k25M21l6r6N3k9N81o09k06Q8N87l61
7153B5j34j88K95J34p1l39j66P0N71M5k67rJ95j31r6ML0j30J87j11m72L91M4M22
7177B99n71j89N08J11%K9n05J31M80o51j9L99J88j73k28J42J42J40J37l59k18
7198b07J10L99l50O0j78K52K65l98j23J22K75m12J76lq2L60k29k74p3M82L05o11
7220a34j49M33J94p0l80O3J86l31J33n1j57K76L97o93J05K28J09j35q1Q8j71L41
$$ y = [91, -258, -122, -8, 37, 538, -179, -334, 101, 113, 6, -180, -131, 46, 346, -129, -283, -35, 59, 271, -208, -379, 35, 190, 73, -248, -287, 61, 83, -340, -95, -168, 222, 131, -32, -151, 1, 302, 310, -76, -140, 122, 240, -8, -40, -505, -23, 117, 133, -172, -135, 218, 212, -105, -149, -59, 255, 230, -137, -464, 23, 204, 24, -378, 241, 131, -127, 174, -212, 38, 252, 335, -366, -2, 115, -98, -410, -143, -368, 53, 17, -79, -26, -55, 526, -83, -289, -201, 386, 25, -109, -297, -2, 132, 61, -278, -444, -374, 197, 242, -25, -34, 161, 30, -66, -62, -32, -162, 25, -86, -558, -167, -123, 299, -272, -461, 47, 158, 158, 187, -318, -187, 293, -358, -377, 22, 210, 37, -191, -49, 93, 233, 370, 11, -207, -97, 302, -48, 12, -166, 86, 351, -47, -170, -48, 227, -185, -9, -12, -94, 266, 37, -237, -310, 172, 477, -134, -283, 150, 344, 274, -106, -43, 143, -188, -55, -106, -263, 13, 410, -283, -178, 50, 159, 24, -57, 31, -140, 201]
7242B01k13j28k73M58Qj4m96J02L87q3k50QQ0K89J75n48J34L21N0l62J6m44Q10
7265B28J1j71l06n5L78K27l08k20K06K20j95k41R9KN8r6j13L81K12l03L7l65K13
7288a01M7K38k21r4m0L29j02l06O6K52J39k65l5J6K47j78j88j1M07k0kk80k7K51
7312A22j04j62J35k3L15m47j2k14L40J79j12j24o0j40L19k45K27K3J0n2K54l59
7334a30K25k6k5l13M8K07K73m21n2K12j25J04j9m2kj15L91j98j63J86K46n33J41
7357a31K19Q7L6m42K81k84P05n54j48J29P9L31k06o8k27L58Q6k37k60j51O98j58
7379A43j18l2l1M33j77l54l09M06J6k6M7l52Q19j95m38P7k07K77J82l09Q7NL00
7402B44l25l9K3K98j06j1l73j74P37j9o07J43J33j2K00m41J71L21J00j90j89j8
$$ y = [201, -12, -140, -413, 45, 53, 39, -457, -355, 32, -51, -301, -293, -213, 76, 251, -297, -163, 158, 208, -154, -138, -582, 228, 239, 68, -238, -293, 85, 312, 4, -216, -10, 210, 15, -226, -127, -125, -67, -163, -276, 105, 317, 14, 51, -314, -101, -54, 184, -37, -131, -171, 158, 56, -250, -184, 68, 207, -58, -93, -77, 170, -8, -196, -207, 200, 180, 178, -102, -129, 122, 18, -144, -9, -32, 283, -164, -176, -390, -50, 129, 17, -107, -167, -307, 12, -233, -6, 17, 27, -25, 229, -130, 95, 69, 44, -269, -221, -14, 259, -162, -214, -2, -127, -23, -42, -84, -86, -201, 190, -8, -171, 15, 261, -272, -131, 88, 175, 211, -231, 50, -234, 471, -83, -231, -102, -23, 308, 102, 34, -193, 165, 251, 14, -246, -397, 301, 143, 25, -7, -38, 395, 218, -136, -445, -39, -23, -49, -2, -354, 465, 270, -168, -91, -298, -21, 161, -148, -61, -56, 244, -81, -120, -97, 201, 95, 84, -289, -463, 274, 255, -352, -209, -76, -88, 112, -329, -158, 163, 263, 73, -116, -134]
7424a34K37K77o02R9K86o3J07m44k20N32m2Ok44K59O1OJ94n21J21J63J84l07j30
7447a75J26K34q4l47J77j15L26l42L1L15Q9N9n01l1L89J26j54l33jM14J5l4k22
7470c8j34J79J41o1k57K29l8L0k07K6Q4M75k57j91k11K90Pn6j70j76M67j27l74
7493c69L25J3L92k02l89O2lM98l24k50J15J32K20l11j46Q9J75J86m36n6O29n9
7515B91n77J68j46L68J45k03l22L21J36j50K4k98K65L51l67jn03L19J44j6p2k2
7537a45M07j68k61pn4M61j52o5k10M08j67j02N0k83M11J2k61k47L63K15N1m19
7559a63K01j4R8Ol75O4L03J9j86m11N14J53j69K48n68J43K67k37j61J06L14R0
7581B42m6l83J49L21k15r5n5J55L32m34j70N3M15k03J66n32K43J55ll74k0L22
$$ y = [-134, 103, 380, -222, -123, 163, 100, 207, -237, -457, 75, 33, 39, -205, 54, 115, 121, 315, -206, -85, 78, 262, -45, -175, -49, 185, 101, -246, -69, -184, 142, -200, -169, 146, 235, 294, -207, -238, 151, 277, 123, -210, -211, 203, 218, 184, -38, -172, 7, 148, 87, -170, 59, 21, 51, -156, -130, -46, 429, 172, -19, -230, 60, 67, 11, -159, -335, 132, 5, -369, -44, -31, 361, 159, -230, -168, -171, 327, 3, -247, -132, 0, 220, -91, -237, -148, 27, 213, -223, -279, 350, 291, -286, -118, -264, 104, 249, 46, -276, 45, 181, 31, 55, -243, 22, 373, 6, 5, -498, -179, -35, -51, -123, -145, 262, 94, -167, -174, -228, 233, 81, 16, -194, 214, 47, -55, -5, -288, 123, 135, -126, -373, -10, 205, 256, -163, 38, 24, 122, 128, -247, -183, 120, 139, -47, -458, 56, 209, 40, 288, -280, -137, 130, -107, -268, -162, 152, 242, 196, -187, -38, 283, 68, -27, -82, 73, 405, -29, -199, -146, 269, 66, 232, -300, -57, 98, 95, -279, -299, 23]
7603B3o1L25l43k0K02K73k75n02J98K90j40K24o70L62L16J2k49k21M11N6j47j13
7625d9l85O62j23k65j32L75j35K83m07J91P9l6J75n61M45j06J70j17j60rK73J42
7647C10k53k68Q0K32k57J06k35M14M74n66l01Q2K82r4l86J29K52K95m23P4k29
7668b82K07L34j01l80J83oK55j08k56q3L08K32o14Q3J44K57k24q3J66r2J93k50
7690a17k29K24K18J19k37j55J27K89k80r3o1KJ33j0J67k96P89k80k95j87J82J07
7712A17o8R2k26K61K96m09l28Q8L80q8k54M9k49K80L18l84M6n3j1J14r8j01K17
7735a1K76m19l0P1J79Q5k18k56K70L03o1l18k45K75N67m26j91O4K45L61n57j59
7757a95K69J70l04P3J22m2Q8j22l52j02L89J44q5l8l43N99j23l42p9L94Q4k02
$$ y = [23, -38, 287, -56, -76, 126, 399, 124, -378, -180, 110, -30, 194, -476, -114, 202, 214, -35, -256, 155, 211, 64, -49, -434, 228, 105, -160, -292, 83, -52, 231, -176, 15, 94, 58, 233, -328, 117, 11, 181, 64, -96, -105, 168, 310, 57, -211, -131, 101, -156, -50, -285, 129, 603, 37, -264, -182, 100, 6, -380, -251, 1, 296, -127, -53, -282, -75, 259, 158, -222, -39, -45, 210, 102, -154, -237, 71, 303, -311, -228, -84, 173, -51, -134, 32, -60, 133, -117, -346, -122, 96, 215, -22, -177, -50, 239, -41, -134, -195, -193, -60, -70, 97, -199, 590, 310, 15, -172, 10, 117, 49, 141, -85, 176, 472, 63, -265, -177, 203, 115, -139, -90, -339, -59, 259, -125, -79, -132, -143, -29, -127, -228, -11, 265, -154, -184, -113, 66, 151, -67, -323, -53, 250, 189, -129, -374, -99, 468, 42, -149, -85, 160, 521, -36, -195, 74, 244, -60, 13, 135, 93, 181, 59, -293, -395, -6, 138, 53, 15, -328, 271, 148, -194, -273, 121, 205, 3]
7779Ck87m9M92N4j11l54o7M13j0j7k95L04K27k23j99l4J94J83k16m37L13j1M22
7802B95k56R0m11M14j05k16J52P3K37Ql12k04K75J06j32j20L8M05r7k01j06j19
7824a86L76l5m45K32J51j26J30j33q7K52J58k94k3J78j21J67k04o8J35L20o53
7845b76oJ66J52M5j36k10P5M07K8k77l20M97K0j09j80N3J20J22k13j60N00m3k29
7868B6l87L14J91k02K96o72K33L79J6m0o01O02J34K60n02m65N42J48k26J6k67
7889b05N2L92l38j67j11M94M8l69k93N50j22N05o51k43M90O2j50N6K42l6J04l91
7911h1j52K89J57K15m29j17Q9m6K97l63N8KL88l49O8j50M27j15R8m87L81j85M54
7934D49o72m2K35j44K85l87J34J83r7j5j94L76q2K25k94k31K14N5L50o80Q3K98
$$ y = [3, -284, -333, 159, 213, 102, -252, -319, 94, 84, 67, -228, 76, 303, 80, -119, -153, 41, 224, 8, -429, -116, -127, 295, 39, 129, -282, 132, 27, -189, -37, 36, 273, 281, -31, -235, 40, 146, 14, -106, -68, 337, 240, 39, -67, -186, 190, 155, -290, -58, 93, -33, 97, -36, -123, 129, 287, -7, -30, 148, 27, 194, -10, -78, 57, 377, -276, -282, -116, 36, 81, -55, -265, -190, 217, 245, -32, -352, 145, 165, 56, -124, -71, 49, 171, -42, -202, 298, 255, 26, -361, -47, 144, -58, 238, -434, -201, 178, 194, 154, -447, 155, 289, 549, 47, -418, 124, 272, 46, 62, -205, -153, 239, -99, -266, -377, 117, 165, -204, -497, 53, -69, 436, -215, -458, 32, 94, -56, 0, 242, 206, 310, -81, -233, 56, 213, 428, -1, -118, -29, -75, 222, -141, -83, -81, 307, -42, 26, -124, 303, 188, 286, -201, 180, -5, 449, -223, -265, -30, -174, 111, -276, -142, 41, -56, -71, -265, 111, 29, 254, -40, -271, -57, -2, 348, -332, -249, 49]
7956D9J66o1l45k8K87J20l20n2j05M67l44J14k60J77O23o32rL50m06L21k70l4
7978a92J03L19k10o6j20K13P8k27j96M64k04L72n50rK09K11k35j82j01M15P9j83
8000a2j22j30L53J28k93j22L43p0J68n40M0l8M40K3k59j37M44k53n1j56J43J70
8022F9P2l38l52N76L0j94J17m34L47L83k29r1j2N0J62k86Pn9M55k29l51M5K57
8045eK19j58m34L52J99j53J41k28k31K06K43o1l22M59j82Rn3l76M93oo2k6r5J99
8069A28j6k48k19J26J08K89l33J50k17L03L0j47j75L05K73k54j92O0J40O5m14
8090b38j30L95K6j48j53J92Q0O7k05K0pK67m7j03j36j39Q8L99k88K9K0M19k33
8113A75m54M14j13j48J25m32M35P3R9k54k15K59K36k9n70L17L34k17m8k06M07
$$ y = [49, 215, 154, -191, -219, 68, 188, -132, -184, -289, 178, -166, -52, -312, -135, 488, -144, -153, 197, -209, 112, -158, -192, -89, 230, 20, -46, -166, 47, 125, -102, -298, 166, -38, 334, -216, -225, -16, 195, -40, -222, -323, 92, 171, -12, -134, -264, 89, 217, -76, -198, 145, 75, 243, -297, -257, -295, 145, 168, -91, -228, 216, -37, -88, -244, -101, 69, 141, -197, -549, 27, 57, -137, -20, -454, -107, 276, 47, -44, -56, -6, 156, -130, -123, -182, 273, 44, -307, -262, -5, 214, 56, -378, -26, 173, 20, 161, -67, -298, -92, 151, 90, -232, 227, 45, 54, 1, -375, 118, 112, 50, 24, -71, 128, 112, -136, -355, -229, -121, 168, -165, -15, -232, 71, 101, -46, -221, 84, 357, 103, -89, -29, 111, 176, -238, -368, 27, 53, -95, -248, -56, 24, 91, -114, -94, -101, 166, 119, 16, -120, -259, -171, 228, -60, -31, -11, 408, 175, -279, 135, 22, -126, -1, -433, 2, 75, 174, -80, -295, -36, 200, 171, -399, -82, 252, 35, -13, -219, 188]
8134A88j59J28m9k0m0L8L1k17oJ36p0J28l27l4M49lk99k41M03L46l74O8j56L41
8158B61j08k51J03P3K08l25K24j77LjK8n6%J6K82l52n9O7N52m22L5j69m4L44o3
8183A69m86K62M3J08J35l52l9K21
$$ y = [188, 29, 157, 108, 88, 48, 86, 117, -100, -106, 30, -40, 88, -239, -273, 176, 173, -126, -367, 36, 382, 8, 76, -80, 261, 153, -98, 5, 78, 286, -39, 185, 8, 11, 10, 38, -18, -18, -2, 280, -72, -131, -64, 488, 66, 101, -68, -112, 232, 169, -317, -55, -12, 96, 231, -121, -160, 61]
8191F1
$$ Imaginary data points
##PAGE= N=2
##DATA TABLE= (X++(I..I)), XYDATA
0@%%%qJ6qQj6K4l2M0n3O1p2R3j17J36j60J92k24K64l11L59m14M77n48O26p14Q10
29D29r14J029j159J302j454J627j816K016k240K491k762L056l384L748m149M596
45B416n097N663o303P034p885Q881j0070J1524j3339J5686j8861K3416l0548M3408
59B5925p3845K73532K72037m43820j34751J97728K03848k02322k53105K4362K58792
70A48381P7252j38535j24366P1693Q5827l8927j17083k9033L6314K0315k9869
81c8031q918J2611K540j7627J1493K8091N594j8756J4966L4453k394l9536m725
94b0239L0596j654m1772O510P9505N3387m5743n4615M2674P2213m5424j29494
106e4056l0682J07528O7809p8319q6309O1231J24238j1551j37832o0329R0576
$$ y = [0, 0, 0, 0, -8, 8, 0, 8, -8, 16, -16, 24, -29, 32, -40, 53, -64, 72, -88, 104, -120, 144, -167, 192, -222, 255, -293, 333, -381, 429, -485, 544, -615, 687, -767, 860, -956, 1060, -1180, 1311, -1451, 1605, -1779, 1969, -2180, 2416, -2681, 2982, -3321, 3713, -4172, 4709, -5361, 6163, -7176, 8510, -10351, 13065, -17483, 25925, -47920, 225612, 497649, 53829, -80922, 116806, 320654, 118332, -134773, -110411, 148381, 225633, 87098, -37268, 34425, 120252, 81325, -35758, -64791, -28477, -8162, -38031, -46949, -34338, -31798, -49425, -37932, -9841, -4247, -23003, -8037, 26416, 24022, -15514, -20239, 10357, 8703, -33069, -26559, 52946, 106333, 60590, 5975, 48649, 120862, 75438, -54056, -84738, 22790, 90599, 12280, -74029, -12798, 111440, 99889, -37943, -98272, -7696]
117g696O8045p9943r7750M4588J10182N009q4370k1866O9598L8151n0068n0056
129e6176K8430N4461n381m7083r577M1290K6100k7833l6266J7690N5287J7763
141E8705m4608m0022K0372L8966j4265n7483k5745M3634O0989L860n2012k8875
153c6484M2648N2260k6142q4532l0755O6405P0230k6926p9274J091R5905N3130
165I7556p1104q8952K5317R2815J0887q7139m7786O7522Q0509k6504q3918p616
177c8413P6527L6265n7753n8953K8468O4074k423o6984l3152M5605N3164j8109
189B8316n5739m295N9530L8300m0937o6526J247O4476K5496n7161n2006L9218
201b0081P9510P954o6971l7115M7281N8149k1595p4355k0372O1888N2794l0755
$$ y = [-7696, 60349, -19594, -117344, -72756, 37426, 42435, -41935, -63801, 5797, 43948, -6120, -56176, -27746, 26715, 21334, -25749, -35326, 5964, 32064, 4231, -32035, -14345, 40942, 58705, 14097, -25925, -5553, 33413, 19148, -38335, -64080, -20446, 40543, 44403, -7609, -36484, 6164, 58424, 32282, -52250, -83005, -16600, 53630, 26704, -52570, -51479, 44426, 97556, 26452, -62500, -37183, 55632, 66519, -20620, -68406, -884, 79625, 53121, -30797, -38413, 38114, 74379, 16626, -42327, -13859, 50215, 47792, -19192, -52344, -6739, 46425, 28316, -27423, -31718, 27812, 66112, 25175, -41351, -40104, 24372, 49868, -7293, -59299, -20081, 59429, 67383, 412, -36703, 10578, 68727, 47132, -27223, -47595, 14293, 67087, 36332]
213C6332n9569O107O4939K6718n1541n3541K1902N8006M70n7542k5137M2595L9445
226D9184k4806m7635M382M6654J4900l9152l1811K2049L3967j3364m3331r283
238c8246L6619K6866k0874l4890P666M2376J3393m0607l6724K0965M3601l699
250A6446m7443j6385M6045M4339k1574n1924j90N1232J8938m6319m0634K3942
262b3527N1308J973m5715k2101L6072L9896j7635m7902n631M3825K4860l4179
274A244m2718J2074M8360Q571m4425k6666L6212M5381j5649n1214q026M5792K7587
287C6523l5557m5688J3534N4229J4083m5439l1728L2768N0111r039n5623k2143
299d3969M2039M2616k3367n4070p86N7376K9831m1401m9566J6885N5941P654n2701
$$ y = [36332, -23237, -17130, 47809, 74527, 22986, -30555, -8653, 49353, 49823, -7719, -32856, 9739, 49184, 24378, -23257, -18875, 27779, 42679, 3527, -28284, -6235, 27732, 14368, -28963, -38246, -1627, 25239, 4365, -30525, -22859, 19517, 32910, -7697, -44421, -23456, 20145, 16446, -30997, -47382, -1337, 43002, 21428, -30496, -30686, 20546, 39484, -6835, -47469, -23527, 27781, 29754, -15961, -38062, -1990, 37906, 20271, -27631, -33262, 10563, 35423, 1244, -41474, -29400, 18960, 27531, -16894, -43560, -7348, 38033, 22384, -28830, -36856, 8936, 36523, 966, -44722, -31188, 23041, 37124, -8315, -40043, -7275, 42836, 33797, -21826, -43969, -1930, 40686, 17319, -36751, -37537, 19839, 49670, 8269, -41297, -24412, 31529, 39183, -13518]
312a3518l2901L6014M8676j2988n2124r821M6011L1789k7743m2512N590M5051
324B1524J5211l8814l3540K3314M4146k743m3968j6593L8265L5783k1372m5766
336b4553J195M5119J5884l9950l4351K3214M4816J05m2036j7953L2726L4220j9025
349A9411m4271m585M1201K2232k9104l6528J2887M2907Q868l8948k7069K7308
361e691L8951j1337m4716j0081L8649K6819k5883l7689R307M2124J0232l7734
373g049k6537K4693L5886p952m0163j1919L2746K7687j9697l7140M036M0995J5725
386C1311l4513l1842J8931L8863k051m0931j6994L4405L4048j8833m1180R77M1278
399A3469J6929l2378l2658J5138L8677L230l7656k0823K8727L5155j1612l9838
$$ y = [-13518, -46419, -10405, 38271, 25283, -26841, -36662, 9349, 41138, 13395, -29117, -23527, 21524, 36735, -2079, -35619, -12305, 31841, 29098, -14870, -31463, 6802, 42585, 21213, -24553, -23358, 21761, 37645, -2305, -36656, -13442, 31374, 31479, -10557, -28510, 4216, 38436, 19411, -24860, -29445, 11756, 33988, 4884, -31644, -18757, 24150, 33018, -5930, -32999, -5691, 33260, 21923, -22793, -32874, 5775, 32594, 6711, -30978, -21671, 20453, 30685, -7049, -33586, -8893, 26993, 19041, -21122, -33041, -295, 27392, 7695, -29445, -25409, 15586, 31311, -3202, -35044, -16113, 22750, 20699, -20232, -37226, -2821, 31227, 12394, -28786, -27809, 13469, 30398, -1980, -34638, -19500, 19177, 22407, -15249, -36072, -7345, 27810, 16198, -23640]
411b3640p270L5664K3744k4703l6471P947M1313R838l6579k5983K4968L7151o840
424A9139l8606j0628L3855K6020k1692l6860M429L8679J4459l1066k7742J8246
436a1767L7416M2l7380j8496K9070L2546j5474l9516k931L8149K0780k8080l2867
449b8508J2974L9605M627l7460k2103K6302L3306j0703l6847o014L3088K2563
461C0830k1648l2919O777L6544J0359l1737k5299J9632L3946l898l5619j2553
473b5585L1360K7324j8559l6035K389L5792J2206l0176k6341J6748L2693m94l3536
486a2214j6054K6304K7997j3604l4480l586L1694J7562k4107k9742J0530L5875
498A6175O236l2411k0362K3378L0529r537l3835o147L1136K1326k0871l0720O874
$$ y = [-23640, -30910, 4754, 28498, 3795, -32676, -24729, 16584, 26422, -10157, -36140, -11172, 25979, 19139, -19467, -30095, 3760, 29780, 8088, -28772, -24343, 14336, 28795, -2271, -30013, -11767, 25649, 25691, -11689, -30185, -1115, 31431, 15957, -23559, -26490, 11659, 32439, 4359, -28508, -15534, 24071, 28698, -8762, -30865, -4563, 28743, 18040, -18807, -24821, 8267, 30830, 9182, -23737, -16960, 19584, 29943, -1794, -27093, -7461, 26485, 22587, -13032, -25585, 5775, 33099, 14540, -21495, -19106, 16686, 28892, -1284, -27625, -10877, 21816, 21322, -12214, -28268, -1964, 26033, 12429, -22051, -25637, 6057, 23619, -488, -30230, -19700, 16175, 22411, -10000, -30362, -6984, 23545, 14008, -19827, -25974, 5162, 26488, 5617, -25103, -18229]
511a8229L4508Q465k9657k1543J8841L0565n224l2856j1900K7264K4344j6701
523G877l2994J915L3284J2905k7579k6289J5372L2914J29l4037j5694K6832K7669
536B2304j3860l2508m13L2424J6452k3618k7430J1036L2694N388l0060j8629K1906
549d314K8797p458l2077p588K9255K1708j9763l0931N700L2386Q152k8692k1459
562b6284J7867K9259l792l1092j1136K5771K2552j5598k9556J661L0410J2885
574B2947k4291k3305J2734L1534K519k9852j5125K3547K6056j1701l0740k322
586a7999L0180J7209k1901k6653R308L1345M500k9215j7968J9864K6442p381l0897
599a3166p537K6492K0279j8544k8319M794L0232Q314k6644k0645J6210K8217k743
$$ y = [-18229, 16279, 24744, -4913, -26456, -7615, 22950, 17726, -15130, -27030, 234, 24578, 7877, -25117, -23202, 10082, 22987, -4592, -30881, -15509, 17405, 17534, -16503, -32197, -5365, 22304, 8444, -24064, -24477, 7947, 24399, 781, -26649, -15613, 17081, 22469, -7591, -26220, -4314, 24483, 17025, -15052, -22640, 6615, 28323, 8560, -22371, -16671, 15715, 23867, -4825, -26284, -8417, 20842, 17050, -14042, -25178, 593, 23145, 7547, -22009, -20348, 10062, 22947, -1344, -24649, -11915, 19619, 22138, -7714, -22839, 708, 26764, 15063, -15677, -17999, 12181, 29390, 7489, -19164, -9856, 21489, 25989, -3226, -21194, -1330, 25112, 17731, -13166, -20703, 5789, 26068, 7524, -20795, -16001, 14231, 22545, -4099, -24744, -8534, 19683, 16940]
612A6940k9688j0658K4895K2627j4946k8588K064K9725J1405k3440k1996J2423
624i237K7999P27k7777j3343K1382K3334j1067k8500k974K6305J5442j9962k5425
637b3096Q126K9155L856k8046j6782J9921K5234p596k9008o057K6258J7683j7999
650A649k5569O270K8153P718k3717j8899J5136K6219j474k7843j0634K3874K1420
663B2303j4449k7418J975K7943J1280k2102k1431J1902K7101R4k7287j2708K1119
676a678K1759j0127k7055k723K5725J5468j9554k4400R159K7921M270k6373j5815
689b3423J8552K4604o257k6521o720K5015J8624j6915k5598N234K8014P717k3122
702g96j8872J4750K5602k695k6794r097K2523J8643j3190k4436P98K4360J0756
$$ y = [16940, -12748, -23406, 1489, 24116, 9170, -19418, -17354, 12371, 23776, 336, -21660, -9237, 18762, 19489, -8288, -21631, -249, 23085, 12018, -16482, -19456, 6849, 22291, 2329, -23096, -14970, 14185, 18041, -10005, -26787, -6866, 18368, 10772, -18236, -24293, 1965, 19648, 1649, -23920, -17650, 10503, 18221, -5496, -24395, -9259, 16960, 15486, -12357, -22991, 883, 22303, 7854, -19564, -17589, 10354, 21634, -468, -21899, -9997, 17104, 17198, -10089, -22797, -1678, 20081, 9954, -17101, -19824, 5901, 21369, 1815, -22585, -13426, 14495, 18765, -7608, -23423, -4871, 19733, 13476, -13045, -19765, 5250, 23874, 6959, -18639, -13405, 14609, 22326, -796, -19668, -4918, 20684, 17989, -8805, -17902, 4621, 23264, 10074, -14362, -13564, 10796, 21552]
715B1552j9147k0381R633K5767J286k5499j3176J9630K1219r504k5574j865K3722
728G663J3592j7852k1502Q105K5042L591k2628j4162J5658K1641m744k4545o726
741a6867K2941J6322j5555k3785M962K5582O559k2122j6800J4131K3134l637k5411
754a0546q422K0729J8235j2922k3837J132K3972J0249j9567k0314J1014K4728
766A4451J23k4489j1595J8925J9981r020k3921k168K2471J4046j7450k1733P315
779a3064K5325M176k2847j4538J6072K1916n952k4831n429K2090J5268j4434k2014
792a8262M123K3166P395k0094j6779J2038K3297j900k4209r389K0448J8121j1573
805F382k3016J093K3262J0093j8464j8438J0241K2834J170k2102j0599J6332J9019
$$ y = [21552, 2405, -17976, -8343, 17424, 18710, -6789, -19965, -335, 20884, 11380, -14194, -16059, 7663, 21255, 3403, -18099, -9994, 15048, 18639, -3989, -18151, -2493, 19148, 14404, -10141, -16867, 6074, 22396, 6841, -16944, -11982, 13600, 20159, -1963, -18763, -4632, 18502, 14865, -10546, -18968, 1761, 19996, 7074, -16763, -15631, 8341, 18590, -977, -21291, -10277, 14451, 14574, -9915, -21510, -2585, 17396, 8376, -15545, -17713, 4758, 18804, 1354, -20379, -13064, 12261, 16437, -6410, -20948, -4876, 17040, 11088, -13743, -19172, 2918, 18186, 3752, -18262, -14139, 9027, 16422, -3672, -20451, -8413, 14884, 12984, -11225, -20614, -166, 17955, 6382, -16634, -15541, 7721, 17814, -650, -19088, -8847, 13987, 15157, -6945, -17544, -1212, 17807]
818A7807p183k2699l286K1967J3430j5620k0989O708K3196M121k0836j3711J4041
831c054K0926m517k3263o222K0659J5334j3571k1053K811K3039P464j9212j6700
844a7359J1971K2238j864k3120q129J8773J6733j0730k0869L75K1491R887j7183
857B214j8057Q776K2411O58k1556j0335J6545J7968p924k2305k036K0526J1822
870A8707j5552j8629O263K1321L647j9542j3343J3588J9391m242k2176n728J9420
883C125J3647j2183k0256L917K1162O857j8418j5670J0895K1039k098k1467p878
896a7328J7695J5696r802k0903M34K1059R566j7077j7304Q722K1240M79k0516
909h039j0083J5312J8003p155k1445k916K0504J1641j5026j8131O349K0936L596
$$ y = [17807, 10624, -12075, -15361, 6606, 20036, 4416, -16573, -9865, 13331, 17452, -3384, -17095, -3054, 17872, 13355, -9908, -16130, 4529, 19863, 6292, -14761, -11950, 11089, 18553, -659, -17359, -5388, 16850, 14986, -8134, -16263, 2510, 19243, 8513, -12356, -11981, 9510, 19397, 2214, -15843, -7067, 15344, 16002, -5554, -15889, 656, 18624, 10700, -11605, -13641, 6885, 18707, 3155, -15474, -9211, 12110, 15757, -3785, -17128, -3540, 15851, 11609, -10567, -16295, 3125, 16772, 4589, -15667, -11750, 9412, 16269, -2149, -17819, -6924, 14115, 12017, -9450, -17328, 367, 16063, 6261, -14642, -14208, 6851, 16417, -660, -17964, -9242, 11998, 12477, -8039, -18122, -2810, 15193, 8038, -13407, -16323, 4181, 15822, 796, -17335, -10986, 9950, 13546]
922A3546j9231j2512J3203J8940m239k0932n359J8809J3635j2096j8862K467K0789
935H158P060j7233j5064J0347K0631k123k0521p510J6877J5620r271j9562l56
948a2947K0018R562j5911j6399Q176K0042J131j8724j0277J3975J7254o188j9972
961a0260k597J8541J1161j3530j6958N643J9354L698j7147j2421J1725J8076l566
974A1719k0051n051J7275J3375j1435j8177K853J9456O187j6282j4316J0083J8812
987A4448k182j8970p085J5629J4566q405j8781o62J9327Q586j5215j6297Q709
1000f332J9031N98j8278r947J3996J5877o353j9066k677J7960J0852j3106j6926
1013a4371N219J8967M069j7570j2225J1800J7798m627j9002m757J6910J2247j0365
$$ y = [13546, -5685, -18197, -4994, 13946, 9707, -11225, -16584, 2225, 15860, 3764, -15098, -12631, 8158, 15218, -2015, -17079, -6732, 13899, 11776, -8745, -16255, 622, 16242, 6971, -12591, -12947, 7071, 16633, 722, -15677, -7501, 12541, 13672, -5052, -15329, -1354, 15900, 9712, -10260, -12857, 5684, 16845, 3315, -13643, -8000, 11354, 15052, -2095, -14516, -2791, 15285, 11719, -8332, -13383, 3892, 17267, 5832, -12345, -9492, 9964, 16151, -131, -14447, -4364, 14448, 12266, -6704, -13789, 1840, 16406, 8001, -10780, -11442, 7885, 16471, 1256, -15041, -6332, 12699, 13297, -4981, -14928, -932, 14945, 8592, -10474, -13151, 4809, 15661, 2555, -14371, -9152, 9815, 13884, -3686, -15911, -4111, 13687, 9060, -9942, -14699, 2211, 14458, 4093]
1026D093j7433J667J8756O379j6186j3650R909J7943j312j8398p298J4900J3959
1039A3329p799j7864p65J8272Q240j4158j5180P636J7873J221j6829r962J2983
1052c003J5864o201j7850k767J7500J0304j2679j5465M777J8107L951j6672j1401
1065a5535J1431J6752l991j8170m683J6191J2209r906j6807J759J8733O372j6012
1078a657j3092R663J7481j613j7612o464J3844J3829p633j7364k12J7706P807
1091A4683j3597j4609P568J7083J788j6848r004J2835J4368n414j7818k133J6377
1104E279R479j1462j4772M546J7036L575j5658j1166J1139J5757l823j6993m759
1117a1822J5254J1657r750j6132J844J7338N784j5068j2423Q842J6311j113j6671
$$ y = [4093, -13340, -11673, 7083, 13462, -2724, -16374, -6465, 11478, 10166, -8232, -15530, -630, 13329, 5530, -12334, -13099, 5173, 13413, -745, -15925, -8289, 9584, 10805, -6024, -15986, -3003, 12861, 6660, -11190, -13957, 3543, 13847, 1168, -14297, -9520, 8587, 12538, -4134, -15535, -4104, 12648, 8657, -9513, -14196, 1995, 14204, 4298, -12509, -10750, 7983, 14355, -1657, -14749, -5086, 12395, 10782, -6830, -13294, 550, 14379, 6746, -10618, -10830, 6876, 14683, 1086, -13523, -5955, 11128, 12916, -3932, -12936, -101, 14267, 8853, -8965, -11098, 5279, 14758, 3296, -11476, -6930, 10106, 13681, -1977, -13143, -2004, 13753, 9930, -7063, -11822, 3432, 15089, 5339, -10793, -8949, 8389, 14173, -895, -13318, -4476, 11835, 10722, -5949]
1130e949o542J3222J3191p777j6917r4J6635P916j3258j3403O511J6484J080j6074
1144d975r076J2205J4442n354j7149k360J6305Q971j1155j5059M620J6721L551
1157A1687j5573j0765J0943J4723l624j6164m783J4643J1145q744j6241K048J6798
1170F093N502j3884j1929Q348J5658o72j6339o978J3511J2863p582j5926l64J6228
1184D529P513j2471j2637O025J6013R05j5009q553J1669J3346m839j5916k057
1197a1482J4847R193j0209j4594M179J5989L320j4104j0379J0173J4281k764j5632
1210g182m217J3730J0538q178j5008J825J5871N215j3458j0563P571J4877q49
1223A0172j5167o561J2616J2459o868j5806k7J5739O796j2001j2930O505J5653
$$ y = [-5949, -12491, 731, 13922, 6145, -10772, -10866, 5769, 13685, 427, -12976, -6465, 10019, 11099, -4975, -14051, -1846, 12596, 7242, -9907, -12267, 4038, 13009, 1854, -13205, -8585, 8136, 11687, -3886, -14651, -3708, 11015, 7391, -8773, -13556, 1087, 12232, 3488, -12753, -10705, 6093, 11595, -2289, -14218, -5870, 9788, 9116, -7223, -14201, -690, 12173, 4591, -11335, -11699, 4529, 12042, -429, -13066, -7041, 8972, 9877, -5132, -13685, -2016, 11330, 6491, -9425, -11482, 3365, 12558, 2349, -12245, -8066, 7923, 11243, -2861, -13240, -3067, 11214, 8450, -7182, -11399, 2331, 12869, 4691, -10317, -8492, 7379, 12594, -864, -11427, -3856, 11021, 10172, -4995, -11556, 1060, 13519, 6651, -9155, -9182, 6557, 13353, 1352, -11578, -5073, 10580]
1236A0580P51j5152q176J1553J3302n508j5247j802J4519Q749j0262j3781L534
1249f940J5953L098j4299r702R890J4019l292j5278m238J3300J0534q454j4558
1262i967J854J5140M981j2810j1008P640J4303q32j5193o047J2095J1740o854
1275E042j4969K32J4661O576j1410j2234N439J4986J456j4635q250J1023J2984
1288A0901n327j4383k338J3756Q830r941j3307L703J5229K718j3470r167R117
1301c679J3194k780j4606l965J2973R881q047j4195K043J4952M494j2446j0264
1314a2445P344J3836n21j4409o224J2244J1172o939j4094L09J4350O307j0595
1327C35j1579N184J4443P84j3721p066J0404J2290m938j3911j795J3142Q390r473
$$ y = [10580, 11331, -3821, -11997, -444, 12858, 7350, -7897, -9699, 4820, 13569, 3307, -10474, -6940, 9013, 12111, -2188, -11890, -2000, 12019, 8727, -6551, -10789, 2511, 13045, 4591, -9967, -8113, 7027, 12008, -802, -11810, -4170, 10133, 9301, -5892, -11939, 156, 11896, 5042, -9927, -9695, 4966, 11542, 132, -12102, -6663, 8323, 9779, -4856, -13106, -2083, 10901, 5574, -8809, -11147, 2609, 11439, 1498, -11809, -8106, 7123, 9841, -3629, -12796, -3679, 9515, 6735, -7871, -11836, 1137, 11018, 2971, -11224, -9181, 5771, 10265, -2181, -12445, -5101, 8735, 8214, -6195, -12419, -175, 10997, 4058, -10036, -9727, 4623, 10930, 335, -11244, -6060, 8383, 9167, -4554, -11620, -1216, 11074, 6136, -7775, -9570, 3572, 11962, 2489]
1341B489j3125M113J4315K861j3179q471Q660J3050k863j3962l832J2000R751
1354A1807p695j3482K282J4185M056j1352r964O656J3448l44j3890o006J1386
1367A087J0905o332j3835N72J3354O340j0870j1163N470J3568R14j3170p358J0050
1381d68J1534m358j3562k351J3022P765r009j2459L650J4219K233j2940q087Q280
1395b531J2663k673j4056l744J2122R320p867j3108K086J3644M352j1444r924
1408a1160O765J3068q32j3495n486J1209J0423o441j2813j20J3049N639r863j1185
1422a1242M959J3626J034j3133o835R845J1062m168j3360j599J2035P593r077
1435G40j1573L910J2946K557j1728q115Q169J1578k325j3167l625J1965Q800p627
$$ y = [2489, -10636, -6523, 7792, 10653, -2526, -10997, -2337, 10713, 7850, -6112, -9944, 2056, 11807, 4112, -9370, -7088, 7097, 11153, -199, -10163, -3507, 9941, 9597, -4293, -10299, 1087, 11992, 5660, -8175, -7603, 5751, 12091, 1221, -9942, -4472, 9096, 10010, -3160, -10518, -468, 11066, 6708, -6854, -9205, 3817, 11582, 2573, -9886, -6236, 7983, 10216, -2724, -10811, -2531, 10132, 7459, -6597, -10341, 1781, 11101, 3234, -9874, -7788, 5856, 10208, -1236, -11160, -4395, 8673, 7841, -5654, -11140, 69, 10492, 4051, -8762, -8882, 4167, 9806, -57, -11242, -6283, 7343, 8377, -4756, -11591, -1746, 9316, 5148, -8212, -9811, 2224, 9817, 740, -10833, -6923, 6023, 8580, -3148, -11263, -3094, 8484, 6159, -7008, -10633, 1332, 10132, 2505]
1449B505j2261K045J3072M213j0787r400O775J2276q19j3084n336J1071R837o015
1463D092j2552L30J2359O435j0318j0487N126J2780J183j2895o044R566J0632
1476A0207m377j2639j504J1895P446q525j1656L624J3028K307j1798p481P854
1489a619J1592k705j2760k976J0928Q252o883j1872J884J2429L962r929r755O376
1503c076J2014n67j2522m807J0342R177n805j1956l2J2105N539r519j0048M571
1517d584J2543M80j1596o118Q530J0103l674j2349j911J1529P295q609j0735L268
1531e828J2480J823j0855p622P699J1165k689j2202l606J1074Q118p332j1082
1544h857J729J1996L793j0255q621N948J1698o36j2153m649R472R285n172j1761
$$ y = [2505, -9756, -7711, 5361, 9574, -1213, -10613, -3838, 8438, 7619, -5465, -10801, 270, 10107, 4092, -8460, -8130, 4229, 10664, 346, -10141, -5015, 7765, 8948, -3947, -9991, -425, 10207, 5830, -6809, -8313, 3582, 11028, 2503, -9153, -5529, 7499, 9806, -1992, -9473, -1619, 9973, 7268, -5492, -8468, 2460, 10712, 3829, -8043, -6159, 6270, 10232, 303, -9452, -3076, 8938, 8371, -4151, -8958, 1384, 10561, 4756, -7200, -7232, 4873, 10412, 893, -9155, -4584, 7959, 8439, -3157, -9275, -745, 9358, 5684, -6665, -8576, 2953, 10248, 1639, -9096, -5828, 6652, 8475, -2380, -10002, -2303, 8862, 6173, -6029, -9635, 1439, 9557, 2225, -8857, -7128, 4868, 8661, -1594, -10215, -4267, 7431, 6795, -5358, -10007, -535, 8750, 3578, -8183]
1558h183m26J1700N882r131j0119M785J1926Q23j1307o313Q802R659l516j1768
1572g186j925J0948P028p568j0594L059J1736K505j0414p509O867J1109k118j1831
1586e893l208J0118Q402o593j0996J704J1347M123r760q587N684J1254n93j1430
1600d428m524R539Q634m802j1398m5J0543N855q454r619M402J1668R27j0957n815
1615h474P815R895k991j2105k063J1346O252p148j0536L238J1162K368j0083p013
1629h337O703J0147j553j1582l187R653P770o245j0598J332J1001M173r091q973
1643h787N471J1396j032j1001m450R025Q380m587j1005n13J0749N229q078r213
1657h416L994J0594J120j0333n775P439R653k792j1599k162J0267O745p431r597
$$ y = [-8183, -8609, 3091, 8973, -158, -10277, -5492, 6434, 7257, -4050, -10363, -1561, 8098, 4582, -7186, -9111, 1837, 8865, 1297, -9297, -6238, 5498, 8003, -2411, -9920, -3053, 8056, 5938, -5893, -9101, 1017, 9419, 2826, -8170, -6466, 4881, 9004, -756, -9343, -3659, 7595, 7002, -4428, -8952, 587, 9221, 4419, -6979, -7024, 3519, 9374, 920, -8699, -4297, 7371, 8298, -2659, -8474, -659, 9236, 6245, -5860, -7923, 3423, 9675, 2527, -8009, -4771, 6391, 8759, -1324, -8337, -1634, 8513, 6960, -4622, -7809, 1844, 9614, 3369, -7229, -5897, 5104, 9277, 186, -8787, -3316, 8080, 7048, -3953, -8403, 622, 9002, 4415, -6590, -7103, 3646, 8875, 797, -8416, -4422, 6172, 7292, -3041, -8816, -1377, 8276, 5484, -6115, -8277, 1990, 8735, 1304, -8293]
1671h293K489J0583L006r912p133O312J0101j669j0852l642R703P176n733r915
1685g779Q59J0330M248q978q282N125J0761l33j0435m890Q657Q829m668j0656
1699g212n27J0880M981q084q805M042J0496J107r916n778P190R195l019j0694
1713f144j801R398O637o702r027J948J0596K458r075p006O524R584j776j0693
1727e079k799R097P278n363j0123R66J0481M222q773p760M807R888L2j0322l970
1742g418P682P868l670j0246n72J0145M876p322q538L278J0366J290r830n802
1756g893O951Q877k663j0259j731R235O306o548q980K179R842K544q861o331N525
1771a807R483j786r832l459Q849P433n766r733P92J0337M137q930p395M773R710
$$ y = [-8293, -5804, 4779, 7785, -2127, -9260, -2948, 7153, 5484, -5368, -9010, 693, 7869, 2136, -7779, -6920, 3410, 7658, -1320, -9602, -4477, 6284, 5951, -4484, -9374, -717, 8112, 3444, -7212, -7739, 3141, 8122, 38, -8767, -4725, 5771, 6878, -3038, -8816, -1626, 7569, 4550, -6144, -7945, 1453, 8090, 1388, -7639, -5691, 4905, 7363, -1712, -8718, -2194, 7390, 5614, -5079, -7878, 1219, 8497, 3134, -6989, -6023, 4458, 8680, -93, -7853, -3046, 6842, 6874, -3448, -7418, 264, 8132, 4462, -5784, -6356, 3789, 8665, 1343, -7195, -3917, 6449, 7739, -2091, -7893, -942, 7935, 5272, -4987, -6718, 2517, 8823, 2275, -6705, -4526, 5316, 7860, -1001, -7332, -1807, 7676, 5890, -3942, -7401, 1448, 8881, 3115, -6618, -5826, 4511, 8648, -282, -7677, -2904, 6806]
1786F806m23r708m403P471P816l985r573p58R628M757p011q310K966R940J015
1801F228q983n824O688Q673k701j0079j906R490N844o298q596K167R268K586q356
1816a799o611N670R030j552r571k602P536O949m607r502O76R757L760q002p389
1831h257M592R540k71r236m662P613P768l676r922m48R653M444o582p983L401
1846d026R078J164q375n402O032Q502k383r514j925Q812O001n940q585J767R542
1861D748K509q203o488N551R001j547r581k530P569O836m817q949L85R473L459
1876G416p302p144M461Q968J37r043m587O948P733l537r251m41Q824M892o748
1891A326p817L009R079J322q413n320O106Q046k411r145j749Q229M974m888q566
$$ y = [6806, 6383, -3325, -7728, -257, 7559, 3574, -5999, -6757, 2871, 7628, 617, -7693, -4727, 5213, 6228, -2755, -8579, -1891, 6782, 4081, -5998, -7904, 1586, 7430, 1132, -7464, -5297, 3971, 6557, -1799, -8410, -2740, 6290, 4738, -4833, -7435, 101, 7050, 2443, -7059, -6383, 3374, 7134, -868, -8257, -3665, 5875, 5604, -3632, -8294, -681, 7087, 3411, -6511, -6959, 2694, 7138, 556, -7427, -4026, 5052, 6216, -2159, -7561, -1529, 6973, 4590, -4924, -6849, 1963, 7964, 2024, -6561, -4794, 4748, 7257, -946, -7434, -1883, 7118, 5571, -4010, -6540, 1029, 7865, 3048, -5901, -5516, 3957, 7416, 114, -7030, -2569, 6399, 6536, -2507, -7094, -146, 7587, 4050, -5201, -5642, 3182, 8074, 1326, -6491, -3482, 5597, 6919, -1494, -6814, -708, 7338, 4927, -4218, -5967, 2262, 7236, 2348, -6218]
1906f218J741R001K427p639o370N025Q275j000q825l260P238O975m712q584J68
1921e758R041L625p354o736M154Q510n9q465m528O679P539l317q889q06Q803M452
1937F891o459p632K664Q934J470q299n272N842Q204k254q984j819P856N608n547
1952A203q158J876Q816K209p502n968M602Q444j182q483k947O786O524l803q427
1967f010K70Q607L659o781o828L678Q652O7q386m308O739P020k916q670l13Q020
1983B500M336n907p384K567Q131J964q025n307O002P729k248q529k002P905N521
1998G253n319p514J270Q330K781p417n416M554P599j033p912l004O774O016l763
2013C199q153K14Q457L499o989o456L940P834L44q083l968O194O811l165p949
$$ y = [-6218, -4477, 4524, 6951, -688, -7058, -2033, 6242, 5242, -3583, -6843, 395, 7370, 2658, -5926, -5758, 3283, 6908, -446, -7182, -3028, 5482, 5423, -3042, -7570, -891, 6648, 3331, -5558, -6364, 2439, 6891, 432, -7200, -4536, 4398, 5868, -2431, -7703, -1861, 6343, 4089, -4895, -6714, 1142, 6750, 1203, -6955, -5079, 3737, 5946, -1556, -7524, -2922, 5522, 4340, -4143, -7090, -304, 6220, 2417, -6010, -5740, 2867, 6526, -255, -7083, -3405, 5247, 5314, -3072, -7380, -641, 6379, 3463, -5207, -5520, 2500, 6836, 929, -6455, -3888, 4243, 6207, -1818, -7125, -1123, 6606, 4358, -4171, -6173, 1732, 7253, 1934, -5580, -4310, 4020, 6801, -616, -6032, -1478, 6121, 5088, -2824, -5828, 946, 6962, 3199, -4954, -4740, 3717, 7216, 227, -6229, -2289, 5545, 5889, -2194, -6162, 32, 6843, 3678, -4271]
2028d271p08P416M523n910o820K360Q305J450q012m490N044P209k176p846j712
2043e638O784N287m415p613J196Q118K514p218n427M388P228l96q258k721O159
2058a2O313l996p751K55P633L410n940o028K839P673M96p441m369N824O529k642
2074B793p771r12P498M096n288o706K224P654J489p059m519M734O802j432p920
2089d317j969P103N401m752p274R19Q277K243o748n511M106P189k52p628l072
2104f285O043O309l426p782K76P465L357n979o091L358P380M73p445l695N871
2119a71O117k630p456q39P012M129n042o384J567P779J745o884m650M845O823
2134E961j745p594j905O644M989m130o963J108P467K000n958n301L924O724l57
$$ y = [-4271, -4979, 2437, 6960, 1050, -5770, -3410, 4895, 6345, -1667, -6157, -1113, 6096, 3920, -3926, -5638, 1146, 6433, 2018, -5595, -4399, 3719, 6233, -985, -6412, -2024, 5204, 4808, -3450, -6171, -12, 6301, 2305, -5446, -5191, 2442, 5852, -88, -6116, -3277, 4396, 4892, -2549, -6918, -1094, 5435, 2793, -4978, -5890, 1608, 5704, 416, -6290, -4066, 3588, 5077, -1982, -6501, -1767, 5035, 3603, -4317, -6286, 817, 6218, 1466, -5808, -4889, 3388, 5631, -1117, -6628, -2522, 4667, 4415, -3213, -6285, -242, 6067, 2641, -5141, -4865, 2600, 5957, -22, -6113, -2755, 4625, 5098, -2347, -6042, -171, 5946, 3316, -4140, -4979, 2033, 6162, 1120, -5264, -3697, 4082, 5827, -1057, -5707, -862, 5961, 4216, -3378, -5283, 1361, 6350, 2220, -4743, -3635, 3832, 5832, -126, -5427, -1503, 5221, 4864]
2149D864p220l134O084N923l630p199J84P073L021n537n783K618P555K76o987
2164a892l866N526O083k866o892r47O917M102n269o243K144P219J126o400m529
2179e787M431O510j424p162k288O437M955m069o457P29P287K179o356n014L676
2194b353O803k59p330k477N633N716l906o528K53O391L303n469n449K715O605
2209C648Q17p148l278N326N596k056p347n61O565L772m492o377K104O708J282
2224D559o383m327M815N765r21p079j634O101M610l885o708J202O857J967n632
2239f93m986L801O512m62o987k431N487N214l097o655K17O700K865n119n532K676
2255b490O832L91o691l243M796N709k184o538r03O252L627m249n820J580O683
$$ y = [4864, -2356, -5490, 594, 6517, 2887, -4312, -4128, 2945, 5966, 429, -5354, -2736, 4819, 5095, -1892, -5758, -232, 5851, 2985, -3907, -4854, 2063, 6165, 896, -5347, -3203, 4016, 5142, -1258, -5787, -1356, 5154, 3730, -3432, -5720, 717, 5672, 1603, -4854, -4125, 3162, 5341, -1015, -6029, -2353, 4450, 4191, -3139, -5616, 17, 5733, 1827, -4701, -4448, 1943, 5246, -223, -5672, -2957, 3648, 4465, -2683, -5961, -635, 4961, 2905, -4442, -5003, 1562, 5334, 842, -5535, -3431, 3277, 4559, -1824, -6151, -1336, 4429, 3508, -3571, -5205, 896, 5506, 1621, -5087, -3885, 2972, 4939, -693, -5679, -1878, 4634, 4172, -2815, -5246, 241, 5455, 2358, -4297, -4080, 2620, 5485, 366, -5166, -2490, 4342, 4733, -1958, -5201, -405, 5304, 3120, -3418, -4321, 1931, 5558, 1309, -4511, -2931, 3752]
2270C752J431o365l564M003N762j315o295k276N990M502l884o243J021O697J875
2285E091n184m837L273O301l73o320k927N397N081l107o470L10N829L485m974
2300E75n782K565O782N47o313l313M439N413k043o096j446O015L994m249n848
2315d760J526O561J212n840m274L993O163j148o626j930N669M514l557o511J081
2330c927O229J920n029m490K971O345n35o218k379N032M642k645o070k17O085
2345A714K923m511n291K365O392L31o271k916M470N014j817n917j048N691L910
2360E039m118n699J622O117J485n581l844L638N377q22o343j267N126L846l037
2375A539n722P32N921K384n400m336K914O172l03o095k579M949M798k845n660
$$ y = [3752, 5183, -1182, -4746, -743, 5019, 3704, -2591, -4867, 1123, 5625, 1741, -4502, -3481, 3216, 5091, -93, -4930, -1657, 4644, 4271, -2049, -4976, 421, 5502, 2395, -4075, -3765, 2064, 5549, 575, -5207, -2642, 4140, 4687, -1626, -4939, -500, 4913, 2870, -3226, -4672, 1343, 5337, 1088, -4760, -3234, 3327, 4539, -1301, -5575, -1582, 4581, 3433, -3193, -5123, 546, 5060, 1503, -5008, -3927, 2302, 4222, -807, -5297, -2326, 4019, 3484, -2734, -5113, -81, 4561, 1916, -4154, -4371, 1714, 4637, 126, -5165, -2800, 3592, 3923, -2348, -5264, -794, 4220, 2403, -3514, -4562, 1129, 5039, 921, -4778, -3156, 2961, 4446, -1135, -4979, -1341, 4036, 3214, -3129, -4396, 730, 4576, 1539, -4183, -3451, 2470, 4854, -546, -4882, -1968, 4204, 3901, -2194, -4773, 176, 4974, 2129, -3531]
2390c531qN677L025m850m621K195N589Q01n767k959M070N129j925n685j313N818
2406A645L512l687n325J137N909J745n567l985L653N395p47o109j656M984L993
2421D897l178n481Q29N522J896m699m478L417N098p4n779k609M340N015k474n802
2437c560l23N565L055m555m884K609N385P38n724l094L974M873j549n933q98N474
2453A153L500l897m524Q35N633J278n130l694L331N115q13n504j679N042L552
2468D198k957n274P67N212K117m840m248K890N437k26n690k030M268M161j981
2483A804n340j57N051K843m106m634K326N256L80m938k803L717M673j549n647
2498c124p77M873L256l493m790J068N768J112m705l383K913N143r47n419j289
$$ y = [-3531, -3539, 2138, 5163, 313, -4308, -2113, 3476, 4277, -1490, -4449, -379, 4750, 2825, -2860, -4173, 1645, 5157, 1470, -3855, -2718, 3191, 4936, -631, -4616, -963, 4432, 3685, -2424, -4080, 904, 4897, 1719, -3762, -2933, 2589, 4485, -214, -4692, -1275, 3823, 3749, -2030, -4639, -299, 4716, 2242, -3560, -3883, 1682, 4737, 182, -4702, -2093, 3292, 4030, -1694, -4788, -814, 4059, 2510, -3423, -4321, 1153, 4653, 756, -3768, -2933, 2700, 3978, -1152, -4846, -1515, 3600, 2787, -2717, -4396, 646, 4198, 1241, -4033, -3266, 1946, 4063, -777, -5025, -2135, 3302, 3076, -2614, -4644, -376, 3785, 1804, -3536, -3693, 1358, 4201, 95, -4539, -2213, 3043, 3423, -1515, -4318, -601, 4072, 2523, -3124, -3901, 972, 4228, 735, -4055, -2987, 2781, 3893, -812, -4195, -1282, 3861, 2914, -2505, -3794]
2513c794M573L606k758n123N00N130K162m292m153K607N289m77m866k333L923
2528fM509k410n021m82N158K687l608m514J687N178Q69n177k886L484M823j309
2544B982n393j152M791L300l312m887J248N086J269m598l367L048M880r18n067
2559b090j775M747L371k755m686o6N230K173m600l664K497M636K40n152k378L971
2575c01M120j763n179k56N048K052l606m519J900N087O34m506k741L045M539j615
2591A939m689j125M736K792l020m626J041N184J299m040m060L165M668p59m881
2606b376j313L757L611k501m812N22M609K300l889l948K430M587k88m464k239
2621d014L561L991j514m914o28M787K434l397m124J562M879Q30m835k821L570
$$ y = [-3794, 779, 4385, 1627, -3496, -2996, 2134, 4296, 4, -4149, -1542, 3747, 3270, -1596, -3929, -6, 4503, 2093, -2928, -3410, 1748, 4435, 827, -3687, -2000, 3178, 4047, -1130, -4016, -532, 4291, 2982, -2411, -3563, 1228, 4528, 1216, -3671, -2423, 2663, 3932, -666, -4033, -985, 3895, 2977, -2090, -3865, 882, 4253, 1498, -3188, -3254, 1976, 4149, -451, -4115, -1618, 3018, 3258, -1894, -4272, -301, 3819, 2056, -3123, -3379, 1669, 3721, 115, -4404, -2504, 2583, 3217, -1289, -4030, -985, 3554, 1939, -2750, -3875, 861, 3653, 633, -3993, -2952, 2232, 3531, -509, -4569, -1404, 3264, 2505, -2376, -3689, 68, 3679, 1178, -3634, -3112, 1497, 3797, -92, -4040, -1610, 2977, 2689, -1775, -4014, -453, 3538, 2024, -2890, -3518, 1269, 3703, 306, -3818, -2256, 2623, 3453, -1382, -4203, -633]
2636f33M460j570m642j123M439L052l318m280J142M863J290m191l038K590M265
2651C306p55m599j346L883L373k172m607K27M983J527l589l587J944M643k42m219
2667a230k143L744L744j975m869j71M659K035l152m105J222N042M96m222k657
2682c582L016M374j491m671j230M718K599l045m099J197M191J659m286l131K690
2697a091M320o58m614j344L694K998j914m408J72M565J999l925l843K547M291
2712B789j51m413k100L518L867j909m601k96M386K354l352l573J493M134Q76m346
2728a324k371K933L869j152m624p49M173K760k956m037R79M356J159l946k689
2743c619K536M098n46m405j622L601L122k092m036R2M298J811l211l358J531M132
$$ y = [-633, 3827, 2257, -2385, -3508, 931, 3983, 665, -3615, -2473, 2390, 3680, -511, -3549, -959, 3306, 2551, -2048, -3394, 489, 3862, 1690, -2917, -2690, 2293, 3820, 231, -3356, -1412, 3231, 2989, -1230, -3373, 371, 4115, 2140, -2729, -2900, 1759, 3794, 642, -3463, -2241, 2801, 3297, -925, -3582, -566, 3808, 2317, -2354, -3584, 1134, 3733, 688, -3411, -2214, 1977, 3636, -650, -3781, -1091, 3229, 2571, -2043, -3387, 307, 3305, 1391, -3017, -2845, 1720, 3719, -206, -4049, -1502, 2789, 2638, -1775, -3875, -357, 3510, 1601, -3000, -3296, 1090, 3444, 92, -3481, -1988, 2146, 3022, -1324, -3695, -762, 3107, 1955, -2669, -3418, 755, 3515, 559, -3478, -2499, 1857, 3016, -930, -3619, -1083, 3015, 2469, -1936, -3558, 43, 3165, 1073, -2963, -2871, 1427, 3238, 27, -3331, -1800, 2332]
2759B332L74l938k192L107L581j661m014k18L963J955k693l843J342M388R13m203
2775h07k551K995L778j115m235p41L810K271k227m027J029M188Q00l695k835K692
2791f70L774o77l976j265L356L169k319l914K66M101J517l105l455K271L720%
2807B793m426j262K722L501j774m026%L771K383l390l605J254M574N83m146k204
2823c252K772L640j329m031o75L516K419k144l704K88M166J271l674k604J969
2838a372M143m50m242j096K958L461k120m047j05M004K165l565l020J816L572
2853B102L16m106j649K589L609j441l965j65L420K417k986l093R75M079O75l725
2869i48k344K488L637j025l756r94L615K100j925l779O83M064J248l823k150J765
$$ y = [2332, 2706, -1232, -3424, -317, 3264, 1603, -2411, -2629, 1334, 3289, 596, -3247, -1905, 2483, 3396, -807, -3358, -363, 3415, 2300, -1935, -2676, 1134, 3405, 1178, -2849, -1820, 2368, 3168, -527, -3362, -670, 3104, 2427, -1549, -2814, 542, 3711, 1392, -2522, -2256, 1845, 3362, 257, -3198, -927, 2793, 2793, -1633, -2895, -173, 3328, 1554, -2472, -2472, 1299, 3682, 292, -3313, -2059, 2515, 3098, -1048, -3252, -480, 3160, 1831, -2200, -2875, 641, 3060, 916, -2788, -2500, 1666, 2937, -737, -3341, -1372, 2771, 2321, -1921, -3017, -59, 3402, 1282, -2765, -2870, 1134, 3299, -266, -3286, -1470, 2102, 2418, -1688, -3337, -748, 2861, 1420, -2545, -2710, 710, 3127, 141, -2952, -1977, 2102, 2777, -948, -3292, -804, 2833, 1808, -1948, -2942, 673, 2773, 848, -2931, -2248, 1816, 3064, -759, -2909, -1144]
2885a144L627m03l464j704L405K457j761l513n5M369J200k835l283J791L975Q2
2901B744l885j793K879K934j370l561n03L507K386k889k776Q64L523R64l863k082
2917b921K435L177n42l871j009L621K349k158l712O20L490J423l263k686K086
2932i61L859n26l820j304L242K605j449l878K37L332J668k734l115J733L432J6
2948B337l405j799K808K821j433l414m82L441J951k336l416J286L713M71l355
2963h12k313K390L213q00l303j369L447K355j971l748R45L389J272k956k524J773
2979a012L365l04l534j519K882L091j961l483j86L721J635k835k832J322L573
2994A923L61l414j944K713L175j492l674k66L018K309k203l307J039L593O53l183
$$ y = [-1144, 2483, 2080, -1384, -3088, 317, 2774, 1013, -2500, -2555, 1814, 3014, 179, -3104, -1313, 2662, 2744, -1141, -2934, -55, 2879, 1509, -2052, -2555, 952, 3338, 449, -2327, -1463, 2060, 3024, -839, -2921, -486, 2691, 2149, -1722, -2731, 890, 3239, 1081, -2631, -2011, 1479, 2902, -361, -3047, -961, 2898, 2372, -1448, -2752, 490, 3095, 1646, -2232, -1995, 1337, 3005, 271, -2844, -1111, 2321, 2337, -1068, -2867, -59, 2762, 1329, -2085, -2567, 874, 2825, 489, -2927, -1641, 2072, 2543, -812, -3125, -735, 2478, 1678, -1625, -2994, 453, 2808, 837, -2911, -1966, 1423, 2695, -261, -2785, -1012, 2353, 2049, -1485, -3004, -122, 2969, 1008, -2475, -2661, 1060, 2695, -140, -2972, -1650, 1923, 2284, -1130, -3074, -361, 2814, 1322, -2352, -2618, 400, 2709, 506, -2801, -1762, 1831, 2484, -699]
3010f99k509K416L415j191l364r40L374K374k082l195K49L519J314k772k533J580
3026a044L308j88l325j233K696K599j570k981l15L083K122k586l030J046L519
3041B101M33l381j759K292L024j118l091n80L228J878k336k998R53L248N76k898
3057d28k079J871K892k27l589p79L036K128j839l218J71L543J297k798k239J543
3073g15K804j32k880j572K755K647j647l186q6L215J398k098k864J140K976N28
3089B283l359j466K430K563j141k913p47L094K157k438k804P11L251M13k631k082
3105b679K108K858p04l051q32K664K267k253k749J84L029J356k624k237J484K918
3121A739O2l083j175K197K504j093l283J52K851J177j908k824J388K846N13k733
$$ y = [-699, -3208, -792, 2623, 1432, -1932, -2872, 502, 2876, 794, -2401, -2152, 1367, 2681, -91, -2624, -1044, 2264, 2076, -1249, -2482, 214, 2813, 1243, -1738, -2053, 1030, 3152, 566, -2464, -1418, 2101, 2534, -847, -2606, -314, 2710, 1592, -1499, -2079, 1149, 3027, 691, -2307, -1354, 1894, 2470, -428, -2507, -636, 2256, 2029, -1560, -2339, 697, 2825, 986, -2232, -2061, 1482, 2779, -19, -2258, -715, 2089, 1957, -923, -2495, 260, 2907, 1260, -1926, -2012, 1203, 2601, 503, -2361, -1221, 1755, 2283, -1076, -2542, -112, 2451, 1310, -1603, -2350, 744, 2901, 463, -2341, -1630, 1621, 2034, -597, -2679, -571, 2287, 1583, -1468, -2300, 364, 2631, 378, -2371, -2187, 842, 2198, -426, -2663, -1179, 1739, 1801, -1282, -2457, -260, 2244, 1151, -2132, -1980, 871, 2048, 140, -2684, -1296, 1550, 2063, -670]
3137f70k003K311K954j003l479m82K890J950j972k949P99L154R70k941j914J854
3153e31K833p48k873j072K816K193j918k741N86K709J032k281k303J293L011R4
3169B100l495p35K497J824j210k609k53K961J420k094k739J208L172L43l080j520
3185b210K273K172o73k870o53K688J970k138k541J054K712N71k894j463J458K438
3201A894j50k906j002K554K085j886k355J24K855Q87k359j846J258K685R3k724
3217g93j517K161K346j230k853J12K544J607k139k457J161K508O94k914j303J498
3233e75K673p92k772p16K661J757j990k592R68K729N38k449j858J544K451k83
3249A294k464q32K093J860j072k857M80K675P36k026k556J524K946j70k794j012
$$ y = [-670, -2673, -362, 2592, 1589, -1890, -2372, 518, 2468, 496, -2453, -1654, 1500, 2470, -471, -2385, -531, 2302, 1554, -1319, -2391, 425, 2618, 700, -2041, -1455, 1254, 2286, 5, -2298, -1005, 2006, 2100, -1395, -2130, 367, 2191, 981, -1628, -1881, 1080, 2500, 406, -2333, -1125, 2047, 2390, -690, -2210, 63, 2235, 1562, -1308, -1961, 727, 2697, 559, -1982, -928, 1784, 2355, -539, -2002, -544, 1894, 1744, -1162, -2164, 390, 2475, 589, -1766, -1642, 1213, 2100, -259, -2105, -847, 1838, 1931, -793, -2310, -149, 2197, 967, -1886, -1774, 770, 2377, 238, -2219, -1058, 1450, 2144, -770, -2073, -575, 2098, 1306, -1466, -2182, 479, 2236, 246, -2346, -1378, 1351, 1889, -560, -2418, -874, 1577, 1294, -1170, -2002, 91, 1951, 879, -1978, -1498, 1177, 1913, -113, -2669, -1145, 1801, 1631, -1163, -2175]
3265b175K109K191j344k447j7K273J611k107k111R79K711J93k585j443J582K654
3281B074n92k909n03K953J239j741k455N51K759P11k269k043J751K587o03k729
3297a219o91K050K116j515k320L13K493R19j992k034J051K622J42l081o65J925
3313A14K081j020k878K8K738J117j898k157P94K599K27k374j502J930K211o64
3329A346k844m02K747J274j707k170O50K352P11j955j854J426K285n86k570o86
3345a983K255K103j611k498M44K690M29j971k184J624K323q5k523j180J873J964
3361A670p48k522J71K015J559k174k098R46K743l06k185j197J455K377o14k478
3377a386l29K206J545j989j678L18K369L72k027j488J699K218p74k504n62K210
$$ y = [-2175, -66, 2125, 781, -1666, -1683, 590, 2201, 94, -2017, -1038, 1673, 1866, -719, -2162, -580, 2074, 1482, -1427, -1930, 1023, 2262, 521, -1934, -1383, 1376, 2087, -182, -2225, -474, 2113, 1510, -1219, -1910, 140, 2256, 741, -1579, -1266, 1227, 2146, 154, -1880, -829, 1793, 1935, -1146, -1811, 114, 2195, 1175, -1703, -1675, 1063, 2180, 282, -1875, -1081, 1518, 1745, -629, -2131, -201, 2010, 1346, -1498, -1900, 847, 2121, 414, -1756, -1106, 1246, 1957, 2, -1852, -426, 1859, 1273, -1297, -1983, 272, 2375, 764, -1734, -1290, 1400, 1829, -142, -2326, -702, 1621, 1536, -987, -2167, -294, 1670, 922, -1600, -1429, 586, 2145, -29, -2127, -1181, 1562, 1256, -929, -2126, -671, 1706, 1092, -1386, -1715, 491, 2036, 47, -1631, -1313, 1056, 1428, -599, -2087, -388, 1830, 1056, -1448, -2010, 200]
3393B00J639j209k296J32K293Q78j906j636J360K165j18k503r47K028J504p35
3409H49k610LK690J049j746k066R55K326R3k235j427J854K312p82k494l41K394
3426H24J221j780j756J71K639M57k123j511J327K156l10k482m34K067J423r83
3442I06k556M06K183J150j885j951J045K201lk318j275K006J833o27k611M6K204
3459G54J007j665j868Q58K146J43j772j581J625K379q57k319o74K136J511j467
3475C56k063M38K462M84k090j262J440J866m97k143p13J961J725j170k126jK415
3492A082O84j744j903J268K066l85j798q76J732J663j165k218j47K160J484j854
3508D9j855P50K321p3j630j507J568K110q07k120l42K244P95j002k119O56K052
$$ y = [200, 1839, 630, -1666, -1534, 759, 1637, -269, -1905, -545, 1620, 1502, -1001, -1948, 80, 1584, 849, -1761, -1758, 932, 1981, 235, -1831, -876, 1450, 1543, -692, -2119, -265, 2047, 1265, -1229, -1570, 824, 2045, 265, -1491, -1320, 1319, 1776, -347, -1858, -531, 1625, 1315, -1167, -1601, 466, 1889, 906, -1650, -1244, 939, 2089, 204, -1747, -702, 1499, 1496, -822, -2097, -91, 1742, 1115, -1496, -1450, 754, 1761, 96, -1772, -914, 1232, 1375, -397, -1978, -353, 2026, 1169, -1150, -1824, 312, 1823, 356, -1707, -1269, 1193, 1677, -413, -1675, -235, 1631, 1134, -1009, -1722, 239, 1964, 794, -1332, -1333, 1082, 1766, 22, -1881, -613, 1453, 1068, -730, -1606, 126, 1789, 624, -1594, -1741, 419, 1903, 49, -1806, -1056, 1265, 1192, -438, -1945, -377, 1733, 926, -1194, -1536, 708, 1503, 501, -1618, -962, 1090]
3525A090K66j581j828J563K051l58k269m67J867J235q80k289K67K147Q99j661
3541E2j985J142K164k21j957o06J293J592o58k323r7K346J150j830j326O03K074
3558A413n0j732j114J320J773r43j558m00J724J214j019k049K96K298M53j976
3574c50j304J606J853n06k120p13J892J306j197j821j12K385M79j546j332J002
3590d78J886l98j691o14J112J805q31j700l55J788Q76j154j676N05K025M22j976
3607d54j164J439J612q55j554n12J945J307j434j603J36K348J22j663j509J378
3623d61J854m50j971m15J550J468r79j698k71K429L31j672j128Q90J653N4j851
3640f67q45J618J349q50j680n34K348O27j697j286Q57J689O99j953j276J524J677
$$ y = [1090, 1356, -225, -2053, -490, 1561, 1203, -1066, -1533, 334, 1569, 689, -1600, -1333, 814, 1713, 52, -1933, -791, 1373, 1152, -805, -1411, -118, 1474, 816, -1507, -1604, 742, 1892, 62, -1264, -661, 1413, 1363, -369, -1483, -163, 1610, 667, -891, -1291, 433, 1647, 628, -1421, -1125, 1173, 1626, -350, -1654, -48, 1805, 1299, -821, -1534, 358, 1664, 467, -1354, -1466, 919, 1398, -148, -1480, -478, 1408, 1010, -681, -1295, -183, 1622, 791, -909, -1264, 524, 1400, 246, -1430, -925, 1100, 1522, -454, -1618, -179, 1433, 578, -976, -1488, 457, 1764, 330, -1273, -1137, 1211, 1333, -330, -1839, -461, 1393, 943, -1028, -1443, 107, 1575, 596, -1102, -1373, 1056, 1387, -285, -1413, -523, 1130, 1184, -667, -1512, 106, 1455, 605, -1075, -1609, 739, 1366, -331, -1617, -760, 929, 1628, -325, -1601, -77, 1600]
3657A600q83j885k44J855P37q36j939N20K046K77j638j008J002J856l57j717q13
3674a427J451J684j122j864L69J777Q13j647j565Q51J849M4j834p39J357J652
3690A649q28j904k00K089O92j190j696O44J755M70j658j245J394J612n21k111
3706a048k37J902J102j468j639M85J682N19j683r47J060J607m46j833n45J742
3722B53J330j206j644K46K040L93j657r77P78J602j0j855p18J448J376q34j402
3739h37k68J476J120j160j676O70J630J12j543j304J383J628k30k171J38J160
3755A28R38m14j739J08J692L30j245j079O92J519q0j333p90J319J076o11j755
3772a244Q2J831M67j191j503J067J594j78j645m66J091J188m31j529j77J409J240
$$ y = [1600, 717, -1168, -1412, 443, 1180, 344, -1595, -1075, 971, 1248, -390, -1398, -396, 1460, 1103, -614, -1427, 24, 1708, 586, -1278, -909, 868, 1681, 34, -1531, -680, 1169, 1213, -621, -1360, -3, 1649, 821, -1083, -1283, 806, 1498, 308, -1388, -744, 1011, 1481, -177, -1422, -28, 1584, 1063, -1048, -1285, 617, 1719, 251, -1388, -903, 779, 1298, -385, -1332, -272, 1335, 889, -944, -1489, 253, 1583, 377, -1267, -1021, 1019, 1412, -245, -1222, -444, 1158, 1148, -707, -1425, 23, 1399, 565, -837, -1105, 371, 1491, 331, -1345, -675, 955, 1067, -476, -1780, -397, 1231, 1001, -1170, -1032, 128, 1066, 652, -1087, -979, 713, 1043, -202, -1281, -589, 930, 850, -483, -1273, 46, 1122, 511, -1244, -1162, 669, 1136, -55, -1558, -491, 1103, 925, -720, -1186, -95, 1093, 662, -867, -1044, 365, 1605]
3789A605j664j257N43J681Q0j437p65R55J635m13j877k65J483J127j298j157P7
3806i47J941N15j662j060Q18J677l06j500q30J515J030o34j445P6J350Q48j343
3823D3j023L75J548J32j406p54J022J369p51j499j63J518Q51j084j509P72J698
3840A139o8j475o34Q39J178k49j316o98J782R19j143j194K83J213R30j635j257
3857a386R90J264K28j739o85J721N41n79j427J7J663N57j292j037Q64J151K46
3874A097j612o93J137J242p56j318m34J497J060j155j199K49J530M55j674m87
3890a061R95J084k42j426l63J232J198j452j060L22J179M72j534p45Q17J419l
3907H32j495m59J158Q61p54j042J80J027O82o83j565M84J731J23j670o39J323
$$ y = [1605, -59, -1316, -773, 908, 988, -449, -1214, -259, 1376, 963, -914, -1179, 304, 1431, 133, -1024, -947, 994, 1509, -153, -1213, -395, 1282, 976, -524, -1354, 161, 1191, 557, -888, -812, 538, 1386, 43, -980, -605, 943, 1075, -331, -1085, -63, 1306, 555, -944, -1107, 411, 1262, 178, -1331, -559, 1139, 1071, -404, -1038, -199, 979, 730, -586, -1284, 498, 1417, 274, -920, -637, 576, 1506, -129, -1386, -396, 868, 1096, -643, -1328, 393, 934, 355, -1072, -1055, 608, 1165, -127, -1164, -300, 851, 1097, -515, -1208, -71, 1171, 415, -903, -1337, 160, 1220, 65, -1134, -885, 645, 1100, -574, -1061, -66, 1018, 776, -650, -1013, 219, 1417, -35, -1095, -773, 406, 878, -656, -1401, -584, 835, 832, -663, -1122, 36, 897, 143, -899, -719, 308, 990, 307, -1258, -774, 957, 1080, -590, -1229, 94]
3924I4R48j47j770q2J256O70p47j287M80J222J00q28p43N39J272k49j211q32J715
3943D00P01p25j601M94J184O86j331r03N91J743j61j707n70J299J083p03j346
3960h66J23J227M96j046q45L78J262O9j178n46J053R69k25j657k07J223P72r55
3978D7j109O23J045O70j521q80J146Q52l67j275j69J080J262j126j172R1J183
3995C80M96j034p98M20J341m1r92p60R37R96p19r89n7J118R13j342r97N28J423
4014H23Q2j007j005R19J373l90j439K2J046O14q22j034j52J341N59j265m17K95
4032d57J331k08j389l75J208R96j021j013n3J467M38j046r51N28J469l44j336
4049g56k86Q16J227m62j279J64R97K76p24p09J90J318R2j261o22Q89J078n39j129
$$ y = [94, 1042, 895, -875, -957, 299, 969, 222, -1065, -585, 637, 737, -91, -834, -295, 977, 728, -483, -1315, 400, 1101, 376, -1225, -731, 453, 1139, -192, -1095, -504, 1239, 1078, -629, -1199, 100, 1183, 480, -866, -743, 484, 980, -66, -911, -533, 729, 798, -380, -926, 127, 1096, 871, -786, -993, 230, 1002, 47, -1062, -439, 606, 1276, -245, -1125, 21, 873, 506, -769, -938, 142, 1404, 278, -894, -803, 380, 876, -158, -956, -536, 805, 764, -228, -988, -51, 945, 226, -763, -820, 298, 1211, -131, -1128, -600, 823, 905, -102, -1107, -188, 1185, 795, -644, -622, 424, 1038, 216, -818, -970, 371, 930, -335, -752, -457, 874, 666, -723, -1098, 110, 1106, 85, -928, -981, 486, 924, -122, -1073, -545, 924, 580, -756, -1042, -226, 1001, 539, -740, -576, 421, 697, -27, -736, -546, 772, 864, -397, -1019, -130, 948, 409, -720]
4068g20j24J027P95o33p77j26J453j63j208l54M82J233j48j121j39Q73M98o80
4086A68r60N43P57M20j045p61M15J380j64r94o84P58J121l94r58n62J295P73j242
4105a34o80J72J139M7q17o35R52Q68l76j119j33J416K16n92j082L76J017q7r98
4124d50n29J067N20Q7j230k70R92P41k51j497J19J199K70r74p88P02Q40P9j011
4143c84l95O68J030m53j175m50J223Q10j118p11O94P76j04q57l67P59O69j76r70
4162e31j58R82O53j017o80L92J088J21j068p60P42J066l11j265J75N30R66o15
4180C10j005j35J125K50p48n92M94R24O7j046n20J144K74j54q56j02R29K83o34
4199Hn70r0J147J79r66n81P11J009m93j007j72Q84M71m59p53L78Q23J32o52o34
$$ y = [-720, -844, 183, 978, 345, -432, -558, 895, 732, -476, -830, -348, 885, 737, -384, -523, 350, 848, 168, -792, -249, 508, 928, -117, -878, -463, 917, 753, -241, -925, -167, 954, 560, -398, -960, 335, 1108, -134, -814, -642, 497, 544, -273, -908, 44, 912, 536, -583, -716, 700, 916, 324, -758, -382, 635, 548, -450, -979, 88, 608, 695, -535, -805, 187, 928, 677, -820, -701, 498, 768, -206, -994, -292, 548, 627, -384, -779, -111, 919, 466, -709, -1159, 64, 874, -244, -955, -261, 515, 411, -446, -813, -54, 615, 439, -531, -689, 293, 946, -71, -751, -359, 729, 850, -218, -978, -236, 830, 519, -746, -571, -41, 925, 310, -695, -830, 295, 545, -203, -795, -301, 623, 690, -356, -876, 268, 542, 388, -468, -570, 359, 642, 8, -562, -652, 495, 674, -292, -873, -162, 847, 354, -653, -825, 59, 530, 71, -682, -304, 519, 651, -1, -635]
4219f35M84Q76K1j453N1O59P57p45n67R2R42M77r32j054O34J200k46p04q28R38
4239c3Q91m61p97l92J115K05n50j049P88Q35M8o35q57R35O70k48j048k82J130
4258B65M76n15j237P85P94O8r53m80P75O02j46r99j29O78O75k95j127J34Q35L01
4278E07n60p18L98P93j77o27m74R32Q69q13p83P1P67M64l39p55N6R63m9p47m80
4299g02O42Q68l89q65j49P88M81n60q76J1J054j97m21k96M40Q97k72o07q16J029
4319F0O61p16o07Q0Q87P83j063o46O29K88J77p72k36J80Q12n82m87R2P97M94q53
4340b2n68R7J011j24o86k71N88M43m3o98m02R19L69m29o35j68R86J89o78m40N42
4361b0O80j44q56l36O57O44m21o04j20O28N28o36m21J80N30K6l67o85L62J013
$$ y = [-635, -151, 725, 746, -707, -656, 3, 760, 15, -552, -460, 482, 959, 27, -1027, -393, 807, 561, -143, -971, -33, 858, 397, -400, -792, 323, 528, -22, -1071, -283, 552, 600, -35, -892, 43, 713, 465, -583, -865, 265, 741, 226, -1011, -226, 568, 636, -317, -797, -22, 580, 434, -565, -694, -16, 659, 364, -763, -629, 206, 507, -53, -771, -373, 420, 243, -384, -858, 74, 943, 130, -653, -582, 185, 649, 310, -445, -389, 574, 525, -222, -702, -60, 808, 419, -446, -595, 193, 674, 114, -762, -751, 303, 106, -315, -611, -171, 726, 454, -153, -969, 60, 721, 5, -602, -522, 365, 1148, 85, -561, 68, 356, 533, -239, -475, -295, 517, -65, -552, -460, 337, 831, -22, -590, -493, 518, 394, -292, -563, 25, 468, 425, -273, -675, 244, 613, 184, -451, -619, 367, 556, -122, -562, -20, 660, 516, -340, -676, -19, 625, 204, -400, -520, 108, 636, 0, -421, -241, 289, 315, -52, -737, -375, 638]
$$ [...]
8191H1
##END NTUPLES=NMR FID
##END=
