##TITLE=1H_EC-3216(3)
 CDCl3, 8 sc, 
 25.12.2019
##JCAMPDX= 6.0         $$ Bruker NMR JCAMP-DX V2.0
##DATA TYPE= NMR FID
##DATA CLASS= NTUPLES
##ORIGIN= UXNMR, Bruker Analytische Messtechnik GmbH
##OWNER= root
$$ XWIN-NMR		Version 3.5
$$ Wed Dec 25 13:48:57 2019 Russian Standard Time (UT+4h)  she@DPX200
##.OBSERVE FREQUENCY= 200.1315
##.OBSERVE NUCLEUS= ^1H
##.DELAY= (6, 6)
##.ACQUISITION MODE= SIMULTANEOUS
##.ACQUISITION SCHEME= undefined
##.AVERAGES= 8
##.DIGITISER RES= 18
##SPECTROMETER/DATA SYSTEM= spect
##.PULSE SEQUENCE= zg30
##.SOLVENT NAME= DMSO
##.SHIFT REFERENCE= (INTERNAL, DMSO, 0, 15.7039)
##AUDIT TRAIL= $$ (NUMBER, WHEN, WHO, WHERE, WHAT)
$$ ##TITLE= Audit trail, XWIN-NMR		Version 3.5
$$ ##JCAMPDX= 5.01
$$ ##ORIGIN= Bruker BioSpin GmbH
$$ ##OWNER= she
$$ F:/spectra/data/she/nmr/H-F/1/audita.txt
$$ ##AUDIT TRAIL=  $$ (NUMBER, WHEN, WHO, WHERE, WHAT)
(   1,<2019-12-25 13:47:29.20 +0400>,<she>,<DPX200>,
      <created by zg, POWCHK disabled, PULCHK disabled
       configuration hash MD5:
       00 E9 B6 7A A2 85 ED C7 34 08 36 98 17 FE 4E 26
       data hash MD5: 16K
       70 74 69 C3 DF F2 3F A0 AE CF 57 5B 81 75 D3 78>)
$$ ##END=
$$ 
$$ hash MD5
$$ 68 74 5D 32 47 32 6B 09 EA 83 6F 9C 6A 62 59 DD
##$RELAX= 
##$RELAX= 
##$RELAX= 
##$RELAX= 
##$RELAX= 
##$RELAX= 
$$ Bruker specific parameters
$$ --------------------------
##$DU= <F:/spectra>
##$EXPNO= 1
##$NAME= <H-F>
##$PROCNO= 1
##$TYPE= <nmr>
##$USER= <she>
##$AMP= (0..31)
100 100 100 100 100 100 100 100 100 100 100 100 100 100 100 100 100 100 
100 100 100 100 100 100 100 100 100 100 100 100 100 100 
##$AQSEQ= 0
##$AQ_mod= 1
##$AUNM= <au_zg>
##$AUTOPOS= <>
##$BF1= 200.13
##$BF2= 200.13
##$BF3= 200.13
##$BF4= 200.13
##$BF5= 200.13
##$BF6= 200.13
##$BF7= 200.13
##$BF8= 200.13
##$BYTORDA= 1
##$CFDGTYP= 0
##$CFRGTYP= 5
##$CHEMSTR= <none>
##$CNST= (0..31)
1 1 145 1 1 1 1 1 1 1 1 1 1 1 1 1 1 1 1 1 1 1 1 1 1 1 1 1 1 1 1 1 
##$CPDPRG= <>
##$CPDPRG1= <>
##$CPDPRG2= <>
##$CPDPRG3= <>
##$CPDPRG4= <mlev>
##$CPDPRG5= <mlev>
##$CPDPRG6= <mlev>
##$CPDPRG7= <mlev>
##$CPDPRG8= <mlev>
##$CPDPRGB= <>
##$CPDPRGT= <>
##$D= (0..31)
0 1.2 0 0 0 0 0 0 0 0.06 0 0.03 0 0 0 0 0.0002 0 0 0 0 0 0 0 0 0 0 0 0 
0 0 0 
##$DATE= 1577267248
##$DBL= (0..7)
120 120 120 120 120 120 120 120 
##$DBP= (0..7)
150 150 150 150 150 150 150 150 
##$DBP07= 0
##$DBPNAM0= <>
##$DBPNAM1= <>
##$DBPNAM2= <>
##$DBPNAM3= <>
##$DBPNAM4= <>
##$DBPNAM5= <>
##$DBPNAM6= <>
##$DBPNAM7= <>
##$DBPOAL= (0..7)
0.5 0.5 0.5 0.5 0.5 0.5 0.5 0.5 
##$DBPOFFS= (0..7)
0 0 0 0 0 0 0 0 
##$DE= 6
##$DECBNUC= <off>
##$DECIM= 24
##$DECNUC= <off>
##$DECSTAT= 4
##$DIGMOD= 1
##$DIGTYP= 9
##$DL= (0..7)
0 120 120 120 120 120 120 120 
##$DP= (0..7)
150 150 150 150 150 150 150 150 
##$DP07= 0
##$DPNAME0= <>
##$DPNAME1= <>
##$DPNAME2= <>
##$DPNAME3= <>
##$DPNAME4= <>
##$DPNAME5= <>
##$DPNAME6= <>
##$DPNAME7= <>
##$DPOAL= (0..7)
0.5 0.5 0.5 0.5 0.5 0.5 0.5 0.5 
##$DPOFFS= (0..7)
0 0 0 0 0 0 0 0 
##$DQDMODE= 0
##$DR= 18
##$DS= 0
##$DSLIST= <SSSSSSSSSSSSSSS>
$$ [...]
##$SUBNAM2= <"">
##$SUBNAM3= <"">
##$SUBNAM4= <"">
##$SUBNAM5= <"">
##$SUBNAM6= <"">
##$SUBNAM7= <"">
##$SUBNAM8= <"">
##$SUBNAM9= <"">
##$SW= 24.9337058887773
##$SWIBOX= (0..15)
0 0 2 0 0 0 0 0 0 0 0 0 0 0 0 0 
##$SW_h= 4990.01996007984
##$TD= 16384
##$TD0= 1
##$TE= 0
##$TE2= 300
##$TE3= 300
##$TEG= 300
##$TL= (0..7)
0 120 120 120 120 120 120 120 
##$TP= (0..7)
150 150 150 150 150 150 150 150 
##$TP07= 0
##$TPNAME0= <>
##$TPNAME1= <>
##$TPNAME2= <>
##$TPNAME3= <>
##$TPNAME4= <>
##$TPNAME5= <>
##$TPNAME6= <>
##$TPNAME7= <>
##$TPOAL= (0..7)
0.5 0.5 0.5 0.5 0.5 0.5 0.5 0.5 
##$TPOFFS= (0..7)
0 0 0 0 0 0 0 0 
##$TUNHIN= 0
##$TUNHOUT= 0
##$TUNXOUT= 0
##$USERA1= <user>
##$USERA2= <user>
##$USERA3= <user>
##$USERA4= <user>
##$USERA5= <user>
##$V9= 5
##$VALIST= <valist>
##$VCLIST= <CCCCCCCCCCCCCCC>
##$VD= 0
##$VDLIST= <DDDDDDDDDDDDDDD>
##$VPLIST= <PPPPPPPPPPPPPPP>
##$VTLIST= <TTTTTTTTTTTTTTT>
##$WBST= 1024
##$WBSW= 4
##$XGAIN= (0..3)
0 0 0 0 
##$XL= 0
##$YL= 0
##$YMAX_a= 250188
##$YMIN_a= -95547
##$ZGOPTNS= <>
##$ZL1= 120
##$ZL2= 120
##$ZL3= 120
##$ZL4= 120
##$ABSF1= 10
##$ABSF2= 0
##$ABSG= 5
##$ABSL= 3
##$ALPHA= 0
##$AQORDER= 0
##$ASSFAC= 0
##$ASSFACI= 0
##$ASSFACX= 0
##$ASSWID= 0
##$AUNMP= <proc_1d>
##$AZFE= 0.1
##$AZFW= 0.1
##$BCFW= 1
##$BC_mod= 2
##$BYTORDP= 1
##$COROFFS= 0
##$CY= 11.3945322036743
##$DATMOD= 1
##$DC= 2
##$DFILT= <>
##$DTYPP= 0
##$F1P= 16.9975609425685
##$F2P= -3.02152046262296
##$FCOR= 0.5
##$FTSIZE= 0
##$FT_mod= 4
##$GAMMA= 1
##$GB= 0.15
##$INTBC= 1
##$INTSCL= 1
##$ISEN= 128
##$LB= 0.24
##$LEV0= 0
##$LPBIN= 0
##$MAXI= 10000
##$MC2= 0
##$MEAN= 0
##$ME_mod= 0
##$MI= 1.114404
##$NCOEF= 0
##$NC_proc= 0
##$NLEV= 6
##$NOISF1= 3.799351
##$NOISF2= 2.8
##$NSP= 1
##$NTH_PI= 0
##$NZP= 0
##$OFFSET= 15.70392
##$PC= 1
##$PHC0= -10148.54
##$PHC1= 19.8008
##$PH_mod= 1
##$PKNL= yes
##$PPARMOD= 0
##$PSCAL= 0
##$PSIGN= 0
##$REVERSE= no
##$SF= 200.130013532006
##$SI= 16384
##$SIGF1= 3
##$SIGF2= 2
##$SINO= 400
##$SIOLD= 16384
##$SREGLST= <1H.CDCl3>
##$SSB= 0
##$STSI= 0
##$STSR= 0
##$SW_p= 3612.71676300578
##$SYMM= 0
##$S_DEV= 0
##$TDeff= 0
##$TDoff= 0
##$TI= <>
##$TILT= no
##$TM1= 0
##$TM2= 0
##$TOPLEV= 0
##$USERP1= <user>
##$USERP2= <user>
##$USERP3= <user>
##$USERP4= <user>
##$USERP5= <user>
##$WDW= 1
##$XDIM= 8192
##$YMAX_p= 0
##$YMIN_p= 0
$$ End of Bruker specific parameters
$$ ---------------------------------
##NTUPLES= NMR FID
##VAR_NAME=  TIME,          FID/REAL,        FID/IMAG
##SYMBOL=    X,             R,               I
##VAR_TYPE=  INDEPENDENT,   DEPENDENT,       DEPENDENT
##VAR_FORM=  AFFN,          ASDF,            ASDF
##VAR_DIM=   8192,          8192,            8192
##UNITS=     SECONDS,       ARBITRARY UNITS, ARBITRARY UNITS
##FACTOR=    0.0002004,     1,               1
##FIRST=     0,             0,               0
##LAST=      1.6414764,     0,               0
##MIN=       0,             -95547,          0
##MAX=       1.6414764,     250188,          0
$$ Real data points
##PAGE= N=1
##DATA TABLE= (X++(R..R)), XYDATA
$$ [...]
2386A461o48k476J460J646k704M55K070j722r03K367m98k052J987J072k559M29
2402f15K888k771j141K761m0k977J821K228k710m00K183j133j111J996j50k265
2418a436J780J246k506M48J819j541j137K686k69k905J742K292k720k93K115o88
2434F33j762J973K74k042J016J613k669K91K594j741j499K416J11k263J194J914
2450B053k641o91L048j198k295K395L27k652J384J921k119q75K950j122k092J812
2466B05J338k610L49K290j871p30J865m98j849J700J023k306P30J439j809k72
2482a006K065q96k398K345J486k664j86K699j469j461K240l53j911J800Q14k476
2498a371Q60J806j930q08K708o89k631K625R66k952J07K726j232k346K367P67
$$ y = [1461, 813, -1663, -203, 1443, -1261, -806, 1264, -458, -1361, 1006, 508, -1544, 443, 1515, -1044, -615, 2273, -498, -1639, 1122, 1082, -1895, -74, 2154, -556, -956, 1227, 94, -1017, 979, 829, -1436, 344, 1590, -916, -468, 1351, -190, -1327, 1359, 1090, -1815, -73, 2219, -501, -794, 1321, 633, -1129, 844, 1118, -924, 92, 1705, -964, -673, 1921, 180, -1319, 1097, 1208, -1055, 139, 2053, -588, -1279, 1769, 571, -1724, 671, 998, -1654, -270, 1651, -468, -1343, 1607, 485, -1607, 205, 1543, -1067, -718, 1572, -299, -1029, 836, 338, -1511, 189, 1212, -1094, -364, 1075, -734, -1006, 1059, 163, -2235, 110, 1596, -1068, -1254, 1445, -24, -1485, 755, 402, -1509, 291, 1105, -1371, -511, 1295, -635, -1443, 1265, 576, -2055, 570, 1536, -1416, -1309, 1417, 185, -2161, 206, 973]
2514I73k357J510P40j961O88J680j565j147K303l03j886J256J329k546Q9K590
2530A393j540j231K423j71k294J283J406k087K14J976j268j656K575K13k538R67
2546c35K361k272o62K563j059j813J851O80k293Q27J780k326l76K645j413j798
2562a640K546Q46k880R54K371k252j275K396l35j460R98Q36j967J000J011j555
2578d06m27K426j364j494K331K78k818R95K707k627j090K973o11k732K070J252
2594A463k164J98J974j794q47K128l66k185J878J097k514M21J814j398j283K611
2610A033m23k118J170J553k481O14J783j584j236K149Q7j869J253J210k329l1
2626a219K250j140j200J543L33j922J322J005k293K26K337j905q61K147k9k335
$$ y = [973, -1384, 126, 866, -1095, -407, 1273, -292, -1439, 864, 561, -1325, -69, 1260, -1286, -1197, 1393, -147, -1378, 1045, 874, -1420, -137, 1269, -818, -604, 1372, 104, -1552, 1023, 1236, -1302, -335, 2026, -246, -908, 1655, 596, -1217, 634, 1314, -979, -152, 1628, -698, -1074, 1571, 158, -1640, 906, 1752, -1128, -174, 2197, -55, -1330, 1066, 731, -729, 269, 1105, -862, 138, 1149, -406, -833, 1593, 229, -1265, 1066, 1344, -1474, -479, 2228, -399, -1489, 1484, 873, -1859, 211, 1463, -701, -503, 1471, -323, -1170, 958, 592, -1593, 285, 1382, -1132, -711, 1103, -295, -1578, 1033, 610, -1508, -338, 1215, -1266, -652, 1131, -453, -1689, 460, 547, -1322, -69, 1141, -1188, -1219, 1031, -109, -1309, 234, 567, -1355, -33, 972, -1321, -1095, 1242, -663, -1524, 623, 594, -1741]
2642a741J383K080k671m42K864j161j947J832Q02j945M39J532j437m89J834j028
2658i5j412K125J55k317J296J808k335l00K471o70k206J870R07k295L43J931j533
2675b57p10K025n78j894K031O13k439R25K146k062q07K280p89j814K088O41k508
2692a109O93J892j852r70K521m27k384J970J376k646J6K633j573j263K237j59
2708I55j988R75J356k201O87J705j479j087K570p36k006J542J280k682N34J723
2724A148j082j634K432K68k353J222J284k202o0K238j114j116J911l29j856J627
2740C84J057k802L04K631j622j680K278K42k518J224K068k349l32K264j050j685
2756a586J813N47j968O30J621j888j71K234j225j396J574N03j744O98J530j797
$$ y = [-1741, -358, 1722, -949, -1391, 1473, 312, -1635, 197, 999, -946, -507, 1025, -412, -901, 933, -95, -1507, 618, 773, -1544, -248, 1560, -775, -1075, 1396, 726, -1480, 390, 1297, -998, -655, 1276, -257, -967, 1058, 480, -1414, 617, 1230, -1209, -284, 1862, -200, -1007, 1273, 484, -1330, 758, 1399, -1109, -416, 1476, -376, -1346, 1175, 748, -1636, 334, 1710, -936, -920, 1713, 140, -1123, 1114, 955, -1033, -58, 1298, -903, -216, 1489, 10, -1077, 1493, 757, -1249, 293, 1573, -1109, -575, 1148, 66, -1568, 864, 1132, -1221, 1, 1285, -917, -977, 1261, 147, -969, 942, 613, -1243, 384, 1441, -1361, -1057, 1574, -48, -1728, 550, 792, -1726, -502, 1566, -783, -1115, 1149, 99, -1586, 227, 774, -1194, -564, 1057, -831, -1002, 1232, 7, -1389, 185, 688, -1056, -358, 1172, -625]
2772f25n80K571q55j948J654P96k277J104J598j893o96K131m74j873J501Q49j957
2789i74M54K092j911j095K472m70j925J887R14k546Q39J698j785q37K379m89j832
2806a129R88J623k083k28K172j203q22J898p10j636J460P30j903L82K039j881
2822c03p02K128n1k179J472J146k207O5K247j061j757K161mj723R72J276k037
2839e57l8K482j784j185J860O5k059J193J260j727l11K131j728j065K035K95j856
2856i89P67J461j948k06K054j079j726J963J132k836N98J676j729k65J854r42
2872b15j039J652K48j932R53J437j876j76J942r72j588K031N18k608J258J634
2888A267j484q30J556m12j458J618M34k025Q98J555j622q87K224k88j990J546
$$ y = [-625, -1205, 1366, 511, -1437, 217, 1013, -1264, -160, 1438, -455, -1151, 980, 506, -1367, 134, 983, -974, -520, 1572, -339, -1434, 1038, 568, -1357, 530, 1444, -1102, -263, 1435, -350, -1187, 1192, 703, -1129, -141, 1482, -601, -829, 1343, 140, -682, 1216, 506, -1130, 330, 1060, -843, -461, 1578, -303, -1005, 1123, 1072, -1107, 365, 1511, -696, -631, 1616, 555, -1202, 959, 955, -768, 204, 1480, -557, -595, 1887, 103, -1082, 778, 843, -1216, -23, 1237, -490, -801, 1330, -398, -1463, 572, 867, -989, -222, 1239, -709, -915, 1139, 60, -1666, 297, 1429, -1407, -809, 867, -862, -1127, 727, -215, -1254, 398, 646, -1286, -333, 1104, -772, -948, 994, 22, -1566, 465, 983, -1625, -367, 1267, -217, -1047, 509, 97, -1361, 257, 691, -1334, -436, 1119, -503, -1390, 834, 546, -1444, 102]
2904A02J003k226M38J913j340j014J824J46j688Q27R97j949L44J901j406j049
2920a177K132l40j870J246J104j650L66J464j463o10J640L7k131J379J272k373
2936i74M45K002j557p94J807L17k372J314J106j486l73J792n42j678J664K65j833
2953h97J096J005j992K97J867r49j335J562O76k862J324J618j871o41K199o14
2969D83j498J465L56j439O04J438j685k14J539r14j166J721L07k071J021J507
2985A454k252k88K314p77j898J831P01k161P08J548j584n99J688p32j516J893
3001C30L67j637K38J633j467n10J992r64j186J405P08j977L67J599r93j153J928
3018F80k75j717J648M20j723m2K010j365j071K193l58j632J445O87k245R75J612
$$ y = [102, 1105, -1121, -683, 1230, -110, -1124, 700, 846, -842, -15, 982, -967, -623, 1278, -128, -1177, 955, 615, -1255, -9, 1095, -555, -189, 1275, -188, -798, 842, 879, -1252, 127, 1399, -974, -529, 1473, -84, -878, 929, 1246, -1126, 188, 1294, -192, -565, 1227, 685, -993, 671, 936, -897, 199, 1204, -788, -491, 1376, 427, -908, 654, 1330, -1532, -208, 1410, -461, -1102, 1097, 483, -1015, 450, 806, -633, -29, 1409, -276, -490, 1049, 135, -1031, 690, 997, -1074, -53, 1454, -798, -1086, 1228, 451, -1447, 384, 1085, -1076, -368, 1180, -404, -1003, 685, -47, -1563, 330, 697, -940, -702, 931, -536, -1046, 946, -18, -1204, 201, 909, -1068, -701, 898, -95, -1248, 680, 405, -1312, 336, 756, -967, -1009, 1001, -364, -1435, 758, 400, -1232, 213, 900, -1345, -370, 1242]
3035A242j596p25K130l16j989J155J376j707k39J886r29j759J794N71j775O46
3051b35J298j547j35J625j003j037J657j2j568P89J505j823j38J662p38j279J797
3068H18J05j659N86J413j490m47J867n94j414J216N41j873J088J216j592p40K502
3085A543j285j332J860L77j802O06J326j703k88J807n41j521J337O25j850N12
3101c29J653j680p12J913q9j845J350P64j661O43R98j383p17J743k79j415J689
3118F43K92k064P85J382j332j120K419p25j424J211J024j903K08J480j286o0R95
3135E25j97j367Q86J207j900l2J844j087j435K241J13j928R31J218k081L62J540
3152H40r52q98J419J56j661Q92J037j543k08J767j048j091J911J53j548N75J063
$$ y = [1242, -354, -1079, 1051, 735, -1254, -99, 1277, -430, -669, 1217, 288, -1471, 323, 894, -881, -235, 1063, -484, -619, 1006, 3, -1034, 623, 611, -957, -168, 1337, -486, -624, 1038, 300, -979, 818, 923, -736, -150, 1263, -227, -674, 1193, 599, -815, 401, 942, -931, 157, 1373, -219, -959, 1543, 258, -1074, 786, 1163, -639, -33, 1293, -410, -698, 1109, 568, -953, 384, 1009, -841, -329, 1324, -356, -1068, 845, 756, -1089, 261, 1025, -636, 7, 1005, -378, -1095, 648, 369, -1046, 643, 935, -1129, -344, 1038, -294, -1414, 1005, 280, -1144, 67, 1091, -812, -604, 876, -410, -470, 525, 328, -1039, -153, 1054, -846, -878, 966, -121, -1556, 685, 798, -1130, -199, 1019, -1062, -700, 840, -112, -1010, 409, 565, -1096, -204, 833, -710, -918, 849, -199, -1290, 621, 774, -774, -199, 864]
3169H64j589k17J987j137m99J233%j563P54J097j365m11J641n41j078J095P76
3186A047j754N39J027j189j20J206n18j203J407L25j389M82J359j447l68J526
3202I30k24j660J144Q67j770K85J307q58p30J639m92j436J515M53j745L50J727
3219A302j458q50K030m65j463J157J019j957K42J771j092r54J429j43j463J015
3235A20Q70j503m4J446r43p33J561l68j385R88R53j476K20J340j179o54J396K00
3253H09j583O19J173j716LJ305o93j207J907k09j173M64J281j541J89J320r54
3270fj148J798K3j849J256N88j056l21J778q63j213J397K28j807J022J149j331
3287c55m50J523l25j368J113O48j626O43J067j310m75J552m19j376J467N47j639
$$ y = [864, -725, -942, 1045, -92, -591, 642, 642, -921, -167, 930, -435, -846, 795, 254, -824, 271, 1047, -707, -168, 859, -330, -450, 756, 238, -965, 442, 767, -622, -140, 1219, -228, -596, 930, 706, -954, 190, 1057, -713, -428, 879, 21, -709, 930, 438, -998, 517, 970, -775, -425, 1302, -156, -1006, 1024, 559, -904, 253, 1272, -685, -443, 1328, 236, -718, 711, 568, -895, 120, 990, -513, -557, 889, -54, -787, 774, 406, -979, 9, 962, -514, -294, 1046, -133, -787, 609, 809, -774, -155, 1018, -698, -695, 610, -83, -1290, 617, 408, -765, -301, 980, -561, -372, 948, -6, -1154, 644, 667, -1182, 74, 662, -394, -715, 1063, 200, -1013, 384, 612, -1195, -173, 976, -355, -805, 718, 393, -975, 138, 786, -840, -197, 870, -440, -915, 637, 218, -1158, 309, 856, -783]
3304g83Q14R72j138o32J557m69j100J190J14j144O22Q96r81k21J197l14j447J127
3322B60P41j553R2J864j548m46J349q4j505J337N83j407L07J047p97r97J598l20
3340E21j319R66J153j587j87J515j030o71J505l67j332J145P19j542P4J322m89
3357C96j250J488K5j440P00R29j195QJ151m96j140J056L72j141O32M80j135L5
3375e25J299r28o42J340m4j392R70O69j222p6J314n06r88J144j53j065M56R64
3393F15j088m73J572p97o83R29N80j693P35P45q31n89J624m72j116J012P66j644
3411h08L2J317o30p09J392j88j367R70K55n67j38J211r15o38J118k18j138J150
3429A29L93j340N26J212q20r48J493k59j300J170N52j403M20Q12m56q70J258p5
$$ y = [-783, 31, 1003, -135, -767, 790, 321, -779, 411, 525, -619, 3, 899, -82, -303, 894, 580, -867, 260, 1001, -552, -460, 1404, -144, -590, 759, 675, -830, 507, 1090, -317, -10, 1037, 240, -757, 841, 521, -798, 168, 1321, -266, -453, 1062, 32, -639, 866, 499, -833, 312, 1031, -511, -437, 885, 396, -854, 634, 659, -781, -81, 848, -347, -339, 812, 316, -824, 232, 604, -537, 95, 575, -560, -525, 774, -154, -796, 544, 500, -892, 78, 747, -475, -551, 763, 257, -731, 413, 260, -805, -349, 615, -473, -946, 626, -171, -854, 75, 655, -1038, -303, 442, -389, -978, 646, 174, -942, 70, 836, -808, -776, 541, -89, -798, 594, 406, -961, 9, 264, -303, -441, 770, -145, -783, 335, 117, -1021, 129, 522, -818, -292, 920, 100, -848, 645, 386, -914, 256, 808, -595, -175, 637, 181, -689, 569, 494]
3447D94j113Q56O04j110j12J050j159n5J464n02j584J312P79j491r7J905j190
3464E1j152J583L0j189R92M67j105l5J110p43n22R74J23j256R10P61j580O6J233
3483G18n37o14O57K46j335R23Q63j303P1R28j59j309J162N55j220J45R07r32m32
3502f66J214j51j148Q28O40j583N04J005j015j34J333j018p61J308J78j242K74
3519d34J382j301p92J654k41j066Q80K91q54J10Q74r87j83J287l98j137R60M64
3537E09j328L61J080r35q51J281J72j211J121L19q00j69J076p84n75J242l10r03
3555g05O79J047j645J24J407j039q46J801k11j336R55N58j452J98J249p06q07
3572g29J637l08j068P29N39r60k11J280q22r96J140K36j024L16J033j205O1J023
$$ y = [494, -619, 237, 841, -269, -381, 669, -490, -545, 919, 417, -1167, 145, 924, -567, -664, 1241, 51, -1101, 482, 512, -677, 315, 782, -323, -358, 752, 9, -513, 461, 584, -672, 238, 999, -581, -515, 718, 181, -433, 224, 470, -865, 58, 921, -382, -311, 617, 458, -851, 311, 866, -354, -209, 698, -234, -666, 548, 397, -751, 77, 717, -866, -362, 643, -372, -506, 827, -191, -952, 356, 534, -708, -434, 948, -353, -1145, 509, 268, -798, 82, 373, -481, -371, 503, -484, -667, 620, 222, -915, 45, 509, -819, -458, 622, -313, -1164, 117, 289, -922, 199, 518, -282, -451, 625, -159, -734, 508, 198, -705, -26, 1021, -624, -500, 907, -132, -978, 823, 612, -724, 231, 789, -663, -465, 784, 78, -729, 908, 600, -468, 261, 800, -160, -371, 909, 87, -909, 231, 467, -557, -241, 792, -413, -352, 671]
3590F71p38n86J055M10j529J019P68j281k26J280o36q45J020K3q63L32N86m80
3608b0l55J189m46r87J078N45j685N50R75j045L8R66l38j213J055M09j295j5J424
3627H30q78n40J304k54j200P14N71j078K63Q96q35m82J076J69j056N70K97j160
3645g93O17O24o36l30Q41k32q44Q36L02j206N90R35r70n06J074j19p16L52O60
3664D79j154jJ245o68n36J293m09j303R44Q32j284L9J194q46p17J046N52j439
3682g33N21O97p02k86P88j14n98P64j60q82N38J121j035l23R76o48p16J091J66
3701D65j327O91Q21p33l26Q48r6j057J010M1q13L78Q60j111j54J400p30p27P62
3720B02N15j031L28Q59q54m54P72K04j054Q30L55r21K05P91p93m16J299m03p45
$$ y = [671, -67, -653, 402, 812, -717, 302, 1070, -211, -437, 843, 207, -638, 382, 405, -458, -126, 460, -20, -375, 814, 368, -619, 459, 1004, -681, -131, 844, -201, -163, 803, 465, -748, 307, 716, -579, -594, 830, -48, -588, 716, 462, -738, -24, 547, -531, -268, 628, -207, -689, 387, 556, -500, 70, 367, -793, -176, 448, -188, -518, 323, 91, -753, 83, 385, -821, -231, 704, -266, -772, 302, 183, -533, -181, 479, -675, -676, 569, -99, -635, 658, 249, -1054, -110, 722, -562, -523, 671, -175, -892, 154, 706, -733, -212, 485, -217, -503, 285, 171, -427, 337, 177, -705, -167, 954, -81, -404, 572, -76, -792, 299, 465, -862, -171, 650, -83, -409, 439, 343, -714, 296, 337, -476, -98, 762, -349, -503, 897, 167, -560, 202, 717, -314, 14, 873, 19, -435, 337, 541, -513, 317, 672, -249, -44, 747, -46, -462, 837, 434, -311]
3739c11O33N20j199J87O98n84o97J273k19o92N43M13j134J56J285j136n42J385
3757E79j21j096O90P38j113j49J142q05l32Q21k87p29O53O18j237J41R52m44p86
3776g65J317K2j050J49Q28j020K41J078q07o11Q24r1r07P06O46j173R1R98l44
3795A32j113J389l8j156P16N30j008N4R38m36r11R77J60r33P42N42j182k12J371
3814E62m06r15R84M62j415O44Q28q18m62P76J18j093J053K79j388M06J128q39
3832i6m11J102k99p85O64N14j181K62R32r46l79J227m19p01O83L08p22K08P30
3851F91p05l94J109p8j221O92N67j120K15Q72o79k67P16O3r11L22O89p96L01O55
3871G21m97r26J132q6q52O06P07j347J99R35p91m85Q28N57j224L27P48q21j5P57
$$ y = [-311, 322, 842, -357, -170, 528, -56, -753, 520, 301, -391, 152, 565, -569, -413, 872, -264, -806, 579, 458, -638, 52, 790, -323, -472, 670, -135, -467, 354, 67, -662, -9, 609, -628, -487, 465, 21, -765, 552, 574, -476, -327, 501, -519, -278, 800, -7, -618, 206, 115, -792, -86, 560, -613, -522, 476, 132, -981, 408, 370, -786, -70, 460, -548, -494, 444, 8, -903, 74, 234, -699, 43, 585, -597, -809, 562, 156, -759, 225, 687, -728, -84, 744, -74, -536, 240, 358, -735, 318, 597, -791, -385, 743, -96, -507, 595, 296, -489, 175, 689, -492, -230, 702, -244, -623, 604, 185, -516, 167, 475, -247, -39, 691, -14, -408, 701, 623, -598, 94, 661, -459, -244, 628, -51, -318, 398, 461, -450, -128, 561, -235, 66, 721, 224, -702, 430, 344, -508, 98, 805, -542, -343, 592, -199, -684, 144, 701, -523, -196, 552, -269, -284, 473]
3891D73n21n91R71J13j065L84O18q00k04J227n73o94O54J26o29O44M12j086J8
3910e23J185n88j029J446k82o26K01J104j228j82J119m65p89Q10J55p52K17R27
3928G00j044m26R20k15m30P21K33j188N88M62m15q68J379r2j125R57J73r67K45
3947c92R05n64m53Q01j66q71J385j62r98L54R49r79m01J376l45j115Q80M09r89
3966c76M81N29r24r9P31P1j054Q07K94n50k04J044o25n42J040O6r14K50O07q93
3986b61r3J118q51m55R75J50j114N23O24q34l29J291q19m87J088l3o56L46J01
4005B84n69NM95j18o96J197m20o60K85O67m90m39Q40l62p68R28J73p79K62O46
4025D81n09m01Q74j69q65P01n9m49K65N32p74QQ11k86o92Q62q6q08O5J159n89
$$ y = [473, -48, -639, 332, 445, -620, -236, 382, -418, -622, 605, 32, -662, -8, 118, -511, 133, 545, -541, -523, 662, 74, -955, 491, 209, -417, -216, 888, -340, -522, 597, 132, -657, 153, 308, -444, -227, 700, -344, -770, 150, -65, -495, 226, 459, -729, -141, 321, -94, -962, 417, 325, -800, 157, 330, -637, -392, 513, -51, -504, 297, 131, -740, 645, 483, -515, -161, 788, -191, -592, 784, 439, -676, 204, 613, -376, 105, 634, -290, -389, 342, 413, -641, 166, 460, -90, -294, 750, 125, -417, 623, 689, -225, 25, 632, -261, -354, 764, -87, -542, 433, 583, -531, -8, 616, -218, -547, 744, -75, -562, 526, 493, -163, 183, 284, -285, -280, 215, 97, -599, 598, 178, -482, -197, 470, -20, -459, 381, 19, -749, 179, 352, -427, -165, 481, -28, -429, 445, 276, -589, 112, 53, -396, -131, 401, -373, -365, 446, 160, -532, 330, 244, -564, -499, 660, 71]
4046G1n61J238o11j062R19N14q52J23N87n01n01R32k3o61L60L22p15M52M96m26
4066A01p31J062l05q05M70O11q37J80P77m51n62O23J86q46K88N84n79J11O69m87
4086E9m39Q09k15l73j9R03r25k76J213o63n94Q00J10j037O16M00n34l00J051l93
4106A93o32Q94j50q04P02J22o53J90O69j77r48Q28O42j329M21Q93q29k99P70m79
4126B4n74P96o3n65K96M14l35m54J074m68o21M69P06j016J69Q03r01k52R42k68
4146A76r42Q56K29p27J90R70j143P0N61q5p25L51P17q11J86N39m17m81Q34m04
4166e6n69P30L26j197Q62K26l99l22R10k62q23O37L10n84j14N48k33m86O55r5
4186F4o58P11K56q66K81O10m79o94J064M7j128N18Q27r63l39J267n36p89J089
$$ y = [71, -490, 748, 137, -925, -6, 508, -344, -221, 366, -135, -636, 296, 273, -388, -28, 294, -421, 31, 527, 101, -630, 432, 127, -678, -208, 403, -434, -254, 523, 72, -490, 133, 319, -527, -239, 345, -234, -123, 546, 59, -380, 429, 214, -159, -178, 725, -200, -476, 737, 74, -520, 280, 390, -647, -31, 369, -165, -465, 586, 193, -439, 455, 305, -499, 203, 325, -328, -138, 531, 354, -594, 234, 876, -453, -32, 861, 32, -267, 503, 24, -550, 246, 183, -382, -86, 328, -7, -461, 613, 145, -476, -7, 699, -317, -148, 655, -246, -498, 444, 176, -766, 90, 319, -408, -218, 752, -391, -321, 240, 155, -570, -219, 498, -313, -127, 412, -5, -486, 348, -56, -625, 105, 431, -766, 96, 322, -77, -399, 511, 249, -574, 63, 373, -211, -325, 223, -10, -496, 159, 64, -594, 117, 373, -493, -212, 398, -81, -775, 289, 336, -792, -274, 553, -410, -749, 518, -18, -807, 282]
4205B82M6p09O91L93j085O8P53k37p62Q35J69r34M91L77o07j70O28o9p66R06j81
4226A19n97L02P63m09o63Q51k64o49O65L02r63M21M75m95l69O51q9m14L91N66
4246E94j108O99J53m89l21P88k83l29L81N50r25M72L27n58o02Q09J90o03K1Q19
4266E85o90%R64p64l83O64j6q50M52L45o65J4Q14q11o8N37J2o41L65P95j045J0
4288c76P36p47l1O07J49r05N07M97p30o3R90o05m64P92l22n48N11J63n99L3J013
4309F08p50m36Q78J72q71M27M21q49j31Q35k70m36O04J21o35L24K65n96k02J244
4329G23p00n16Q04j00p51O70J14k87k76J124n09o26J90O91q77K24N65r44J31Q99
4349E49o01n78Q40R8p33L72P87n62n29P68m32l09N31R1q34M12O84m76m12L87N45
$$ y = [282, 328, -381, 310, 703, -382, -314, 439, 202, -560, 275, 444, -490, 1, 378, -229, -399, 229, 160, -606, 300, 119, -478, -176, 587, 178, -485, 366, 102, -547, 118, 420, -543, -122, 353, -142, -511, 140, 51, -363, 28, 594, -514, 185, 338, -151, -472, 316, 33, -296, 85, 635, -290, 182, 509, -49, -651, 158, 348, -255, -234, 585, -105, -105, 859, 95, -288, 376, 360, -490, -38, 307, -358, -344, 470, -341, -409, 128, 140, -501, -136, 659, -386, -376, 360, -387, -418, 189, 338, -567, -60, 437, -293, -356, 634, 29, -435, 357, 35, -513, -2, 161, -438, -405, 608, -142, -578, 300, 472, -399, 28, 449, -400, -531, 304, 34, -402, 202, 323, -312, 12, 277, -319, -521, 723, 23, -493, 311, 211, -540, 130, 244, -43, -319, 805, 296, -330, -140, 551, -326, -102, 463, -481, -350, 549, -52, -630, 210, 308, -425, -53, 734, 172, -357, 411, -21, -330, 201, 292, -542, -130, 554, 78, -334, 53, 598]
4370E98q99L78O42r54j2P76o20l97O32J64n93O23J33p09K32K67n4n24Q63m09o47
4391e10L38P06r37K42M39j53m80N30J06o94L79K17m75rO55k48m19Q08k10q35O62
4412A12J71m31j7M32r6p66O85L3n15L05L50p02J0R32p36o5N10m2o27J76N46p65
4434e00j10R49j17q54O49K25p46L08O20p80j11Q36p78p9M62L65p53L70L22n79
4454c01J95P56m25p58J019m0j004J57J038r94o08J507k26q44M21M86n84k14J197
4473G78r67r4N45q6o80P07J98q15J04P85o44l23P29R2j108J093K9q62N82N59p40
4494a18m01J039O3j047N86K25p45L27N55m76l68P97k08n74M22M21n97j56O79l43
4514H1o69Q95K73r72K95N61o84j4O29j08o80N99q7o73O41K91n34j50O28l92j17
$$ y = [598, -301, 77, 719, -235, -247, 529, -91, -488, 144, 308, -285, 338, 471, -238, -6, 261, 207, -317, 546, 137, -510, -172, 534, -403, -161, 278, 125, -355, 175, 281, -413, -34, 183, -292, -301, 354, 106, -313, 495, 285, -550, 112, 283, -148, -165, 267, 171, -595, 90, 123, -392, -87, 263, -439, -429, 503, -233, -298, 212, 170, -457, -281, 265, -500, -610, 339, 222, -632, 17, 242, -504, -196, 424, -356, -467, 369, -409, -488, -26, 339, -414, -44, 278, -301, -106, 650, 225, -533, 486, 446, -558, -401, 637, -357, -965, 542, 316, -528, -107, 379, -205, -419, 778, -189, -283, 262, 176, -504, 203, 401, -414, -310, 475, -169, -492, 237, 329, -779, 314, 343, -519, 63, 622, -118, -519, 520, 583, -464, 122, 347, -398, -71, 484, 8, -360, 437, 229, -345, 77, 498, -99, -255, 424, 81, -588, 307, 580, -392, -97, 464, -220, -234, 395, 287, -393, 206, 119, -554, 87, 378, -156, -306, 322, -70, -187]
4535a87N00K64p50O9K49m77r9M78Lp59J055K5p77L29O21p61l23Q24k77l81P26
4556C52n6q10K74L31j68k48Q30l55p51M76M00p28J31Q82q49n6Q15l93q40Q47J60
4577B44o99M75M94p69K7L84P4n92N17N13r57L15N17n11m22Q77l41k79O6M92n66
4598a41k62P63l58l81M71P7n78L81N07n29k62N63m8l80M90k1o90N05M88p35N0
4619i0Q52n59n03L31N39r67J67O34n16l5P12m25n39O57K7p08L86M91o63p3P16
4640D34k00n87R21k12o56K02M54m60l0P31m74m66M86J77l92L6L10m55j79N74q7
4661A27l89M31j1p77O03M29m87m23N33q3n52O80J75m69j38R00n77n92R36J48p20
4682b56N01J00n83K20M93q47K96N97j22o61K82J27m74L6N89n59r0O22M5p43L73
$$ y = [-187, 313, 577, -173, -104, 145, -332, -431, 47, 50, -709, 346, 371, -406, -77, 544, -217, -540, 284, 7, -374, 352, 296, -514, -240, 91, -77, -325, 505, 150, -601, -125, 275, -453, -322, 560, -289, -345, 470, 77, -763, 84, 244, -455, 20, 514, -255, -228, 156, 230, -362, 155, 668, -289, 26, 543, 32, -390, 487, 146, -133, -67, 425, -141, -403, 360, 2, -379, 92, 169, -409, -28, 479, -50, -312, 251, 203, -177, 313, 292, -398, 107, 595, -140, -90, 762, 203, -300, 31, 570, -397, -230, 404, -112, -147, 565, 140, -399, 258, 285, -423, -37, 454, -209, -282, 434, 234, -353, 568, 356, -300, -98, 356, -104, -134, 597, 123, -343, 143, 320, -72, -36, 274, -181, -360, 214, 127, -262, 169, 158, -619, -16, 413, -74, -497, 36, -47, -599, 81, 256, -213, -351, 549, -28, -620, 316, 464, -256, 245, 345, -238, -18, 475, -372, -76, 521, 399, -262, 20, 147, -327, -291, 298, -261, -351, 271, 316, -427, -54]
4703e4M19o57PO32n67j75M30K84n64L37K42p07L76L58k43j018J023N7o81O15K63
4724C77o83L07J72n6n84O51j01k11J51M16m47m72R21n21m90M93M65p14K86L50
4744C10l22p0M81k24m34M73J57o83K55P91q69j43N75m62k46O91J28o38J25M41
4764C36l41k12P72k87m45K31J80o10K18M23k60k56O78l26l37L06J54n40K47L76
4784C07l92k88Q55l72o11M36K44m49K73K79l56l33P02j82m44L37L10n92O1N80
4804C65p5p69M43pm40L73N22o02j09M68K5l87J96L28p19L74K72m61j40N15nl65
4826a98J94q9j52J40M37p00l5P65m56p15R84O1m93K08K97k03k88M69l38l33P05
4847B60j1n25N65L5m22j20Q18o85l22M37Q2j08M6O09p63k25N99j17o65M98L55
$$ y = [-54, 365, -292, -285, 347, -220, -395, 35, 319, -245, 92, 334, -373, 3, 361, 118, -900, 123, 180, -501, 114, 377, -306, 1, 173, 117, -467, 184, 83, -128, 23, 439, -8, -480, 441, -80, -570, -77, 388, -326, -40, 310, -12, -82, 399, 175, -259, 214, 371, -312, -57, 734, -135, -278, 297, -165, -411, 280, 408, -230, -105, 336, -5, -217, 555, 268, -177, 54, 234, -376, -158, 265, 5, -251, 427, 101, -236, 70, 224, -316, -69, 307, -85, -373, 482, 110, -501, -65, 179, -270, 3, 282, -74, -407, 295, 113, -331, 6, 316, -276, -215, 365, 290, -479, -36, -43, -483, -110, 412, -190, -299, 169, 194, -193, 3, 331, -388, -14, 258, -203, -343, 172, 167, -198, -4, -93, -245, -105, 332, -368, -403, 362, -94, -809, 175, 236, -257, -49, 248, 45, -243, 226, -112, -445, 260, 249, -276, 289, 324, -98, -218, 600, -85, -407, 30, 112, 4, 50, 659, -104, -329, 270, 153, -512, -14, 341]
4868C41o52O5O99l71k29K23J15o15N53J76l66N9K75n54j67P30q7o70O06K8k83
4889a24L95J24m30j95Q10n17l14M84j03l76r4N87m40k08R23k64p77K99N00n91
4909c11L23L25n31m39Q85P7l87K37M08p57K40M23l16m22L06J00o79P25N6n88K98
4930b7N92p44p4K14K90p52O75M43o63j70M66l28j68K44L11p55K78M09l88o4N46
4951C35m05k45P19J07q69M5N87l88q6L97j33l65K62P1l77M07M10q03j49O03J38
4972B61n62M97K68m31l12N39n44K25K85k77l46O40P6p83P1Q43o57j90J005l69
4992B39k99J64K18m38k64N79J28q07M09K1j29L21P6m59J07M32k04l3L54j33l12
5013c0J30J97m00K66J98p01J87N08j65n58K08J91r4L71km17r1M36M0o33K32O88
$$ y = [341, -311, -246, 453, 82, -147, 76, 191, -424, 129, 305, -61, -2, 273, -281, -448, 282, 195, -475, 131, 159, -124, 271, 395, -35, -230, 580, 63, -251, 233, 130, -246, -340, 247, -193, -401, 522, 258, -519, -220, 280, -311, 12, 337, -194, -633, 252, 329, -58, 179, 587, -170, 70, 493, 177, -245, 61, 161, -518, 207, 263, -325, -27, 565, -179, -253, -39, 251, -501, 174, 617, -46, -216, 250, -78, -246, -2, 309, -446, -168, 241, -147, -211, 335, -70, -315, 404, 511, -358, -313, 274, -114, -200, 197, 64, -301, -39, 32, -345, 62, 472, -331, -480, 123, 261, -301, 196, 464, 33, -279, 260, -284, -59, 226, -51, -397, 243, 319, -464, -393, 450, -207, -397, 608, 239, -60, 104, 322, -116, -380, 199, 327, -480, -71, -50, -179, 142, 218, -241, -134, 298, 94, 61, 415, 282, -30, 100, 297, -103, 163, 361, -340, -153, 355, 190, -368, -160, 31, -63, 308, 306, -111, -202, 234, 274, -359, -127, 561]
5035E61n86j24N02k78j14M32k43o63Q41L70r77K65J62j25l72N06o7n96Q11k51
5055E4j68j68M91j54k45O4K64k00r1L48n38K80K74j71k46J31J79k26q2N73k16
5076A53l60K03L03p11J96O52p79J60M22n23mO67l13n34O64O4m19K07K13m24k13
5097c76N60l40k40P62k95l93M27L24p13J20N03m8p25P69k67k66R2L64j83k43K18
5118E0K56o25L66K78m06j67N82l46n04N69N8m77N27L79o92R1M31m37m98P77j17
5139I5l26J50J83k87L06O4r7l54M69L69p08M0L83l26j62M22k77j83M34j32l29
5160b66K01M83n70R6N51k12o92N68l1j19P5L19o08M1O29n05m84O66J61o71M57
5181H9K29o53L69J98j8l05K73rn16K51M85n18m3L03j37j97J60K46j99k41L37k51
$$ y = [561, -25, -149, 353, 75, -39, 393, 150, -513, 328, 698, -279, -14, 148, 23, -349, 157, 90, -506, 305, 54, -114, -282, 209, 55, -190, -126, 138, -62, -153, 195, -343, -63, 211, 40, -206, -75, 104, -122, -204, 369, 153, -207, -4, 299, -412, -216, 436, -343, -183, 239, -284, -288, 379, 66, -468, 196, 260, -159, 48, 261, -163, -376, 184, -156, -396, 366, 71, -322, 105, 429, -284, -164, 339, 291, -434, 335, 68, -198, -106, 258, 75, -168, 50, 306, -319, 47, 325, -81, -248, 334, -12, -516, 53, 111, -366, 161, 540, -152, -61, 370, -67, -565, 212, 95, -231, -81, 102, -185, 121, 185, 88, -266, 203, 572, -136, -96, 287, -39, -201, 221, -56, -239, 195, 63, -266, -65, 418, -152, -56, 495, 283, -409, 159, 128, 9, 84, 403, -205, -164, 465, -40, -524, 142, 303, -368, 89, 318, -335, 34, 232, 214, -91, 182, 173, -343, -92, 393, -125, -168, 135, -2, -199, -39, 207, 8, -233, 104, -147]
5203a47nN20K3q60L85J74k33j44O18n65N6K53J84o40L23P7k43j10M01j93l28L50
5225a04L9l62M71L70o58J38M07o9n51L07K76k97p4K77k01k97P53p07P6K62J49
5246B05m89K62L64m22j66M28j83l18L99N7m97J53M06l65P7L60o8l35L72q8m02
5267b50J2O25l10j99J02j30k65M47J81n04L72M10o30NM29k58r5J68K94o24J43
5288g7L35l31k17N85n73J63L17j63k92O58m45J5l96O87r8k86K54K29p12k1N52
5309A84p7m65R53k79o91L99L14n49K02J67k10K14Q2q3n35O40k09l38J37J76l7
5330ej26L65K0m81K8K45j98r2N18l06l64M52M5l13L09K01m84k30O15m46j5L75
5352A13n7l09L69J79o33M5N46j72l44O23n9n85N34J09n39j17N35k73j6J12K6m73
$$ y = [-147, -152, 368, 391, -469, -84, 90, -143, -287, 331, -234, -178, 75, 259, -381, -58, 19, -224, -334, 67, -126, -454, -104, -65, -427, 44, 414, -244, -106, 301, 232, -319, -12, 264, -33, -107, 170, -31, -328, 425, -282, -206, 56, 205, -284, -22, 342, -80, -246, 182, -1, -319, 80, 137, -360, -207, 199, -166, -89, 271, 203, -132, 240, 152, -250, -238, 387, 77, -122, -20, -150, -415, 32, 213, -291, 81, 491, -139, -134, 295, 37, -58, 110, 404, -220, -77, 258, -73, -290, 295, -278, -115, 202, 39, -253, 405, -40, -25, -421, 266, 168, -118, 136, 365, -347, -368, 184, 107, -358, 595, 316, -375, 24, 338, -211, -9, 158, -52, 162, 244, 161, -374, 266, 57, -281, -144, 32, -5, -131, 234, 254, -227, -199, 46, -152, -244, 274, -32, -396, 56, 101, -212, 97, 298, -186, -416, 199, -247, -262, 113, 56, -253, 116, 295, -338, -293, 253, 81, -263, 360, 301, -284, 250, 359, -180, -297, 238, -35, -51, 61, 87, -386]
5374c86K86J01JJ42J42m14l26L91L86m43J12O63j043J54M09k9n25K18N04l09j61
5395a27N20m85k39N11j85l69K35N18n52J01K60j25m71O16m4n85M61J92l10RM02
5416C33l01L5J40j44n6o5Q7j97L00Q4m39P5K66j30m38N23P1l86Q4N53k22k95K16
5439I4k53k26L94L01k52j52K03j22l28O86k11m49K24M70n04p1o7R3J19J89j67
5460b9k59M83k53j40K52j97j47k37M08K99l69K39Ok58j16O50j40o89M66J45n71
5481d57K81M60o41L70j47K53l58L87K4j12m4Pk22O9J44J43k83l8M52n35M7K25
5503B5j36o2O98n01k44K43K18k45j01M10m78J78K04j8j67L52k68k20K01J69l09
5524e1l12K01J12L02k65J25o4l1M13m28R5M11j87n61K76L23m48o5J99l75K92j05
$$ y = [-386, -100, 1, 2, 144, 286, -128, -454, -63, 323, -120, -8, 655, -388, -234, 175, 146, -379, -161, 343, 34, -127, 393, -92, -331, 180, -5, -374, -139, 379, -173, -72, 188, 63, -408, 208, 164, -421, 40, 232, -78, -69, 333, 32, 67, 207, 63, 7, -58, 29, -168, 132, 216, -223, -148, 118, -12, -450, 73, 144, -242, -158, 395, 173, -122, 94, -159, -385, 9, 310, 58, -94, 109, -13, -341, 345, 134, -315, -91, 379, -125, -196, -263, -170, -51, 138, -29, -288, 195, -58, -198, 54, -143, -290, -527, -119, 180, -189, 50, 56, -202, -318, 332, 192, -497, -31, 114, -457, -176, 284, -357, 13, -134, 119, -239, 148, 172, 60, 16, 23, -199, -130, 14, 157, -126, -164, 288, -247, -200, 25, -111, -173, 525, 24, -220, 23, 241, -4, -105, 305, -173, 5, 209, 191, 24, 376, 108, -112, 89, 258, -51, -363, -162, -50, 252, -13, 112, 48, 17, 430, 2, 97, 508, 321, -240, 36, 359, -89, -154, 45, -330, -38, -143]
5546a43L67n22J30N55n00j5L57J79n87M34j5j96j5r1o3j24N96k79l08L95M2m22
5568b25R8K05rk03M36j89j10N37o15o5J39L83m93k23O36j64n97O56k7k50j93N99
5590C26o12L75mK32n65J95L35p01L09L15m93R1K54p9l30J40N94m83q8M42l11l32
5612c90N66Qm99J97M9l20J15N31k74k66L59m0m42K19O70l70n89Q62l94m19N75
5633A48j4p5j16J36l8k19P43n76j34L97j00m39r3O66m65R7K82j03m02N08qm46
5655b51M68N1m22j15L30K14n33M69K30l06l9K81l47N4j32O3j41N6M37k99j97N49
5677D20o84J97N23m57R8J79m66K55N0J95l64MM07k26l73L19M2l22L73m0p4m58
5699d02N39n7j42L14j00n62L50K64k33j00J64p1NJ8K03l20j1K05j80N4N08o31
$$ y = [-143, 224, -298, -168, 387, -113, -128, 229, 408, -179, 255, 240, 44, 29, -62, -125, -249, 347, 68, -240, 155, 197, -225, -127, 78, 69, -134, 302, 113, 3, 540, -75, -140, -1, 382, -111, -334, 302, 138, -459, 197, 170, -80, -273, 326, -286, 89, 85, 317, -248, -53, 282, -419, -110, 205, -288, -197, 57, -22, -352, -212, 382, -101, -189, 253, -58, -390, 176, 184, -315, -118, -69, -389, -274, 257, -17, -283, 76, 36, -406, -187, 483, 113, -476, 386, -8, -427, 148, 134, 59, -57, 79, 41, -178, 565, -11, -145, 252, 152, -287, -380, 286, -179, -82, 200, 97, -305, 203, 195, -251, 217, 268, -154, -269, 61, 275, -258, 211, 441, 135, 96, 377, 30, 84, -48, 15, -126, -70, 367, 68, -129, 420, -264, -67, 456, -1, 97, 276, -190, 65, 115, 310, -54, -50, 357, 131, -242, 77, 119, -203, 170, 130, 56, -402, 137, 80, -62, 252, 152, -410, -60, 204, -29, -129, 35, -36, -31, -13, 190, -130, -141, 64, -116, -62, 446, -185]
5721a85k2L59K44j26m78J34K14n08M37k42N5J9M01o31J4M98l46j39J48p0j44M93
5743A25o5l13K81J29J3j95L7Q5m10L65K14k09K61j43m49N1K44k3l74L86J89l03
5765a04ML14j72j58J71n1p3L2l9n5n0N84k31l25K72l6k67j68N59j9l11J59q9k36
5789b89M05O2p48O53K95m71j3M99l16j51L32R1m62J40M37n28k54M42k77j55M33
5810A25K36l81K64L0n33J40M65m89N16k78J24l37r2L56l8m44L84j49N4qK26k96
5832a25j34O48l20p11Q61j91m99O21o4l94n5N00p2l31J07M09o38J29L37r2j96
5853b10N25m36l48Q40l31J67K3R9m79j06M79k17j56L21l42J74rJ10l41K96P9k62
5875a24k10O19m07j50L31p5jl65K16J27p6K13J20n45L10K33m10r5O25k52m61M03
$$ y = [-185, -207, 152, 396, 270, -208, -74, 140, -368, 69, -173, -118, -99, 302, -329, -315, 183, -163, -302, -154, -224, -368, 125, 60, -253, 28, 157, 170, -25, 12, 97, -313, 52, 266, 57, 318, 175, -274, -223, 21, -2, -376, 10, 199, -104, -100, 214, 42, -116, 55, 4, -69, -37, -76, -131, -181, 403, 172, -153, 119, 83, -184, -352, 207, 188, -123, 36, -53, -289, 116, 178, -570, 83, 378, -93, -106, 393, 77, -74, 258, 349, -113, 27, 464, -64, -318, 124, -153, -308, 125, 361, -20, 244, 274, -259, -119, 346, -143, 373, 95, 219, -118, -210, 146, 108, -336, 48, -101, -47, -55, 171, -125, -259, 389, 69, -642, 219, 28, -471, 150, 86, -308, -363, 137, 65, -266, -159, 250, -388, -259, 78, -14, -210, 315, -121, -469, 371, 40, 207, 230, 329, -150, -256, 223, 6, -150, 171, -171, 3, -6, 104, -237, 59, 138, -124, -334, 285, -122, -272, 59, -16, -17, -382, -166, -39, -115, 98, 218, -327, -17, 216, -194, -289, 336, 84, -377, 26]
5897B6r3k86N87l7k67O4N65l47l93P03l35o83L01O67m46j06K39K82n08K0K29k05
5919b3J06M01j3n22K05k9j17P6o0k35K43K18r3l3kj82J10o5M75m60j76N15l3n04
5943a98L23O0k96l8K07m0j26K70J47m97J34K22K66k48j57j06J05P6l29K34j5K21
5965B15n26L17M73n14l24N19k66l5L27r8l41K98J34l36k23M54q3p1P5L5j83J93
5987D0J06m69K87k59M62l28kL9r8Q9M58l75k21M92k04Mj0L1k76j21L66j62J59
6010HL9n0l22N91j41n40L73K61j61m35M45j91k17L00J9l45L27J27K8l50M80K6
6032B72n14M38p3P4j77O5j03r9J3J70k84M06j08j15j76L6J36n4O78m13n88O06
6054A90k83M6Q2K80k39K2M3j93j81J33K06j60M53k06l20j02L58J63l57R3M54k67
$$ y = [26, -67, -353, 234, 197, -70, -6, 559, 212, -181, 522, 187, -496, -195, 472, 26, -80, 159, 441, -67, -47, 182, -23, 83, 484, 471, -51, 154, 125, 8, 84, 24, -211, 32, 250, 157, 124, 122, -60, 50, -15, 460, 0, -176, 339, 306, -198, 125, 185, -111, -149, 58, 18, -108, 162, 309, -188, -54, 168, 434, 186, 29, -77, 28, 104, -225, 9, -6, 215, -311, 6, 479, -35, -359, 160, -106, -141, 186, 88, -253, 45, 179, -157, -380, 74, -9, -80, -5, 30, -153, 40, 146, -323, -36, -295, 167, -161, -163, -124, -222, -133, 325, -50, -271, 221, 17, 21, 11, 42, -234, -355, 11, -151, 8, 47, -3, -325, 266, 125, -415, -42, 219, 58, -377, 68, -123, -340, -40, -21, -366, -39, 88, 116, -234, 246, 272, -242, 196, 123, 197, 20, 85, -18, -117, -104, 66, -218, 188, 80, -35, -211, -175, -39, -93, 585, 172, -416, 190, -93, -47, 35, 315, 76, 98, 141, -52, -233, -100, 106, -54, 399, 193, -127, -229, 129, 292, -65, 28, 482, 215]
6076B15k89J47l22j18N72k62n0l24P33l29o6L00k16k65L48N4l51J31L22q1k05
6097e6mL6J10m55L39m2k16N92j52l58N23q3l36J72K41n60N28l50k14J6L3M64q55
6120f27R38K6n10m4K56l61N2M94k47l62M54n2J01J08k2k51J2J55j26j15%K0j14
6143b15L48P3m23l5J7J46k9J4K60m21J56K35l26O8K49L89o87J07K77k06o8R7J98
6166B24j68k08K80j76nL50l66K65k55j13J76J49J40p02O03O3J56l57K4j02l18
6187c40P18l76k60M35J06k39o0Q0m14J97K54k8j49L94q8k75j41M67O9n68J7N00
6209B99n79j08L64J40j71L83m56j41L19k4j44K83K8k43j19L56n9l48M43k11j58
6230a46J28L70k59j21K62l04l87N13J9l08R0M14j74m78M36k45J84l1J70L0k71
$$ y = [215, -74, 73, -249, -367, 205, -57, -107, -431, 302, -27, -93, 207, -9, -274, 74, 128, -223, -92, 230, 149, -56, -60, -24, 86, -369, -30, -72, -288, 304, 152, -206, 317, 234, -102, 70, 311, -249, 279, -71, -285, -269, -236, 228, -627, 311, 337, -173, -217, 39, -322, -270, 224, -23, -385, 69, 17, 118, 226, 204, -47, -35, 120, -6, -121, -121, -101, -215, 133, 206, -217, -252, -235, -89, -118, -104, 156, -265, -109, 126, -200, -132, 117, 506, -181, -74, 203, -3, -71, 26, 224, 56, -152, 128, -48, -53, 297, -69, 196, -59, -172, 4, 153, 293, -409, 194, 257, 413, 56, 80, -22, -340, 378, 2, -258, 177, 283, 44, -16, 64, -350, -153, 101, 73, -76, 318, 230, -45, -186, 281, 350, -218, -201, 299, -280, -388, -24, 116, -55, 328, -128, -269, 50, 26, -118, 165, 193, -50, -169, 187, 128, -220, 223, 12, -146, -18, 352, 93, -28, 234, -70, -457, 56, 75, -233, -143, 271, 97, -381, 55, -190, -6, -37, 133, 163, -108]
6251a08L36j67l28L10k59k88O08J48m50K25P5j07k1L38j06m57J08J28Jk10J89
6272c5K18m11K43M3K1j74M87n01K8k7J85J60r7N8p83M55L41j35o4J65N0l30K24
6295A21J67n30J26J40m38L91J98j99j96M33l23l5K14K73n23J99L3j50n3K41J54
6316B43n20J68M42l45k08Q5L54l10K34k91J5n7L77J64l06J44m96Q3J36L52l46
6337h2K52J1M0l95J95j20n7J22J21j21j94Q45m98n23N62r3k89J92k50K43k9K0
6359d8j9r1M22m03N1J44l2j60O7J17O2k79J7K05k14K67L9q0j67ON62q99N98j81
6383a6K48l44J37k4j83M45m00r2M41pk16j25K26r3n7K55j78%K09j76k53M19o8
6406A48k19j99M46l94J12J51J33m25L15l4j60l64O55l0o2oJ53k29o2J74k16J39
$$ y = [-108, 228, 61, -267, 43, -216, -504, 104, 252, -198, 27, 102, -5, -26, 312, 206, -251, -143, -15, -14, -224, -35, 183, -228, 15, 58, 79, -95, 392, -109, -81, -108, 77, 237, 140, 198, -585, -130, 211, 76, 12, 177, 227, -103, 121, 288, -242, -116, 24, -414, -23, 175, -24, -220, 213, -110, -145, 69, 342, -181, 18, 51, -99, -152, 89, 243, -277, -109, 333, -12, -220, -135, 219, -91, 143, -148, -133, -190, 187, 351, 45, 189, -307, -224, -88, 264, -82, 170, 181, 221, -174, 21, -99, -156, -34, 87, -34, -228, 617, 119, -404, 158, 65, -224, -32, -282, -39, -68, -48, -67, -158, 264, -139, -88, 56, 24, -136, -69, 48, 110, -169, -152, 53, -161, 106, 145, 65, -102, -96, 466, -433, 165, -16, 232, -112, 25, 1, -182, 263, -137, -229, 212, 205, -11, -136, 90, -3, -60, 195, 17, 17, 226, 50, -203, 216, 148, -71, -270, 176, -218, -106, 45, 178, -247, 68, 34, -126, -490, 165, 135, 73, 67, 220, -9, -71, 103, -113, 26]
6428B6L84l07p0q1K62l73L11km50Q4M32m21L35j83L8k11L04M85p13p5J92J44p5
6451C6J9K2o5R4j10J30k64N20k41n66M16K48l59j45L88l5m56O69m7l09M7L21m58
6474a45K43J51k88m3k92L38RJ36j02q8J01j30J16j91Nl0M8M01j34o6m5m2q2P0
6498f0K07j31l9N9J97l07j50K57k10L1K06P9l00J42l7K16j59J11l77M26j17L2
6520G6j58J74k8j87Q5Q1K0Po7j17O5M0j14j26J65K04m23J09K05R4l57M26k82k25
6544c33L59l9j63L79r4R4n79M69j33R3j34k92L34J50l69M07k70J44o0K29l54J82
6566B0K25j76J45M6K9l75K74m26L15M2mj32J11J99l51K2J78j50k14N2J73j6R8
6589H5J47j11j33L9k71J72M98k52m0J64k89j20j22M27Q8o65L23J27R0j52J78l04
$$ y = [26, 410, 103, 33, -48, 214, -159, 152, 150, -300, -216, 216, -205, 130, -53, -15, -226, 78, 563, -150, -225, -33, 111, 36, 55, 77, 12, 106, -4, 126, -138, 382, 141, -425, -9, 239, -120, -265, 123, 88, -368, 301, 254, -55, -8, 313, -145, 98, 249, -39, -82, -374, -36, -27, 109, 7, -81, 20, -110, 6, -185, -180, -210, -162, 239, 105, 39, -6, -48, -130, -60, 147, 16, -23, 36, 233, -74, -224, 33, -177, -146, 60, 139, -161, -19, -56, 160, 1, 112, -265, 161, 44, 76, -82, 92, 64, -123, -38, 43, 63, 70, 3, -114, -49, -9, -123, -249, -84, 120, -303, -194, 11, 105, -252, 174, -108, -333, 26, -13, -176, 203, 109, 203, -376, 93, -40, 53, -81, -373, -39, 111, -258, 149, -121, 23, -37, 192, -162, 20, 245, 69, 214, 260, 289, -86, 188, -238, 77, 119, 115, -17, 94, 293, -58, -36, 142, -8, -222, -170, 3, -13, 85, 232, 121, -12, 27, -244, -72, 426, 174, 134, 298, 9, -111, -233, 194, 282, -383, -60, 67, 157, 5, 183, -121]
6611a21K10m25K09k17K72K86k57J8O6K7N2j03K20m51K09o2L2n5P3N7l78K75j74
6634b37R8L18P4j67n5J00j21K62m19M4J16J0o2j02lM7K46m97L07M0k4rJ48j93
6658g9Q5M31o85J78L30l57K2L25l39O9J53k20K56l26L69j64J39j17j9j03j20K75
6680A03j78K0k53L13j26J6M05j50m40M71k25KJ99j31P1j3k1j75n1J18J74k26L48
6703B51Km54n0J78Q3K23l54qO1K91j97m4J06m21M71o6J02l46J93J68k02N1K81
6726C19j89l8j31k03K76l15K39J8j01L8j74J14J75q3k1J01PK80k63j39J58j78
6748a10j4J92K03l89N9Q5Q7J25p5j53j41N67m58j41J00J86K1j86J07R3k09O2J76
6771A87k98J63J57k00j65J75J64l57L00J22m08K86j00m0M2k01K5n1L01nl64K26
$$ y = [-121, 89, -336, -127, -344, -72, 214, -43, -25, 41, 68, 120, 17, 237, -214, -5, -67, -35, -90, -17, 40, -338, -63, -237, -139, 179, 253, 86, 31, 131, 10, 272, -147, -103, 13, 23, -39, -141, -144, -97, 149, -348, -41, -1, -25, -34, 114, -79, 6, 437, -248, -70, 260, -97, -75, 250, -89, -20, 133, -87, 169, -157, 212, 48, 187, 70, 51, -52, -172, 103, -75, -55, -308, 5, -121, -105, 300, 150, -290, 181, -44, -42, 157, 26, 97, 84, 63, -112, -163, -45, 129, -97, 251, 253, -201, -251, -73, 10, 233, -121, -129, -68, 223, 26, -18, 88, -333, 138, 72, 174, -172, 21, 189, -13, 38, 319, 130, 92, -39, -242, 34, -281, -42, -24, -125, -87, -261, -147, 28, -55, -76, 25, 32, 312, 49, -90, 68, -110, -124, 68, 271, -118, -59, 26, 113, 238, 163, 10, -131, 436, -22, -163, -63, 123, 144, -42, 65, 158, -51, 11, 187, -111, 52, 209, 9, -156, 19, 183, -174, 126, 248, -160, 126, 26, -14, 28, -173, -148, -199, 102, 97, -267, -41]
6793d1K83l85Q2J66j49j24q9K70MJ07J95l66l49N97k60n0J42P7j68k2L47n58N5
6816b36P99k67m04L6l3p1N9K74k84J74j36J09R3M1l36p5K1M49n4k47N45n22j12
6839a77J0p5K92L24p7m37O5J55L2qJ2K5k74q1L71j05m3K91l05j78K47J93m3l08
6863i4J34n6p8J47J60l02j02J22K95l06L7l3K01j13J54j16n1J8j86L64j34Q1K02
6886C44l32K06j20k71K65q7J18j7l67P0K27j81R1j9J92n59L53K31l39J71K50j12
6908A14L9p1Ok29J26r0K9J44L15k07l76L58j61J39p4l01R2L12k41J77l8k13k1
6931a71J08K1J03j30j45J49J29q6j49M76j46j66L54k56k64R6J24nj78N40l94j10
6953a00k7K81m22J06J62N9L8j72R9q5N4q7K8L56j39l63K46j59K20j96k3R4J54
$$ y = [-41, 242, -143, -61, 105, -44, -168, -257, 13, 17, 124, 319, -47, -396, 201, -59, -109, 33, 110, -58, -80, 267, -291, -236, 563, 296, -108, -72, -105, -176, -117, 157, -127, 47, -89, 20, 113, 154, -182, -257, -236, 213, 159, -88, 457, -65, -177, -167, -242, 50, 374, 297, -140, -75, 80, 112, 104, 116, 141, -133, -214, 157, 52, 9, 300, -5, -183, 64, 257, 214, -94, 40, -16, -94, 53, 213, -89, -191, -69, 226, -80, -43, -76, 125, 12, 166, 50, -1, 17, -169, 195, 61, 142, 344, 12, 218, 98, -173, 92, 5, 123, 106, -261, -191, 36, -145, -54, -73, 119, -440, -87, 144, -195, -24, 226, 114, 153, 82, 88, -141, -15, -105, -76, 68, 383, 176, -200, 158, -3, 136, 62, -239, -147, 165, -76, 101, 63, -150, -171, -63, -42, 61, -69, -214, -65, 64, -22, -171, 305, 159, -7, 347, 91, -173, -77, 47, 42, -136, 404, 10, -100, -127, 154, -268, -162, 0, 59, 97, -75, 24, -61, -7, -94, -66, 290, 151, -212, 34, -125, 95, -101, -124, -30, 124]
6976A24k01L6L55l79L29j02k93K47J35j7j68r9K46r6J55l82q5L36m2j50J42k60
6998a69j80M62J33l70N32k41k18l1M59m77J86l1J5j15k28K40J42m00K38K42j41
7019D8l04M81l82K28k80M70j00K2k46R3K09k27j97J38K56k58R4J75o03K95O6l2
7041e4j54J53J58j36L78n16J86J52l77M39j27J44l07o0q4J40Qp9Q8K05k40p6K25
7064F6m2l7J08R3n16l9J66L10j65J30K86o19Q5K57l55L16k2q3k78L40K37k53O0
7087D5J57k81J42j28J37m06K99J58k66M21m12RK08J13j26J8p3n2r3P1J71j13P7
7110G6j11m5k54K43J59p0L0P8K1l97K66l6k4J89L5j34j22K21n8j71l5Q0J22q7
7134b4k13L35m4p7k76J4J73J85m57M53j46K45j36M4K14m98L35l79M62k07J39J95
$$ y = [124, -77, -41, 314, -65, 264, 162, -131, 116, 251, 234, 66, -33, 213, 117, 272, -110, -195, 141, 99, -51, 91, -169, -349, 113, 246, -124, 408, 167, -51, -82, 377, -100, 86, 55, 70, -45, -273, -33, 109, -291, -53, 189, 48, -256, 225, -157, 71, -209, 261, 161, 183, -63, 30, 239, 12, -185, -47, 209, -49, 45, 220, -383, -88, -22, -54, -208, -55, 103, -33, 345, -171, 15, 167, -210, 229, 102, 246, -61, -121, -205, -65, -57, -136, -48, 157, -83, -159, 66, 24, -13, 95, 188, -328, -367, -201, 109, -56, 74, 360, -259, -174, 83, -272, 44, 22, -61, -339, 1, 238, -15, 45, 202, -79, 63, -65, 72, -334, -35, 123, -143, 278, -134, -125, 83, 196, 70, 88, 15, -37, -130, -59, 112, -1, 76, -35, -80, -334, -91, 68, -2, 28, 106, 127, -270, -4, -40, -64, 125, 160, 26, -96, 125, 67, -104, -139, -59, 63, -24, -237, 98, 54, -23, -299, -285, -112, 73, -384, 69, -77, 168, 32, 76, 290, -208, 127, -252, 210, 3, 142, 337]
7156C37l66j28Q5J98k8k30J33l17L40R5J45j61k61J86J00k74M05J0m08K01j50
7177h8J99k70J11K2l2j66K90k35K22p6K2j94J20J52K2jk57o2R7J78J19N3k81J85
7201A30k20L34k67K10j54N1m21K58J01l0j48L03k16L7J85j21o1K25j78j10K7N7
7223hL00k66J72j95j15o0K18J89k54Q0l1j47J82K3j20J57l16M30l9k74J37l59
7245b96L75M41m37l6l23J83K73N8Qk04k91K57j33J24M7J15n6n9j07o9L34j78j31
7268a05J67Nk27J27Q8j88R9M01j40j87q0J3l6Q8r5O7J70O9k44rK10k71j08J34
7292e2rJ11k12K80l9J22j19j04P0O6Mj06M6m8l7J54O6j76k81J1L16MK31l35L90
7317C53l74Q7N9R1j64L64n39l9R1j2J25O1j27P7J63l99J54J58J03k53R8R2l22
$$ y = [337, -29, -157, -72, 126, 98, -132, 1, -316, 24, 119, 264, 103, -158, 28, 128, -146, 259, 269, -139, 62, -88, 111, -159, -48, -26, -58, -224, 66, -169, 53, -23, -1, -195, -75, 77, 99, 98, -159, -221, -124, 54, 173, 226, -55, 130, -90, 244, -23, 187, 33, 84, -337, -79, 22, -8, -156, 147, -69, -32, 153, 32, -29, 196, 18, -92, -65, -8, 292, 26, 198, 3, -112, -172, 46, 235, -19, 61, 30, -117, 65, 88, -32, 125, -191, 239, 200, -74, 63, -296, 79, 520, 83, 47, -276, -93, 180, 238, 246, 42, -249, 8, -125, -1, 46, 161, 105, 46, -61, -130, 204, 26, -105, 62, 67, -160, -33, 55, -133, -34, 367, 227, 40, -40, -27, -63, 25, -70, -3, 167, 236, -8, -17, 193, -78, -186, -52, -61, 50, -162, 118, 79, 201, 82, -22, 48, 114, 118, 12, 58, 10, -27, 127, 193, 17, -264, -253, 63, 67, 298, -37, 353, -21, 66, 125, 216, 52, 416, -123, -162, -71, -83, 42, 103, -24, 53, 216, -183, -29, 129, 232, -21, 77, 169, -153]
7340a53k11L33j11J61Jp4J7J77l38K29j95J72j42P0K24L7k31J06Nj3k07m0J16
7363f7J64L0m1k12K51j91m4K06m10K73Q6r3J70j10J86k94l6M4K53K7l47K45L59
7386D49m91k1L33p7j01r4q3K3J79n4j44K20j06l38M81j78Q5j49N0J39J21n24K40
7409d0Jpj50K60R4j80R1J0m41K47O0m8R7K0o2p9J20j20M1L3j12K68L4m34L15M0
7435E8l2o8J12j3O3Nm09J00J01J06J59j24j36P0J97L7l30J07j77R1Mk2Q5M8K6
7460E8j48K90l8j72N1k40Q3o7P1M22k52k83K29m7J05j41j59K64J03rj86j02M8
7483a20K18k37J81o1k1j37K77n9j00K23l31n3K22J11j46L3j34L68j66j44L0j62
7505b08L06Pq3n4L4qj68l3M83m16J72k39M12l17p2M39k25J7k1j20J02r8J08m5
$$ y = [-153, -364, -31, -142, 19, 20, -54, -37, 140, -198, 31, -164, 8, -134, -64, 160, 197, -34, 72, 77, 64, -143, -183, -67, 97, 127, 86, -126, 125, -66, -110, 96, -314, -41, 45, -48, 122, 12, 198, -96, -132, -88, 165, 192, -155, 90, 449, -42, -63, 270, 193, 92, -2, -85, -62, 117, 63, -81, 139, 33, -305, 176, -2, 83, -66, -16, 123, 244, -280, -40, -39, -46, -196, 64, 158, -22, 69, 79, -362, -115, -55, -103, -6, 14, -48, -127, -7, -127, -86, -53, -165, 103, 137, -297, 18, 58, 26, -42, 70, 57, 120, 125, -284, -184, -83, 23, 182, 58, -78, -8, 189, 226, -104, 3, -174, -83, -79, -101, -16, 32, 58, -90, 200, 162, -10, 41, -199, -116, -183, -112, 310, 58, -225, 4, -43, 62, -79, -238, 26, 129, 120, -66, -168, -120, 98, -139, 42, -19, -40, -177, 100, 41, -59, 164, -167, -220, 2, 113, -33, 0, -134, 234, 68, -76, -46, -208, 98, 105, 22, -32, 2, -6, -174, -207, 276, -140, 32, -207, 205, -112, -184, 255, 30, 47, 26, -94, 8, -90, 18, -27]
7529b7J82l86M48J08l25j75M04J03m55K37m9j48K37rm15L82l21K87j18J77l14
7550a77L73L4j81J12m45O8L71j57j37jkjL87l3k55L0J43l42J51J48j50Q1K12j58
7574G1j54N5o3J8j2L14j29j58M1L00k36N1q2o3j63J47J05j63PK76j96j58L36k72
7598a28L19j49kn8j88M20j98q4K20m44K76O8mk08J47J69j99o0Jj4P5M0K85k33
7622E1J30j12k2q9r0J69j07K90m07K32n6j74PJ40q9L8PJ38K0J57m40K11rO0r5
7647d0J40J13j15j53J25J16l25k13P5O01l53j99O5N9L43l77j66O22m48K82k04
7668e2j4J72j12l03J90P4r7o8P8K71j61k29p2O59m50J32j15J60J12k74j07K84
7690G8j21p6K14M9J11j87J22l3k59j60K81k49N30k76K34l20K48k34k23J68q8J62
$$ y = [-27, 155, -231, 217, 325, 0, -175, 229, 332, -123, 114, 65, -83, 154, 145, -270, 112, -209, 78, -40, 137, -177, 196, 230, 49, 161, -284, -216, 155, -2, -139, -140, -142, -143, 244, 211, -44, -14, 129, -213, -62, 86, -64, 17, 229, 71, -83, -28, -91, -73, -85, 229, 100, -58, -17, 283, 47, 98, 16, -47, -210, -63, 42, -121, -114, 162, -34, -192, 144, -128, 191, 42, 40, -18, -206, 214, 16, -68, 152, -292, -16, 52, 48, -160, -13, 156, -43, -103, -102, -116, -41, -1, 284, 51, 181, 69, 47, -42, -132, 37, -70, 220, -187, 45, -11, -185, -178, -38, -127, -89, -82, 56, 76, 233, -207, 4, -5, 55, -40, 100, 213, 98, -55, 70, 186, -139, -352, -277, 324, -29, -228, -163, -104, 239, -138, -304, 318, -130, 152, -52, -66, 106, -6, -309, -119, -45, -142, -210, -132, 139, -22, -251, -323, 336, -114, 18, -97, 63, 175, -99, -206, 78, -43, -119, 95, 144, 255, 68, 190, 157, -102, -262, 19, -230, 300, 24, 258, -62, 186, -48, -271, -103, -191, -29]
7712b9j69K74R7j58j22J65M8Rk32M3R1j75L37j19%o5J4k57K40J42j98m8J94r8
7736a6M1L2r7J64r2j28PL36k08l38K56J58K1j24q5O1k8J28o4Q5j45M59k56j73
7760fJ55m90J80K87j64O6j28M74p96J84K61K77l69J14J44l15K99m9l65J53J28
7781D0j48J99k07o2P5K50l18NL92M0j6l64M19l48m0J51lN8k08L31k97J39k75J67
7805b0J68j7L49o57K50Q2n24M84j26o4p0P9J53j6j61K95L9j65q6r1J24j31J11
7828Fl9k10J64Q9q9J0K83m46J14J40mj62O5l6O2OjJ34j74n5L15P1r7l2k98J23
7854f1n3K7j47J55j95J78R6k67J55L28j00k19r1M37l40j41K23L1n0O3L3l2j66
7877a36K84k02O6p6M17l54J8J95l30J9M85m67p5M87l59j6k8r9L58l88J73J77k28
$$ y = [-29, -198, 76, 173, 15, -107, 58, 106, 115, -117, -74, 17, -158, 179, 60, 60, -5, 9, -248, -8, 134, -64, -112, 82, -16, 25, 57, -40, 124, 32, -96, -89, 247, 39, -299, -43, 115, 136, 12, -73, -12, -40, 88, 24, 109, -36, 423, 167, -6, 149, -341, -161, 126, -38, 28, -100, 374, -422, -238, 23, 300, -69, 45, 189, -126, 173, 124, -241, -88, 40, -108, 91, -116, -178, -103, 147, -171, -166, 226, 266, 250, -114, 305, -43, -83, 68, 65, 123, -85, 246, -51, 88, -187, -20, 148, 131, 480, -177, 73, 155, -369, 115, -11, -75, -145, -66, 87, 71, -90, 205, 244, 79, -7, -98, 26, -105, 6, -33, -243, -79, 10, -79, -69, 214, -232, -118, 22, 18, -144, -79, -115, -53, -47, -48, 86, -88, -143, 172, 243, 146, 114, -184, -61, -114, -87, -234, -79, -274, -96, 0, -267, -112, 216, 116, -103, -194, 243, -97, -238, -15, 16, -34, 29, 62, 30, -136, 148, -54, 12, -64, 353, -1, 17, 212, -118, -99, 386, -81, -156, 331, -28, -44, -72, -171, 187, -201, -28, 149, -79]
7900g9j3l8L31Q1j52j16J13j37K68l00j33J04jn0L30p4rj6J13k80R6m2J33j34
7924eJ86j47o6J09j10O7K50m06K36l24L71j15n9Q4P0j57j55J80l4P1J45k44P1
7947A8r3p3J15J18O9O8l16K40n44K88L96m06m9L72j17m2o7r7n5M02k63M3R6k90
7971a87L70l84K21J88j72j11J26o5L01k98P5J46K3j34R0l75J28M3j56K40r3j36
7993a60p7J27K53k53J13K3j2j10Q3k55L38P7k24j12K13J5k19K53J2k32K86k01
8015f2J44j73J08K4j15J00k26K37j09p7J49J45j10k40J05J90m24K83n1K01l32
8036b33P4k7K42Mj47P9j76R4J93j26K8q1L6J83j79L11k97K08k99K40r1K23k03
8059E6Ol20L00o0j96M09j78R2q8L68l90k93M14J18k45l4K74k82k47O0M53j16j14
$$ y = [-79, -92, -130, 201, 282, 130, 14, 127, -10, 258, -42, -175, -71, -72, -122, 208, 134, 125, 109, 222, -58, 38, -4, 129, -5, 181, 34, -32, 77, -33, 34, 284, -122, 114, -210, 161, 46, -13, 71, 141, -16, -171, 9, -25, 46, 191, -53, 18, -75, -148, -33, 85, 154, 222, -94, 146, -398, -110, 286, -120, -169, 203, 86, 44, -23, -120, -175, 227, -36, 7, 103, -187, 183, -201, 20, 208, 36, -75, 51, -14, 287, -11, 64, 210, 233, 99, 189, -186, -58, -15, -171, 69, -24, -160, -237, -110, 143, -110, 3, 26, 14, -96, -13, -268, 70, 147, -77, -189, 24, 39, -180, 73, 85, -147, 139, -62, 82, -91, 17, 41, -74, 26, -200, 37, -72, -149, 0, 145, 35, -205, -100, 90, -334, -51, -102, 99, -233, -159, -186, 56, 60, -87, -8, -184, -90, 103, -23, 5, -76, -40, 143, -36, 275, -22, 186, -113, 127, 36, 259, 56, 62, -258, 42, -18, -214, 195, 17, 109, 21, 389, -1, -294, 120, 238, -7, -41, 233, -49, -296, -236, 217, 101, -13]
8082a3n6Q7o4P6m9k64K30q3L63m2j91k56L31LL5r8n6J45m80K70K05qL10k92Q1
8107A84k26j19J72j33J55j87j91M08M4m31L03J19M7m00J75J60k60J43P1J08k3
8128A19o7j41k27P3K84k95N26Q0o6M3n2l16J14j99k9P6J32K28l88J10J27j71j8
8151e7J4K15Ol7j48j64L37j60k7J63jk22j77O60j18l76K85n6j29N8j56K95k82
8174g7m9n7m2K90k1Q8m08L13k7N7l99L77o1m72O58O8k79
$$ y = [-13, -69, 18, -46, 30, -19, -283, -53, -136, 227, 185, -6, -262, 69, 72, 107, 9, -47, 98, -382, -112, 93, 85, 395, 103, 184, -42, -161, 11, -122, 33, -154, -345, 63, 107, -324, -21, 98, 145, -255, -80, 80, -180, -37, 34, 142, 119, 52, -89, -316, -243, 41, -254, 272, 352, 286, 329, 277, -39, 75, -124, -153, -77, 55, 283, -105, 5, 132, -39, -57, -43, 172, 178, 141, -7, -171, 166, 6, -21, 142, 141, -81, -258, 402, 284, -92, 193, 137, 8, 66, -90, 205, -77, -126, -183, -225, 65, 44, 132, -276, 37, 10, 67, -332, 45, -16, -488, 170, 238, -41]
8191d1
$$ Imaginary data points
##PAGE= N=2
##DATA TABLE= (X++(I..I)), XYDATA
0@%%%%%%Oj4J6j6K4l2L6m4N6o5P4r1J10j31J54j79K07k39K76l16L59m09M64n24
30b78N92o66P46q36R35j041J158j287J428j583J754j944K152k382K638k924L249
47A711l618M040m530N105n790O626p677R041j0885J3532j7687K5180m2841J56910
61A29117J21071l20097j6311J56179J7268r0355M8850K1676n0541j0N7736l4445
73D0138o4880K552O6938K5772n1136n6584M8392N7475n9429p5141N2934O1986
85D9017k6255k3676R520k6039p041M0032k125l7212K0620K9236j9697j2724k042
98h386k1343K0779M7812k3658m4723K5659J3292l0194K2396K5837n5129q912P2478
111C5908j6639p1304M5304M7599p6556k0892R5747l755r2136K6380P2833m5436
$$ y = [0, 0, 0, 0, 0, 0, 0, 6, -8, 8, -8, 16, -16, 20, -24, 32, -33, 41, -50, 60, -71, 83, -96, 111, -128, 148, -168, 191, -218, 246, -278, 314, -352, 394, -442, 493, -548, 610, -677, 751, -832, 922, -1022, 1130, -1252, 1386, -1538, 1711, -1907, 2133, -2397, 2708, -3082, 3544, -4133, 4908, -5977, 7555, -10132, 15048, -27793, 129117, 250188, -69909, -86220, 69959, 87227, -3128, 45722, 67398, 16857, 16847, 74583, 40138, -24742, -22190, 44748, 70520, 19384, -37200, 11192, 68667, 9238, -65903, -12969, 49017, 22762, -914, 8606, -17433, -24474, 15558, 13433, -23779, -3159, 26077, 6380, -6344, -8386, -29729, -8950, 38862, 15204, -29519, -3860, 9432, -20762, 1634, 27471, -27658, -36570, 35908, 19269, -52035, -6731, 40868, -35688, -56580, 39167, 35412, -56724, -30344, 42489, -2947]
123b947n4978N3949M5257m4701m0479K6803L9583j3141m1422J1751M3246k5822
135b901m2397M8811L7043p2668k6204Q6420J1052q5621M418P0709j2784l9744
147b3866J4898O198j1844J9125O350k3032P464J0715k0216J2490K7254l8060k1256
160c3780O0530Q139p1387P437O5420k1424m5317K7882J6481k7018J1392K0107
172A8462l1866j4358L3453P047k0041Q74J355n477J2048L47j5979J1072J4018
185A0955j5803q52J4134j8722l326M0755p822m8098K4510M3644l9938k7380M9094
198B1151N676m7677J6801L7927l0552k4803K8675O027j8572O942M243q703R659
211F794l754k4659J7781K7681l0652j6035M1822l261m8572J7651M3096k5771k5302
$$ y = [-2947, -57925, -3976, 41281, -3420, -43899, -17096, 22487, 9346, -32076, -20325, 22921, -2901, -45298, 3513, 40556, -32112, -58316, 28104, 39156, -46465, -42047, 28662, 15878, -23866, -8968, -2770, -14614, 4511, 10861, -12171, -4707, 6008, -14208, -1718, 25536, -12524, -33780, 26750, 34889, -36498, -29061, 36359, 14935, -30382, -2500, 13981, -13037, -1645, 18462, -13404, -27762, 5691, 12738, -7303, -6429, -5074, -10551, 1497, 1844, -14135, -3063, 10955, -4848, -5700, 8434, -10288, -13614, 27141, 19319, -28779, -4269, 39375, -563, -27943, 21151, 26827, -20850, -4049, 33878, 3326, -21477, 7198, 13225, -5347, 1595, 5838, -2865, 6794, 3040, -21619, -3838, 23843, -6809, -22844, 18978, 15717, -32855, -15204, 27892, 2121, -23181]
224b3181L0493P144k6376L564J4261n238N90M74r631J3822J2468k7770q393L4438
238A6665m971l1310K4437K2809l7646j1270L7873o216k9456K1570J6736k4653
250e432j407J5688j6219k221K6146j1609k3301K2058J2184k7991P26K2225j3837
263b990r153K0136o554j9297J7463R315k2745J661J5123j4064K748K4335k0603
276d625l0277K9939K4519k9785o996K4811q130j5427J7265L917j4729R905O136
289F523j6153P402J5412j6929l058K1235j5403k0669L3785J7192m1294q778L6089
302A5354m452k2422J5137O430j8973P816J2809j6171k266J4965r914l764J8959
315A3508j0545k2733K5039J8926l0826p999K8768n377j7485J7988N390k2117O042
$$ y = [-23181, 7312, 14456, -11920, -8356, 5905, 667, 1257, 1731, -7900, 5922, 18390, -9380, -17773, 16665, 11694, -19616, 4821, 27630, -10016, -21286, 16587, 10371, -19085, 2485, 19221, -5432, -6839, 8849, -7370, -9591, 16555, 4946, -18355, 3703, 15887, -12104, -11378, 10847, -2990, -12143, 7993, 1439, -17858, -395, 8920, -13825, -12164, 2959, -11105, -8357, 15978, -4625, -34902, -4963, 19556, -10229, -17225, 7586, -544, -15971, 1294, 5211, -9518, 387, 6523, -9630, -2228, 13184, -3745, -6803, 14432, -971, -21640, 12145, 29337, -11957, -20735, 15354, 10902, -11520, 3617, 10047, -8926, -1110, 11699, -4472, -6738, 8227, -1687, -5451, 13508, 2963, -19770, 5269, 24195, -6631, -14630, 14138, 8761, -8724, 9264, 14654, -7463, -1421]
328a421J5568j3382q61J5564j2931j1129K0810k633k3229J8417K0064k9858j3665
341a8686K9117K421j8815P620L246j6046R997J6069j6957p532J5714o868p664
354h384J9557m256k6548J7042K4991k6690j6481K7636N411k0214N682O973j3619
367h900O417J3285j6069n729J8656o206j4179J6772L058k2695J1567K1471k4246
380f798j4451K9081O023k4067K329J0845q657N787J0636j7690o366K1300l728
393D244j6277J5783M166k3789P876K5168j9255j8774K3836P237k1001M012J1689
406D915j2006L83J3024j0643o028J6249m931j5017J7517Q600k3781K838K4756
419A5876j3432j7534K1665P430k0071L087J2383j0957P96J4732j2550j1747J8047
$$ y = [-1421, 14147, 765, -96, 15468, 2537, -8592, 12218, 9585, -13644, 4773, 24837, -5021, -18686, 10431, 12852, -5963, 1657, 4903, -11143, -1146, 14923, -2034, -9566, 6148, -720, -8384, 11173, 6917, -19631, -2589, 22402, -4288, -20769, 6867, 12278, -7936, -2254, 4719, -8900, -2483, 10802, -5267, -10996, 7660, 1454, -12725, 4047, 7105, -15590, -4023, 17448, -6798, -21249, 7832, 13855, -10212, -7883, 2962, -5695, 92, 10728, -6962, -13328, 7972, 4244, -12033, 3750, 7916, -15873, -7997, 17171, -2084, -20858, 2978, 10215, -10786, -6774, 4915, -7091, -6708, 6316, -4327, -10355, 5894, 963, -14054, 3463, 12063, -11718, -8880, 15876, 2444, -15090, 6575, 14005, -6066, -2979, 9404, -1553, -757, 13975, 1425, -10322, 7725]
432G725K447j6129R115Q171k1472K085K5808j0828k2791J4899J2055j4331L08
445b938O954j0009K587J4823j2902j1739J9214L352j9676R322J3020j9289k783
458a0064K5175p428k3467J5500J6031j7019n743J1754k909n02Q019j1434p830
471i917J9427J651k0522R048J3989j9001l880K4725p252k3069J6124J4485k0388
484d580l422J8243n215j0530R470n21q558J1464K233j6980N296J4618j3536o653
498h671J7687l703j6899J1828Q606j6477K474J5809j3589j0006J7960P97j5709
511i893R778P639j7691K509J9361j0642j4986J5837O520j5350K509Q788p605M93
525b733P720j0498k615J6144o298j5836J4824R113k1586J081K2729j2257j7977
$$ y = [7725, 10172, -5957, 3158, 11329, -10143, -8058, 17750, 6922, -15869, -970, 11085, -3246, -2938, 4016, -5993, -3406, 11417, -1485, -13224, 5990, 9342, -10334, -1012, 12008, -7281, -10064, 15111, 7683, -15784, -284, 15747, -1272, -7015, 4739, 1830, 1328, 9347, -2087, -9917, 9510, 11161, -9361, -313, 13676, -5325, -9205, 15520, 8268, -14801, 1323, 15808, -4580, -8002, 10241, 5026, -5504, 3966, 3445, -5113, 6351, 8584, -8396, -3100, 11518, -2018, -8671, 9016, 5313, -11586, 242, 8848, -7629, -5155, 10654, -2935, -12941, 5019, 5816, -9893, -115, 7524, -10167, -7658, 11703, 1061, -13925, 1912, 8432, -6918, -4409, 4379, -3226, -2733, 4987, -5511, -8126, 8018, 1720, -14116, 708, 9821, -11765, -10684, 12045, -212, -18189]
538a8189K0006R727k3560j117K0059m116j0693N312L55k287Q021k769q039J0332
552C042K508j6210P949J9649j6221j5182K1905N873k2545O797J9297j5916j2979
565a2033J8923L753j4208M193N045q460L238P700r754j345J2576p969j0085J4443
579F017L343j6292O662J1458j4997l041J9733o065j8590J4025J1921j6902j703
592d431J5154r123q230J6186J080j7533L827J3409n753m468K208m659K761J0004
606A0432r506r308J4388J880j7414Q976J4488j8551p955K3950j178k5444J0146
619e096K1027j4953j4206J4094M908p987J789r12m749P140K590j0262L696P336
633D415j3840J36K0711p969k4490J5807K0313j9807j1070J9734Qj5041Q491Q947
$$ y = [-18189, 1817, 11544, -12016, -13133, 6926, 2810, -7883, -2571, -2216, -4503, 3518, 749, -7290, 3042, 5550, -10660, -2711, 16938, 717, -14465, 7440, 13313, -9232, -2435, 16862, 946, -12033, 6890, 10643, -3565, 628, 5673, -2787, 451, 8151, -1603, -2948, 9628, 1659, -8426, 6017, 9360, -6932, -270, 11188, -3809, -6850, 12883, 6818, -11772, 2253, 14174, -2728, -4431, 10723, 1600, -6630, 9556, 10636, -6897, -3070, 10339, 4586, 118, 2326, -2333, 428, 10432, 926, -8382, 6006, 7886, -9528, -552, 13936, -4615, -12570, 11380, 10202, -15242, -5096, 15931, 978, -13228, 866, 5774, -2213, -424, -1336, -6085, 1055, 3645, -6617, -2921, 4415, -9425, -9289, 11422, 3453, -21037, -5230, 15083, -4724, -15794, 3940, 3948, -11093, -2602, 6345]
647F345j1471k131J0074k465l112M294m755p91R829m749j0676J1636P789j6319
661f502K04J4720q472r401J6632N96k0239P701J7973j4066j0711J5450L34j2462
675h243Q975P367j4659j543J4244k575q253M143p29j078Q861m014j3607J0919
689a92J2020j5051m794J7242n100j6330J3964J1599j9138m512J9860j757j5910
702h099M271Q469j754j843k648l206Q703L462j2724J384J3269r578r742J8414
716H378L935k4191M084K4143j1272j8166J5827R345j5249K27J0418q027l493J0764
730F723k379q089O102P61o213O308K408j1640K791J3097r308q988J1965J648j1686
745f500O173P619j2848n09J4389n998j2236J0024N792j0520J145P794p307k566
$$ y = [6345, -5126, -7257, 2817, 352, -2760, 1534, -3221, -4012, 5817, 1068, -9608, 2028, 9817, -6502, -6298, 8422, -50, -9451, 7181, 7777, -12462, -4761, 13212, -854, -11565, 3885, 4219, -8243, 732, 8099, -6560, -8103, 6141, 3566, -4687, -544, -1273, -2351, 6510, 2496, -11111, -192, 11828, -3223, -8017, 9225, 4125, -12205, 1759, 13358, -5780, -10292, 9568, 7811, -8099, -3828, 4641, 2887, 1044, -1604, -4810, 3893, 7355, -5369, -3985, 9284, -294, -10036, 8378, 12313, -11878, -7794, 16349, 5077, -13089, 2738, 12083, -3166, -2939, 7479, -548, -4041, 6723, 4344, -3745, 2357, 3118, -3095, 3213, 5621, -6019, -3228, 9869, 561, -8427, 3538, 5186, -6500, -327, 7292, -5556, -6065, 8324, 2326, -9910, 114, 5906, -4614, -3469, 4325, -2982, -5548]
759e548R500l554p081P420L34o902P191K285j3873M810J6697j2531j4514J7048
773A282Q467j8577J262J5877j0041j0508J4902N671j4700o53R453j763j417J156
787D11m479K137P242p998m882J2863j15j4378O566J1913j2926o071J6698j150
801E831j6210O239J0858p935l246O813m337k577Q957l191q502P980M326j0429
815e423L256R180r815m353J4444j839j4264Q272R244j1203j050J1417o816p742
829f692J2100J736j3000M528R635r418m092J0581q50p606M817J485o133N329L993
844F413q439J342P100p442k064J2012m736j3176J0926J1231j5263n338J5112j904
858E774j1439P302N730r876L93P717m999l261O406l222l664P840k107j0249Q207
$$ y = [-5548, 3952, 398, -6683, 737, 1071, -5831, 1360, 3645, -10228, -5418, 11279, -1252, -15766, 1282, 9749, -8828, -7566, 8311, -1730, -12238, 2664, 8335, -6365, -7018, 2435, 672, -745, 411, -4068, -1931, 5311, -2687, -7569, 5294, 5179, -9199, -2633, 9280, -3646, -9717, 6981, 5831, -10379, -4140, 6718, -1217, -4463, 2350, -1987, -4564, 4393, 1202, -7300, 680, 5006, -5423, -2167, 7013, -2802, -7155, 7289, 5450, -8814, -542, 8702, -2501, -3551, 7866, 1050, -6692, 5408, 7144, -5856, -1328, 8307, -1111, -5203, 5378, 4528, -3078, 1739, 3224, -2909, 2420, 6413, -2026, -684, 6416, -1026, -3090, 8922, 4186, -8990, 1936, 13167, -2096, -7434, 7678, 5774, -5665, 1637, 7367, -2509, -2116, 5601, 602, -2659, 3747, 525, -3139, 4701, 2594, -7655, 552]
873E52Q380j3760l276J4957k317j2687P869N850j0553J087R647o699n673Q677
887B054K50o906N298R36q452N806Q155j0402m601J1704j432q770O530L518r647
902e959K842Q995p556m825J0040k298q653Q730M359j1559J922J0668q082o639
916h015J1715J897j1707L530O891n507r12N552n678l083R491j562q557O649L523
931D227r974K267J1012q630q041J2034L023j1805K478Q050o566j777P584l764
945A18m811P187r7p781O087M774r462N01J0612o302p679J0688K741j1426K096
960b754Q841n384l022O990m254n716R341J947r888L399O101p721l72J0573n983
975B098r832R974O071j0096j040P593m713k144P302l396o451Q125K402r597K827
$$ y = [552, 8932, -4828, -8104, 6853, 4536, -8151, -282, 5568, -4985, -3898, 5749, -950, -6623, 2054, 2304, -4602, 696, 1632, -6820, -1014, 7141, -3261, -7862, 3842, 2410, -6360, 170, 3688, -5959, -3117, 5878, -1678, -6503, 3537, 1239, -7414, 1316, 5675, -5884, -3962, 6706, -1376, -8015, 3700, 5597, -6110, -2580, 4311, -1196, -2108, 3444, -2234, -5317, 4174, 2612, -5945, 704, 4227, -5747, -3480, 7532, -1098, -9139, 2895, 5918, -5887, -3409, 4641, -1925, -3702, 3882, 118, -4693, 2494, 2397, -5384, 703, 5477, -3985, -3484, 7128, 826, -6853, 3835, 6576, -4850, -2754, 6087, 703, -2319, 4671, 417, -5299, 4042, 5989, -3899, -500, 5601, -2120, -2492, 8081, 2098, -7734, 2240, 8311, -1785, -2825, 4768, 55, -2089, 5213, 1817, -4634, 3491, 5893, -3704, -877]
990h77P148q060j842J0451m205j0327R416O472j0984j435Q865l589l868O112k730
1005E47n844P878L330j0075Q50Q432n834l392R564l267r847Q271P314j0409k915
1020e397Q774k634l723N863k326o301O667M470r983P08R180n861n251R226n16
1035B896r990N691P500r083l345R377j816n260N168n00n664N419M193r104L54
1050d164Q959n155o200R395O84r816M740P704q931l250Q855j565o041N907R09
1065B031o940L911N607p835j320R001m117o140Q795J541j0493L126Q460o015l687
1080d075Q007k464n408O286J767q202L503P214p902k634R482k542q126P035M420
1095F361r629R45Q925m730n826O910J82m813L776J156o380L956O211q526l349
$$ y = [-877, 6271, -1789, -3631, 6820, 2615, -7712, 1704, 8176, -2808, -4243, 4622, 1033, -2835, 3277, 547, -5297, 2581, 5911, -4164, -3314, 5118, -716, -4108, 5456, 2189, -7658, 613, 7927, -2482, -5397, 3377, 743, -2980, 2883, 557, -5744, 923, 5393, -4590, -3882, 5298, -563, -5814, 3412, 2896, -7094, -1403, 6097, -2986, -6331, 3046, 1230, -4030, 1138, 638, -5026, 393, 4586, -4518, -4164, 4795, -360, -6560, 2835, 3519, -6297, -1557, 6147, -2784, -6034, 2821, 1256, -4785, 1122, 2031, -4909, -998, 4609, -3226, -4546, 4455, 338, -5802, 2993, 4534, -5959, -2833, 5627, -388, -4075, 3932, 1468, -3940, 2346, 4113, -4089, -586, 6628, -1274, -3908, 5574, 3032, -5094, 1941, 6361, -3268, -2323, 6602, 1872, -3954, 2956, 3138, -1675, 2101, 3257, -3123, 833, 7044, -1482, -4831]
1110d831J0189j934p939O553L905r567M06J0391n794o394P165J391o172L608K603
1125C580o523J548O298o184l088R282j971r368O363N901q786k91Q484m743o459
1140e957Q454J614q452L003N282o185m91P493m739n606P984J306q609L668N867
1155D632p128j848P995l310n007N426O45o431M842M104q333J21Q559m570o230
1170f533Q458J146r205L598Q218p492m326Q295o30o045M867K140o421K728M931
1185C729o507j260Q897m619p001Q096L523j0082K411Q223o519n398R465J033q552
1200d561K813M851m975N23M625m671j559O371k375n184N999J876p735L081P088
1215F167o961l829R005j084p528N569L833q118P60P964n336m266P544q47p013
$$ y = [-4831, 5358, 3424, -4515, 2038, 5943, -3624, -3218, 7173, 1379, -5015, 2150, 3541, -2631, 977, 3580, -2943, -1395, 4903, -1281, -4369, 4913, 2942, -6426, -63, 5838, -2948, -3239, 5245, 502, -5957, 2497, 4111, -4341, -1338, 3944, -2241, -2732, 4761, 22, -5584, 2400, 3706, -4903, -1235, 4632, -2496, -4344, 3651, 341, -4666, 760, 1405, -5026, -184, 3920, -4413, -4292, 4267, -303, -6533, 1925, 3071, -6134, -2536, 5682, -1810, -6136, 2159, 1529, -4516, 351, 2491, -3930, -1202, 3729, -2778, -4038, 4859, 240, -6761, 1335, 4858, -5224, -2813, 5410, -1109, -6507, 2958, 3991, -4561, -1748, 3103, -1872, -1349, 3276, -1395, -2954, 3417, 1042, -4142, 1857, 3733, -4002, -921, 6167, -794, -4623, 4382, 3298, -4230, 1339, 5172, -2946, -2186, 5778, 442, -3824, 3720, 2873, -4140]
1230d140N290M641q729m0Q389m319n029O762O72o734L889M168p384O40P390n111
1246C55n363P758J617q549L415N893p315j206Q204k764o682M722L205m866J283
1261b93K557n032J663N919n708l835P901r5q151N003N564q700j357J0157l630
1276A963q548P180M228p794J50O283m282k172N624k638m713O458J071p839K861
1291b168O108o272k321P879k347p170O119M515p655j27O080l912k529O201j715
1306F86n947N306K991o815J527N874n363k733P127j032o421N375K404o185J276
1321a930O031n555k218P562k241p473O842M544r298N73Q477m900n254P480R50
1336C590p666L220N563n619j619N154k055k920N958j871o392N444M944p872r80
$$ y = [-4140, 1150, 5791, -2938, -2978, 5411, 1092, -3937, 2825, 3497, -3237, 652, 4820, -2564, -1924, 5466, 355, -5008, 2750, 4367, -4182, -767, 5126, -2189, -3395, 4809, 2045, -4637, 85, 3290, -1576, -293, 2264, -2768, -1105, 4814, -894, -4729, 3172, 3077, -5074, -71, 5493, -3207, -4564, 5593, 1963, -6585, 595, 4823, -2971, -2821, 3462, -820, -2992, 2632, -6, -4719, 1739, 2810, -5029, -2168, 3940, -2332, -4653, 3226, 879, -6291, -172, 4343, -3312, -3439, 2641, -1271, -3800, 2401, 686, -5261, 45, 3036, -3779, -2252, 3622, -1741, -4474, 2653, 1621, -4800, 575, 2979, -3206, -1930, 4101, -1454, -3672, 3890, 1649, -5824, 1018, 5562, -3736, -3163, 5314, 414, -4840, 2640, 3590, -4076, -856, 4707, -912, -2531, 2623, 568, -2352, 3606, 1735, -4657, 787, 5731, -2141, -3121]
1351c121P909l938n240P209J266p839K428N805m588k166N343k035k938M813r50
1366A958n344M943L200p094m22Q295m268n249O869J130p570K927O308o584k566
1381c467P413k402n360N884J027o858L030N614o118k666P126j533n739N261K365
1396C577p048J088O379m275k690N353j926m228N220J485o904K147O180n570k332
1411c544O479j275o264M666L333o371M78N848m131l204N751j119m501M907J617
1426B670p420K479O751n971m090P906P5p303M039M409o483n67P068l360m352M799
1442F50R79m527L044K702o085J067O195m407m136O983R03p537L283N023n695r94
1458b552N926l009l772N767O59o191K541L616m679M38N434m409m375P506R12p372
$$ y = [-3121, 4788, 850, -4390, 2819, 4085, -3754, -1326, 4479, -109, -2275, 3068, 1033, -1905, 2908, 1958, -3386, 1557, 4757, -2337, -2759, 5536, 1268, -3981, 2888, 4018, -3552, -625, 5683, -901, -3467, 3946, 1544, -3816, 2068, 3095, -3763, -733, 4881, -1237, -3903, 3223, 1690, -4049, 1212, 3577, -3471, -2383, 3996, -279, -2969, 2384, 458, -3770, 1450, 2935, -3969, -1822, 4358, -1212, -3544, 2935, 1660, -4604, 62, 3395, -2976, -2498, 3350, -781, -3985, 1766, 647, -3854, 1053, 2670, -4750, -2271, 4480, -1491, -5581, 2325, 2400, -4903, -864, 3545, -2938, -3505, 3563, 203, -4149, 650, 1629, -2898, 146, 2848, -3237, -2170, 4025, -382, -4518, 2465, 3368, -4169, -886, 4137, -1558, -2552, 3374, 365, -3407, 2360, 3019, -3172, -631, 2985, -1694, -1256, 4178, -231, -4606, 2900, 3812, -3560]
1474c560K884N147n253j566N953k517n032N777J676o761K666M987n570j641O442
1489C632k486m867N753J658o858J749O394m721l108N539j080m015M410J010n691
1504b681K450N280n433k167O516k091n579N435K871p043N38O057l964l192N588
1519B585l03n489L344K624n037J679M087n186k049P080j349o198M463L314o387
1534b822J84O431l684l937N026Q38n149K701L210n406J80N429l574k841N528p81
1550A333n933M699L770o833j073O682k624l600M594M98n103L295L586o166k92
1565c167O465l347m032N757K04n875L747M084n936j554O914k206m423L485J865
1580A981m467K470L041n431r8O295l301m828N502J117n605K647M772n640k352
$$ y = [-3560, -676, 4471, -782, -2348, 3605, 1088, -3944, 1833, 3509, -3252, -586, 4401, -1169, -2810, 3632, 1146, -3721, 2032, 3690, -3168, -1419, 4975, 254, -2854, 2685, 1605, -2410, 2000, 3010, -2681, -231, 5049, -384, -2551, 3965, 1874, -3705, 1730, 4601, -2442, -1904, 4153, 189, -3003, 2585, 2282, -3207, 137, 2761, -2276, -597, 3490, -1696, -3745, 3335, 1986, -4212, 251, 3565, -2822, -2638, 3793, 109, -3828, 1198, 2036, -3113, -412, 2798, -2608, -2428, 3001, -573, -3414, 2114, 1333, -4600, 99, 3869, -2964, -4037, 2645, 21, -3579, 1015, 1513, -3590, -295, 3291, -2875, -3167, 3298, -49, -4081, 1676, 1880, -3995, -248, 3836, -2100, -3654, 3260, 1054, -3369, 116, 1981, -2486, -16, 3025, -2406, -2504, 3791, 490, -4338, 1164, 2281, -3324, -677, 4095, -1545, -3897]
1595c897O824p30n335L539J879m229J530L285m141p05N759k511m755N059J889
1610C461o256J860N144m673k732N786n11m771L171K408m639J098M156m388j552
1625b438N600j474n030M675K470n641R78N001m052l015N504N89n370K673K649
1640C119m158O81M210m247k844O245j98o047L553L230n632K70N734l611m408N218
1656A115J208m980J548L518m147O2M417l631k397N410j46o031L628L670m812j316
1672b884N349k269m086N407J130n686J425M071l747r12M173k643l050N302O00
1687B180n737K396M231n081j070N861k152m452M090J977n080J556L975l810j560
1702b676M892j853l197M020J210n471K114M193m320k259N785j017m780L414K769
$$ y = [-3897, 2927, 2197, -3138, 401, 2280, -1949, -419, 2866, -1275, -1980, 3779, 1268, -3487, 1572, 3461, -2795, -935, 4209, -464, -3196, 2590, 2079, -2692, 479, 2887, -1752, -654, 3502, -886, -2438, 3162, 1688, -3342, 1333, 3803, -1838, -860, 4141, 89, -2926, 2578, 3167, -2203, 470, 3119, -1039, -358, 3852, -395, -3239, 3006, 2808, -3239, 314, 3544, -2088, -1818, 3916, 305, -4103, 1115, 2323, -2657, -1109, 2409, -1738, -1676, 2741, -890, -3287, 2123, 1977, -4054, -426, 3244, -1568, -2884, 2465, 196, -3890, 1517, 2647, -3039, -1614, 2457, -1290, -2202, 1971, -672, -3722, 1580, 2180, -3557, -1161, 3070, -2011, -3081, 2780, 628, -3824, 266, 2243, -2837, -1281, 2694, -1116, -2676, 2216, 363, -2834, 1186, 2396, -3075, -961, 3232, -1088, -3347, 2438, 1421, -3359, 55, 2824]
1717B824m803K82M483l783j072M307j593m087M430K040n594J121M689l730j958
1732b444N232q92n073L777L150n087j31M369k915j766M484j196m652L902K909
1747C667n374j92N433k968l549M813K64m530K808K752m700K83M514k339k856L768
1763A794n85l819L728K902o099o7N535k213l821M155Q72m397J938K947l346r21
1779a397L960k214k709M193j70m623K967K927m794n64N335k562m258M943J717
1794B751n507J278M299l593j643M247j464l421L615J416m528J686L463m390q84
1809b675M728j121m101L466J567m640J207L833l432j556M271r99l714M115Q14
1824A763n135J835M244l666k465N063o44m076L153K078m171P57L607l011j587
$$ y = [2824, -1979, -1697, 2786, -997, -2069, 2238, 645, -3442, 988, 3028, -2566, -1445, 3244, -486, -2444, 2788, 1896, -3177, 600, 3750, -1337, -1468, 2901, -14, -1780, 2704, 1508, -3144, 758, 3667, -1707, -1899, 3534, 566, -2983, 1830, 2094, -2436, 372, 3124, -1576, -1293, 3221, 882, -1974, 1794, 1209, -2610, 1118, 4020, -2079, -2146, 3389, 1176, -2645, 1510, 2382, -2015, -77, 2870, -476, -1397, 2563, 349, -2360, 1833, 1663, -2960, 7, 2934, -1860, -2424, 2911, 349, -3909, 1034, 2751, -2756, -1478, 2821, -772, -2415, 1832, 368, -3053, 562, 1978, -2550, -864, 2599, -1791, -2675, 2053, 932, -3169, 297, 1864, -2776, -1569, 2264, -1168, -2724, 1547, 548, -3166, 949, 1763, -3372, -1537, 2707, -959, -3424, 1639, 995, -3081, 72, 2150, -2021, -1264, 2343, -668, -2255]
1839b255M054j111l566L542J967n121J265M487m207k695N734J51n529K243L765
1854B724l645o93L492j562k605L457K29l173K446J566l747N92M062l065k356M666
1870B388k31m884K778L435m162j394M537j460l152L855P4l822J983K967l816p06
1886a610M378k174k871L843O53m378J908L249l605j259M090j480l033L662O61
1901B034m134J905L243m027j019M499j000l908K768J875l477N45K880l053r96
1916a865L751j211k605K749O80l895K058K796m441q30N534j776m486L852K280
1931B591m517j26M048k004k196L042M71l538K297J659l584P17L181l340r68L953
1947A686j061l909L269K687m762j30M138j674k970L313O54l319J750K235l565
$$ y = [-2255, 1799, 688, -2878, 664, 2631, -2490, -1225, 3262, -945, -3640, 2094, 2245, -3284, -1041, 2724, -921, -1614, 1878, 316, -2289, 1168, 1397, -1776, 670, 2236, -1511, -919, 3143, 78, -2278, 2388, 2157, -2727, 51, 3486, -676, -2070, 2467, 1007, -2145, 1710, 1784, -2038, -55, 2912, -904, -1610, 2768, 594, -2277, 1566, 2219, -2159, -251, 2998, -607, -1866, 2224, 744, -2289, 1373, 2034, -2100, -195, 3048, -979, -1998, 2501, 1501, -2407, 361, 2236, -1241, -696, 2184, -869, -1865, 1886, 675, -1930, 819, 1499, -2396, -338, 2458, -1983, -2813, 2721, 945, -3541, 311, 2591, -1926, -2052, 1996, -8, -2204, 838, 1309, -2229, 68, 1727, -1857, -1140, 2041, -1299, -2267, 1686, 625, -3284, -15, 2672, -2090, -2220, 1918, 244, -2726, 587, 1241, -2078, -328, 1907, -1658]
1962a658M26L252k321k181L576J64l514K397J963l730L09L672k286k494L555L83
1978A513l853K253K611m398J55M381k044l112L440J244m315J210L346k931j330
1993a830L520j016k330K967J84l062J513K528l579L19L807k783k482L999J021
2008B776m863J378L419k422j871L315l21l274K606J135l276R52K775l198k27L595
2024B499j819k961L469J160m355J208M088l371k178L964Ml553K344J815l460J39
2040a007L350k266j672L168m93l109K461J554l432Q3L096k180j551L241n49l110
2056b416K300J807l248J71L319k415k018L861p0l903K261K419l606k11L284j413
2072A22k609L103M71k746J476J827l433L03L163k117j958L351J94l744K151K611
$$ y = [-1658, -1232, 2020, -301, -2482, 1094, 1258, -2256, 141, 2104, -1626, -1317, 2355, 69, -2425, 1130, 1513, -2340, -87, 2524, -1874, -1719, 2662, 618, -2494, 946, 2190, -2125, -915, 2431, -500, -1830, 1690, 674, -1656, 1311, 1495, -1567, -54, 2474, -1105, -786, 3021, 238, -2244, 1755, 2776, -2087, -709, 2710, 288, -1583, 1732, 1411, -1863, 743, 1878, -1398, -446, 2329, -869, -1096, 2499, 680, -2281, 1188, 2348, -2007, -799, 3289, -82, -2260, 1704, 1708, -1845, 499, 2314, -1146, -1007, 2343, 77, -1595, 1573, 1080, -2029, 432, 1986, -1446, -1363, 1733, -447, -1998, 1243, 694, -2416, -116, 1691, -1557, -1386, 1933, -482, -2500, 1361, 1291, -2612, -351, 2068, -1538, -1749, 1535, 122, -2487, 616, 1087, -1659, -183, 1644, -1789, -1486, 1677, -440, -2398, 953, 1147, -2597, -446, 2165]
2088B165l400r96M166j597k764K460J160l044J445K196k546m52K748j662j943
2103b064L438L07l842J837K503l206m27L600j440l226L258J578l788O43K494j988
2119c23j268L419r83l007K595J208l078R83K741k574j196L317n73k857K503J463
2135B370l246N17K544k002j478L207n75l055K514J425l514M46L239k068j933K777
2151A168J79l037J967J642k869L36K293j755j335K870o88l020K659J860l624K02
2167a152L386k241j989L070Q28l529J141K264k770k35K605j297j759K962k66l088
2183b070J821J824l007j57L472j808k720L364P61l897J876K313k913o01K936j079
2199A15k035K796n3k874J594K025k488o71L117j310k510K893Q41l242J092K198
$$ y = [2165, -1235, -2231, 1935, 338, -2426, 34, 1194, -1850, -405, 1791, -755, -1207, 1541, -121, -2064, 1374, 1681, -2161, -324, 2179, -1027, -1454, 2146, 706, -2520, 738, 2316, -1472, -829, 1665, -323, -1591, 1828, 845, -2162, 433, 1641, -1437, -454, 2287, -287, -1483, 1834, 1261, -1596, 907, 2370, -876, -359, 2185, 183, -1295, 1912, 1337, -1718, 796, 2221, -1293, -847, 2392, 324, -1609, 1168, 1347, -1690, 277, 1919, -950, -614, 1679, -76, -1411, 1459, 771, -2249, 410, 2270, -1354, -1152, 2234, -7, -1996, 1074, 1902, -1627, -486, 1778, -992, -1227, 1378, 81, -1678, 1284, 1018, -2070, -249, 1575, -1432, -1589, 1883, 75, -2645, 719, 1480, -2417, -541, 1772, -1141, -1742, 1194, 115, -1920, 876, 823, -2051, -457, 1568, -920, -1591, 1526, 216, -2294, 599, 1440, -1802, -710, 1488]
2215A488j948j139K725j187j964K530P04l340J076K986k764j364L770o19k701
2230a747K188Q72k282J44K578k308p93K744m11k524K266O85k667P99L031l136
2246e61j674L802j72l421J833K051l049J99K637j525j432K339j52k283J843J377
2262A812k927M90K828j999j854L232J11l261J933K002k766n28K842j090j745K087
2278A167K5k621J862J595k853P6K594j760j800K634N35l097J391J788k015n96
2294a075K551r49k042K511k8k233J307J427k443k09L067j448k156K215J111k867
2310a261M47K665k480q51K584q64k181K496N37k646R54K032k171r20K760p92k968
2327b659K868J292l291O91K344j697p42K031n12k067J685J226k762Q49K205k012
$$ y = [1488, -460, -1599, 1126, -61, -2025, 505, 1209, -2131, -1055, 1931, -833, -2197, 1573, 954, -1747, 441, 1313, -969, -825, 1753, -555, -1348, 1396, 985, -1539, 727, 1412, -1255, -456, 2575, -561, -2235, 1567, 1395, -2026, -193, 1858, -1191, -992, 1645, 120, -1312, 1027, 875, -1408, 435, 1812, -1115, -625, 2203, 204, -1650, 1582, 1693, -1568, 365, 2367, -399, -927, 1915, 825, -920, 1167, 1192, -1429, 433, 2028, -825, -749, 1845, 85, -1715, 919, 1454, -1643, -252, 1536, -479, -1075, 1476, 527, -1515, 996, 968, -1265, 42, 1469, -974, -1183, 1884, 436, -1720, 495, 1606, -1261, -814, 1851, -629, -1480, 1104, 240, -1941, 555, 1092, -1554, -600, 1432, -739, -1659, 1101, 309, -2659, 209, 1501, -1790, -1099, 1245, -452, -1194, 837, 325, -1742, -57, 1169, -1593, -744, 1461, -551]
2343e51j251L281q69k781K432J126k987L81K806k179j359K674q2k455J708J557
2359A451l010N45K725j875j688L093l79k565J975J514k657q6K354j221j447K141
2375H70M70k634J242J648k714L69K038j332j664K976J60l321J565K398k541m76
2391i46K591j738j144K443K07k567J325J798k572l49K850j461k065K679P63l448
2407a634J373K375k186r26K197m09k058J524Q32k225J009J993k263j091K905q94
2423E22j747K181L15k817J078K433k475q92K724n58k213J470R96k051J59K201
2439A326j534j049K557p79k254K111J408k993J85K796k358j307K960j72k946J856
2455a93J477k129J1K200j516j209K329m06k414J356J864k538k49K841j432j376
$$ y = [-551, -1802, 1479, 610, -2171, 261, 1387, -1600, -1219, 1587, -592, -1951, 723, 641, -1814, -106, 1451, -1559, -1014, 1711, -164, -1852, 1241, 862, -1703, 272, 1786, -871, -957, 1397, 176, -1271, 870, 1340, -1294, -52, 1596, -1118, -749, 1289, -43, -1707, 1269, 1429, -1892, -327, 2071, -470, -946, 1645, -93, -1237, 1206, 1413, -1154, 171, 1969, -603, -952, 1898, 437, -1628, 1051, 1814, -1634, -261, 2114, -72, -998, 1199, 790, -1268, 256, 1088, -1137, -128, 1865, -398, -1489, 1416, 522, -1225, 956, 1271, -1546, -468, 1965, -510, -1402, 1322, 764, -1449, 21, 1017, -1034, -875, 1326, -208, -1257, 1300, 521, -1733, 378, 1786, -1207, -1022, 1774, -584, -1891, 1069, 897, -2049, -193, 1284, -845, -834, 1366, -150, -1359, 970, 564, -1850, -494, 1370, -1168, -1417, 1424, -8, -1384]
2471a384K072M9j965R29J487k020j07K447j911j046K408l25k831K116J820k754
2487a015n00K622o27k009K031N74k277Q60J635j962k27K517j695j575K754n5k780
2504a729J863K206l170o34L322o86k787J897J387k244K19J601j437o66K269q19
2520E92j869J925L73k090O68J762j814n95K655q18j926K076N87k243L81K127j838
2537d7q67K039l01k423K207J352k948L21K557j545j435K207n1k471J847R57k082
2554f83j10K320j786p71K158p5k553J636J511k573j09K809j709j712K321M16k225
2571a135Q70J010j238j03J451r78r48J554j96k006J713R72k365K12K715j643j652
2588a767K466N42l119J150K384k327p01K292j091j404K180K75k414Q78J951k206
$$ y = [-1384, 688, 737, -1228, -299, 1188, -832, -939, 1508, -403, -1449, 959, 634, -2197, -81, 1739, -1015, -1515, 1107, 480, -1529, 502, 1076, -1201, -341, 1294, -668, -895, 1622, -73, -1648, 1106, 1051, -1729, 134, 2340, -830, -1464, 1858, 1172, -1615, 282, 1669, -575, -356, 1245, -192, -858, 1411, 592, -1277, 648, 1021, -1069, -401, 1361, -453, -1048, 1607, 789, -1137, 939, 1526, -717, -336, 1791, -47, -914, 1125, 824, -1599, 608, 1960, -988, -667, 1890, 345, -1090, 1117, 1066, -1405, 442, 1399, -683, -793, 1527, -259, -1030, 1128, 1053, -1500, 136, 1647, -926, -1035, 1774, 65, -1647, 674, 1090, -1135, -265, 745, -493, -596, 855, -123, -1071, 483, 287, -1719, -6, 966, -1399, -1187, 1528, -115, -1767, 699, 1241, -1878, -728, 1656, -671, -1372, 920, -171, -1575, 605, 880, -1534, -656, 1295, -911]
2604i11m58K450r58k135K338P27k571R28J678j815m57K288r36j851K180O23k477
2621a357O95J993j779o18K016l50j951J744O38k287J096J608j872k18K215j145
2637D28j692K337L91l022J137K392k441q91K653j81k549J411J724k023l24J963
2653A313j272j071K123n21j657J473R38k243O11J933j877r26K386k14k772J714
2669f2J902k541j60K085j016j325J941J65j850J011J212k449M72K285j887j314
2685a531K378N6k605J830J569k630J08K276j126j588J887M95k475J005J845k072
2701e78k88J703p14j532J639Q45k361Q67J305j679l57K222j224j230J719L33k449
2718a779J320J558j900n79K723q91k013J647R69k606O74K022j609q73K028n15
$$ y = [-911, -1369, 1081, 123, -2012, 326, 1053, -1518, -590, 1088, -727, -1184, 1104, 168, -1683, 497, 1120, -1357, -662, 1331, -448, -1066, 950, 600, -1351, 393, 1031, -1256, -160, 1448, -424, -642, 1573, 428, -1264, 1073, 1464, -1558, -421, 1971, -470, -1361, 1292, 1111, -1438, -27, 1697, -326, -650, 1313, 41, -1030, 1093, 572, -1085, 388, 1326, -917, -306, 1627, -250, -1176, 1210, 996, -1776, -62, 1840, -701, -861, 1224, 208, -1117, 824, 989, -861, 150, 1362, -1087, -615, 1670, -217, -1531, 847, 903, -1702, 128, 1697, -933, -825, 1451, 325, -1263, 624, 1119, -1356, -351, 1494, -578, -866, 837, 123, -1409, 230, 1075, -1286, -419, 886, -793, -1150, 1072, -152, -1382, 337, 670, -1779, -459, 1099, -801, -1380, 1343, 452, -1561, 86, 1055, -1551, -877, 1145, -464, -1337, 691, 176]
2734A76j740J964N21k187J063J391j995o57K771q68k162K055Q70k282J9K644j417
2751A66j817K444k7k060J560P94j827K94J791j469j168K176m19j676J341J230
2767A333k303O01J835j922j048K559m9k126J701P41j864j43K140j665j083K297
2783A004O5k089J052J492j999l00K024j101j145J965Lk038J440R55k038p4K248
2800A464q50j796K230L11k230P48J797j936o80K120o60j415J466K29j624M56J645
2817A275j842k79J992j208j444K041N95k234P61J695j882n37J999m56k082K052
2833D46N75k196Q47J524j655o36K031l66k093J923M70k029O84J418j594q32K455
2850I72q45j602J565R47k330O08J872j523r10J805j90j663J612P92k146J06J938
$$ y = [176, -1564, 400, 921, -1266, -203, 1188, -807, -1464, 1307, 439, -1723, 332, 1202, -1080, -1061, 1583, 166, -1651, 793, 766, -1294, 266, 1060, -767, -473, 1318, -151, -1319, 857, 438, -1238, 103, 1333, -970, -369, 1466, -456, -1504, 1055, 1006, -1120, 581, 1322, -542, -685, 1455, -210, -1293, 1004, 1069, -1020, 32, 1524, -475, -775, 1249, 148, -997, 968, 971, -1067, 373, 1328, -710, -784, 1464, 614, -1182, 1048, 1359, -871, -123, 1674, -262, -942, 1178, 518, -897, 569, 798, -826, -370, 1275, -567, -846, 1146, -62, -1506, 535, 1130, -1104, -343, 1352, -530, -1067, 932, 476, -1606, 446, 1021, -1175, -328, 1196, -459, -1095, 936, 570, -1523, 400, 870, -1159, -475, 943, -651, -1483, 972, 127, -1475, 90, 1037, -1293, -685, 1187, -336, -1246, 559, 369, -1294, 318, 1110, -1036, -930, 1008]
2867A008p48j557J999l46j743J527J043k405K44K077j422j163K483n78j985J749
2883A83J155k033m8K137j129j675J821L79j617J275L32j467L23J745j289j076
2899i84J634L11j999J182J297k229J57J802j002j662K123L26j758K67J910j658
2915b83k55J690j008j307J821M22k333J308J492j940n71K326q01j546J800L81
2931A196k155P19J217r94n99J973j139j137J496O08k098N74J681j492q92J917
2947H75p3j758J141P44j797L82J715j555q78J834j42j602J281N69j988N51J945
2964A244j585q69J594J30j379P02J123j686L26J520j552n63J715k88j782J209
2980a41J269k129J27K087j671q61J839L96k190J154J351k203j09J856j114q41
$$ y = [1008, 260, -1297, 702, 356, -1387, 140, 1183, -1222, -978, 1099, -323, -1486, 997, 419, -1566, 183, 1338, -695, -743, 1394, 265, -1410, 411, 790, -827, 448, 780, -687, -364, 1381, 92, -984, 650, 961, -1038, 144, 1441, -788, -631, 1171, 169, -1493, 630, 956, -802, -535, 1375, -283, -538, 1152, 144, -1163, 658, 1080, -1253, 55, 1547, -393, -964, 1362, 561, -985, 815, 1196, -959, -240, 977, -17, -616, 1357, 218, -919, 577, 1185, -913, -339, 1342, -150, -1042, 875, 802, -956, 185, 929, -868, -486, 1229, -326, -1204, 630, 488, -1114, 167, 736, -1252, -701, 1244, -341, -1210, 384, 514, -865, -163, 960, -726, -400, 1120, -432, -995, 720, 432, -1350, -141, 1128, -1001, -874, 1213, -458, -1319, 520, 916, -1274, -120, 1231, -972, -1081, 775, -339, -1180]
2996a180J810J0j744P15J359j495j67J457r80r68J701J27j567P21J233j891l26
3013a185K280j052j196J553L84j621P34J489j897m66K173j093j190J482O94j881
3029g92N32J374j334o36K173j164j162J562L44j621K73J672j582m92J878n17j692
3046a184J501R75j985L59J225j148p73J816k72j391J241O37j714M77J749j634
3062a21p26J866m38j488J260P79k004K17J705j009r41J652n45j140J093J292k066
3079f14q0J594j132p49J794k76j749J305P39j602M30J386j165r39J751j98j744
3096a249J055J334k073K06J861j253j178J933l01j620J063J298j771j95J865j431
3112d56p92K050j77j772Q60J159j801K3K115p84j707J524J56j431P25J331j224
$$ y = [-1180, 630, 640, -1104, -389, 970, -525, -692, 765, -215, -1183, 518, 645, -922, -201, 1032, -859, -1185, 1095, 43, -1153, 400, 784, -837, -103, 1386, -511, -977, 1196, 103, -1087, 395, 1089, -792, -260, 1114, -220, -856, 1317, 153, -1009, 553, 897, -724, -451, 1221, -361, -853, 1025, 508, -1184, 317, 1292, -693, -334, 891, -257, -1030, 786, 514, -877, 364, 1001, -713, -236, 1513, -121, -847, 1019, 581, -907, 353, 1132, -872, -655, 1050, 41, -900, 752, 207, -933, 160, 1452, -614, -694, 900, -232, -981, 813, 537, -1212, 93, 832, -770, -340, 1046, -119, -1058, 693, 495, -1249, -194, 1140, -933, -727, 1134, -119, -1297, 636, 335, -1285, -222, 1076, -695, -890, 975, -456, -1248, 802, 625, -1147, -287, 872, -929, -906, 1209, 425, -1282, 242, 398, -1033, -308, 1023, -201]
3129b01o84J677m93j412J541J56j511Q03J326j719n11K048p17j518J586M58j930
3146a101J098J361j580p42J898p77j285J376Q41j601J79J274j494j43J726n94
3162D36j490J483O66j634M86J347j542p38J989k30j579J112R49k036M29J744j217
3179A75q22J582m32j341R12J045j438M5J453j316o80J713o44j170J086Q86j837
3196g83N56J279j135j045K039j73j638N82J579j714k66J380o49q78J294L66j832
3213a038J047R99j417l25J883j338q86J441P2j679Q56J248j364l35J557p71r94
3230a044J394L27j667O35R38j197l07J720q11j098J681L6j730P93J314j704m36
3247a156J608l03j050J004N17j512M11J301j176n09J507m26j334J259O38j448
$$ y = [-201, -885, 792, 299, -1113, 428, 584, -927, -124, 1202, -517, -1028, 1020, 303, -1215, 371, 829, -1101, -3, 1358, -222, -964, 934, 157, -1128, 248, 1089, -512, -333, 941, -553, -696, 1030, 436, -1054, 429, 1095, -539, -53, 1294, -248, -986, 1003, 773, -806, 306, 1255, -781, -352, 1392, 175, -647, 935, 503, -838, 74, 1119, -319, -274, 1179, -137, -817, 896, 252, -918, 168, 1054, -783, -227, 1052, -83, -1128, 911, 738, -900, -318, 1261, -453, -719, 661, 12, -866, 428, 794, -1038, 9, 1008, -409, -734, 1149, -189, -1075, 366, 438, -1241, -385, 863, -501, -836, 721, -50, -1044, 350, 677, -990, -355, 583, -614, -921, 799, -12, -1110, 571, 607, -1123, -330, 984, -720, -1156, 452, 149, -901, 103, 620, -892, -481, 820, -356, -865, 642, 216, -1118, 141, 779, -669]
3263f69l6J668j187o27J369j34j525J157R57j541L85J161j302o99J756m29j362
3280a058R85J011j619M26J591r96r38R77l2j016J072N87j572M21J206r41q13J365
3298F56K3j759J071Q07j002l46J483n01j230J459J5j426R59O55j198k76J729j181
3316f2o52J457P5j691R80J076j469j66J574o16j159J261J74j233J27J289j720
3333g55L91J082m56j297J352M14j357O92Q56j350o69J939p05r78J029K65j497
3350a044P02J343j640k09J783n98j426J434O17j940P72J404j354n96J301n05q73
3367h29N68J133j444L20O53p84k77J286k37j387R45Q10j563J39J725j539m68J696
3385G47m73j190P04P66j154J59J429j216n84J291J94j449J021M24j244K53J347
$$ y = [-669, -705, 963, -224, -851, 518, 384, -1141, 16, 973, -568, -183, 978, -324, -1023, 733, 304, -1058, -73, 938, -681, -255, 1336, 340, -598, 379, 347, -669, 403, 990, -582, -161, 1045, 104, -709, 656, 679, -1080, -9, 798, -204, -550, 933, 432, -798, 661, 676, -750, 209, 864, -334, -610, 1119, -62, -714, 743, 818, -873, 107, 1183, -286, -452, 1122, 506, -653, 608, 782, -451, -324, 965, -755, -364, 718, 262, -1035, 317, 731, -626, 66, 922, -428, -1097, 842, 137, -841, 188, 453, -1044, -342, 1001, -639, -848, 935, 337, -1089, 345, 962, -978, -206, 1198, -156, -752, 549, 44, -829, -261, 872, -572, -252, 401, -383, -660, 626, 389, -998, -53, 757, -806, -667, 1058, -481, -949, 747, 274, -916, -212, 554, -600, -441, 988, -228, -812, 479, 673, -776, 245, 669, -575, -322, 1025]
3402A025j016j152J784K74j643Q80O34j261j5J430m74j222J352p9j371R00R63
3419A009j503n2J471o71j065J210L79j451O95P53r59r1J079o13o71J060L96j600
3437f24J049M75j068l29J335j60j587J258N53j404L62P34r04j42R92l86q00J241
3455E95J02j440M79J415j595l92J559m89j065J223M55j387L19J361j319m15J083
3472D89l71j197J155M94j510O59J371j378p11J571j51j263R92N20j391K00J199
3489F78j151m75J564k70j519J117N28j221J65J085p50p72J434j14j023O17O42
3506E35j278J83J485j079p21J170K13j789J019R11j167k00J487q43r10J260L21
3523E97j250N18R89j600L35J102o55j018J246L22j702J100R46j088l45J400r29
$$ y = [1025, 9, -1143, 641, 915, -728, 152, 786, -475, -490, 940, 466, -756, 596, 517, -854, 46, 1009, -494, -546, 925, 254, -811, 399, 778, -673, 22, 775, -184, -275, 804, 191, -480, 580, 976, -624, 425, 900, -168, -497, 838, 678, -909, 349, 902, -502, -140, 594, -310, -452, 540, 154, -646, 595, 697, -743, -264, 1151, -444, -836, 723, 234, -831, 392, 847, -540, -221, 1140, -179, -594, 489, 118, -1079, 76, 570, -940, -281, 1090, -288, -999, 572, 421, -842, 150, 670, -721, -521, 678, -473, -948, 616, 346, -1173, -56, 472, -749, -584, 501, -249, -1021, 413, 299, -724, -107, 535, -743, -560, 925, -154, -875, 295, 508, -1281, -262, 649, -518, -718, 769, -74, -984, 276, 597, -653, -135, 854, -746, -411, 691, 36, -982, 264, 586, -1116, -16, 930, -158, -503, 897, -32]
3540c2o94J179J3p92M57N85j381L53J099m68q64J012M5q98L09P71r47l55J484
3559H76l85j369J297K94j344R08M03j035j06J333m45j317R93P16j220J85J192
3576I76n11j104J432k99j303J113J88r76J47R73q33n51J464m12j186J030L71j085
3594e66M75R26p72p34J236j55j163R51N13j290%J236r50n66J215k93q32Q47O40
3613G18j220Q2J442q43p49R45k21j136Q74P13j273j22J255p23m65J074K06j685
3631a128R04Q03j153j52J631q09q66J282k42r12M20O66o58k79Q63m33o17J163
3649D83m5r22N21N30j102O7J293p92j106J438L11j541P92Q30j259j04J055q2j046
3668f79R50L82j150N63R52j238k11R73J6j350Q98Q03j306J29R77p09l2O01k93
$$ y = [-32, -726, 453, 466, -326, 131, 716, -665, -312, 787, 319, -545, 467, 512, -386, -77, 694, -253, -608, 876, 491, -878, 419, 713, -631, 277, 680, -355, -461, 872, 427, -890, 103, 819, -401, -216, 976, 465, -639, 793, 494, -809, 304, 492, -484, -337, 636, -197, -748, 716, 304, -882, 148, 519, -566, -91, 835, 63, -671, 565, 410, -753, 198, 711, -579, -579, 657, -293, -859, 356, 63, -769, 78, 718, -502, -420, 1022, 179, -570, 375, 154, -982, -108, 605, -668, -790, 465, -258, -723, 351, 557, -1128, -224, 579, -574, -726, 905, 96, -770, 512, 270, -642, -222, 444, -214, -493, 370, -63, -680, 483, 438, -484, 37, 567, -535, -468, 825, 33, -1073, 365, 676, -865, -73, 757, -502, -606, 449, 367, -679, 271, 653, -497, 66, 1018, -220, -431, 542, 558, -792, 106, 909, -397, -268, 709, 0, -32, 569, 276]
3687B76o32Q68J28r86J83R57j114k29J283j69j206R56N72j457M33J023n58j101
3705g73J539n69r87R62M85j113N11P27o70r50J343n5j123R14N80j102j57J011
3723E73l53q14J096k28r95Q71O58j265n0J281q69r26J448l19o99L92Q22j199P4
3742e02O62l83k54Q69J69j297O00P45j169J28R50p15l60O78L69j170M10Q12j312
3761g70j69J460m49o45P35N00j133K61R19j129k11Q65j61p42Q70or01N72Q12o55
3781B3p46J144j47j006Q28L20r64J70J122j091j96J246o11o83P75J66q49L67P06
3800E74q62r8Q52p6j119Q76N42j134M79O78o75m59R61k13j001Q10P57j163J44
3819a27Q40l53q63P73K90q06L37M98q65j22J211n61j064J116M83j328M54Q31j033
$$ y = [276, -356, 512, 640, -346, -163, 794, -320, -549, 734, 565, -641, 315, 887, -570, -137, 886, 328, -773, 766, 197, -790, 172, 657, -456, 55, 782, 112, -838, 505, 450, -673, 241, 821, -281, -438, 573, 220, -594, 502, 274, -721, 150, 808, -457, -507, 774, -95, -1021, 427, 108, -591, -199, 623, -576, -502, 160, -223, -477, 392, 561, -736, -136, 609, -560, -432, 518, -197, -557, 121, 490, -680, -270, 542, -770, -939, 521, 72, -573, 162, 662, -471, -210, 709, -420, -631, 234, 73, -669, 201, 195, -706, -134, 678, 23, -723, 421, 274, -732, 96, 416, -548, -378, 744, -347, -543, 703, 92, -591, 184, 350, -499, -132, 574, -288, -386, 466, 390, -729, 147, 689, -445, 34, 712, 37, -422, 539, 326, -675, 135, 892, -271, -127, 713, 360, -503, 270, 560, -246, 91, 589, -276, -398, 813, 252, -812, 304, 787, -541, -87, 744, -289]
3838b89p3J126o96r32J079K23r45N12N23q31r2R65m50m24N27J02p89O01M63j071
3858d71m1J225p03o32R84J77j085l7P63m07n22J036k2j024Q80K02r79L62R26j002
3878c70k21J115l29q60N90O12j022J76N78m88k04P06j37q56J052K6r43K27J094
3897G46p35j063J456O0j197P80J55n83N0P70o93q7Q45k98p60P58R5p60M65O35
3917F39p57m10N16K42m42O18N20j132K14N90m57o63P59K59j343J135L22j119%
3936e09J019k18o58O54K98j253O79M97p68J03O12k69l28L93L54q66M77N13r14
3955a84l03J012l33r63J044J09q24J84R17q19l44J505o42o75P54N8o79J06N08
3974D31o24l71J232m30r87Q24M10j003K57O79o56j26Q02n06n96P67M38j053K87
$$ y = [-289, -362, 764, 68, -864, 215, 438, -507, 5, 528, -303, -395, 570, 120, -304, 223, 325, -464, 137, 600, -471, -512, 713, 10, -622, 362, 539, -546, -583, 180, -227, -749, 287, 265, -759, 121, 323, -656, -294, 632, -370, -591, 524, 195, -665, -75, 537, -485, -309, 269, -219, -423, 283, 146, -710, 342, 368, -575, -348, 746, 11, -1052, 404, 464, -733, 47, 202, -381, -331, 439, -254, -341, 504, 206, -554, 204, 299, -461, 4, 639, -118, -528, -12, 230, -212, 406, 926, -206, 8, 598, 141, -522, 237, 496, -847, 288, 610, -509, -509, 510, 292, -366, 288, 586, -667, 12, 509, -259, -156, 456, 187, -141, 252, 606, -260, 217, 730, -184, -487, 525, 192, -771, 273, 382, -442, -258, 659, -160, -504, 1001, 359, -316, 438, 496, -183, -77, 431, -193, -564, 668, 238, -749, 75, 485, -518, -261, 418, -238, -364, 438, -68, -664, 103, 541, -512, -225]
3993b25N81l53n06Q82R0j106P77M26j399O61P01o95l30P95J8q00O22J47r55L2
4013f37J186p08m39Q91J36j343R16N77j038K31O53m63n71P59J5p60O97J68r25
4032f55M39P77j043L3J003j37j263R04P73j390J30J029n95m51Q02k07n68L69O66
4051F16r92NP85k61l31O13j12q79P07L69p24L1L24l9l97M28M71j311Q54L35r25
4072d33J51J058p77o20Q28L80q27K27N33n71l44J008l49o21M97K76o96L05O97
4091G22j114K54Q53l42j093P62N54j003L02P62r08m05J058m08n62O56N04j282
4109f90J34J117p02m90J113l32p67O00O91j019P7P80n91n23R06N7j011O80O08
4128F38j312M33O68o56k61O10J81r80P12M70j069Q4J187o36o22Q10j05o52L62
$$ y = [-225, 356, 3, -503, 379, 469, -637, 140, 566, -833, -172, 529, -166, -496, 299, 317, -483, 139, 286, -669, -637, 549, -159, -598, 293, 429, -914, 2, 579, -459, -228, 425, -38, -609, 150, 165, -595, 102, 270, -655, -216, 561, -482, -449, 554, 417, -846, 58, 831, -559, -429, 600, 5, -446, 356, 149, -419, -50, 616, -376, -371, 414, 153, -178, 435, 323, -556, 151, 520, -204, -173, 151, 112, -285, 143, 614, -697, 157, 492, -433, -282, 776, -1, -621, 207, 587, -240, -13, 520, -51, -395, 613, 264, -357, 140, 416, -280, 25, 722, -392, -138, 715, 373, -720, 42, 596, -407, -105, 657, -251, -656, 402, -6, -568, 88, 592, -690, -556, 561, -141, -631, 482, 150, -617, -17, 674, -345, -268, 512, -79, -602, 304, 361, -650, 30, 638, -674, -241, 427, -229, -490, 120, 301, -679, 33, 503, -566, -482, 705, 69, -553, 257, 152, -500, -138]
4147a38P85j361M05O92n62o50J046K35q94M03O19r47j2O42j51q57R28n7o27M86
4167a5M89p79nO89n83l37Q46n0n90K48O23j025L8R04k54n63M91M14p19J93N55
4188E70n41k70R81q55m13O21M09p99k1P56l29n64J017k35p50L21M57n64%O09m82
4209h2k38P38Mq40O35L09o26mQ82q74j60Q42l88o01L91M29j113P23N40n59m29
4230d21N58m1o63M91O25o25j19Q05m15p87P65J15r38N52N96q12J54M98l57m16
4250d35J164n36q33O75M98q21k37P72k45o97P78M65j059L42O60o84l53R78l73
4269E9n57O22J20q17O77P57j095k57P97m45l71P82j86o70M48Q73j147o9Q73j86
4289B08q99P03L65q47L0J050q96l50J162m86n24O48m6p53O22L97q01N4P00M3r43
$$ y = [-138, 647, -714, -309, 383, -179, -829, 217, 452, -442, -39, 580, -367, -379, 263, 112, -745, 183, 126, -501, -15, 474, -305, -310, 379, -204, -541, 305, 255, -335, -87, 536, -489, -451, 453, 199, -364, 127, 541, -178, 15, 570, 29, -241, 740, -115, -528, 93, 502, -297, -318, 438, 109, -455, 562, 327, -423, -102, 355, -209, -209, 400, -82, -320, 418, 422, -418, 217, 526, -100, -104, 778, -96, -256, 586, 198, -403, -12, 417, -696, 27, 567, 8, -421, 137, 96, -567, -76, 549, -76, -195, 610, 195, -592, 173, 288, -650, -98, 498, -314, -160, 338, -19, -435, 729, 193, -640, 35, 533, -288, -525, 247, 2, -695, 83, 548, -511, -169, 491, -193, -546, 432, 59, -498, 124, 244, -573, 104, 861, -234, -491, 306, -139, -510, 272, 86, -584, -136, 737, -410, -479, 394, 208, -691, 12, 377, -470, -440, 610, -286, -636, 526, 40, -484, 164, 118, -635, -13, 384, -417, -363, 337, 380, -563]
4310e63M40O35r21J79O64m17k27O46m18n71O45K24m27K1N44o66j06M86j44m76
4330d52Q03L44j106j2R29n13m08N77J82r67O76P96r07l43J173m90n10N25r6n74
4350c73M54K66n41M4N12o29k68P94P2r80L79P30o81K42O24m43n34L87K84o28J92
4371i7O32n57k94P85k83p41Q44K45j005L50Q86j139j10Q22k21n27O85j20n80L20
4391a05M61n28n6O75k99q64Q14K86p89J04Q02p37l13J084m11q01P40M2q85K28
4411e52J069p97j07O51m37m64P53L5o88O3P34m71j95M58K23q88P72K00p51J70
4431b22P86o92n02J053k97n51L93K90n29k78R26m40k07N91k5r53P06L40o99J61
4451a49O39m91m52Q63m3q96N95K30o73K48N60l38o46P42J16q59Q27K25n93j16
$$ y = [-563, -123, 512, -409, -230, 434, 17, -210, 436, 18, -553, 92, 316, -111, -90, 454, -212, -318, 168, 24, -452, 351, 695, -411, -423, 506, -7, -415, 162, 344, -623, 53, 849, -58, -401, 772, 282, -228, 297, 201, -373, 81, 347, -194, -150, 362, -267, -535, 259, 331, -649, -270, 460, -221, 21, 645, 202, -332, 55, 339, -289, -97, 535, -22, -316, 469, 186, -555, 289, 534, -471, -121, 765, -374, -484, 338, 117, -410, 275, 155, -425, -105, 356, -172, -228, 447, 148, -716, 98, 384, -405, -301, 501, -236, -549, 535, 124, -677, 63, 105, -780, -552, 517, -280, -387, 264, -173, -637, 116, 151, -537, -474, 260, -211, -406, 52, 275, -613, 159, 359, -392, -222, 564, -128, -630, 423, 126, -425, -32, 258, -271, -549, 377, -63, -270, 321, 296, -657, 49, 389, -310, -149, 490, -1, -453, 410, 367, -529, 66, 296, -377, -129, 431, 93, -553, 189, 305, -554, 273, 498, -95, -211]
4471b11O34j76o94N69K80o07K37M82p20j79Q32m76L8K37K76j310J081K64o27j48
4491b18N38l17m28R55l61n79L52M21n93k50R71j43p48Q28k71m64j17P55o40J97
4511a12N71l63o29N32J70p75N31N15q97N6N98k8m89L43K06l85l1J57l7n13O96
4532A16J36p83L40N60o16k32Q34l33o64R94p9o97O25J75n93l8R31o93k46P62k05
4553B94q56L99P66q87K14R2k41J13M90j84k41Pj7M1k24R49p52m17Q16M5n51K50
4575A06K35m85mL46k05o20N83J30l52J43M41m77j57P15l13n02M29L03n71j0Q30
4596E65p67k20Q06k96o18N93J44o75L15M62j52n69P72j41n89N21J00o05L6P83
4616D65m85k24O57l13l52L14L83p30K09N25k34o20J005m14m92K62L87m49j83O67
$$ y = [-211, 423, 247, -447, 122, 402, -205, 32, 514, -206, -385, 447, -29, 9, 246, 522, -788, 293, 557, -70, -218, 320, 3, -425, 530, 169, -410, -58, 363, -230, -480, 491, 348, -400, 428, 157, -307, -424, 331, -309, -112, 459, 96, -533, -1, 169, -606, -75, 440, -457, -401, 197, 169, -320, 23, 229, -156, -187, -30, -67, -580, 116, 252, -531, -191, 369, -247, -479, 355, 22, -642, 352, 273, -424, 201, 376, -217, -255, 676, -17, -263, 499, 294, -562, -163, 603, -284, -70, 22, -219, -106, 384, 200, -41, -34, -51, -10, -234, 715, -37, -454, 362, 407, -144, 106, 341, -144, -148, 198, -7, -627, -44, 86, -266, -123, 318, -159, -316, 399, 86, -416, 13, 316, -255, -265, 565, -202, -422, 384, 88, -530, 63, 207, -468, -153, 309, 157, -412, 360, 219, -370, 151, 251, -354, -318, 465, -20, -244, 413, 100, -252, 62, 445, -285, -76, 449, 215, -405, 600, 186, -306, -44, 343, -106, -289, 378]
4636C78l59m17N87J53o87L13L98m01n6N84o94l72Q77n1p76O02N4p71N50L12j48
4657G6m36N84j91m35J78N97n93n5P06o19l11R35k45n33L63N23o85m69J037m50
4677b3j5M32k67n56J47N14k15l28N45k04k07L43J04o80RQ67p45l10R73r6o40M29
4699G7K23n83L2M78o52PR63m55m15L79J36m26K36N02p42m8P10j99o23L66L31p24
4721d27L13N26m37l45M75J10m39N67k20l53K05N22k36r20R91K6p22M24K68o19
4741b91OM31r2j32L36R9p98O83J57o93L54J92l32m34J042k92o28N16k6k09O0L83
4763C32l62k73N11j13j65R3K59l00m92R31m63m30N12L68p10K53J64k90J62K95
4783B82q8o77P33j17l02J94j6l4j11J89J8l53L16q5j16K06K79m25j39N03l91k86
$$ y = [378, 19, -398, 189, 342, -345, -32, 366, -35, -91, 493, -201, -573, 304, 253, -523, 79, 133, -638, -88, 224, 76, -360, 224, 33, -402, -224, 373, -220, -275, 431, -188, -499, 436, 191, -342, 21, 544, -141, -610, 427, -23, -38, 394, 127, -429, -282, 232, 17, -311, 234, 30, -177, 166, 270, -410, -401, 466, -279, -589, 384, 288, -352, 77, 300, -283, -251, 227, -425, -418, 545, 90, -325, 54, 190, -236, 0, 502, -240, -288, 422, 223, -400, -34, 297, -427, -114, 412, -25, -370, 105, 215, -224, 343, 123, -230, -25, 497, 261, -659, 332, 358, -364, 60, 328, -291, -285, 146, 54, -78, 258, 357, -441, 242, 399, -294, 60, 252, -80, -514, 528, 236, -392, 124, 98, -111, -51, 332, -30, -303, 208, 95, -70, 23, 282, -18, -510, 421, -42, -472, 40, 408, -302, -49, 115, -175, -13, 282, 194, -483, 250, 133, -169, 25, 9, -25, -136, 53, 71, -282, 34, -51, -167, 39, 318, -107, -246, 257, -134, -420]
4805d20O65J28p52M53Nj0k49K85ml94J21M92m94j75P80n53m68Q40J20q85P37K82
$$ y = [-420, 245, 373, -379, 74, 79, 69, -180, 105, 101, -293, -172, 320, -174, -349, 431, -122, -590, 250, 370, -515, 222, 504]
$$ [...]
8191C0
##END NTUPLES=NMR FID
##END=
