##TITLE=1H_EC-3215(1)
 DMSO, 32 sc, 
 16.12.2019
##JCAMPDX= 6.0         $$ Bruker NMR JCAMP-DX V2.0
##DATA TYPE= NMR FID
##DATA CLASS= NTUPLES
##ORIGIN= UXNMR, Bruker Analytische Messtechnik GmbH
##OWNER= root
$$ XWIN-NMR		Version 3.5
$$ Mon Dec 16 13:55:17 2019 Russian Standard Time (UT+4h)  she@DPX200
##.OBSERVE FREQUENCY= 200.1315
##.OBSERVE NUCLEUS= ^1H
##.DELAY= (6, 6)
##.ACQUISITION MODE= SIMULTANEOUS
##.ACQUISITION SCHEME= undefined
##.AVERAGES= 32
##.DIGITISER RES= 18
##SPECTROMETER/DATA SYSTEM= spect
##.PULSE SEQUENCE= zg30
##.SOLVENT NAME= DMSO
##.SHIFT REFERENCE= (INTERNAL, DMSO, 0, 15.7039)
##AUDIT TRAIL= $$ (NUMBER, WHEN, WHO, WHERE, WHAT)
$$ ##TITLE= Audit trail, XWIN-NMR		Version 3.5
$$ ##JCAMPDX= 5.01
$$ ##ORIGIN= Bruker BioSpin GmbH
$$ ##OWNER= she
$$ F:/spectra/data/she/nmr/H-F/1/audita.txt
$$ ##AUDIT TRAIL=  $$ (NUMBER, WHEN, WHO, WHERE, WHAT)
(   1,<2019-12-16 13:54:01.67 +0400>,<she>,<DPX200>,
      <continue with go, POWCHK disabled, PULCHK disabled
       configuration hash MD5:
       00 E9 B6 7A A2 85 ED C7 34 08 36 98 17 FE 4E 26
       data hash MD5: 16K
       3E F1 39 89 A0 93 0C 96 69 45 AE E6 9D A8 9D B3>)
$$ ##END=
$$ 
$$ hash MD5
$$ D1 17 9C 3A 9A B4 F7 BD 8E 0F 1C 9B 7E C6 24 B3
##$RELAX= 
##$RELAX= 
##$RELAX= 
##$RELAX= 
##$RELAX= 
##$RELAX= 
$$ Bruker specific parameters
$$ --------------------------
##$DU= <F:/spectra>
##$EXPNO= 1
##$NAME= <H-F>
##$PROCNO= 1
##$TYPE= <nmr>
##$USER= <she>
##$AMP= (0..31)
100 100 100 100 100 100 100 100 100 100 100 100 100 100 100 100 100 100 
100 100 100 100 100 100 100 100 100 100 100 100 100 100 
##$AQSEQ= 0
##$AQ_mod= 1
##$AUNM= <au_zg>
##$AUTOPOS= <>
##$BF1= 200.13
##$BF2= 200.13
##$BF3= 200.13
##$BF4= 200.13
##$BF5= 200.13
##$BF6= 200.13
##$BF7= 200.13
##$BF8= 200.13
##$BYTORDA= 1
##$CFDGTYP= 0
##$CFRGTYP= 5
##$CHEMSTR= <none>
##$CNST= (0..31)
1 1 145 1 1 1 1 1 1 1 1 1 1 1 1 1 1 1 1 1 1 1 1 1 1 1 1 1 1 1 1 1 
##$CPDPRG= <>
##$CPDPRG1= <>
##$CPDPRG2= <>
##$CPDPRG3= <>
##$CPDPRG4= <mlev>
##$CPDPRG5= <mlev>
##$CPDPRG6= <mlev>
##$CPDPRG7= <mlev>
##$CPDPRG8= <mlev>
##$CPDPRGB= <>
##$CPDPRGT= <>
##$D= (0..31)
0 1.2 0 0 0 0 0 0 0 0.06 0 0.03 0 0 0 0 0.0002 0 0 0 0 0 0 0 0 0 0 0 0 
0 0 0 
##$DATE= 1576489918
##$DBL= (0..7)
120 120 120 120 120 120 120 120 
##$DBP= (0..7)
150 150 150 150 150 150 150 150 
##$DBP07= 0
##$DBPNAM0= <>
##$DBPNAM1= <>
##$DBPNAM2= <>
##$DBPNAM3= <>
##$DBPNAM4= <>
##$DBPNAM5= <>
##$DBPNAM6= <>
##$DBPNAM7= <>
##$DBPOAL= (0..7)
0.5 0.5 0.5 0.5 0.5 0.5 0.5 0.5 
##$DBPOFFS= (0..7)
0 0 0 0 0 0 0 0 
##$DE= 6
##$DECBNUC= <off>
##$DECIM= 24
##$DECNUC= <off>
##$DECSTAT= 4
##$DIGMOD= 1
##$DIGTYP= 9
##$DL= (0..7)
0 120 120 120 120 120 120 120 
##$DP= (0..7)
150 150 150 150 150 150 150 150 
##$DP07= 0
##$DPNAME0= <>
##$DPNAME1= <>
##$DPNAME2= <>
##$DPNAME3= <>
##$DPNAME4= <>
##$DPNAME5= <>
##$DPNAME6= <>
##$DPNAME7= <>
##$DPOAL= (0..7)
0.5 0.5 0.5 0.5 0.5 0.5 0.5 0.5 
##$DPOFFS= (0..7)
0 0 0 0 0 0 0 0 
##$DQDMODE= 0
##$DR= 18
##$DS= 0
##$DSLIST= <SSSSSSSSSSSSSSS>
$$ [...]
##$SUBNAM2= <"">
##$SUBNAM3= <"">
##$SUBNAM4= <"">
##$SUBNAM5= <"">
##$SUBNAM6= <"">
##$SUBNAM7= <"">
##$SUBNAM8= <"">
##$SUBNAM9= <"">
##$SW= 24.9337058887773
##$SWIBOX= (0..15)
0 0 2 0 0 0 0 0 0 0 0 0 0 0 0 0 
##$SW_h= 4990.01996007984
##$TD= 16384
##$TD0= 1
##$TE= 0
##$TE2= 300
##$TE3= 300
##$TEG= 300
##$TL= (0..7)
0 120 120 120 120 120 120 120 
##$TP= (0..7)
150 150 150 150 150 150 150 150 
##$TP07= 0
##$TPNAME0= <>
##$TPNAME1= <>
##$TPNAME2= <>
##$TPNAME3= <>
##$TPNAME4= <>
##$TPNAME5= <>
##$TPNAME6= <>
##$TPNAME7= <>
##$TPOAL= (0..7)
0.5 0.5 0.5 0.5 0.5 0.5 0.5 0.5 
##$TPOFFS= (0..7)
0 0 0 0 0 0 0 0 
##$TUNHIN= 0
##$TUNHOUT= 0
##$TUNXOUT= 0
##$USERA1= <user>
##$USERA2= <user>
##$USERA3= <user>
##$USERA4= <user>
##$USERA5= <user>
##$V9= 5
##$VALIST= <valist>
##$VCLIST= <CCCCCCCCCCCCCCC>
##$VD= 0
##$VDLIST= <DDDDDDDDDDDDDDD>
##$VPLIST= <PPPPPPPPPPPPPPP>
##$VTLIST= <TTTTTTTTTTTTTTT>
##$WBST= 1024
##$WBSW= 4
##$XGAIN= (0..3)
0 0 0 0 
##$XL= 0
##$YL= 0
##$YMAX_a= 686065
##$YMIN_a= -286210
##$ZGOPTNS= <>
##$ZL1= 120
##$ZL2= 120
##$ZL3= 120
##$ZL4= 120
##$ABSF1= 10
##$ABSF2= 0
##$ABSG= 5
##$ABSL= 3
##$ALPHA= 0
##$AQORDER= 0
##$ASSFAC= 0
##$ASSFACI= 0
##$ASSFACX= 0
##$ASSWID= 0
##$AUNMP= <proc_1d>
##$AZFE= 0.1
##$AZFW= 0.1
##$BCFW= 1
##$BC_mod= 2
##$BYTORDP= 1
##$COROFFS= 0
##$CY= 11.3945322036743
##$DATMOD= 1
##$DC= 2
##$DFILT= <>
##$DTYPP= 0
##$F1P= 16.9975609425685
##$F2P= -3.02152046262296
##$FCOR= 0.5
##$FTSIZE= 0
##$FT_mod= 4
##$GAMMA= 1
##$GB= 0.15
##$INTBC= 1
##$INTSCL= 1
##$ISEN= 128
##$LB= 0.24
##$LEV0= 0
##$LPBIN= 0
##$MAXI= 10000
##$MC2= 0
##$MEAN= 0
##$ME_mod= 0
##$MI= 1.114404
##$NCOEF= 0
##$NC_proc= 0
##$NLEV= 6
##$NOISF1= 3.799351
##$NOISF2= 2.8
##$NSP= 1
##$NTH_PI= 0
##$NZP= 0
##$OFFSET= 15.70392
##$PC= 1
##$PHC0= -9794.406
##$PHC1= 25.40086
##$PH_mod= 1
##$PKNL= yes
##$PPARMOD= 0
##$PSCAL= 0
##$PSIGN= 0
##$REVERSE= no
##$SF= 200.130013532006
##$SI= 16384
##$SIGF1= 3
##$SIGF2= 2
##$SINO= 400
##$SIOLD= 16384
##$SREGLST= <1H.CDCl3>
##$SSB= 0
##$STSI= 0
##$STSR= 0
##$SW_p= 3612.71676300578
##$SYMM= 0
##$S_DEV= 0
##$TDeff= 0
##$TDoff= 0
##$TI= <>
##$TILT= no
##$TM1= 0
##$TM2= 0
##$TOPLEV= 0
##$USERP1= <user>
##$USERP2= <user>
##$USERP3= <user>
##$USERP4= <user>
##$USERP5= <user>
##$WDW= 1
##$XDIM= 8192
##$YMAX_p= 0
##$YMIN_p= 0
$$ End of Bruker specific parameters
$$ ---------------------------------
##NTUPLES= NMR FID
##VAR_NAME=  TIME,          FID/REAL,        FID/IMAG
##SYMBOL=    X,             R,               I
##VAR_TYPE=  INDEPENDENT,   DEPENDENT,       DEPENDENT
##VAR_FORM=  AFFN,          ASDF,            ASDF
##VAR_DIM=   8192,          8192,            8192
##UNITS=     SECONDS,       ARBITRARY UNITS, ARBITRARY UNITS
##FACTOR=    0.0002004,     1,               1
##FIRST=     0,             0,               0
##LAST=      1.6414764,     0,               0
##MIN=       0,             -286210,         0
##MAX=       1.6414764,     686065,          0
$$ Real data points
##PAGE= N=1
##DATA TABLE= (X++(R..R)), XYDATA
$$ [...]
2462h62k007J964L333l90l294p89J801K438l30k404j193L24L672O62l645j588
$$ -862 -2869 -905 2428 2038 -1256 -2045 -244 2194 1864 -540 -1733 -1409 2263 2925 -720 -2308
2478b308J643K682R52l815j607J397L679j043l269l54J796J962l5k028k669J735
$$ -2308 -665 2017 2969 -846 -2453 -1056 2623 1580 -1689 -2043 -247 1715 1680 -348 -3017 -1282
2494a282K961R55m102p86J694K199j06k881q75J260L120J44k873j600Q82K868
$$ -1282 1679 2634 -1468 -2254 -560 1639 1533 -1348 -2223 -963 2157 2301 -572 -2172 -1290 1578
2510A578R75k728k743J160L992J82l471j830K215K212M66l451n90J55L504J071
$$ 1578 2553 -175 -2918 -1758 2234 2416 -1055 -2885 -670 1542 2008 -1443 -2033 -1878 1626 2697
2526B697l204j836J046L073P16l354k005J839L242N0k733j632J130K524J056k242
$$ 2697 -507 -2343 -1297 1776 2492 -862 -2867 -1028 2214 2264 -469 -2101 -971 1553 2609 367
2542C67l288J354L631M45l577k318J574L858J26k424k547O09L412J195k369k345
$$ 367 -2921 -1567 2064 2509 -1068 -3386 -1812 2046 2172 -252 -2799 -2190 1222 2417 48 -2297
2558b297Q91L188J506k520k793J274L046M04k274k191N38K231J724k990j880N44
$$ -2297 -1406 1782 3288 768 -2025 -751 2295 2699 425 -1766 -1228 1003 2727 -263 -2143 -1599
2574a599K561J892l748k315J227L756N37k457k914J660L110M53j935k759Q54L018
$$ -1599 962 2854 -894 -3209 -1982 1774 2311 -146 -3060 -1400 1710 2163 228 -2531 -1677 1341
2590A341K056k558k979Q8M050J434l520k981J357L077P38k114j817k74L435J041
$$ 1341 3397 839 -2140 -2052 1998 3432 -88 -3069 -1712 1365 2103 -11 -1828 -2102 1333 2374
2606B374j710k656n37L330J704j931l377P52M085R46k093k931J34L273J409k254
$$ 2374 664 -1992 -2529 801 2505 574 -2803 -2051 2034 2980 887 -2044 -1910 1363 2772 518
2622E18k539L76L082J600k315k793p1L042K061j791l535K30K666K095j617l017
$$ 518 -2021 -1645 1437 3037 722 -2071 -2142 900 2961 1170 -2365 -2135 531 2626 1009 -2008
2638b008n06L242J810j815l237j14L607J363k079k258Q41K283N98J08l508l54
$$ -2008 -2514 728 2538 723 -2514 -2628 979 2342 263 -1995 -1154 1129 1727 1835 -1673 -2027
2654b027K929K125j701l229o44L408K106j911l553L70K892J555j606l310j7K102
$$ -2027 902 3027 1326 -1903 -2547 861 2967 1056 -2497 -2127 765 2320 714 -2596 -2613 -511
2670e11K787j654k586n41K343L044j805l500K20K690K414j669k519n51K905J702
$$ -511 2276 622 -1964 -2505 -162 2882 1077 -2423 -2203 487 2901 1232 -1287 -1838 1067 2769
2686B769j428k307j224K544K449j530l805o5K089K480j429k570n83K257K597j153
$$ 2769 1341 -966 -2190 354 2803 1273 -2532 -2597 -508 1972 543 -2027 -2610 -353 2244 1091
2702A091k741r45K386K985j063l338o16K552K676r39k966j531K563K829j460k465
$$ 1091 -1650 -2595 -209 2776 1713 -1625 -2241 311 2987 2048 -918 -2449 114 2943 1483 -982
2718i82j319J797K565l03l659p93K829K547j868k322j115K799J915o14l595r2
$$ -982 -2301 -504 2061 1758 -1901 -2694 135 2682 814 -1508 -2623 176 2091 1477 -2118 -2210
2734b210J828K880o29k989j129K062L204q89l527j690K932K559o88k819j273J876
$$ -2210 -382 2498 1869 -1120 -2249 -187 3017 2128 -1399 -3089 -157 2402 1714 -1105 -2378 -502
2750e02K595L4l565j436K257K772o21k767j436J729K633K88k734j348J877K044
$$ -502 2093 2127 -1438 -2874 -617 2155 1534 -1233 -2669 -940 1693 1981 -753 -2101 -224 1820
2766A820L60k581j696J958K950k26l238j205J581L355r04k645j902J771K532k75
$$ 1820 2180 -401 -2097 -139 2811 2585 -653 -1858 -277 3078 2174 -471 -2373 -602 1930 1655
2782A655k057k172P21K965Q84l024j495J183L697j77k858r68J918K056n26j845
$$ 1655 -402 -2574 -1853 1112 1996 -1028 -2523 -1340 2357 2180 -678 -1646 272 2328 1802 -43
2798d3k318J629K471K4k113j979J839K465n45k502j100K188K194m08l011k148
$$ -43 -2361 -732 1739 1763 -350 -2329 -490 1975 1430 -1072 -2172 16 2210 1802 -1209 -3357
2814c357K236K387Q66k368j741O99L600l83l057j707J959L065p03j824j474P29
$$ -3357 -1121 1266 2132 -236 -1977 -1278 2322 1939 -1118 -2825 -866 2199 1496 -328 -1802 -1073
2830a073K872R20k649k162J148K983K69k379k719K169K447j21k190j740J015K692
$$ -1073 1799 2719 70 -2092 -944 2039 2308 -71 -2790 -621 1826 1705 -485 -2225 -1210 1482
2846A482L07k365j146M16K957P41k894k119J632K787J99k088j734J108K433N96
$$ 1482 1789 -576 -1722 -1306 1651 2392 -502 -2621 -989 1798 1997 -91 -1825 -717 1716 2312
2862B312k076k212J178J975R84k118j674L67K104J549k864j653Q38J532J161j371
$$ 2312 236 -1976 -798 1177 2161 43 -1631 -1264 840 2389 -475 -2128 -1290 242 1403 32
2878C2k033J195J662J524k428k199P41K776Q15j622k469M26K792N10j636j784
$$ 32 -2001 -806 856 2380 -48 -2247 -1506 1270 2085 463 -2006 -1580 1212 1722 86 -1698
2894a698K65K482R5l11k919N79J662J494j417k399O86K042J391j952k373J185
$$ -1698 -1433 1049 1144 833 -2086 -1507 155 1649 232 -2167 -1481 561 1952 0 -2373 -1188
2910a188J748J440j650j682M32K321K71p94k621R64K007R53j371k034m16L098
$$ -1188 560 2000 350 -1332 -900 1421 1692 898 -1723 -759 1248 2201 830 -1204 -1620 1478
2926A478L08j501j965N7K677K61j034j975M25J003J944j275j885k50K557L79q45
$$ 1478 1786 285 -1680 -1623 1054 1315 281 -1694 -1269 -266 1678 403 -1482 -1732 825 1204 359
2943C59j445k20J983J129r19j789n10J954J959j921j885j39K630L77j447j213
$$ 359 -1086 -1306 677 1806 887 -902 -1412 542 2501 580 -1305 -1444 1186 1563 116 -1097
2959a097j25J331J399j226j537j3J185J713r04j823M5J319J194p58j889J44J670
$$ -1097 -1222 109 1508 282 -1255 -1268 -83 1630 726 -1097 -1052 267 1461 703 -1186 -1042 628
2976F28J203o89k796O84J724J426j397j755j84J615J762k227j094m95K288M76
$$ 628 1831 1142 -1654 -970 754 2180 783 -972 -1156 459 2221 -6 -1100 -1595 693 1169
2992A169p20j584n78J690R02L64l194O08R58K098r09j957j7J400J221l43j703
$$ 1169 449 -1135 -1713 -23 879 1243 -1951 -1343 -385 1713 804 -1153 -1170 230 1451 1108 -595
3009e95k02J248J029j418j166n0J158J769j360k012m70K307P32p35j100n76J411
$$ -595 -797 451 1480 62 -1104 -1154 4 1773 413 -1599 -2069 238 970 235 -865 -1441 -30
3026c0J750q25j899n63J434K079j400r50p08R45J438l06j420o48Q52J716n12j552
$$ -30 1720 895 -1004 -1567 -133 1946 546 -404 -1112 -167 1271 965 -455 -1103 -251 1465 953 -599
3044e99k07L43J463l45j223o13K95J851Lj774l38N58J267Q29j841p17K40J718
$$ -599 -806 -463 1000 655 -568 -1181 -886 965 968 -806 -1144 -586 681 1510 -331 -1048 -808 910
3062I10K8j754l22J265J491m23j875p2J006P06m03o70l91R8J347q4j375m27N98
$$ 910 938 -816 -1138 127 1618 1195 -680 -752 254 960 557 -113 -504 -406 941 857 -518 -945 -347
3081c47J572l26j654o96J212J135K86j391r58N34J608j88j155n81O17J038N74
$$ -347 1225 899 -755 -1451 -239 896 1182 -209 -1167 -633 975 787 -368 -949 -332 706 1280
3098A280j613p91M61J697j80l67j748K75J673M60j127j030q7J948p09p95o81J148
$$ 1280 -333 -1124 -663 1034 854 487 -1261 -986 687 1147 20 -1010 -1097 851 142 -653 -1334 -186
3116a86J052n8j498o5O22R56n59n57k03J08J324M1j021q60Q21R14K27j632m11
$$ -186 866 808 -690 -755 -133 823 264 -293 -496 -388 936 977 -44 -904 -83 831 1058 -574 -985
3135i85P89Q70n73j080J73L14q0R47m17j109k5J440O95q48j387N71J778M4q52
$$ -985 -196 674 101 -979 -806 -492 -572 375 -42 -1151 -1176 264 959 111 -1276 -705 1073 1117 265
3154B65r79O42R38J46o74j377K38J749n28m25q23R63M8J093j706o68M74J050J09
$$ 265 -714 -72 866 1012 338 -1039 -801 948 420 -5 -828 135 183 1276 -430 -1098 -624 426 535
3173E35r58m31Q9J053J90k67j553R23J424j059K59j83m08P62J31J70r64j02J336
$$ 535 -423 -854 -765 288 478 211 -1342 -419 1005 -54 205 22 -386 376 507 677 -287 -389 947
3192I47k88q22n23J34J378K22j584k50N16J069l19l64j018L40M48R06p40l20K47
$$ 947 659 -163 -686 -552 826 1048 -536 -786 -270 799 480 116 -902 -562 -114 792 52 -268 -21
3211b1O2N33k16o22J74J118j12n38j373Q62M90Q7k56n86J27J06O92n32r15N47
$$ -21 41 574 358 -264 -90 1028 916 378 -995 -133 357 444 188 -398 -271 -165 527 -5 -920 -373
3231c73JK09Q04o51p34J229N8j033N40n31P69M37m89m15q9P53K62m11q88M24L2
$$ -373 -372 -163 641 -10 -744 485 543 -490 50 -481 288 725 236 -179 -268 485 747 336 -552 -128 -96
3252i6L40m59P3q95O93R99n76j83o86R07J87J49q87o3P85L07k78o82K50P84k11
$$ -96 244 -215 -142 -1037 -344 655 79 -104 -790 117 304 453 -434 -497 288 595 317 -365 -115 669 458
3273D58J6m90n89J261j5l31o72k35J168m13l98k19k8r3P17L54p57j85O41l59k56
$$ 458 474 -16 -605 656 641 310 -362 -597 571 158 -240 -459 -487 -580 137 491 -266 -451 190 -169 -425
3294d25M82p39P99L68L7n57o97J545j23l31p0q31M71R44r52J98o79Q90n21O06
$$ -425 57 -682 117 485 522 -35 -732 813 690 359 289 -542 -71 873 -79 119 -560 330 -191 415
3314D15rq82K93Q9M7l95l68O1J502o63j78o77J202L74l14l69K40J13n36R6m2j99
$$ 415 406 -476 -183 -94 -47 -442 -810 -749 753 90 -88 -765 437 811 497 128 368 481 -55 41 -1 -200
3336b00J02Q27n36O89j210M37j38J14J4k74o8M51l08k70K80k39N07K43n23r4L71
$$ -200 -98 729 193 882 -328 109 -29 85 99 -175 -243 208 -100 -370 -90 -329 178 421 -102 -196 175
3357A75K62k16m79l49Q76O24j028l98M26j4J70L76j213K58Q29K75m20p11k97N81
$$ 175 437 221 -258 -607 269 893 -135 -533 -107 -121 49 425 -788 -530 299 574 154 -557 -854 -273
3377b73O09o44l31l2J116n40L88m54k68O24O89o71k30p13J170J33N6m69o07M8
$$ -273 336 -308 -639 -671 445 -95 293 -161 -429 195 884 213 -17 -730 440 573 629 160 -447 -399
3397c99Q24J5r42M62L13j76j14J75q35J27O54j22o6J21p6N15m29K43l03k55N78
$$ -399 425 440 -502 -40 273 97 -17 158 -677 -550 104 -18 -84 37 -39 476 47 290 -13 -268 310
3418C10L67l80l42L56J90m62l16L13Nj17M97l23m18L66m74L31l1k45Q34r64P16
$$ 310 677 297 -45 311 501 39 -277 36 41 -76 421 98 -320 46 -428 -97 -128 -373 461 -503 213
3439B13o60L25M83j26K4p4k23L84j57k96L07l40N5M50l31j26k33j89P61k14K26
$$ 213 -447 -122 361 235 259 185 -38 346 189 -107 200 -140 -85 365 34 -92 -325 -514 247 33 259
3460B59k77k96k83O68k51J61l56M12k76R3j76J71Q9m05K99J70J07O6J18n6k18
$$ 259 -18 -314 -597 71 -180 -19 -375 37 -239 -146 -322 -151 -62 -467 -168 2 109 175 293 237 19
3481A9J66J8L93R3j245M88k8N89p11J36M50m63k75L01o04N53k99L44O4o94J024
$$ 19 185 203 596 689 -556 -68 -96 493 -218 -82 368 -95 -370 -69 -673 -120 -419 -75 -11 -705 319
3502C19j85l05l5K22M3rK50o38N17O86q09N10k68j78J66L14j340j31O20j18L92
$$ 319 134 -171 -206 16 59 50 300 -338 179 865 56 566 298 120 286 600 -740 -871 -251 -369 23
3523B3K11q9n98K68K33K15k25o3N06n64L56n14j22L94O1K9l92L32J57J85j35m1
$$ 23 234 145 -453 -185 48 263 38 -25 481 -83 273 -241 -363 31 92 121 -271 61 218 403 268 227
3545B27M51J06l19j15o34r1K89K67K89j156R54k14n84M52J36kK41K28l53K08l91
$$ 227 678 784 465 350 -284 -375 -86 181 470 -686 268 54 -530 -78 58 56 297 525 172 380 -11
3566a1J66L2k5p7J50l78L94L9l58L49o3n85j71n0L11j34J43K15K32j67k65L71
$$ -11 155 187 162 85 235 -143 251 290 -68 281 218 -367 -538 -588 -277 -411 -268 -53 179 12 -253 118
3588A18m00Q1j46M10KJ72m65N82k48j73k4P16l44J87J3m42j0L40l78m01M80Q9
$$ 118 -282 -201 -347 63 65 237 -228 354 106 -67 -91 625 281 468 481 39 29 369 -9 -410 70 159
3610A59j017N26r0M01L55n54K02r3j22P24o21J7R3N7J8r5k93Q80m91o9M42K93
$$ 159 -858 -332 -422 -21 334 -220 -18 -111 -233 491 -130 -113 -20 37 55 -40 -333 547 56 -13 429 722
3632G22J54j327N46k67k8J84K2j34l00K05m88O82K65m81n27L72K39j36j50N88
$$ 722 876 -451 95 -172 -200 -16 6 -128 -428 -223 -711 -29 236 -245 -772 -400 -161 -297 -447 141
3652A41k60L92o15O68j80p40R13l19n5O01j390R26K10o0N8o27k31m31P23J19O5
$$ 141 -119 273 -342 326 146 -594 319 0 -55 546 -844 82 292 232 290 -337 -568 -999 -276 -157 -92
3673i2J10j82K32J43j17j62J76J77m36k93Q95l85M42o28M23K19l70M1p95P82j81
$$ -92 18 -164 68 211 94 -68 108 285 -151 -444 451 66 508 -120 303 522 152 193 -602 180 -1
3694al0k39j26K56k53L79m33M87l17J34m4J33R5k62n4Q50l49J20o88P17m63l61
$$ -1 -31 -270 -396 -140 -393 -14 -447 40 -277 -143 -187 -54 41 -221 -275 575 226 346 -342 375 -88 -449
3716d49P9J26Q82j19m33l75J05M40r0M11n47m94K47K68L21q09N23r0l84L05M30
$$ -449 -370 -244 638 519 86 -289 -184 256 166 577 30 -464 -217 51 372 -437 86 -4 -388 -83 347
3737C47l9j68n91P40o93M71j75J1M61N5m11k5N55o11k40L30o5k38O5j71Q42o43
$$ 347 308 140 -451 289 -404 67 -108 -97 364 419 8 -17 538 -73 -313 17 -48 -286 -221 -392 450 -193
3759a93O0M0k03L89J00L8k49J54J40m53L33n08N22l26J109j025N23n48L01K30
$$ -193 -133 -93 -296 93 193 231 -18 136 276 -177 156 -352 170 -156 953 -72 451 -97 204 434
3779D34k36j23n9l29j19J30N14j022R39j28o30P40L10n23O67m29j033R91n81P11
$$ 434 198 75 16 -313 -432 -302 212 -810 129 1 -629 111 421 -102 565 136 -897 94 -487 224
3799B24p70K97J91K08q1K81N0j5l58M47q5j73N7l0n1n0o69K16J96R8%J56l46N57
$$ 224 -546 -249 -58 150 69 350 400 385 27 474 389 216 273 243 192 142 -527 -311 -115 -17 -17 139 -207 350
3823C50m98J21K02l89j56J73j1M86j28q92M05K29J55K04K47n02j62O73o69o34
$$ 350 -148 -27 175 -214 -370 -197 -208 278 150 -742 -337 -108 47 251 498 -4 -166 507 -162 -796
3843g96O38M52r2j36j89m81M63rk03K14q1M9p3N04l13k0J44L92k03K47p11N61
$$ -796 -158 294 202 66 -123 -604 -141 -150 -353 -139 -220 -171 -244 260 -53 -73 71 463 260 507 -204 357
3865C57p89R48m11L97n12r6j1l25P24l42K48k47n8N85j79p32M30J53J5n90K48
$$ 357 -432 516 105 502 -10 -106 -117 -442 282 -60 188 -59 -117 468 289 -443 -13 140 155 -435 -187
3886a87K14O16j046K02L41p9l64L12J69j34m03j17M40m76N48j37l52J127q04j01
$$ -187 27 643 -403 -201 140 61 -303 9 178 44 -359 -476 -36 -512 36 -101 -453 674 -130 -231
3906b31L77o03J89L74k69R8l81J91O71m03j91K09n06k47J101k61n38O01j85L46
$$ -231 146 -457 -268 106 -163 -65 -446 -255 416 13 -178 31 -475 -722 379 118 -420 181 -4 342
3926C42j61N7j57k86n49O92J17nm62qP76k02m33j67J58L48m30P81l34l54K66k58
$$ 342 181 238 81 -205 -754 -62 55 50 -412 -420 356 154 -279 -446 -288 60 -370 411 77 -277 -11 -269
3948b69K63r8N66o61L85M8m77L57k68K52m56K20N19Nj56l98J31Q2O9k9o32R8N92
$$ -269 -6 -104 462 -199 186 234 -243 114 -154 98 -358 -138 381 386 230 -168 -37 45 114 85 -547 -449 143
3971A43m72J92J43K63o01L0n3N65j94j1J70j2m85K09K12m81M26m54P4R03q31K70
$$ 143 -329 -137 6 269 -332 -302 -355 210 16 5 175 163 -322 -113 99 -382 44 -410 -336 567 -264 6
3993FL35m55K58j99o15M56J15P10n13o96O8M80j40l34P40K4L16l39J62m19o6P5
$$ 6 341 -114 144 -55 -670 -214 -99 611 98 -598 -530 -50 -190 -524 216 240 556 217 379 -40 -106 -31
4015c1M79k2p35R36p56K22K78o81N46l83Q10p68Kl68O32l69j71J56L84n8k33L0
$$ -31 448 426 -309 627 -129 93 371 -310 236 -147 663 -105 -103 -471 161 -208 -379 -223 161 103 -130 -100
4037a00l16M84K9Q0l34M1L92j77J33Q7L60m80m16M28m8K36l10j78K14m24l77P30
$$ -100 -416 68 97 177 -157 -116 276 99 232 319 679 199 -217 211 163 399 89 -89 125 -299 -676 54
4059E4k54M67l36J06l33M12k97k43P98k33Q4Lo8j07k1l54L1O02j11m35K54l36
$$ 54 -200 267 -69 37 -296 116 -181 -424 374 141 225 228 160 53 32 -322 -291 311 200 -235 19 -317
4081c17P69R3n35k38M3J66q07P70Kk51O30n51L21m3J41l82mM71o74R55m98k49
$$ -317 452 545 10 -228 -185 -19 -826 -56 -54 -305 325 -226 95 52 193 -189 -193 278 -396 559 61 -188
4103a88Q86m94m07L36m1o15O26k63K25p34J30O49j69K24l03J23N20q44Q9o1Q00
$$ -188 698 204 -203 133 92 -523 103 -160 65 -669 -539 110 -59 165 -138 -15 505 -339 -250 -311 489
4124D89o1k08p26R11j41q26R08m82J85k4j79k38O41p86P81n86O53j66r6n4l80
$$ 489 428 220 -506 405 264 -562 346 -136 49 25 -154 -392 249 -537 244 -342 311 145 49 -5 -385
4145c85M03l11J32k79K23O66p08N77k23o17O98j008Q53j02j3M41n39N73l05j72
$$ -385 18 -293 -161 -440 -217 449 -259 318 95 -522 176 -832 21 -81 -94 347 -192 381 76 -96
4165i6l1K94j58o76J045j59r4m47M89p4n85N06K9M2J3r74M01N41l38L39j32M96
$$ -96 -127 167 9 -667 378 219 125 -322 167 93 -492 14 43 85 98 -876 -475 66 -272 67 -65 431
4187D31k53j00j05R9l69N18P7n18K85J52k49J93k87R6m8m85l0L23M06p02R21n99
$$ 431 178 78 -27 72 -297 221 298 -220 65 217 -32 161 -126 -30 -78 -563 -593 -270 136 -566 355 -244
4209b44R7M69o53J000j085K57L0k65K66K13k27K98l18K86Q2k74k53R49n65j74
$$ -244 -147 322 -331 669 -416 -159 -129 -394 -128 85 -142 156 -162 124 206 -68 -321 628 63 -111
4229a11K27l22J01l84L87P1J60j87%j03N71o52M2R3K64J31j89j35j92L64o2q70
$$ -111 116 -206 -105 -489 -102 -31 129 -58 -58 -161 410 -242 -200 -107 157 288 99 -36 -228 136 74 -796
4251g96J027n46K15L98K55p05p7K81K49n44K45l3k28j98J57K39l61O67j61p7j3
$$ -796 231 -315 -100 298 553 -152 -229 52 301 -243 2 -31 -259 -457 -300 -61 -422 245 84 7 -6
4272fq4K78l90l0J55k80N58m68Q42m81l48PN66j61K50l94P05p9p14L09l21P96
$$ -6 -90 188 -202 -232 -77 -357 201 -267 575 94 -254 -247 319 158 408 14 719 640 -74 235 -86 710
4294G10q44n31M24L20p8J21k18Q4L9k82P02p80N81l66O53l47M32Nj121N68l44
$$ 710 -134 -665 -241 79 1 122 -96 -12 27 -255 447 -333 248 -118 535 188 620 625 -496 72 -272
4315b72N50m02M42k57k04J18L61o12O5n00L55J53O6q43J348j36k69k88L01K43
$$ -272 278 -124 318 61 -143 -25 336 -276 -211 -711 -356 -203 -137 -980 368 232 -37 -325 -24 219
4335B19ml55K95k61m8j63P65n3l67J83k30K66r6k42j4r3J42m73M90L5J64k48O41
$$ 219 215 -140 155 -106 -154 -317 448 395 28 211 -19 247 151 -91 -105 -198 -56 -529 -39 -4 160 -88 553
4358E53m46l26M51n7j13M74p02r3O55m60p8M25M0j1L22n93M8k35K09j26O4k67
$$ 553 107 -219 232 175 62 536 -166 -259 396 -64 -142 283 323 312 634 41 89 -146 63 -63 1 -266
4380b66j13K48J7P2j81MM24k51pn34Q50l41j69L30o9n18Q50q02J062q71R19p8
$$ -266 -379 -131 -114 -42 -223 -219 205 -46 -53 -587 263 -78 -247 83 14 -504 346 -456 606 -265 654 576
4402E76o9q48Q71q13j1J51k53N19k41K02k96M81m21l23L28k40L67k41K76n31O29
$$ 576 507 -341 530 -283 -294 -143 -396 123 -118 84 -212 269 -152 -475 -147 -387 -20 -261 15 -516 113
4423A13j98k90N61m08L67p3j82J11J04j1P7l59N30j020L38O09K80p98K51m09o3
$$ 113 -85 -375 186 -222 145 72 -110 1 105 94 171 -188 342 -678 -340 269 549 -249 2 -407 -470
4444d70P89n75K31j92K07M83o4q42N64k74P2N17l71K51l47L8j83N69j69j179P64
$$ -470 319 -256 -25 -217 -10 473 409 -433 131 -143 -71 446 75 326 -21 17 -166 403 234 -945 -181
4465a81J80J7J19j84R4j39n00r7O15m42P94n55Q5M29p06J046o15q5K92l1k04k26
$$ -181 -1 16 135 -49 45 -94 -594 -691 -76 -518 276 -279 -194 235 -471 575 -40 -125 167 136 -68 -294
4487b94P0M25m05M28k00L68r00M87j6L61o57L65o03N41k72L06j22O16r24O37K02
$$ -294 -224 201 -204 224 24 392 -508 -21 -37 324 -333 32 -571 -30 -302 4 -118 498 -426 211 413
4508D13l24L58p90K80J53J08j01J74M48m78p6l24O2L57J46m76L4J35k59M32J91
$$ 413 89 447 -343 -63 90 198 97 271 719 241 165 -159 -97 260 406 -70 -36 99 -160 272 463
4529D63l55j67k43k62O80n73M47j10L99k42p3k01M23K52m75K81j95K40on3m0Q
$$ 463 108 -59 -302 -564 116 -457 -10 -120 279 37 -36 -237 186 438 -37 244 49 289 283 230 190 198
4551A98n1l90M72n34L1O48Mn74l4O09q70N30J6r3L80p27K92J83J4l66Q37l65m35
$$ 198 147 -243 229 -305 -274 374 378 -196 -230 379 -491 39 55 -38 342 -385 -93 90 104 -262 575 210 -225
4574b25P44oJ34p58L59k11k98O30n33k03L84n76R66l37p60J87j63J115o12K43
$$ -225 519 513 647 -111 248 37 -261 369 -164 -367 17 -559 407 70 -690 -503 -666 449 -163 80
4594H0J63k26n51M40K35J20j71M23l43o62R96q73L05o4J05l57M46l82P4j72J051
$$ 80 243 17 -534 -94 141 261 90 513 170 -492 504 -369 -64 -128 -23 -380 66 -316 -242 -414 637
4615F37p55j11K29l05N71m97k41R11p70K31J42M52l60l71J65K04L62j9n31M95
$$ 637 -118 -229 0 -305 266 -231 -472 439 -331 -100 42 494 134 -237 -72 132 494 475 -56 439
4635D39m87N9m74J31J73P7l23K19N50j2J9n86K63n07p6N35k51l6K73L01o35J11
$$ 439 -48 11 -463 -332 -159 -82 -405 -186 364 352 371 -215 48 -459 -535 0 -251 -287 -14 287 -348 -237
4657b37J77J6J02j10J44L59n32K00j13j52J01M85k90L17m86j29L11k70J69j33
$$ -237 -60 -44 58 -52 92 451 -81 119 6 -146 -45 440 150 467 -19 -148 163 -107 62 -71
4677g1j4l94N86j39j06L45l99J90m5J02l94K10L3J02k08N63p67J71K93M09l20
$$ -71 -85 -479 107 -32 -138 207 -192 -2 -47 55 -339 -129 -96 6 -202 361 -406 -235 58 467 147
4698A47p8m64O96j07l24m46K95r3L8P95l12l77O2K2K16J6q4j20K63k93K14L1l3
$$ 147 69 -395 301 194 -130 -576 -281 -374 -336 459 147 -230 -168 -146 70 86 2 -118 145 -148 66 97 64
4721F4N93n08k42l56M30K53o16K49k33o4Q1L59n90L25K51l13K72K65l32R2Q9p9
$$ 64 657 149 -93 -449 -19 234 -382 -133 -366 -430 -349 10 -580 -255 -4 -317 -45 220 -112 -20 69 -10
4743a0M86o66L84R7k80K86l91J87r9K91k00k23ko7j95J48Q39r95N85j53J30R4
$$ -10 476 -190 194 291 11 297 -94 93 -6 285 85 -138 -140 -207 -402 -254 585 -410 175 22 152 246
4765B46l17n0l81J11O02R7k76k40n72K8O98L81Q2m57J12p43J254j21m48M00m33
$$ 246 -71 -121 -502 -391 211 308 32 -208 -780 -752 -54 327 409 -48 64 -679 575 454 6 406 -27
4786b7J27n7J49l06r5p6J71o9M44K9m9l07M73m38k34L65r5m42L81o93L13L51l0
$$ -27 100 43 192 -114 -209 -285 -114 -183 261 290 241 -66 407 -31 -265 100 5 -437 -56 -749 -436 -85 -115
4809a15m03O55M52m41o71K99K85j4k83Q56o23j37k63K32m00P02o05J85Q40n40
$$ -115 -518 137 589 148 -523 -224 61 47 -236 620 -3 -140 -403 -171 -571 131 -474 -289 551 11
4829A1J25n86J334j052j75N93m9l60N77j9m83j20r3K32J144r03L98o33N46m57
$$ 11 136 -450 884 -168 -343 250 201 -159 418 399 -84 -204 -297 -65 1079 176 574 -59 487 30
4849C0R4L2m68L26m76N37l0l49L6J14K98K39l78j56l41Q56J90n49l47Q62j451
$$ 30 124 156 -312 14 -462 75 45 -304 -268 -154 144 383 5 -151 -492 364 554 5 -342 520 -931
4870i31P01K81LJ39k02Nj86M78L53r33M53m31L22n2n72R00q57P09p9l38r0K56
$$ -931 -230 51 54 193 -9 -4 -190 288 641 -292 161 -270 52 0 -572 328 -529 180 101 -237 -327 -71
4892g1k35M33m72m37Q79j01O5r8l2O1r7L0l54j78N92L12k99P04j033j67J379r84
$$ -71 -306 127 -345 -782 97 -4 61 -37 -69 -8 -105 -75 -429 -607 -15 297 -2 702 -331 -498 881 -103
4914a03l56K18m33J006o8p30J022k34l91Q82o05K5p42N85N72m48j81K97q65J030
$$ -103 -459 -241 -674 332 264 -466 556 322 -69 813 208 233 -509 76 648 200 19 316 -549 481
4934D81m07k29j46J89L26n78O37j58j98j35k69M63m03N62q7l83l0M37L14j1p86
$$ 481 74 -155 -301 -112 214 -364 273 115 -83 -218 -487 -24 -427 135 48 -335 -365 72 386 375 -411
4955d11O16k94L14M71p67q8j47J81J56J27J04j81n45Q53p11J49p7J89q2l12N25
$$ -411 205 -89 225 696 -71 -159 -306 -125 31 158 262 81 -464 389 -322 -173 -250 -61 -143 -455 70
4976G0l51K16KJ28k19l1L76r1o9Mj97K95L76n67j16J97J77M87j013L40k8M87m18
$$ 70 -281 -65 -63 65 -154 -185 191 100 31 35 -162 133 509 -58 -174 23 200 687 -326 14 -14 473 55
4999E5J59l45L93n80P45p28N00l73p1K77k13k82N98m12M98J5l86J30J76L13m86
$$ 55 214 -131 262 -318 427 -301 199 -174 -245 32 -181 -463 135 -277 221 236 -150 -20 156 469 -17
5020a7K63l66J004q17j47J12m04N75p6l58m4L45J53l90j87M52m85Q66l75N8K20
$$ -17 246 -120 884 67 -80 32 -372 203 127 -231 -275 70 223 -167 -354 98 -387 479 104 162 382
5041C82o71L34k32N5j00N42K28p78j1o38J404N7q45L67m57R7J94j91Q0N25m91
$$ 382 -289 45 -187 -132 -232 310 538 -240 -251 -889 515 572 -273 94 -363 -266 -72 -263 -183 342 -149
5062a49R8M91m20K79p92L92O02m51o28N41M79Q1o42j56K94L13K5k76j07m31J5
$$ -149 -51 440 20 299 -493 -101 501 50 -578 -37 442 523 -119 -275 19 332 357 81 -26 -457 -442
5083d42J71Q55q27o79J298j89j86j92j91M77m14M6l3J62M18l17N78q52M27j86
$$ -442 -271 584 -243 -922 376 187 1 -191 -382 95 -319 -273 -306 -144 274 -43 535 -317 110 -76
5103g6J16P2M21l05m78J21J37l67n2J241j055L88o23k65M05N41k64j29N78j099
$$ -76 40 112 533 228 -250 -129 8 -359 -411 830 -225 163 -460 -725 -320 221 -43 -172 406 -693
5123f93M44L51m75J89J05k69K48q38J197l2Q39q31l88Q6L86M8l14m12J30L56J06
$$ -693 -249 102 -373 -184 -79 -348 -100 -938 259 227 1066 235 -153 -67 319 367 53 -359 -229 127 233
5144B33m15n34L33P36%K20o36L12q36J110n36l55K29oJ036j003k82L52j61R70
$$ 233 -182 -716 -383 353 353 573 -63 249 -587 523 -13 -368 -139 -145 891 -112 -394 -42 -203 767
5164G67j075O89q75J80M58r9J69o6K1j09p2n69J54J38K97J99M2O1q41O07L3k02
$$ 767 -308 381 -494 -314 144 45 214 148 169 60 -12 -581 -427 -289 8 207 249 310 -531 76 109 -93
5186i3K56J45l87M8j20k86J085q37K52l78M42N2M4L05j454J072q6m80M21J25n96
$$ -93 163 308 -79 -31 -151 -437 648 -189 63 -315 127 179 223 528 -926 146 60 -420 1 126 -470
5207d70L9L17M38m22K57k07M56p10M08o10L66M32j80o31l97O84P67k96j54J08
$$ -470 -431 -114 324 -98 159 -48 408 -302 106 -504 -138 294 114 -517 -914 -230 537 241 87 195
5227A95k36l48Q30n6j186Q28l29O21j96L9j54m61l6L48j17J81M81p31K30j5j33
$$ 195 -41 -389 441 385 -801 27 -302 319 123 162 8 -453 -489 -141 -258 -77 404 -327 -97 -112 -245
5248b45K77O6n67M96m42N33k35J04J18k2J77l36L32q31N67k82L05Pl47Q07m24
$$ -245 32 98 -469 27 -415 118 -117 -13 105 83 260 -76 256 -575 -8 -290 15 22 -325 482 58
5269E8J61k86l43N20j29L36j22m93K07L29K23p20l66R42m55K14J81j84N32p94
$$ 58 219 -67 -410 110 -19 317 195 -298 -91 238 461 -259 -625 317 -138 76 257 73 605 -189
5289a89L69m71J87l25P05j8m94O8l43L97J5K78n92K16R8O47o22l40K21M03L22
$$ -189 180 -291 -104 -429 276 258 -236 -168 -511 -114 -99 179 -413 -197 -99 548 -74 -414 -193 210 532
5310E32r66Q8j17M72L56o77j56p8O84M57p0o97K73P4k96l58J85L79L10l46o79
$$ 532 -434 -346 -463 9 365 -312 -468 -546 138 595 525 -172 101 175 -121 -479 -294 85 395 49 -630
5331f30Q42p23J84J03K05K06m31N42k41J10k72M0l07O73l56j67k5l41R81j3q22
$$ -630 212 -511 -327 -224 -19 187 -244 298 57 167 -105 -65 -372 301 -55 -222 -247 -588 393 380 -442
5352d42O5K03K78O5j69J50r0j76k39L77n1P53q12K34o73j40R05j73N64r85j89
$$ -442 -377 -174 104 169 0 150 60 -116 -355 22 -29 724 -88 146 -527 -667 238 65 629 -356 -545
5373e45J319l94K25n53k02l52Q41l56l39L40N61l07l55qk78P36J25o48m2j54L01
$$ -545 774 380 605 52 -150 -502 339 -17 -356 -16 545 238 -117 -125 -403 333 458 -190 -232 -386 -85
5394h5j07K25m74K73K33n2k3j72N11j93N60j049J13M8O06K31k77p64j21M18K53
$$ -85 -192 33 -441 -168 65 13 -10 -182 329 136 696 -353 -240 -192 414 645 368 -396 -517 -99 154
5415A54j8q6k78M84m17M53J5r57O20Pj23p4L77j92P6K07K6m55N17j10K54k61l71
$$ 154 136 50 -228 256 -161 292 307 -650 -30 -23 -146 -220 157 -35 41 248 274 -181 336 226 480 219 -152
5438a52L99k0m44j06n2J71Q23j091OM95j07L90l34Q4l11j61P62m64j66K07O24
$$ -152 247 227 -217 -323 -375 -204 619 -472 -466 29 -78 312 -22 62 -249 -410 352 -112 -278 -71 553
5459E53o6o64N8J25j17L94O1j56m6q04R82K76l88l80L65O29o63r57Q25j98j01
$$ 553 487 -177 -119 6 -111 283 344 188 142 -662 320 596 208 -172 193 822 159 -798 27 -171 -272
5480b72N89n79J24q0M74r8k79j74M52J37n93J69M10m06O06K09l54o28K77L29k73
$$ -272 317 -262 -138 -218 256 158 -121 -295 157 294 -299 -130 280 -126 480 689 335 -293 -16 313 40
5501D0m73N37L7K87j97m48p9O15l12j67n40Q57j9j16K28k29p17N37N54k34k49
$$ 40 -433 104 141 428 231 -217 -296 319 7 -160 -700 157 138 22 250 21 -696 -159 395 161 -88
5522h8M29j35l93r9L46J6n85M12N60q58K78q6K50k1p58L79L66M64j87q5o88j32
$$ -88 341 206 -187 -286 60 76 -509 -97 463 -395 -117 -203 47 26 -732 -353 13 477 290 205 -483 -615
5544f15Q45K53n09K82m92O96j67k55L28j61J01n70P49r7n64j33K23j22j05mL83
$$ -615 230 483 -26 256 -236 460 293 38 366 205 306 -264 485 388 -176 -309 -86 -208 -313 -317 66
5565F6M48j339N51L52p7P67o96m09J62N06n14o26Q02j10o4Q80m49n01K74K7Q5
$$ 66 514 -825 -274 78 1 768 72 -337 -175 331 -183 -809 -7 -117 -181 699 250 -251 23 50 135
5586A35Jn26Q19m12J36m71J37M58J65l77k26M0n25O27q1K80j87l77P09L1j93j52
$$ 135 136 -390 429 17 153 -318 -181 277 442 65 -161 -121 -646 -19 -100 180 -7 -384 325 356 163 11
5608A1n6r7r0J26j65n01N60O25k22j95j70L42K0j89k51J96l40M80k25K10r2n65
$$ 11 -45 -142 -232 -106 -271 -772 -212 413 191 -4 -174 168 188 -1 -252 -56 -396 84 -141 69 -23 -588
5630e88J211p04m29O45p71R35r61N12m63J098Ln00M37p71N18J59j41j23j86m8
$$ -588 623 -81 -510 135 -636 299 -662 -150 -613 485 488 -12 425 -346 172 331 190 67 -119 -167
5650a67k54M13o92Q87k65MK96k48k31J71rk98P09m20R0M10K42p90m42J42K24O70
$$ -167 -421 -8 -700 187 -78 -74 222 -26 -257 -86 -95 -393 316 -104 -14 396 638 -152 -594 -452 -228 442
5672D42o37J79n1m13J08M11j03k76O25q68J149j462J410o4l54k51K41l49L01j79
$$ 442 -195 -16 -67 -480 -372 39 -64 -340 285 -583 566 -896 514 450 96 -155 86 -263 38 -141
5692a41m13J000l80K33K29k00J32j277J474n28l35N01K99j238J043n77k57R14
$$ -141 -554 446 66 299 528 328 460 -817 657 129 -206 295 594 -644 399 -178 -435 479
5710D79r97K59k43L45K35J55n54M23J49m7lp2j36m00O65l25J40L7j27J94l7KK28
$$ 479 -518 -259 -502 -157 78 233 -321 102 251 204 201 129 -7 -407 258 -67 73 110 -17 177 140 142 370
5733C70o31M03k70k18k37L88k0M6M56k2l03o3n16L82J72P5K82m81J15o6J84k96
$$ 370 -261 142 -128 -346 -583 -195 -215 -169 287 265 -38 -101 -617 -235 -63 12 294 -187 -72 -138 46 -250
5755b50N24k35k97k54p7P61K22n06l7L0J29n56K35K77R9J24M84p18K2L57q5pj42
$$ -250 274 39 -258 -512 -589 172 394 -112 -149 -119 10 -546 -311 -34 65 189 673 -45 -23 334 249 242 100
5778A00m44R00n87L47j80M20m32J69o44N35m57jL17n56K74N01j38L29r14K46j19
$$ 100 -344 556 -31 316 136 556 124 293 -351 184 -273 -274 43 -513 -239 262 124 453 -461 -215 -334
5799c34j96M41qN40m92j8O10r87O9N94o25M30M28m16pp06R41k76j55p9k35M08
$$ -334 -530 -89 -97 443 -49 -67 543 -444 -375 219 -406 24 452 36 29 -677 264 -12 -167 -246 -481 -73
5821g3O24l21p02K22Q3N42q81P32j00O6k30j88l84J006k53n72K02J71p3K7M2m05
$$ -73 551 230 -472 -250 -167 375 -506 226 126 192 -38 -226 -610 396 143 -429 -227 -56 -129 -102 -60 -465
5843d65N48m40M35P25p10m91M25N4M48p9m71m88J338j102j42j09O27L7M97n83
$$ -465 83 -357 78 803 93 -398 27 81 529 450 -21 -509 829 -273 -415 -524 103 140 637 54
5863E4l83O11m46J31k40K93j72l11N53l26j26K5O03N0m14O59mp48j93L96j75L
$$ 54 -329 282 -164 -33 -273 20 -152 -463 90 -236 -362 -337 266 316 -98 561 557 -191 -384 12 -163 -160
5885a60J3J40o3k16L72J24j64l27L89R7J5J53l05M07k01J6j71n9l29M84r03O62
$$ -160 -147 -7 -70 -286 86 210 46 -281 108 205 220 373 68 475 274 290 119 60 -269 215 -688 -26
5907b6M79k91m50K89L76n50L84k64j47K19K03j34K1J33p44L81Q1n98K59O14n86
$$ -26 453 162 -288 1 377 -173 211 -53 -200 19 222 88 109 242 -502 -121 -40 -638 -379 235 -351
5928c51M51l48K01L3k07k73Q36L85m65J19o33P14M20o33o6l99K03n26j43P25n15
$$ -351 100 -248 -47 -14 -221 -494 342 727 262 381 -252 462 882 249 183 -216 -13 -539 -682 43 -472
5949d72R17n58J75j58K76n50L55o0k44N64k43M85k77p7J41J69r3l70N08N63r28
$$ -472 445 -113 62 -96 180 -370 -15 -75 -319 245 2 487 210 133 274 443 350 -20 488 1051 123
5970A23M66j236L40J78P0m91O2J83K24N87n14L72p84J075m46j52K88k85L79q66
$$ 123 589 -647 -307 -129 -59 -550 -488 -305 -81 506 -8 364 -420 655 209 57 345 60 439 -427
5990d27L43J80l02J28K86L78k37j83r80R98l80L39l07J48L30n4R1p30L08l7J53
$$ -427 -84 96 -206 -78 208 586 349 166 -814 184 -196 143 -164 -16 314 260 351 -379 -71 -108 45
6011D5K56l04L98m00j57R6K39P6j37J45k02K30n80J160j430O09P41r37k72K10
$$ 45 301 -3 395 -5 -162 -66 173 249 112 257 55 285 -295 865 -565 44 785 -152 -424 -214
6031b14K51K73r16K20N46K94k54R0m2l39o3j06j8N28l36M66l55Q9k67P42n59k28
$$ -214 37 310 -606 -386 160 454 200 290 248 -91 -154 -260 -278 250 -86 380 25 114 -153 589 30 -198
6053a98O4M66l79N80oo79j16Q95o34j33l81N46K25l07K3Ql29M88m63O6J74N02
$$ -198 -134 332 -47 533 527 -152 -268 627 -7 -140 -521 25 250 -57 -34 -26 -355 133 -330 -264 -90 412
6075D12m50k1j31j15N9N13l18J42M48p44P87o25P94n97o10N52J62L22p97k33J79
$$ 412 -38 -59 -190 -305 -246 267 -51 91 539 -205 582 -43 751 154 -456 96 258 580 -217 -450 -271
6096b71J84N29l25n08O88l50n5R3l25M18m71N60m34J04K43N57o38M29K1j86L20
$$ -271 -87 442 117 -391 297 -53 -108 -15 -340 78 -393 167 -267 -163 80 637 -1 428 449 263 583
6117E83p56Q5K14O4N0l5n17P1rK22n03M24o9O6N89l06M2k42P5l48N25o09J86m0
$$ 583 -173 -88 126 190 240 205 -312 -241 -250 -28 -531 -107 -176 -110 479 173 215 -27 48 -300 225 -384 -198 -238
6141b38k37L57j21N7L57m35M8l7N87o28O9J69k89L78l39N1K88m88K39J24q8L04
$$ -238 -475 -118 -239 -182 175 -260 -212 -249 338 -290 -221 -52 -341 37 -302 -251 37 -451 -212 -88 -176 128
6163A28n71L06J90l28K87P1K30o10J81p51J386m64M07m69K42o40N84J67p5k29
$$ 128 -443 -137 53 -275 12 83 313 -297 -116 -867 519 55 462 -7 235 -405 179 346 271 42
6183D2j62k04K02j4j67J97l61M02L93k98J94l0J36r3m08Q36o44m16N25l91P01
$$ 42 -120 -324 -122 -136 -303 -106 -467 -65 328 30 224 194 330 237 -171 665 21 -395 130 -261 440
6204D40p11Q2J71K45n63M96L20l48Q4j47m82M46L60L9o17M14L16j87r7m06O01
$$ 440 -271 -189 -18 227 -336 160 480 132 216 69 -413 33 393 432 -185 229 545 358 261 -145 456
6225D56k48j09k47O21p55P9j72P63n37O26o09L1K86J02l53L47k04p06R27O6n84
$$ 456 208 99 -148 473 -282 -203 -375 388 -149 477 -132 -101 185 287 -66 281 77 -629 298 364 -220
6246b20q1Q81q62Q2L24L19j012l07R59m46N32o6k28M60m56J55n7l21M21j81L22
$$ -220 -301 580 -282 -200 124 443 -569 -876 83 -363 169 103 -125 335 -121 34 -23 -344 77 -104 218
6267B18M8J51n06P56n37J4o8l60N20j68k31L03K17m09K3J88k19M13m34k88K6L54
$$ 218 266 417 -89 667 130 144 76 -284 236 68 -163 140 357 -52 -29 159 -60 353 -81 -369 -343 11
6289A1j7M83j87l30l1J65L72k89k55L49o14K26k34K43K90K7n65j03O46m15J98
$$ 11 -6 477 290 -40 -71 94 466 177 -78 271 -343 -117 -351 -108 182 209 -356 -459 187 -228 -30
6310c0J2o44R71l61k88Q18p39JL13K99j45k37P2p0J82q58J149k50j0k48k24L79
$$ -30 -18 -662 309 -52 -340 478 -261 -260 53 352 207 -30 42 -28 154 -704 445 195 185 -63 -287 92
6332I2M75n54K67m86M81l8k91k16J00O11j003N85j28J4m64Q6K06o5R02r51N14
$$ 92 567 13 280 -206 275 237 -54 -270 -170 441 -562 23 -105 -91 -555 -469 -263 -328 574 -377 137
6353A37l75l20L32l68P91o90J96M83J22k00l03N50o51L08L69k99l33M65r02R94
$$ 137 -238 -558 -226 -594 197 -493 -297 186 308 108 -195 355 -296 12 381 82 -251 214 -688 306
6373C06J31n75J29J76r6M81j106O62K09n71J93K8J24j67L28k19k52k8K59k52J48
$$ 306 437 -138 -9 167 71 552 -554 108 317 -254 -61 -33 91 -76 252 33 -219 -247 12 -240 -92
6394i2J58J1n85K42J97N32j95j25K31p6Jj73L26k15k76m7l8o90P71L01j39J43
$$ -92 66 77 -508 -266 -69 463 268 143 374 298 299 126 452 237 -39 -86 -124 -814 -43 258 119 262
6416B62m26L23J21l21L47j20J05o04M79L53p19l03K81M62J94o81O2M34j02o5K27
$$ 262 -164 159 280 -41 306 186 291 -313 166 519 -200 -503 -222 240 434 -247 -185 249 147 82 309
6437C09l27k31j7N06K07o41R42l99K3j11K86l95M8O68o54L65n95j19K73Kr3J98
$$ 309 -18 -249 -266 240 447 -194 748 349 372 261 547 152 200 868 214 579 -16 -135 138 140 47 245
6459B45K04q0n74j59J23K65J07m50Q26n73MJ34p5J86P4p1o19J86K91K62k38K84
$$ 245 449 369 -205 -364 -241 24 131 -319 507 -66 -62 72 -3 183 257 186 -433 -247 44 306 68 352
6481C52m77o8r1L46K80j46m23K00J20j2K13mq34M41m64N94j78m07R54j70n11K3
$$ 352 -125 -193 -284 62 342 196 -227 -27 93 81 294 290 -544 -103 -567 27 -151 -558 396 226 -285 -262
6503b62M84m52L86k62L70l43%K04o52L26k54N77J7q7n2l54KK72n1M44n00k71j41
$$ -262 222 -230 156 -106 264 -79 -79 125 -527 -201 -455 122 139 52 0 -354 -352 -80 -131 313 -187 -458 -599
6526e99N65j85N73M77j346P5O07J58o2k6k83n2Q6jm72L07K24j11m38R91o18R6
$$ -599 -34 -219 354 831 -515 -440 167 325 263 237 -46 -98 -12 -13 -485 -178 46 -65 -503 488 -130 -34
6548c4P30k20r25Q16k91N95r77N62N86q46L11l64K75L4q45N78l45N08Q5Rk97J59
$$ -34 696 476 -449 367 76 671 -306 256 842 -4 307 -57 218 252 -593 -15 -360 148 233 242 -55 104
6570A04j83j43L88j90k20j5M91n6j15n97j42Q34j48K43l16M04j93R9r6p6j43o09
$$ 104 -79 -222 166 -24 -244 -259 232 176 61 -536 -678 156 8 251 -65 339 146 245 149 73 -70 -679
6592f79N51M37o61P86o24L51l42M53q13J42P05m06J21R9m3Q0n30Q03n15M37K28
$$ -679 -128 309 -352 434 -190 161 -181 272 -541 -399 306 -100 21 120 77 157 -373 430 -85 352 580
6613E80q01O13k54k4O18j011M05K28n14K83k82J2n7K20J34m62N9L06l5j27p06
$$ 580 -221 392 138 114 732 -279 126 354 -160 123 -159 -147 -204 16 150 -312 -253 53 18 -109 -815
6634h15O21j1j16L96n8l59Q02p46o9R3J8N22o47P63m01K11j18J8Q9l39K06j99
$$ -815 -194 -205 -321 75 17 -342 460 -286 -355 -262 -244 278 -369 394 -7 204 86 104 193 -146 60 -139
6656a39M42m63m45N69L12k75q2R9K52M66m56n48K7K49k84M30j04O9M19o91L75
$$ -139 303 -160 -605 -36 276 1 -81 18 270 736 280 -268 -241 8 -276 154 50 119 538 -153 222
6677B22r4K73j109N92M59q1o23j37O52O0n81J8K65M20m41m3M63m43J86m34P19
$$ 222 128 401 -708 -116 343 262 -361 -498 154 214 -367 -349 -84 336 -105 -148 315 -128 58 -376 343
6698C43p72o2N03L73j70l82J47j96K29k0p0j10K37L63k09L0o90O30n20J00K12
$$ 343 -429 -491 12 385 215 -167 -20 -216 13 -7 -77 -187 50 413 204 234 -456 174 -346 -246 -34
6719c4J27q7k90M34k21K10J50k02j24r6M99k70O3J09n22K79j01m19M75j54J87
$$ -34 93 6 -284 150 -71 139 289 87 -37 -133 366 96 159 268 -254 25 -76 -495 -20 -174 13
6740A3k00N93p22P18J23l89j19L33o40Q68n17m25O29m03j57l31O71J3rr0Q8M07
$$ 13 -187 406 -316 402 525 136 17 350 -290 578 61 -364 265 -138 -295 -626 45 58 49 -41 47 454
6762D54k88l36j06K78j08Q51r71p2M37m30N71l9m46k2L0J20o8m23M26j20O4ML54
$$ 454 166 -170 -276 2 -106 745 -226 -298 139 -291 280 241 -205 -227 -197 -77 -145 -568 -142 -262 -198 -194 160
6785A60q22O34k04O6K51p9k2L53p03N1J01M58K73j064P78M13r25k81Q81j28n8
$$ 160 -662 -28 -232 -166 85 6 -16 337 -366 -315 -214 244 517 -547 231 644 -281 -562 319 191 133
6806A33n05K1L94l37L62p8P31r53L32m43M19M40o67L10r0J85l23l44K94J62M56
$$ 133 -372 -351 43 -294 68 -10 721 -232 100 -343 76 516 -151 159 69 254 -69 -413 -119 43 499
6827D99p85R22j018j15J038j008Q62o98M26pm55m04R39j66J89l15J37k6L03l40
$$ 499 -286 636 -382 -497 541 -467 395 -303 123 116 -339 -743 196 30 219 -96 41 15 318 -22
6847b2M74r9l13J79o3N4j53L9l62M07k01K14R5m63k48L88M01r00R12n02L78n23
$$ -22 452 353 40 219 156 210 57 96 -266 141 -60 154 249 -214 -462 -74 327 -573 339 -163 215 -308
6869c08N66l32J12j15K97k39J68k21J172p46k43n37N92m34p7N46l08M47j05j09
$$ -308 258 -74 38 -77 220 -19 149 -72 1100 354 111 -426 166 -268 -345 201 -107 340 235 126
6889A26l76J11L70K92r67R38j8m86k25L16j58K70J11j02N3m2k59l66K37O26l94
$$ 126 -250 -139 231 523 -444 494 476 -10 -235 81 -77 193 304 202 255 213 -46 -412 -175 451 57
6910E7j50M34J1o74O64m77j93O10m10l20K65J57j67KM2m02M98l85O31K8m09m91
$$ 57 -93 341 352 -322 342 -135 -328 282 -128 -448 -183 -26 -193 -191 -149 -551 -53 -438 193 221 -188 -679
6932f79Q0N09N50r21lj3N74K93j3j38L70r12L54n80P90L82n90k28m47J294j060
$$ -679 -599 -90 460 -461 -464 -477 97 390 377 239 609 -303 51 -529 261 643 53 -175 -622 672 -388
6953c88N13p8K5n10R04n14M25l6j006L00N79o28K78N21m81J27J10N9n38P78k94
$$ -388 125 47 72 -438 466 -48 377 341 -665 -365 214 -414 -136 385 -96 31 141 200 -338 440 146
6974A46k05K3O93r39R23l11J62n09m83K94r7J78Pn58R67n44K05P2j90L92l20N43
$$ 146 -59 -36 657 -282 641 330 492 -17 -500 -206 -303 -125 -118 -676 291 -253 -48 24 -166 226 -94 449
6996D49m54nj92L42k40O37j152R18q05R57l69j68p4J42j64l84M94j09n7m0J58
$$ 449 -5 -10 -202 140 -100 537 -615 303 -502 455 86 -82 -156 -14 -178 -562 -68 -177 -234 -274 -116
7017a16k31Q75k69j89m76N84l68J07O7K09k4N31q68j07O81n35J17p91R71l08m83
$$ -116 -347 528 259 70 -406 178 -190 -83 -16 193 169 700 -168 -275 406 -129 -12 -803 168 -140 -623
7038f23R17q64L35L98j64l28R26p88L15J25q7k01l44L2J73M18n31Q20l79q69O69
$$ -623 294 -570 -235 163 -1 -329 597 -191 124 249 162 -39 -383 -351 -178 240 -291 529 150 -719 -50
7059e0K65m5P0r7l38j14M78L23l83j78N76k93k20M50m97P5K04j69l60KR30k57
$$ -50 215 170 240 143 -195 -309 169 492 109 -69 507 214 -6 444 -53 22 226 57 -303 -301 629 372
7081C72p14M65J34o59J032j333N60J34l26Q18J4p60L39L95l01n17Q73p78R8m11
$$ 372 -342 123 257 -402 630 -703 -143 -9 -335 483 497 -263 76 471 170 -347 526 -252 -154 -565
7101e65M16o2M18m1o09M99k51j02o5l89M39J13L1k12N02j09j57P72q69M13m31
$$ -565 -149 -211 207 166 -443 56 -195 -297 -362 -751 -312 -199 -168 -380 122 13 -144 628 -241 172 -259
7122b59m90L52K94J91j85M7q7K3kM00k57J85l75M43no64o4J76n86O92n8J86J82
$$ -259 -749 -397 -103 88 -97 -50 -137 -114 -116 284 27 212 -163 280 275 -389 -453 -277 -863 -171 -229 -43 139
7145A39j50j38M09j01J66o48Q3Q87q20k22P30m66K94j37k60r8L04l52k86L85m57
$$ 139 -11 -149 260 159 325 -323 -240 647 -173 -395 335 -131 163 26 -234 -332 -28 -380 -666 -281 -738
7166g38Q81j99j95M17M50o41o09k49J099k18k45N84j42n59M04j43N13p11K65J8
$$ -738 143 -56 -251 166 616 -25 -634 -883 216 -2 -247 337 195 -364 40 -103 410 -301 -36 -18
7186a8K32k04K79k68P82j129P9j56L73L90m35M69o63M80N37r10L73j38J14j49
$$ -18 214 10 289 21 803 -326 -247 -403 -30 360 -75 394 -269 211 748 -162 211 73 187 38
7206C8K81m38r2K34M43r55O95q59N17k14r7J04m8N05j26o2r33M07j07Q08L36l85
$$ 38 319 -119 -211 23 466 -489 206 -653 -136 -350 -447 -343 -391 114 -12 -74 -1007 -600 -707 101 437 52
7228E2k52m4J97l50N01k79L79o4j16o71R12l05J30Mj08J37l90J76O35n02M85P3
$$ 52 -200 -244 -47 -397 104 -175 204 140 24 -647 265 -40 90 94 -14 123 -267 -91 544 42 527 600
7250F00m87K1l67j90l2N98j10L97j4o95K40l93M46j2j45O24l64m95K5N71L69o03
$$ 600 113 134 -233 -423 -455 143 33 430 416 -279 -39 -432 14 2 -143 481 117 -378 -353 218 587 -16
7272a6O3L83j10j56l5M3m91O62m5m01k04J63K26j48L87l35M04o23M75J45k63L77
$$ -16 47 430 320 164 129 172 -319 343 298 -103 -307 -144 82 -66 321 -14 390 -233 242 387 124 501
7294E01r32L88L24l01K53j26m99P29m09O52J65m81j469O10R21m02K63r1j05j69
$$ 501 -431 -43 281 -20 233 107 -392 337 -72 580 745 264 -1205 -595 326 -76 187 96 -9 -178
7314a78L03M0j58k24m42J462p11Q9j85l22K10o8LJ84Q15p85r7L24l99r8m9J47
$$ -178 125 165 7 -217 -659 803 92 181 -4 -326 -116 -184 -181 3 818 33 -64 260 -139 -237 -286 -139
7336a39%M14r35L99L83J35m8l74N42k12k88O64k94m94l11M05J16m36M15K12j96
$$ -139 -139 275 -660 -261 122 257 209 -165 377 165 -123 541 247 -247 -558 -153 -37 -473 -58 154 -42
7357d2%J36m16N86o25M54k95L10J08j50J42o20mO76m44K91l83P78o85j76N21k37
$$ -42 -42 94 -322 264 -361 93 -202 108 216 66 208 -412 -416 260 -184 107 -276 502 -183 -359 162 -75
7379g5j35P18j080R94n68J24J14M89p98L18k71m2K89k22O64q56M16K5k54L58m32
$$ -75 -210 508 -572 422 -146 -22 92 581 -217 101 -170 -212 77 -145 519 -337 79 104 -150 208 -224
7400b24K08O71j089K97l81K78K81J8K7j11K63o0J75l10r79Q01m6L59j36k15N03
$$ -224 -16 655 -434 -137 -518 -240 41 59 86 -25 238 178 353 43 -936 -135 -181 178 42 -173 330
7421C30n79M50K57p76K45M56p6n57Lr6O01o00j16O7J80p5M55n2o11L61l5K78k09
$$ 330 -249 201 458 -318 -73 383 307 -250 -247 -343 258 -342 -458 -391 -211 -286 169 117 -494 -133 -168 110 -99
7444i9m19M71J33m26M89k29K8k01J70N20o85N98M96j011N36k87J35k61O9L58p
$$ -99 -518 -47 86 -340 149 -80 -52 -253 -83 437 -248 350 846 -165 371 84 219 -42 27 385 378
7465C78k90M53p8p93Q04n58M73L54n47j70l77J206p3o72J23k67k92j37P0o0N35
$$ 378 88 541 463 -330 474 -84 389 743 196 26 -351 855 782 110 233 -34 -326 -463 -393 -453 82
7486H2P32o15kj68J88m35l4o0J33K22p2m4L48o73M08K13Q4j69k15M71l01j9J12
$$ 82 814 199 197 29 217 -218 -252 -312 -179 43 -29 -73 275 -398 10 223 307 138 -77 394 93 74 186
7509A86L17m40q8l7j04O86m62l58O58k54O42k38m70J03K36n92Q35q14L96n4k45
$$ 186 503 63 -25 -62 -166 520 58 -300 358 104 746 508 38 141 377 -215 620 -194 202 148 -97
7530i7j69Q91o34N3r5K6j8L57K6j41p30K07K34K28K99l48n8j72K50m82L26l65
$$ -97 -266 625 -9 44 -51 -25 -43 314 340 199 -531 -324 -90 138 437 89 31 -141 109 -373 -47 -412
7552d12%P35k63k07R67r89Q8o59M35N29N6J74p05k8m9Q03o29o2K63o36J162l80
$$ -412 -412 323 60 -147 820 -169 -81 -740 -305 224 280 454 -251 -279 -328 475 -154 -216 47 -589 573 193
7574A93n82L17k98j59N78K9l17L98o40J07P98k68j90M28l79j21Q53j67r56K88
$$ 193 -389 -72 -370 -529 49 78 -239 159 -481 -374 424 156 -34 394 15 -106 747 580 -376 -88
7594h8k83N91k61K74o02J286j114L26J64M8m85J61R8n6nM68j10n39J57m19J20
$$ -88 -371 220 -41 233 -369 917 -197 129 293 341 -144 17 115 59 54 522 412 -127 30 -389 -269
7615b69L46k86Q73k95l60K57n8Jj39l82J255o03n30J2k33L21L82o74r4N19j4m2
$$ -269 77 -209 664 369 9 266 208 209 70 -312 943 340 -190 -178 -411 -90 292 -382 -476 43 29 -13
7637a3j74N94o33j9L74l19L15q5L4K03n42M64n97P47n21L61o23N43l89K37j5k0
$$ -13 -187 407 -226 -245 129 -190 125 40 74 277 -265 199 -398 349 -172 189 -434 109 -280 -43 -58 -78
7659g8k44p6L26J7L55R0m83j64L58k18K61p6P2m36K42m32N25J38j84l99L67m21
$$ -78 -322 -398 -72 -55 300 390 -93 -257 101 -117 144 68 140 -296 -54 -486 39 177 -7 -406 -39 -460
7681d60J308n50m00K37J05l84M31p22k10J97J19N72q96N42k03o2L12K60j6l98
$$ -460 848 298 -102 135 240 -144 287 -435 -645 -448 -329 243 -653 -111 -314 -376 -64 196 180 -218
7701b18M57j74k72QK49K37n57m9N55o41M47m30o4K20Ll67M14L43m24O10j06Q7
$$ -218 239 65 -207 -199 50 287 -270 -319 236 -405 42 -388 -452 -232 -229 -596 -182 161 -263 347 241 328
7723C28K68o63P4J53Q31j189O12j17M9m83q5L8N50m80M1J25J64N94p05m19K59
$$ 328 596 -67 7 160 991 -198 414 297 346 -137 -222 -184 366 -114 -73 52 216 810 105 -314 -55
7744e5K93J60n79k01k60L01M44j06n7N13K6q91j51Q40K88k85l59j64R2N33l12
$$ -55 238 398 -181 -382 -642 -341 103 -3 -60 453 479 -412 -563 277 565 280 -79 -243 -151 382 70
7765G0L13O2o23O35o46K9J24m2j64k51N55M51j3p63k21R83n31k40J34O3k76J21
$$ 70 383 445 -178 457 -189 -160 -36 -78 -242 -493 62 513 500 -263 -484 499 -32 -272 -138 -75 -351 -230
7787b30K28j95L17n72L41J89m13M89k17o35O36p6O47j590J035j86J32j3j04J04
$$ -230 -2 -197 120 -452 -111 78 -335 154 -63 -698 -62 -138 509 -1081 -46 -232 -100 -113 -217 -113
7807a13l58L92m0L91j89n5k86O55m76N58k0o42k36K84J50K54P2k39k05l45N36
$$ -113 -471 -79 -119 272 83 28 -258 397 -79 479 459 -183 -419 -135 15 269 341 102 -103 -448 88
7828H8n20N04j83k32o5L5K4J95J93p64P81Kn42J81O27Q6o00J79M9l55N57l52m7
$$ 88 -432 72 -111 -343 -408 -373 -349 -154 39 -725 56 58 -484 -303 324 410 -190 -11 38 -317 240 -112 -159
7851a59P22k28l34M49l8l66k24L79l40K09J15n58J47Qk16M84N53q35J16j07K56
$$ -159 563 335 1 450 412 46 -178 201 -139 70 185 -373 -226 -218 -434 50 603 -232 -116 -223 33
7872C3j6k48K68J0l65Q40n21j13J22N1j43M07k72%J08K71l15q7K34L3l41J32p9
$$ 33 17 -231 37 47 -318 522 1 -112 10 61 -82 325 53 53 161 432 117 30 264 297 -44 88 9
7895Ij7K57m81J79j10L87N82j150P36k8l83J80L98K61l16m89J92l89K69K54p33
$$ 9 -8 249 -232 -53 -163 224 806 -344 392 364 -19 161 559 820 504 15 207 -182 87 341 -392
7916c92N98k35J17j86j98L09M02n13M23m08J41j4Q1l15J74K30K52p63k1M30J71
$$ -392 206 -29 88 -98 -296 13 415 -98 325 -83 58 44 125 -190 -16 214 466 -297 -318 112 283
7937B83m82rr3M90J19n49M40n52l70P43R1m46M99k50J40o13O63k54L54j03J86
$$ 283 -199 -208 -301 189 308 -241 199 -353 -723 20 111 -335 164 -86 54 -559 104 -150 204 101 287
7958B87o38K61J54Q2o54r8N81k69o6K20O26l27n55M95q55M13M60l98K79k13M73
$$ 287 -351 -90 64 146 -508 -606 -25 -294 -360 -140 486 159 -396 99 -756 -343 117 -281 -2 -215 258
7979B58N30k24q13N35o21N20k44r3M72k86J20r86J059l96k24P60o0m51J38K39
$$ 258 788 564 -249 286 -335 185 -59 -152 320 34 154 -832 227 -169 -393 367 307 -144 -6 233
7999B33Ko93M66j4J48K92k53k58m15O15K45jj04l7Q9l46n6o98Q05K34J59m55j98
$$ 233 235 -458 8 -6 142 434 181 -77 -492 123 368 367 263 226 315 -31 -87 -785 20 254 413 -42 -240
8022b40J85K88o00k15Q11m63O89p23N19l78Q8l28R66o97N35l60L59l47K66m48
$$ -240 -55 233 -367 -582 229 -234 455 -268 251 -127 -39 -367 599 -98 437 77 436 89 355 -93
8042i3j68O45j44q13K53J266q28k65k13Q27j75n98O58k63j96P2J19L6j78l68L60
$$ -93 -261 384 240 -573 -320 946 118 -147 -360 467 292 -306 352 89 -107 -35 84 120 -58 -426 -66
8063f6K29k3k02o27P69l09L59m90L16k15P99q93K92j73L60M10o95Q09q18k21Q83
$$ -66 163 140 -62 -689 80 -229 130 -360 -44 -259 540 -353 -61 -234 126 536 -159 650 -168 -389 494
8084D94o26L31K1k79j60J68N10l76j74K99J00o3m80o8N61K19p11J88o24J562n61
$$ 494 -132 199 220 -59 -219 -51 459 83 -91 208 308 245 -235 -303 258 477 -234 -46 -670 892 331
8105C31m27L17k8l33N16m42K4J184j592N21n9m35M80N36n57k75P30o13N11Q7r7
$$ 331 -96 221 193 -140 376 -66 -42 1142 -450 71 12 -423 57 593 36 -239 491 -122 389 476 379
8126C79k21j24q8N4j91M21J69l35M17ll43k09j48L11p02M62j28K05K43K4l21K58
$$ 379 158 34 -54 0 -191 230 399 64 481 478 135 -74 -222 89 -613 -151 -279 -74 169 193 -128 130
8148A30P8L87j291N3O83n8P9N50m48p31K97L76K82K05l64j58J88l59K6l82M58
$$ 130 208 595 -696 -643 40 -18 61 611 163 -568 -271 105 387 592 228 70 258 -101 -75 -457 1
8169Ak34K12n9J01L10k84k00k16L98L3K88J55p64K47J11j68O0J7M9k98N54n85
$$ 1 -233 -21 -80 21 331 47 -153 -369 29 62 350 505 -259 -12 99 -69 -9 8 57 -241 313 -272
8191b72
$$ Imaginary data points
##PAGE= N=2
##DATA TABLE= (X++(I..I)), XYDATA
0@%%%%%%%l2O4o4O4o4R6j28J31j63K21k53K88l52M16m80N49o40P38q41R63j095
$$ 0 0 0 0 0 0 0 0 -32 32 -32 32 -32 64 -64 67 -96 125 -128 160 -192 224 -256 293 -347 391 -450 513 -582
28e82J246j409J584j787K008k246K509k793L106l455L837m255M716n226N785o400
$$ -582 664 -745 839 -948 1060 -1186 1323 -1470 1636 -1819 2018 -2237 2479 -2747 3038 -3362
44c362P087p857Q730r721J0847j2156J3696j5529J7764k0565K4189k9082L6091
$$ -3362 3725 -4132 4598 -5123 5724 -6432 7264 -8265 9499 -11066 13123 -15959 20132
57B0132m7057O6798j13357M20560L38989p47792k23080K38152K44953q8928p897
$$ 20132 -26925 39873 -73484 347076 686065 -61727 -284807 -46655 198298 109370 101473
68A01473m7239j62590p0935K68970J51728j74283j54067J39210M1946j88264o2568
$$ 101473 54234 -108356 -179291 89679 241407 67124 -86943 52267 94213 -94051 -156619
79a56619K11584O1862j89373r1877J42553Q8541j5168K4593k351j50162n7255
$$ -156619 54965 116827 -72546 -164423 -21870 66671 51503 76096 73745 -76417 -133672
90a33672J83362J12265j83458j48860J38349J54535o3464o5908O7830Q772q7894
$$ -133672 49690 161955 -21503 -170363 -32014 122521 59057 -6851 60979 69751 -18143
101a8143K3914Q6207q6309j32810J03169J63440r8649j68828J07243J92010p6384
$$ -18143 5771 91978 5669 -127141 -23972 139468 40819 -128009 -20766 171244 94860
112I4860j78867L1246J05891m9897o1877O6676J2919r9548K9844J67858p467j88900
$$ 94860 -84007 -52761 53130 3233 -58644 8032 20951 -78597 -48753 119105 111638 -77262
124g7262j5171J84958K5953j81799n1569J42722N5314q4546j7213N9201p375j7390
$$ -77262 -92433 92525 118478 -63321 -114890 27832 83146 -1400 -18613 40588 33213 15823
136A5823O2950K211j27224l2009J49852N8208j53565q5344J30763J02290p5065
$$ 15823 78773 80984 -46240 -78249 71603 129811 -23754 -109098 21665 123955 48890
147D8890p3595K6380J0783k1221M1300K1584j08146o6368J33906J15515j21915
$$ 48890 -24705 1675 12458 -8763 32537 54121 -54025 -120393 13513 129028 7113
158G113j41642R1789J44397n5354j18440K2501N7974k3457K281N5523m2424r2457
$$ 7113 -134529 -42740 101657 46303 -72137 -49636 8338 -15119 -12838 42685 261 -92196
170i2196O6950J47061n2197j77193J8856J79304J7091j51053l9496J02320L6961
$$ -92196 -25246 121815 69618 -107575 -88719 90585 107676 -43377 -82873 19447 56408
181E6408m5984k079K539n1956J0094J06244K091j46632l5328J54996P0739j35157
$$ 56408 10424 8345 10884 -41072 -30978 75266 77357 -69275 -104603 50393 121132 -14025
193a4025r2233Q7866Q0287m0936m2874Q685j0576J446P1237K0672j10925n8960
$$ -14025 -106258 -18392 61895 20959 -21915 -13230 -23806 -22360 48877 69549 -41376 -100336
205a00336J20838R2269j07757j14167P3080J07415l6227o7117J9814J8592k2484
$$ -100336 20502 112771 5014 -109153 -36073 71342 35115 -32002 -12188 6404 -16080
216a6080L1466M4532p1628q9837P6594J24022o0505j38861L7577J37867l971j02882
$$ -16080 15386 59918 -11710 -101547 -24953 99069 38564 -100297 -62720 75147 71176 -31706
228c1706r631N5371o413j8209L2289j3243p4724K3650J21941j298j36268k2755
$$ -31706 -41337 14034 7621 -10588 21701 8458 -66266 -42616 79325 78027 -58241 -80996
240h0996J32788M1977j14388n9864O5765M0975k7028k97R614l8925k214Q7177
$$ -80996 51792 93769 -20619 -80483 -14718 26257 -771 -1068 8546 -30379 -32593 54584
252E4584K3307j17912o4315J06495Q3659q6965r1558N7285Q1831j5417l3076R448
$$ 54584 77891 -40021 -104336 2159 85818 -1147 -92705 -35420 46411 30994 -2082 7366
264G366j5797k3198M8254M3603q0192q3817P8921J12312m9307j08347L3315R7949
$$ 7366 -8431 -31629 16625 60228 -19964 -103781 -24860 87452 38145 -70202 -36887 61062
276F1062j0577o7710k725J8295k3241Q678N1590k5013p8620L5316J16125j1630
$$ 61062 50485 -17225 -19950 -1655 -24896 -16218 35372 10359 -68261 -32945 83180 71550
288G1550j25233j2567J07560J9162r1128k9001N0041J3245j1913L0621M845o1942
$$ 71550 -53683 -66250 41310 60472 -30656 -59657 -9616 3629 -8284 22337 27182 -34760
300c4760n324R1798J7830j14353n2322R8629O4697p1896n5296N1325M5738j9351
$$ -34760 -40084 51714 69544 -44809 -97131 1498 66195 -5701 -60997 -9672 36066 16715
312A6715k874J2218m0355l0271O3048M5953q1364o7771Q1561R1558n3576q2494
$$ 16715 13841 26059 -14296 -44567 18481 64434 -16930 -84701 -3140 88418 34842 -47652
324d7652L4033O3164k3302l9038O950o187k7065L4192N4324m4933p6605M9772
$$ -47652 -13619 49545 26243 -12795 -5845 -12032 -39097 -4905 49419 4486 -72119 -22347
336b2347J02345l2533j12449L735Q7509M970o0186m239K7600p368J2559M8905
$$ -22347 79998 47465 -64984 -61249 26260 31230 -28956 -33195 -5595 -12963 -404 48501
348D8501j7674q0513R294R9928N670j10599l1772R4541M7256o0436l3138L5598
$$ 48501 30827 -49686 -40392 59536 65206 -45393 -77165 17376 64632 4196 -28942 6656
360F656J3483j5490J7342O192o0111k5650P6763M3099q2973n9752P5686P2886
$$ 6656 20139 4649 21991 28183 -31928 -57578 19185 62284 -20689 -80441 -4755 68131
372F8131n0049o4664K4823L6294j6117r647J3635k4242k7091N0714N7324m9848
$$ 68131 18082 -46582 -21759 14535 -1582 -11229 2406 -21836 -48927 1787 59111 9263
384I263p4957M2338Q5932k4646q2102L818N7289L034k2569R780j456k6744K4114
$$ 9263 -65694 -23356 62576 37930 -44172 -40354 16935 19969 -2600 7180 5724 -21020 3094
397C094N6640k6253q1520J1696Q7905K892q2812j6273O5436K0549l8431p079J5609
$$ 3094 59734 33481 -48039 -36343 51562 54454 -28358 -44631 20805 41354 2923 -4156 11453
410A1453j6706q586L9719M034o5685j7638P7951L1481p5718m1388O3525M3480
$$ 11453 -5253 -13839 25880 29914 -35771 -53409 24542 56023 -19695 -61083 2442 45922
422D5922m7090l4808K6585J2662j7229J3746J9967l4881k7706N3104M7129n5338
$$ 45922 -1168 -35976 -9391 3271 -13958 -212 19755 -15126 -42832 10272 57401 2063
434B063n9336M5617O3824l1297n4561J9100L5998j2534q768J9610j5203l7003
$$ 2063 -57273 -11656 52168 20871 -33690 -14590 21408 8874 106 19716 4513 -32490
446c2490K7324N2378l2188p0199K2895P4040j1629o5404J530M6891k192k6614
$$ -32490 -5166 47212 15024 -55175 -32280 41760 30131 -35273 -33743 13148 10956 -15658
458a5658J0647O024k9895L680N3655k92o7101m258P6256J8249o9171k6296N6671
$$ -15658 -5011 1013 -28882 -25202 28453 28161 -38940 -43198 33058 51307 -17864 -44160 12511
471A2511K3209l5238r495K2205p133j2494L3612J5703n1274k9212N7338L9076
$$ 12511 35720 482 -9013 13192 6059 -6435 27177 42880 -8394 -37606 19732 58808
483E8808n4487n0780M1732M7759k4119l4716J3937J2233j4555Q209J8162k9929
$$ 58808 4321 -46459 -4727 43032 18913 -15803 -1866 10367 -4188 4021 22183 -7746
495g746l5770L5590M8953l2465n6904K5820N5786j3340m5377L398K4136q802o136
$$ -7746 -43516 -7926 41027 8562 -48342 -22522 33264 19924 -25453 -22055 2081 -6721 -12857
508a2857J8143o835l2139J6347N1615j0105o0823K570O0193M866n4213r560L9620
$$ -12857 5286 -1549 -33688 -17341 34274 24169 -36654 -34084 26109 30975 -23238 -32798 6822
521F822O849j9939J0258J3223k5194o726M1491J0179n5168k1896N2793K8644m6716
$$ 6822 13671 -6268 3990 17213 -7981 -14707 26784 36963 -18205 -40101 12692 41336 -5380
534e380k9509L7854K6624k5053j2247J6623o555k1153J9193K3848l2621l2860
$$ -5380 -34889 2965 29589 4536 -7711 8912 2357 -18796 397 24245 -8376 -41236
546d1236L7157M4600l0932m3062K4737L9635j7901k8929J1820J0547j4569N214
$$ -41236 -4079 40521 9589 -33473 -8736 30899 12998 -15931 -4111 6436 -8133 -2919
558b919K4731j1482l3109J8934M4263j6038n0755O522M4626m681l8134K775K4763
$$ -2919 21812 10330 -22779 -3845 40418 24380 -26375 -19853 24773 20092 -18042 -15267 9496
571I496o186j0472J8168K785l3524j241M1211P38n0973q008M7545J4602l7710
$$ 9496 3310 -7162 11006 13791 -19733 -20974 20237 20975 -29998 -38006 9539 24141 -13569
584a3569j2305L0757P423k0754K664J3133j8785j5649K9529K0747l5532k4373
$$ -13569 -25874 4883 12306 -8448 -5784 7349 -11436 -27085 2444 23191 -12341 -36714
596c6714L9053L1765l1930k9905K4005K1874j9888j2031J6592n86j7355J4358
$$ -36714 2339 34104 2174 -27731 -3726 18148 -1740 -13771 2821 2235 -15120 -762
608g62K6337j6944l1889J9778L6446j7075l9517J1886L2061q772k2175J0492J4206
$$ -762 25575 8631 -23258 -3480 32966 15891 -23626 -11740 20321 11549 -10626 -134 14072
621A4072j4873l121K2612n347l3772L715L7062l886m0671J86L7580L623k8898
$$ 14072 -801 -3922 18690 13343 -20429 -16714 20348 16462 -24209 -24023 13557 17180 -11718
634a1718j474J9611n260j4073J3241R271k5013q676L3134J6280l6150j6650L4311
$$ -11718 -13192 6419 1159 -12914 327 9598 -15415 -24091 9043 25323 -10827 -27477 6834
647F834K0281l0026j6608K1863Q780j8016N70J8500j0678j8997J8403K4123k2254
$$ 6834 27115 -2911 -19519 2344 11124 -6892 -6322 12178 1500 -17497 906 25029 2775
660B775k9779K0360K9724j8746k9187J4973K3202j1890j4311J4179O433j9096
$$ 2775 -27004 -6644 23080 4334 -24853 -9880 13322 1432 -12879 1300 7733 -11363
672a1363P59K3713o118l0116O870L3154m370l1687M027K8519l638k0466M522J3578
$$ -11363 -10604 13109 6991 -23125 -16255 16899 12529 -19158 -15131 13388 9750 -10716 -6194 7384
686G384j1447p579J7675N893k3428n055K9393P488k9653q547K7788O706k3725
$$ 7384 -4063 -11642 6033 11926 -11502 -16557 12836 20324 -9329 -17876 9912 16618 -7107
699g107m428K0736k097j5883J0171J4942j6849j5988K1539J6082k3357k0578K2887
$$ -7107 -11535 9201 7104 -8779 1392 16334 -515 -16503 5036 21118 -2239 -22817 70
712G0J8928k0931j5786J7507J0507j6745l859J6392l846k1272Q829K4338j1529
$$ 70 18998 -1933 -17719 -212 10295 -6450 -10309 6083 2237 -19035 -10206 14132 2603
725B603k4728J2016K6026q472k3268R530J8085r684j2278J3124P266j6285j994
$$ 2603 -22125 -10109 15917 7445 -15823 -6293 11792 2108 -10170 2954 10220 -6065 -8059
738h059K1793J579k4031j981K4332J458k5520k350K1671q74j8169L330J6129q444
$$ -8059 13734 15313 -8718 -10699 13633 15091 -10429 -12779 8892 8018 -10151 -6821 9308 864
752H64j3470J3327J1642j9844j1348K0634J2003k1779j1291K1684J1243j8821
$$ 864 -12606 721 12363 -7481 -18829 1805 13808 -7971 -19262 2422 13665 -5156
764e156o545J6896K395j7048K477J7206o908j8309J1235K0899j1567k0935J2668
$$ -5156 -11701 5195 7590 -9458 -6981 10225 3317 -14992 -3757 17142 5575 -15360 -2692
777b692J9652j3107j7235J2790J1571j4078p077J6107L904j6944k27J9409q06
$$ -2692 16960 3853 -13382 -592 10979 -3099 -10176 5931 9835 -7109 -7336 12073 11267
790A1267k1748J648K0008k766j9942M354J7236n188j3909R462J1483j3658r804
$$ 11267 -10481 -8833 11175 8409 -11533 -7179 10057 4869 -9040 422 11905 -1753 -11557
803a1557J5427O453j8986o230K0141N712j9266l532J9745J422j7131J075J5387
$$ -11557 3870 10323 -8663 -14893 5248 10960 -8306 -11838 7907 9329 -7802 -6727 8660
816H660n221j5226R178J4933j0890j3558J4903J4660j5039j4496J5451J1596j6431
$$ 8660 3439 -11787 -2609 12324 1434 -12124 2779 17439 2400 -12096 3355 14951 -1480
829a480r694J5000N849j5340j447J6167j691j8097M076J8362p060j8585N557J6922
$$ -1480 -11174 3826 9675 -5665 -7112 9055 7364 -10733 -6657 11705 4645 -13940 -8383 8539
843H539o832j4180R116J3027r757r385J2491P036j4942n435J6270L516j7660o73
$$ 8539 1707 -12473 -3357 9670 -87 -9472 3019 10055 -4887 -10322 5948 9464 -8196 -8869
857h869J7827N53j6115K668J4599n059j4253O435J2097r923j1449J2898J0264
$$ -8869 8958 9511 -6604 -3936 10663 5604 -8649 -2214 9883 -40 -11489 1409 11673
870A1673j3665q200J3997P823j5063p269J4685M507j5947j063J6331j502j3777
$$ 11673 -1992 -10192 3805 11628 -3435 -10704 3981 8488 -7459 -8522 7809 6307 -7470
883g470L493J5442o409j5200P778J3500r060j3375R493J1871j0804q888J2053
$$ -7470 -3977 11465 5056 -10144 -2366 11134 2074 -11301 -1808 10063 -741 -9629 2424
896B424O901j2093o607J3641K760j4692o15J5241l45j4710L331J5163m201j3960
$$ 2424 9325 -2768 -9375 4266 7026 -7666 -8281 6960 6615 -8095 -4764 10399 6198 -7762
910g762O296J1066q245r818R203Q094r834o756J1970N314j3028m518J2850K341
$$ -7762 -1466 9600 1355 -8463 740 8834 -1000 -7756 4214 9528 -3500 -8018 4832 7173
924G173j4719p45J3517j650j3246L839J3084n474j2831Q063J1817r825j0686J1305
$$ 7173 -7546 -8291 5226 3576 -9670 -5831 7253 1779 -11052 -2989 8828 -997 -11683 -378
938c78Q893j0399p420J3008O593j3228l402J3539J665j3718l51J3061o41j4720
$$ -378 8515 -1884 -9304 3704 10297 -2931 -6333 7206 8871 -4847 -5198 7863 7222 -7498
952g498L452J4119n059j3342N739J1770p874j0318Q401Q325r283p145J0677O266
$$ -7498 -4046 10073 5014 -8328 -2589 9181 1307 -9011 -610 7715 -1568 -8713 1964 8230
966H230j1391l745J1219K395j1187j235J0810k54j1344K224J0663k634j0107N298
$$ 8230 -3161 -6906 4313 6708 -4479 -5714 5096 4842 -6502 -4278 6385 3751 -6356 -1058
980a058R059p719q478P286P589r363n316J0165L802j0069j130J0500n33j0310
$$ -1058 8001 282 -8196 -910 6679 -2684 -8000 2165 5967 -4102 -5232 5268 4735 -5575
994e575O89J0467k134j0101L256J0890m254q976O416Q037q150p707Q077P223j0232
$$ -5575 -4886 5581 3447 -6654 -3398 7492 3238 -5738 678 8715 565 -7142 935 8158 -2074
1009b074o198J1309M491j1335k925J0626J180j0880l14J0904j795j0156K518J0606
$$ -2074 -8272 3037 7528 -3807 -6732 3894 5074 -5806 -6120 4784 2989 -7167 -4649 5957
1023E957k701j0176M750J0716o045q254P032O945q558n563R579N024r942l579
$$ 5957 3256 -6920 -2170 8546 2501 -5753 1279 8224 -334 -5897 3682 8706 -1236 -4815
1037d815J0549K136j0430p9Q723j753r615J755R130l869q298M866Q895o560p666
$$ -4815 5734 7870 -2560 -2639 6084 4331 -5284 -3529 5601 1732 -6566 -1700 7195 635 -7031
1052g031O216P511q287n782Q920M290r232k639J0397J784j0241O24R786j527j0002
$$ -7031 -815 6696 -1591 -7373 1547 5837 -3395 -6034 4363 6147 -4094 -3470 6316 4789 -5213
1067e213J836R166k776r376M536Q323n977o849O754O606p908n210P728M368q132
$$ -5213 -3377 5789 3013 -6363 -1827 6496 519 -6330 424 7030 -878 -6088 1640 6008 -2124
1082b124l730J0242K460r666l81J0062j278r420K753P635l778p797N011O431m676
$$ -2124 -5854 4388 6848 -2818 -3199 6863 5585 -3835 -1082 6553 2775 -5022 -11 6420 1744
1097A744o753P135M419p622m465P736K358q524j523Q614M60q494J103R295k256
$$ 1744 -5009 2126 6545 -1077 -5542 2194 4552 -3972 -5495 3119 3579 -4915 -3812 5483 3227
1112C227r217M140Q338m872p457N491P128n761n381O895M724p225m252Q067K271
$$ 3227 -5990 -1850 6488 1616 -5841 -350 6778 1017 -4364 2531 7255 30 -4222 3845 6116
1127F116q900j813Q354J451r571K85R589j659q991J483Q536l466q177M552O905
$$ 6116 -2784 -4597 3757 5208 -4363 -4078 5511 3852 -5139 -3656 4880 1414 -6763 -2211 4694
1142D694m683m706N698M682o636l021O552K722o222l187P660J047o263p95P175
$$ 4694 11 -4695 1003 5685 -951 -3972 2580 5302 -920 -4107 3553 4600 -1663 -2458 4717
1157D717j268p224L324N965m675o229N130N974o706m565O089N286o622l331O359
$$ 4717 3449 -3775 -451 5514 839 -5390 -260 5714 -992 -5557 532 5818 -804 -4135 2224
1172B224J881o582q75P611q65p891K109P932j349q304K192P928l927o735L400
$$ 2224 4105 -2477 -3352 4259 3394 -4497 -2388 5544 4195 -4109 -1917 6011 2084 -4651 -1251
1187a251N726m947m646N492L927o488l291P063K024p287j615O822J043p074N62
$$ -1251 4475 -472 -5118 374 4301 -2187 -5478 1585 3609 -3678 -5293 1529 2572 -4502 -3940
1202c940P018k72o908K423O309k703n134L673M926n353m686O244M305p203k520
$$ -3940 3078 2806 -4102 -1679 4630 1927 -3207 466 5392 39 -4647 1597 5902 -1301 -3821
1217c821N563K730o495j589O105p69n920J684N964k893o519L864P075m386n998
$$ -3821 1742 4472 -2023 -3612 2493 1724 -4196 -2512 3452 559 -5960 -2096 4979 593 -5405
1232e405M311N102l312n166M702L700n862j967P073Q28o902n35O902L76p507o86
$$ -5405 -1094 4008 696 -4470 232 3932 -1930 -3897 3176 4004 -2898 -3433 3469 3845 -3662 -4348
1248d348P481m15p390K188N580k401n379L005M432m037l789M608M435n521l997
$$ -4348 3133 2718 -4672 -2484 3096 695 -4684 -1679 2753 -1284 -5073 -465 3970 -1551 -5548
1263e548O849K975o364j299M869R98m443j68M758j805m605K854M143k514n062
$$ -5548 1301 4276 -2088 -3387 1482 2480 -1963 -2131 2627 822 -3783 -929 3214 700 -4362
1278d362L751M623m514m781L886L987m122k034M160J213m820r5O457j423o374
$$ -4362 -611 4012 -502 -5283 -1397 2590 -1532 -3566 594 1807 -3013 -3108 3349 1926 -4448
1293d448J610P273k117o140J692N940j336o042L465L345k875l834M217K427n407
$$ -4448 -2838 4435 2318 -3822 -2130 3810 2474 -3568 -103 3242 367 -3467 750 3177 -2230
1308b230k844P194J442o787j929O214J538n745o98M537m27l962K652L820k796
$$ -2230 -5074 2120 3562 -3225 -5154 1060 2598 -3147 -3845 692 265 -3697 -1045 2775 -21
1323b1m066L974M378m002m823N163L808m597l411M403K986m919q65M586n96n238
$$ -21 -4087 -113 4265 263 -4560 603 4411 -186 -3597 806 3792 -1127 -1992 2594 1998 -3240
1339c240J074N803k374o487L362N481l488m591L336M810m070l113L788J681m447
$$ -3240 -2166 3637 1263 -5224 -1862 3619 131 -4460 -1124 3686 -384 -3497 291 1972 -2475
1354b475m85N291P12o430K41O762N11o833k25O320m63n818Q81M113k076l522L485
$$ -2475 -2960 2331 3043 -3387 -3146 3616 4127 -2706 -2931 3389 2926 -2892 -2011 2102 26 -3496 -11
1371a1L173m822k747N282K508m785k598M108K854m124j155L474K57k480R98L090
$$ -11 3162 -1660 -4407 875 3383 -1402 -4000 108 2962 -1162 -2317 1157 1414 -1066 -68 3022
1387C022k472l455K742M130l452l958K664L999k801m073L724J761l315p04L132
$$ 3022 550 -2905 -163 3967 515 -3443 -779 3220 419 -3654 70 1831 -1484 -2188 944
1402I44K69n154J210M973n36n725J920O122j640m903J704M170j735l348L170K207
$$ 944 1213 -3941 -2731 2242 1706 -4019 -2099 4023 2383 -2520 -816 3354 1619 -1729 1441 3648
1418C648l675j745N039J190o625j222O122J216o017l79K618K065m161l57L552
$$ 3648 -27 -1772 3267 4457 -2168 -3390 2732 3948 -2069 -2448 170 2235 -1926 -2283 1269
1433A269r23l603K336K815l603k723L849M023l889l567L604K801k726j676L206
$$ 1269 346 -3257 -921 1894 -1709 -4432 -583 3440 -449 -4016 -412 2389 -337 -2013 1193
1448A193O21l141O87K947j340l513J533M223k316l883J817L616k139l662K463
$$ 1193 1814 -1327 -640 2307 967 -2546 -1013 3210 894 -2989 -1172 2444 305 -3357 -894
1463h94K718l417j427M819q4l796L11M496l30m893L07M996Km205Q7M060j216k871
$$ -894 1824 -1593 -3020 1799 1715 -2081 -1770 2726 2396 -2497 -2190 2806 2808 -1397 -1310 2750 1534 -1337
1481a337J583J627j720k374L282K469m285k441L806K493l855k918L945J867k902
$$ -1337 246 1873 153 -2221 1061 3530 -755 -3196 610 3103 -752 -3670 275 2142 -760
1496g60o56K544j14l153K132L248j752l827L056K749j825l527K357J745j596j854
$$ -760 -1416 1128 1014 -2139 -7 3241 1489 -2338 718 3467 1642 -1885 472 2217 621 -1233
1512a233K182R83l403K18K197J32m226J613L056q03m092J309L505r93k692J137
$$ -1233 949 1932 -1471 -1253 944 1076 -3150 -1537 1519 716 -3376 -2067 1438 445 -2247 -1110
1528a110K484k052j688K754J378l255p56L903J356m543o57M063J352m333r26L501
$$ -1110 1374 -678 -2366 388 1766 -1489 -2245 1658 3014 -1529 -2186 1877 3229 -1104 -2030 1471
1544A471N85l407M13K438j553k273J830L172k987k069K336K907k600k145K034
$$ 1471 2056 -1351 -938 1500 -53 -2326 -496 2676 -311 -2380 -44 2863 263 -1882 152
1559A52K569k086k040K789K45k183P4L376j070l089K91L486j093l163J056K859
$$ 152 2721 635 -1405 1384 1629 -554 -480 2896 1826 -1263 -972 2514 1421 -1742 -686 2173
1575B173j495k236J367J209k244r43L071o9k726j61K747J170l338n75K276J223
$$ 2173 678 -1558 -191 1018 -1226 -2169 902 833 -1893 -2054 693 1863 -1475 -2050 226 1449
1591A449l161O34K979j170k545K021K052k168k541L802J063l658j113L117J046
$$ 1449 -1712 -1078 1901 731 -1814 207 2259 91 -2450 1352 2415 -1243 -2356 761 1807
1606A807m128m23K791M45j401o85K083o77k275K104J674j439k757K167L460j722
$$ 1807 -2321 -2744 47 492 -909 -1594 489 -188 -2463 -359 1315 -124 -2881 -714 2746 1024
1622A024k927J587K999k253m94J052M15k778J005J900J7k511O77K181m28k664
$$ 1024 -1903 -316 2683 430 -64 988 1403 -1375 -370 1530 1547 -964 -287 1894 1466 -1198
1638a198j82L119l35k137O51J597j479j421J970J219j679j632K657J407k637m95
$$ -1198 -1380 1739 1404 -733 -82 1515 36 -1385 585 1804 125 -1507 1150 2557 -80 -575
1654e75K377Q5k320k60J872N5j886K9J500m61k105L26K338j128k619J583K334
$$ -575 1802 1887 -433 -693 1179 1234 -652 -623 877 416 -1689 -1363 975 -153 -2772 -1189 1145
1671A145j966j153K233R52j868j538K883K41k755O81K897j178k073J212K229n93
$$ 1145 -821 -1974 259 1211 -657 -2195 688 929 -1826 -1145 1752 574 -1499 -287 1942 1349
1687A349k035P12J531q96k225J569J515k261r05K386j29k045m12K410N53l095
$$ 1349 -686 26 1557 661 -1564 5 1520 -741 -1646 740 611 -1434 -1846 564 1117 -1978
1703a978Q32K745q84j783L66K682q59k122J206J987j391j916K058J656k140j658
$$ -1978 -1146 1599 715 -1068 -702 1980 1121 -1001 205 2192 801 -1115 943 2599 459 -1199
1719a199K025J328k293j443K443R23k817Q9J417O0j836M05J894p48j862P20J943
$$ -1199 826 2154 -139 -1582 861 1784 -1033 -944 473 533 -1303 -898 996 248 -1614 -894 1049
1736A049j396l19N83J101p35j310J700O45k215r1K036k29j939k25K628n37k086
$$ 1049 -347 -666 -83 1018 283 -1027 673 1318 -897 -988 1048 819 -1120 -1345 1283 746 -1340
1753a340P11J545j441j301J133J047j731k89J559Q17q03k003K190J567k285O35
$$ -1340 -629 916 -525 -1826 -693 354 -1377 -1666 -107 710 -93 -2096 94 1661 -624 11
1769A1Q59R58j760n63K947m42k797R21R84L97k373R25J098j719n04N86J538r68
$$ 11 870 1828 68 -495 2452 2010 -787 134 1118 1515 -858 67 1165 -554 -1058 -472 1066 98
1787I8j182J448K04j428j325K686J33j726L53J740N61k068m8K162k30k568J971
$$ 98 -1084 364 568 -860 -2185 501 634 -1092 -739 1001 1562 -506 -554 1608 1378 -1190 781
1804G81J021j155j138R43P75j553r10K768l46j623p38J700k0j962k06K198J54
$$ 781 1802 647 -491 452 1227 -326 -1236 1532 1186 -437 -1175 525 505 -1457 -1663 535 689
1821F89k047P88J929j241k255J915K192k045m96J711J043k274n29J184R38k348
$$ 689 -1358 -570 1359 118 -2137 -222 1970 -75 -571 1140 2183 -91 -620 564 1502 -846
1837h46L91J413p5j670K31J489n95j603L65J718k38j885M91J633r24j109J839
$$ -846 -455 958 883 -787 -556 933 338 -1265 -900 818 580 -1305 -814 819 -105 -1214 625
1854F25K90j303o21J948L83j542oJ263q0j179J39J067o53j090O99P16j71j666
$$ 625 915 -388 -1009 939 1322 -220 -226 1037 957 -222 -83 984 331 -759 -60 656 485 -1181
1872a181R93O66j057q71J351R42k105k29J512J265k178J64J460o30j456J312J721
$$ -1181 -188 478 -579 -1450 -99 843 -1262 -1491 21 1286 -892 -728 732 102 -1354 -42 1679
1889A679n44j605P90J493p49j584N55J836r74j589J387K67k29j866J365P79k053
$$ 1679 1135 -470 320 1813 1064 -520 35 1871 897 -692 695 962 733 -1133 232 1011 -1042
1906a042L60L82L79j326J52J809l63j119O59Q32l3j344K27J260n99m57kJ269o48
$$ -1042 -682 -300 79 -1247 -1095 714 351 -768 -109 723 690 -654 -427 833 234 -223 -225 1044 396
1925C96r64Q79M18j740J80J539r9j626k38Q12o5j126J282N10o52m04Q96J136j147
$$ 396 -568 311 729 -1011 -831 708 609 -1017 -1255 -443 -508 -1634 -352 158 -494 -898 -2 1134 -13
1944a3j037J954K15j281p19J282J35j19o81J493k1k689J076J428j055j013M47
$$ -13 -1050 904 1119 -162 -881 401 536 417 -264 1229 1208 -1481 -405 1023 -32 -1045 -598
1961e98J029Kj524K45J629j029o35O52R58p22j26L26O92j144m33J950K63j619
$$ -598 431 433 -1091 -846 783 -246 -881 -229 729 7 -119 207 899 -245 -678 1272 1535 -84
1979h4L06O65M37j289L72Q00j029q15R28L67j328Q8N62J89r28q71J492P49j402
$$ -84 222 887 1324 35 407 1207 178 -637 291 658 -670 -582 -20 169 -759 -1630 -138 611 -791
1998g91l09R33M85m40L44L33n50r37J136R01p86j312J633N28m01j897J371M09
$$ -791 -1100 -167 318 -122 222 555 5 -932 204 1105 319 -993 640 1168 767 -1130 241 650
2016F50n12j013J359k98n52k40O59O24j479m6J186J092k030l28J408K14o22J41
$$ 650 138 -875 484 186 -366 -606 53 677 -802 -848 338 1430 -600 -928 480 694 72 213
2034B13J14r83Q60J042o03j623K46J591P74j551k48O43l19k4m93J329n39n72R69
$$ 213 327 -656 204 1246 643 -980 -734 857 1631 80 -168 475 156 132 -361 968 429 -143 826
2053H26j23r65j059J364J593j315j837J988P87j376k41P06M12q65N98N02m50j181
$$ 826 703 -262 -1321 43 1636 321 -1516 472 1259 -117 -358 348 760 -105 493 995 545 -636
2071f36N90R96q79j306k0K045O8j874o0N81J35j071J664o47o43k27J901l04j492
$$ -636 -46 950 71 -1235 -1255 790 858 -1016 -1076 -495 -360 -1431 233 -414 -1057 -1284 617 313 -1179
2090a179j79J633N66j909R57K0O30J69j48Jq35L07J384q05q68p79J612J384k078
$$ -1179 -1358 275 841 -1068 -111 -91 539 708 560 561 -274 33 1417 612 -256 -1035 577 1961 -117
2109a17j083P79J352j011J34j66l26m35J322M90j528j049J586J343r81n55K36
$$ -117 -1200 -421 931 -80 54 -112 -438 -873 449 939 -589 -1638 -52 1291 310 -245 -9
2126iJ923r89j261M76K80k57N9R10j249j017N37J903p55j980P37P45R80j242j018
$$ -9 1914 925 -336 140 420 163 222 1132 -117 -1134 -597 1306 551 -1429 -692 53 1033 -209 -1227
2145a227M50M15N27P1jj121N30J899l87j839j006K047R33l73j823M17J474q70
$$ -1227 -777 -362 165 236 235 -886 -356 1543 1156 -683 -1689 358 1291 918 -905 -488 986 116
2163A16L78n06j255j76K453J82k451j258J808J424r21j044l78J681N62p36k39
$$ 116 494 -12 -1267 -1443 1010 1192 -1259 -2517 -709 715 -206 -1250 -1628 53 615 -121 -360
2180c60j15N98P81P76j780p37J004J520o12j961j71J937O58q94r98k54R91j70
$$ -360 -475 123 904 1680 -100 -837 167 1687 1075 -886 -1057 880 1538 644 -354 -608 383 213
2198B13Q76j192q75o3K757N43l835m30J568K307j580p85j60O46M90Q40j103j228
$$ 213 1089 -103 -978 -1041 1716 2259 -1576 -2006 -438 1869 289 -496 -656 -10 480 1320 217 -1011
2216a011K23L225q60k298k62Q31K128j546j746J46Q80J033J77j253q67p19K102
$$ -1011 -788 2437 1577 -721 -983 -152 1976 430 -1316 -1170 -290 743 920 -333 -1200 -1919 183
2233A83J511k193j502R27K621l35j659p42J835O27L7j205j205L28K227K79j826
$$ 183 1694 -499 -2001 -1074 1547 1212 -447 -1189 646 1273 1310 105 -1100 -772 1455 1734 -92
2250i2q53Q18J661k45k159p39J027K465k052m22j126J009J194K38j302j099R31
$$ -92 -945 -127 1534 1289 -870 -1609 -582 1883 -169 -591 -1717 -708 486 724 -578 -1677 -746
2267g46K360m76j637j142J735K300n63k551q82J560J265O22j877j333j8L010N65
$$ -746 1614 1138 -499 -1641 94 2394 1831 -720 -1602 -42 1223 1845 -32 -1365 -1383 1627 2192
2284B192l063j016J405J982o69j856p77Q17J654K45j272j213L39J986J054j793
$$ 2192 -871 -1887 -482 1500 831 -1025 -1802 -985 669 914 -358 -1571 -1232 754 1808 15
2300A5k202J280K031J172k788r25J021J911J98j556j209K07K076Q11j427k297
$$ 15 -2187 -907 1124 2296 -492 -1417 -396 1515 1713 157 -1052 -845 1231 2042 615 -1682
2316a682O39K000J481k987j767J061K758P48k667j398J150J464J211j819j387
$$ -1682 -1043 957 2438 -549 -2316 -1255 1503 2251 -416 -1814 -664 800 2011 192 -1195
2331a195K67K099J896k867k290J720K296K1j972j686q6K872O01j713k403P72K545
$$ -1195 -928 1171 3067 200 -2090 -370 1926 1947 -25 -1711 -1797 1075 1676 -37 -2440 -1668 877
2348H77J465k818k578J782K462J061k365j852J330J517J120j095k445O40J321
$$ 877 2342 -476 -3054 -1272 1190 2251 -114 -1966 -636 881 2001 906 -1539 -899 422
2363D22K393j669k779j1L254J002k767j640L47K643N4j532j682K03K647O75j773
$$ 422 2815 1146 -1633 -1644 1610 2612 -155 -1795 -1448 1195 1249 -283 -1965 -1762 885 1560 -213
2380b13k041k94L084J540j462l566J423K471Q21k146j504P55J633K189j175l671
$$ -213 -2254 -2548 536 2076 614 -2952 -1529 942 1763 -383 -1887 -1132 501 2690 1515 -2156
2396b156M41L148J356k161k933R50J471K566j735l275l6L212J170q69l349n7K075
$$ -2156 -1715 1433 2789 628 -2305 -1355 116 2682 947 -2328 -2364 848 2018 1149 -2200 -2257 -182
2413a82K806j382l956N79L320J071j544k515P43J785J676j293k855n21K855J535
$$ -182 2624 1242 -2714 -2135 1185 2256 712 -1803 -1060 725 2401 1108 -1747 -2268 587 2122
2429B122o97l099p13L126K297k458k989R0K856P86j579j344p84K512J584k49l588
$$ 2122 1425 -1674 -2387 739 3036 578 -2411 -2321 535 1321 -258 -1602 -2386 126 1710 1461 -2127
2446b127l49K953K845k091l078n6L027J643j477l253N46J780K552j320l066j022
$$ -2127 -2476 477 3322 1231 -1847 -1903 1124 2767 1290 -1963 -1417 363 2915 1595 -1471 -2493
2462b493L091K510k061k753p90K903J813j060l546M33J263K074J38k951p62K400
$$ -2493 598 3108 1047 -1706 -2496 407 2220 1160 -2386 -1953 -690 1384 1522 -1429 -2191 209
2478B09K469m12l934j020L084K451r37l492l91K429J399l78l274j398K247K993
$$ 209 2678 2266 -1668 -2688 396 2847 1910 -1582 -1973 456 1855 1477 -1797 -3195 -948 2045
2494B045o95l174j123K167L207j549l101m42K656J766K07l088j182J938L185m75
$$ 2045 1350 -1824 -2947 -780 2427 878 -2223 -2665 -9 1757 1964 -1124 -2306 -368 2817 2342
2510B342l184j927K318L775k218k955p24K663K502j149k492j391J355L118M99
$$ 2342 -842 -2769 -451 3324 1106 -1849 -2573 90 2592 1443 -1049 -2440 -1085 2033 2532
2525B532m271j079K241K783m54l519j449K660K721k0l033j022J691K748j2k857
$$ 2532 -1739 -2818 -577 2206 1752 -1767 -3216 -556 2165 2145 -888 -1910 -219 2529 2517 -340
2541c40k331J642M039k18l671j585J609L478k39m180q57K080K090M03l503k95
$$ -340 -2671 -1029 3010 2792 -879 -2464 -855 2623 2384 -1796 -2653 -573 1517 1920 -1583 -1878
2557a878N57K975N61l532j442K127K459J46k987j721K466K468m9k495k603K249
$$ -1878 -1321 1654 2215 -1317 -2759 -632 1827 1973 -1014 -2735 -269 2199 2150 -345 -2948 -699
2573f99K864R47l812k710K721L468o07l264j254J170K936L0k378k248J152L502
$$ -699 2165 3112 -700 -3410 -689 2779 2172 -1092 -2346 -1176 1760 1790 -588 -2836 -1684 1818
2589A818P3k467j419O60L773L67l264k763K039L413j27k294j769J616K586M40
$$ 1818 1891 -576 -1995 -1335 2438 2805 -459 -3222 -1183 2230 2103 -191 -1960 -344 2242 2682
2605B682k122k865J257K770R26l048k949J830L308R00l576k041J638K988J76j789
$$ 2682 560 -2305 -1048 1722 2648 -400 -3349 -1519 1789 2689 -887 -2928 -1290 1698 1874 85
2621H5k815J064L030J279k629k867J982L089O1k545j798Q44L008K94j655l323
$$ 85 -2730 -1666 1364 2643 14 -2853 -871 2218 2279 -266 -2064 -1220 1788 2082 427 -2896
2637b896J372K859J484l216k655J533L031O80k983k053P68L386O68j799k740L73
$$ -2896 -1524 1335 2819 -397 -3052 -1519 1512 2192 -791 -2844 -2076 1310 1978 179 -2561 -2188
2653b188L119J177j779k897O25L587J558l302k101P28L351M38k672j579J053J893
$$ -2188 931 2108 329 -2568 -1943 1644 3202 -100 -2201 -1473 1878 2316 -356 -1935 -882 1011
2669A011J480k394k158J37K888J857k651l206R06L172Q22j969j934K08K517K032
$$ 1011 2491 97 -2061 -1924 964 2821 170 -3036 -2130 1042 1864 -105 -2039 -1831 686 2718
2685B718k533k146k02L429J769k625k614N90L033J186j804k779j19L057J340j649
$$ 2718 185 -1961 -2163 1266 3035 410 -2204 -1614 1419 2605 801 -1978 -2097 960 2300 651
2701F51k922j98L460K046k561l106j32L544J529j480k649K08K341K025k117k344
$$ 651 -2271 -2469 991 3037 476 -2630 -2762 782 2311 831 -1818 -1610 731 2756 639 -1705
2717a705n5K416J662q66l409m51L413J715j952k933j65L740J018k023k263k25
$$ -1705 -1760 656 2318 1452 -1957 -2408 1005 2720 768 -2165 -2330 1410 2428 405 -1858 -2083
2733b083K706J348j298k630n90L048K687l031k048J77K831J571j462l472K72L201
$$ -2083 623 1971 673 -1957 -2547 501 3188 157 -1891 -1714 1117 2688 1226 -2246 -1974 1227
2749A227J459q56l070q30K272K394j585l005J95K622J627j540l045m19K712J682
$$ 1227 2686 1830 -1240 -2070 202 2596 1011 -1994 -1799 823 2450 910 -2135 -2554 158 1840
2765A840m65l238j050K630L241j534l235p62L356K069j709k393k10J950J701j48
$$ 1840 1375 -1863 -2913 -283 2958 1424 -1811 -2573 783 2852 1143 -1250 -1460 490 2191 2043
2781B043l432r18K336K490o37l129p82K342K260j063l331o30K236K473j439k604
$$ 2043 -1389 -2307 29 2519 1882 -1247 -2029 313 2573 1510 -1821 -2451 -215 2258 819 -1785
2797a785j51J605K772j056k580j066K109K679j532k451o57K256K568j280k955
$$ -1785 -1936 -331 2441 1385 -1195 -2261 -152 2527 995 -1456 -2113 143 2711 1431 -1524
2812a524p77K107K891j511k170j824K604K016m73l148p43J758K628q47j856j218
$$ -1524 -2301 -194 2697 1186 -984 -2808 -204 1812 1339 -1809 -2552 -794 1834 987 -869 -2087
2828b087K319J709p10k791p44K289J907o26j982j110J672K488r86k195j237K854
$$ -2087 232 1941 1231 -1560 -2304 -15 1892 1266 -716 -1826 -154 2334 1348 -847 -2084 770
2844G70J236r29k083j225J417K597j48k028k222J562L114j77l233n71J306K610
$$ 770 2006 1077 -1006 -2231 -814 1783 1635 -393 -2615 -1053 2061 1884 -1349 -1920 -614 1996
2860A996o76l013m79J914K454j19k806j278J907J894K15k549j565J782K315o61
$$ 1996 1320 -1693 -2172 -258 2196 2077 -729 -2007 -100 1794 2009 -540 -2105 -323 1992 1331
2876A331k043j216O80K379M45j872k700K237J910M1k492j033J467K405O84l167
$$ 1331 -712 -1928 -1248 1131 1576 -296 -2996 -759 1151 1192 -1300 -2333 -866 1539 2223 -944
2892i44k02J106J045O96j624j952J505J598J085k839j368R80K462P37l108j574
$$ -944 -1146 -40 1005 1701 77 -1875 -370 1228 2313 -526 -1894 -914 1548 2285 -823 -2397
2908b397J031K977l27k245j098J074K361K09k166j294J319J546R94j973k180J171
$$ -2397 -1366 1611 1284 -961 -2059 -985 1376 1585 -581 -1875 -556 990 1984 11 -2169 -998
2924i98K178J269k704q51Q52J180J353k224j840J318J188P45k325q35O09K273
$$ -998 1180 2449 -255 -1106 -254 926 2279 55 -1785 -467 721 1466 -859 -1694 -1085 1188
2940A188Mj561j548P27K689Q6k183j249ML216L40j316j878N87K401M56j743j525
$$ 1188 1192 -369 -1917 -1190 1499 1585 -598 -1847 -1843 1373 1713 397 -1481 -894 1507 1963 220 -1305
2958a305Q23J438R43j425j887M63J624J090j855j314M02J658J472k474k103J399
$$ -1305 -482 956 1899 474 -1413 -950 674 1764 -91 -1405 -1003 655 2127 -347 -2450 -1051
2974a051K470m83r24j525L07K277O04j475j558M51K000N77j241j206o1J786Q00
$$ -1051 1419 936 12 -1513 -1206 1071 1675 200 -1358 -907 1093 1670 429 -777 -838 948 1748
2991A748j647j490L66J971N86j245j426j095K611Q49j164j748Q56J287Q65j360
$$ 1748 101 -1389 -1023 948 1534 289 -1137 -2232 379 1228 64 -1684 -828 459 1324 -36
3007c6j340k66K171J358j521j232J07J922R61j358j570j68J103J316j047p30n97
$$ -36 -1376 -1642 529 1887 366 -866 -759 1163 2124 766 -804 -972 131 1447 400 -330 -927
3024i27J676J52q77j596L50J649J332j065k207M40J102J317q92j643m63K346Q39
$$ -927 749 901 24 -1572 -1222 427 1759 694 -1513 -1073 29 1346 454 -1189 -1652 694 1533
3041A533p70j360m57J827M55j127j375J50R67J176K61k253l85J568J104j306j363
$$ 1533 763 -597 -1054 773 1228 101 -1274 -1124 -157 1019 1280 -973 -1358 210 1314 8 -1355
3058a355K35J551Q63j234j347K90Q88J739j019j769K0J939R33j164j125j35J191
$$ -1355 -1120 431 1294 60 -1287 -997 -109 1630 611 -1158 -1138 801 1734 570 -555 -690 501
3075E01N35p22q16m22J317J610k031o97p42J462R21n7j682l39K78J930m02p13
$$ 501 1036 314 -502 -924 393 2003 -28 -725 -1467 -5 916 859 -823 -1162 -884 1046 644 -69
3093f9j135J061J637j463n39r58K081M31j31r74r03N43J039p9o18p88J276M00
$$ -69 -1204 -143 1494 31 -508 -1466 615 1046 915 -59 -962 -419 620 541 -77 -865 411 811
3111H11k79j938J39J657M03j3j149m64R02K41L37j619j22J400J112q88r53O8J13
$$ 811 532 -1406 -1267 390 793 780 -369 -833 69 310 647 -972 -1094 306 1418 530 -423 -355 -242
3130b42J718n65j196m14O46J333m43j051l11N96O71k60m15l49L09N89k07j237
$$ -242 1476 911 -285 -699 -53 1280 837 -214 -525 71 742 482 67 -282 27 616 409 -828
3148h28j6P13N22M30j734KR92J237o56l67j134J031J138n85j284L27K79LQ38j147
$$ -828 -844 -131 391 821 -913 -911 81 1318 662 295 -839 192 1330 745 -539 -212 67 70 908 -239
3168b39oJ23N88L24j254o65M37Q39Q27j366o30N17J139m67m53m29R22K38N02q40
$$ -239 -245 -122 466 790 -464 -1129 -692 147 974 -392 -1022 -505 634 167 -286 -715 207 445 947 107
3188A07j340P40J553m20j058n89J056J207J5j041o83O54M02j20j93o81l02P68
$$ 107 -1233 -493 1060 640 -418 -1007 49 1256 1271 230 -453 201 603 483 290 -391 -693 75
3206G5j13L41j950J290N16J024j595j16K84L86N88r80n70O58O83J5j005M07J81
$$ 75 -38 303 -1647 -357 159 1183 -412 -528 -244 142 730 -250 -820 -162 521 536 -469 -62 119
3225A19N00J80j101k76J31K73J80L51p76M7O66N5n21l75J33K37P86j665O67K20
$$ 119 619 799 -302 -578 -447 -174 6 357 -419 -372 294 349 -172 -547 -414 -177 609 -1056 -389 -169
3245a69M42O85p61m14Q4R49m92j35l55l93R01M09n29p51P01k75N71o86o23M29
$$ -169 273 958 197 -217 -133 816 324 189 -166 -559 342 751 222 -529 172 -103 468 -218 -841 -412
3265d12O81l80Q3m82L48j47R36j195L34R4M1Q58p46l01O77J94n13L77p73K03O19
$$ -412 269 -111 -28 -510 -162 -309 627 -568 -234 -140 -99 759 13 -288 389 583 70 447 -326 -123 496
3286D96j27k44l72k3O57n13L07r05O38N09j04o50J8J6M08O17n70n2m03M61L24
$$ 496 369 125 -247 -270 387 -126 181 -724 -86 423 319 -331 -313 -297 111 728 158 106 -297 164 488
3307D88j11n12m33J536o63r30M99K93m91N42m96l5j25O08P81r42r34L7N46L59
$$ 488 377 -135 -568 968 305 -625 -126 167 -324 218 -278 -313 -438 170 951 9 -925 -888 -342 17
3327A7j15r33J40J215N07p95o70L42L38J73M84q56K6P92N5j036L52K86J95k10
$$ 17 -98 -1031 -891 324 831 36 -634 -292 46 219 703 -153 -127 665 720 -316 36 322 517 307
3347C07j39k30N02k51k84p54J1K96K24L49j05m03O3R63m97n72k48J001n37O07
$$ 307 168 -62 440 189 -95 -849 -838 -542 -318 31 -74 -477 -414 549 52 -520 -768 233 -304 303
3367C03K68l59k38n2k2J06l9l55L86L97m51P6o09N80M66j263N86o84Q54K24r4
$$ 303 571 212 -26 -78 -100 6 -33 -388 -2 395 -56 20 -589 -9 457 -806 -220 -904 -50 174 80
3388H0p70j59J240q28J82o18Q21J22O28j017P3M82j19k01R89j614M44K22m8n1
$$ 80 -690 -849 391 -437 -255 -873 -52 70 698 -319 -246 236 117 -84 905 -709 -265 -43 -91 -142
3408a42l84K63J2P29o93K89k69l08N34r1q2J00k78O25j48k73N25m5l04L38m60
$$ -142 -526 -263 -251 478 -215 74 -195 -503 31 -60 -142 -42 -320 305 157 -116 409 364 60 398 -62
3429f2K60J68n2K84j153J225r36O0O4J03l2m74K27J78Q47j157J09L23K21l23n8
$$ -62 198 366 314 598 -555 670 -266 -206 -142 -39 -71 -545 -318 -140 707 -450 -341 -18 203 -120 -178
3450a78o01Q57P6J4n46Q40o9n74L91N53n73K13l04k96K90k85k05K63J12o37J004
$$ -178 -779 78 154 168 -378 462 393 -181 210 763 190 403 99 -197 93 -192 -397 -134 -22 -659 345
3471C45j95O0n08q7L99m34O86l12K32m74l22J010o65N15k01j10M47j71k88J05
$$ 345 150 210 -298 -385 14 -420 266 -46 186 -288 -610 400 -265 250 49 -61 386 215 -73 32
3491C2N92o95k37R53p57j24L58m60Q4m09N28M1K28l36r8qP25o03k49L9O14k95
$$ 32 624 -71 -308 645 -112 -236 122 -338 -254 -663 -135 -94 134 -202 -300 -308 417 -186 -435 -396 218 -77
3513g7m35O89m54O46k81o9J46J75k67K53j42K57j96j33o43j66J11O43j9M52o27
$$ -77 -512 177 -277 369 88 19 165 340 73 326 184 441 245 112 -531 -697 -586 57 38 490 -137
3534a37j48O65m22n95J08L96L51J01o45J160o70L56n94p6K60j65K00r8M19k46
$$ -137 -285 380 -42 -637 -529 -133 218 319 -326 834 164 520 -74 -150 110 -55 145 47 466 220
3554B20j86m66P41m88r98J096M29m85p1K27P2J02j043Q24j70q4N12K91L6j97o18
$$ 220 34 -432 309 -179 -1177 -81 348 -137 -208 19 91 193 -850 -26 -196 -280 232 523 559 362 -256
3575b56K19J6n9K20m4Q5J95n44R73p78j34l05L71J72j84j57Q7J39K4k86N09k68
$$ -256 -37 -21 -80 140 96 181 376 -168 805 27 -107 -412 -41 131 -53 -210 -123 16 40 -246 263 -5
3597em77M01J14J37N0j12m4j70N11o0K7L19n17K96n42J97J5O9J19j07O5m13L97
$$ -5 -482 -81 33 170 220 108 64 -106 405 345 372 691 174 470 -72 125 140 209 328 221 286 -127 270
3620B70j74l90J8M75m97L57Q0l95P22l62LM53l89r5m0O8N4P16j088J75J01k75
$$ 270 96 -294 -276 199 -298 59 139 -256 466 104 107 560 171 76 36 104 158 874 -214 -39 62 -213
3642b13J79K0n57P73k67k21J68J38j90q8O2p19P85N45o15M91l28l82P5L35L06
$$ -213 -34 -14 -571 202 -65 -286 -118 20 -170 -258 -196 -915 -130 415 -200 291 -37 -419 -344 -9 297
3663B97l57M0N93m12l39L79o1m10L02K9j38N21L75q00n06M71O7l90L60J14j82
$$ 297 -60 -20 573 161 -178 201 140 -270 32 61 -77 444 819 19 -487 -16 51 -339 21 135 -47
3684d7L10o24L9m93J105N9k51O60l18l86l33N00P1k6Q0k89l40l59N33j46J65Q03
$$ -47 263 -361 -322 -815 290 349 98 758 440 54 -279 221 292 266 346 57 -283 -642 -109 -255 -90 713
3706G13j142N71L89j521P23K58L41m46k98k32K95R51q95M32n7J65K9K64j91n65
$$ 713 -429 142 531 -990 -267 -9 332 -114 -412 -644 -349 602 -293 139 82 247 276 540 349 -216
3726b16K96P5j48O97j11n35M51n42K72J90o63P46p60j87O97o91J1N61m41Q7L97
$$ -216 80 155 7 704 593 58 509 -33 239 429 -234 512 -248 -435 262 -429 -418 143 -298 -211 186
3747A86k31k05N45p04J87K67J34n9m49j38R44o00K57N32k44m48J20k89L43m0r6
$$ 186 -45 -250 295 -409 -222 45 179 120 -329 -467 477 -123 134 666 422 -26 94 -195 148 108 12
3768A2L2m59mq1N00p97P64N43l05j93K07m61J30P30l70j20l36O67L12l97j31M42
$$ 12 44 -415 -419 -500 0 -797 -33 510 205 12 219 -242 -112 618 248 128 -208 459 771 374 243 685
3790F85m81l04OK78M28n83k07K82l11l88L20L42J16p36L25O21m39M32m08r0N56
$$ 685 204 -100 -94 184 612 29 -178 104 -207 -595 -275 67 183 -553 -228 393 -46 386 -22 -112 444
3811D44j027M00K68N10q20P25l66p6Jn13M75O5M02k65l22M17m78L10N2k24q54
$$ 444 -583 -183 85 595 -225 500 134 58 59 -454 21 86 488 223 -99 318 -160 150 202 -22 -876
3832h76L80M27j15J39j37M56l73j70N2M13r4N62n58l14M45K51j46k27Rj13K23
$$ -876 -496 -69 -184 -45 -182 274 -99 -269 -217 196 102 664 106 -208 237 488 342 115 124 11 234
3853B34n83N73j72Q8Mo90O33L2l05N57j99k57j45K44j30J01L25l22L9O7L54m99
$$ 234 -349 224 52 140 144 -546 87 119 -186 371 172 -85 -230 14 -116 -15 310 -12 27 94 448 -51
3875e1K67j02L85k97K2J90m15j9m7K12n27J81k2m2K52m45L91l71P87m24J52L57
$$ -51 216 114 499 202 224 414 -1 -20 -67 145 -382 -201 -223 -265 -13 -458 -67 -438 349 -75 77 434
3897D34m46N63r44R36o70J09K99j18k49J24K90p1k46P6K92J44p83N63j318J239
$$ 434 -12 551 -393 543 -127 -18 281 163 -86 38 328 257 11 87 379 523 -260 303 -1015 224
3917B24p06N22M97j058N13L45J65p31O41o29K23j12J15kL06j55n6K94n43k8j8
$$ 224 -482 40 537 -521 -8 337 502 -229 412 -217 6 -106 9 7 313 158 102 396 -147 -175 -193
3938a93J36P62o91L23j6m72J53oL27j32q7m27K17K20l25L63l60Q63q31R78q31
$$ -193 -57 705 14 337 321 -151 2 -4 323 191 104 -323 -106 114 -211 152 -208 655 -176 802 -29
3959b9J33L10m14K45l19K48R0j18p5J76n85Kk2j03L41r3J31M35O1o52j77J49J91
$$ -29 104 414 0 245 -74 174 264 146 71 247 -338 -336 -358 -461 -120 -213 -82 353 414 -238 -415 -266 -75
3982g5p7N83j95l91R28m10K33kp11l0M01m28Q26k67Kj30l60K68k79l03K80K14
$$ -75 -152 431 236 -155 773 363 596 594 -117 -147 254 -174 652 385 387 257 -103 165 -114 -417 -137 77
4004G7j07k09j25K53J92j92Q1j5k23L89Ll60J53K63p8j10j36K65l37M84k01L39
$$ 77 -30 -239 -364 -111 81 -111 -30 -45 -268 121 124 -236 -83 180 102 -8 -144 121 -216 268 67 406
4026D06Q4n14J30K46p19M0J87J86k81j31Q22q55K96P6L09m00P9k65N29m45K05
$$ 406 490 -24 106 352 -367 -327 -140 46 -235 -366 456 -399 -103 -27 282 -118 -39 -304 225 -220 -15
4047a5J71p5M11K74n25l61K16J10k18rj4K15l90J73K45J21l94R3l56K74p44M94
$$ -15 156 81 492 766 241 -120 96 206 -12 -21 -35 180 -210 -37 208 329 -65 28 -328 -54 -798 -304
4069c04L49K32l61J78J82j7n74J90O42m72J87m76K8K72l76N95l5l73M79l39l60
$$ -304 45 277 -84 94 276 259 -315 -125 517 45 232 -244 -216 56 -320 275 240 -133 346 7 -353
4090c53O1j9K02k35L30J84m39j50K85J22J98o05O58M59q3m16J00p29R8L5L62m9
$$ -353 -292 -311 -109 -344 -14 170 -269 -419 -134 -12 186 -419 239 698 615 199 299 -430 -332 -297 65 16
4112A6p1k03K44p9N25m26m65P85k70k12J44k00K03o0K5M01j223Q17K03m49K04
$$ 16 -55 -258 -14 -93 432 6 -459 326 56 -156 -12 -212 -9 -69 -44 357 -866 -49 154 -295 -91
4133i1L08m0l11l93M47O82n63M74l30j76j75L26n4p6l9m74L26l11R52n87N14k79
$$ -91 217 177 -134 -527 -80 602 39 513 183 7 -168 158 104 28 -11 -485 -159 -470 482 -105 409 130
4155A30M65k14j18k07j72J06k17J98J76r5J04l47L70p84J040n46n25M74K92j25
$$ 130 595 381 263 56 -116 -10 -227 -29 147 52 156 -191 179 -605 435 -111 -636 -162 130 5
4175Ek75K81l01N50K6q60J62M2p7Q85p57j80K69r4K78j84L49k52m8P53n35N40
$$ 5 -270 11 -290 260 286 -574 -412 -370 -447 438 -319 -499 -230 -324 -46 -230 119 -133 -181 572 37 577
4197E77p96K0n7q7J76M6O59n79J83j51K40M37M7n56o92q0Q56o2q2j81l87P71l55
$$ 577 -219 -199 -256 -343 -167 -121 538 -41 142 -9 231 668 715 159 -533 -613 243 181 99 -82 -469 302 -53
4220e3j44O3L0Q59m69l53N2J07l62L32O9L01m44K97k17q6n1jj07K91m07M22K13
$$ -53 -197 -134 -104 755 286 -67 -15 92 -270 62 131 432 -12 285 68 -18 -69 -70 -177 114 -293 129 342
4243C42p53L10n44J19J056o99L02K42l33M77o30P4J13j23Q7k07K05J51o32K01
$$ 342 -411 -101 -645 -526 530 -169 133 375 42 519 -111 -37 76 -47 40 -167 38 189 -443 -242
4263b42l08J96L05L1k63K22r1L98n15j17O06n14m4K50L40k52L4j15K49p5n49N87
$$ -242 -550 -354 -49 -18 -281 -59 -150 248 -267 -384 222 -292 -336 -86 254 2 36 -79 170 95 -454 133
4285A33j94J039j331M06l69L43l31K43J99o3q0k03N84o52O24n9l31o62P80J06
$$ 133 -61 978 -353 53 -316 27 -304 -61 138 75 -5 -208 376 -276 348 289 -42 -704 76 182
4305A82m08N75r4k37j95J10L29k19K19k67M23j77K53k71j88k47L4J01J22k46M2
$$ 182 -226 349 255 18 -177 -67 262 43 262 -5 418 241 494 223 35 -212 -178 -77 45 -201 -159
4326a59j95N16l87L16J8p89R19l98M37p11M27P0K51l46OK19j8j16k39o28R33M63
$$ -159 -354 162 -225 91 109 -680 239 -159 278 -433 -6 64 315 -31 -25 194 176 60 -179 -807 126 589
4348E89j08k05l99L1L47n1K49q21O27o10k11K6O34k73n2M44p14J232j092J003
$$ 589 481 276 -123 -92 255 204 453 -368 259 -351 -562 -536 98 -175 -227 217 -497 735 -357 646
4368F46r06J2P8N78m05n29N04k44K98K43j39K4k21L40l56pL75m56J98k25l04R54
$$ 646 -260 -248 -170 408 3 -526 -22 -266 32 275 136 160 -61 279 -77 -84 291 -165 33 -192 -496 458
4390D58l45m96O11l12J36j88K1K26m51O51q9m24K46k95P68l41j04j57K96j0q82
$$ 458 113 -383 228 -84 52 -136 -115 111 -340 311 222 -202 44 -251 517 176 72 -85 211 201 -681
4411f81J046k74q3n89J241n20k22J22J83l3m46L03m21J75P13j087Q46P8l39j3
$$ -681 365 91 8 -581 660 140 -82 40 223 190 -256 47 -374 -199 514 -573 273 351 12 -1
4431al5P76p97M99o66M28j29R5o16M51m50R72l65k6K26o04L71o95O56K86l86J59
$$ -1 -36 740 -57 442 -224 204 75 170 -446 5 -445 527 162 136 362 -242 129 -566 90 376 -10 149
4453A49K62j63k01J43R0o3K39k88Q7l34Q54m05m79R16n63j18j71m18L73k60L78
$$ 149 411 248 47 190 280 217 456 168 255 -79 775 370 -109 807 244 126 -45 -463 -90 -350 28
4474B8o37M44Q9L31k61j70k99L64M77l26k30K44J29l96o8J149j365O83k90K19
$$ 28 -609 -165 -76 255 -6 -176 -475 -111 366 40 -190 54 183 -213 -281 868 -497 186 -104 115
4494A15l20M85K17o35l7l90K77O44j28m46Qk14K23M79p70R35l83k7j6r5K21k64
$$ 115 -205 280 497 -138 -175 -565 -288 356 228 -218 -210 -424 -201 278 -492 443 60 33 17 -78 143 -121
4516a21n78L23J89N36k78n92M42L78o02P81j69o33J004o50k22O40j295K86Q94
$$ -121 -699 -376 -187 349 71 -521 -79 299 -303 478 309 -324 680 30 -192 448 -847 -561 333
4535C33j62N62j003N84n94M59k55M5K95q12N55k15Q94p31J84k15J81m5N66j12
$$ 333 171 733 -270 314 -280 179 -76 -31 264 -548 7 -208 686 -45 139 -76 105 60 626 514
4555E14l02n62J14r3P08o07j3K78o56MM23n3K82n79K78l8J88o2R02l35l21R1p
$$ 514 212 -350 -236 -329 379 -228 -241 37 -619 -615 -192 -245 37 -542 -264 -302 -114 -176 726 391 70 161 154
4578A54m32N94j67K12j9l49k93L59r2n9K90l25K15p33O60k90L31j25J11k05l85
$$ 154 -278 316 149 361 342 -7 -300 59 -33 -92 198 -127 88 -645 15 -275 56 -69 42 -163 -548
4599e48O04M23J54n94l24O13o53L73j37j01k41P00j05K9j08l16l52R71k97m64
$$ -548 56 479 633 39 -285 328 -325 48 -89 -190 -431 269 164 193 85 -231 -583 388 91 -373
4619c73M18j69Q0Q6k36k38O31l52Q3l64k5N32K98n75N97p0Kk03l07O13o2k20j56
$$ -373 45 -124 -44 42 -194 -432 199 -153 -70 -434 -459 73 371 -204 393 323 325 122 -185 428 366 146 -10
4642a0j16j93P50k62j77K93J31k72L32j33Q0l77n10J99M11l61j06L63m96L35N47
$$ -10 -126 -319 431 169 -8 285 416 144 476 343 423 46 -464 -265 146 -215 -321 42 -454 -119 428
4663D28m53J69L0k74R5J74n72M55k9j44K20K85l68j74P22r36M65J25l14Q6l8K44
$$ 428 -25 144 174 -100 -5 169 -403 52 23 -121 99 384 16 -158 564 -372 93 218 -96 -10 -48 196
4685A96k10K8k03K69k39K00n75J52J85J66NJ34K07o00k19Q46n85k13J42P01l76
$$ 196 -14 14 -189 80 -159 41 -534 -382 -197 -31 -26 108 315 -285 -504 342 -243 -456 -314 387 11
4706A1j95K85p3n13M46n3K09n31M34j01j89N32o58j50P50q18L51N15j98K37K63
$$ 11 -184 101 28 -485 -39 -92 117 -414 20 -81 -270 262 -396 -546 204 -614 -263 252 54 291 554
4727E54p35J24K04n3N6qq8k08N15p85M69L6K43l99l73J13O35l06k47R6k2J91r
$$ 554 -181 -57 147 94 150 142 54 -154 361 -424 45 81 324 -75 -448 -335 300 -6 -253 -157 -179 12 3
4750CK89l55J63l31K3L95L30q09j20K04K67J39K68m95m30K65R5O46o53n7p6K68
$$ 3 292 -63 100 -231 -208 187 517 -292 -412 -208 59 198 466 -29 -459 -194 -99 547 -106 -163 -239 29
4772B9j24J95N3j079Q74J70k41l86K39k1N03J27K4k11l5J25m0j69M03n24M1j04
$$ 29 -95 100 153 -926 -52 118 -123 -509 -270 -291 212 339 363 152 117 242 202 33 436 -88 -47 -151
4794a51l56L92K38o78M16N70m05J91k65o2K17j8k09j68M75J39n14NN65m78K48
$$ -151 -507 -115 123 -555 -139 431 26 217 -48 -110 107 89 -120 -288 187 326 -188 -183 382 -96 152
4815A52k64K15j38J9O05m56J14m73L31l77M05L33p74K73j04n22J48L10R0L1j37
$$ 152 -112 103 -35 -16 589 133 247 -226 105 -272 133 466 -308 -35 -139 -661 -513 -203 -113 -82 -219
4836b19J39j01P38q87Q56n73N82o7l12J87j50o3l46L09n35N38k7m03K23Q67p49
$$ -219 -80 -181 557 -330 526 -47 535 468 156 343 193 130 -216 93 -442 96 69 -334 -111 756 7
4857Gl94N42q2O8l31m10L83P14l40n6k63l73O16N81m49j52M6l17N29n2O19r90
$$ 7 -387 155 73 141 -190 -600 -217 497 157 101 -162 -535 81 662 213 61 107 -210 319 267 886 -104
4879a04m21M04J03L13k72j09O16o11Q88q58PL39r3l74R5k92O73Q4n74K04M31j84
$$ -104 -525 -121 -18 295 23 -86 530 -81 807 -51 -44 295 202 -172 -77 -369 304 388 -186 18 449 265
4901B65J54l82j65N32k33r9k14l06O00M82p72N12l93l7K92O8q12N0p9P84l49J70
$$ 265 419 37 -128 404 171 72 -142 -448 152 634 -138 374 -19 -56 236 304 -508 -458 -537 247 -102 68
4923F8j91l78P94K2k32J76P2k28mQ4l51n08K28O65l18l88M92K26p9n3m7k58L88
$$ 68 -123 -501 293 315 83 259 331 103 99 183 -168 -676 -448 217 -101 -489 3 229 150 97 50 -208 180
$$ [...]
8191B53
##END NTUPLES=NMR FID
##END=
