##TITLE=1H_EC-3211
 CDCl3, 8 sc, 
 22.11.2019
##JCAMPDX= 6.0         $$ Bruker NMR JCAMP-DX V2.0
##DATA TYPE= NMR FID
##DATA CLASS= NTUPLES
##ORIGIN= UXNMR, Bruker Analytische Messtechnik GmbH
##OWNER= root
$$ XWIN-NMR		Version 3.5
$$ Fri Nov 22 14:05:58 2019 Russian Standard Time (UT+4h)  she@DPX200
##.OBSERVE FREQUENCY= 200.1315
##.OBSERVE NUCLEUS= ^1H
##.DELAY= (6, 6)
##.ACQUISITION MODE= SIMULTANEOUS
##.ACQUISITION SCHEME= undefined
##.AVERAGES= 8
##.DIGITISER RES= 18
##SPECTROMETER/DATA SYSTEM= spect
##.PULSE SEQUENCE= zg30
##.SOLVENT NAME= CDCl3
##.SHIFT REFERENCE= (INTERNAL, CDCl3, 0, 15.7039)
##AUDIT TRAIL= $$ (NUMBER, WHEN, WHO, WHERE, WHAT)
$$ ##TITLE= Audit trail, XWIN-NMR		Version 3.5
$$ ##JCAMPDX= 5.01
$$ ##ORIGIN= Bruker BioSpin GmbH
$$ ##OWNER= she
$$ F:/spectra/data/she/nmr/H-F/1/audita.txt
$$ ##AUDIT TRAIL=  $$ (NUMBER, WHEN, WHO, WHERE, WHAT)
(   1,<2019-11-22 14:04:50.06 +0400>,<she>,<DPX200>,
      <created by zg, POWCHK disabled, PULCHK disabled
       configuration hash MD5:
       00 E9 B6 7A A2 85 ED C7 34 08 36 98 17 FE 4E 26
       data hash MD5: 16K
       DE 0B FC 7C D6 4D BC 10 43 8A C1 49 02 E9 B5 02>)
$$ ##END=
$$ 
$$ hash MD5
$$ AD AB E7 04 F7 8D 71 23 8D 5B 10 74 1D 0A 06 90
##$RELAX= 
##$RELAX= 
##$RELAX= 
##$RELAX= 
##$RELAX= 
##$RELAX= 
$$ Bruker specific parameters
$$ --------------------------
##$DU= <F:/spectra>
##$EXPNO= 1
##$NAME= <H-F>
##$PROCNO= 1
##$TYPE= <nmr>
##$USER= <she>
##$AMP= (0..31)
100 100 100 100 100 100 100 100 100 100 100 100 100 100 100 100 100 100 
100 100 100 100 100 100 100 100 100 100 100 100 100 100 
##$AQSEQ= 0
##$AQ_mod= 1
##$AUNM= <au_zg>
##$AUTOPOS= <>
##$BF1= 200.13
##$BF2= 200.13
##$BF3= 200.13
##$BF4= 200.13
##$BF5= 200.13
##$BF6= 200.13
##$BF7= 200.13
##$BF8= 200.13
##$BYTORDA= 1
##$CFDGTYP= 0
##$CFRGTYP= 5
##$CHEMSTR= <none>
##$CNST= (0..31)
1 1 145 1 1 1 1 1 1 1 1 1 1 1 1 1 1 1 1 1 1 1 1 1 1 1 1 1 1 1 1 1 
##$CPDPRG= <>
##$CPDPRG1= <>
##$CPDPRG2= <>
##$CPDPRG3= <>
##$CPDPRG4= <mlev>
##$CPDPRG5= <mlev>
##$CPDPRG6= <mlev>
##$CPDPRG7= <mlev>
##$CPDPRG8= <mlev>
##$CPDPRGB= <>
##$CPDPRGT= <>
##$D= (0..31)
0 1.2 0 0 0 0 0 0 0 0.06 0 0.03 0 0 0 0 0.0002 0 0 0 0 0 0 0 0 0 0 0 0 
0 0 0 
##$DATE= 1574417089
##$DBL= (0..7)
120 120 120 120 120 120 120 120 
##$DBP= (0..7)
150 150 150 150 150 150 150 150 
##$DBP07= 0
##$DBPNAM0= <>
##$DBPNAM1= <>
##$DBPNAM2= <>
##$DBPNAM3= <>
##$DBPNAM4= <>
##$DBPNAM5= <>
##$DBPNAM6= <>
##$DBPNAM7= <>
##$DBPOAL= (0..7)
0.5 0.5 0.5 0.5 0.5 0.5 0.5 0.5 
##$DBPOFFS= (0..7)
0 0 0 0 0 0 0 0 
##$DE= 6
##$DECBNUC= <off>
##$DECIM= 24
##$DECNUC= <off>
##$DECSTAT= 4
##$DIGMOD= 1
##$DIGTYP= 9
##$DL= (0..7)
0 120 120 120 120 120 120 120 
##$DP= (0..7)
150 150 150 150 150 150 150 150 
##$DP07= 0
##$DPNAME0= <>
##$DPNAME1= <>
##$DPNAME2= <>
##$DPNAME3= <>
##$DPNAME4= <>
##$DPNAME5= <>
##$DPNAME6= <>
##$DPNAME7= <>
##$DPOAL= (0..7)
0.5 0.5 0.5 0.5 0.5 0.5 0.5 0.5 
##$DPOFFS= (0..7)
0 0 0 0 0 0 0 0 
##$DQDMODE= 0
##$DR= 18
##$DS= 0
##$DSLIST= <SSSSSSSSSSSSSSS>
$$ [...]
##$SUBNAM2= <"">
##$SUBNAM3= <"">
##$SUBNAM4= <"">
##$SUBNAM5= <"">
##$SUBNAM6= <"">
##$SUBNAM7= <"">
##$SUBNAM8= <"">
##$SUBNAM9= <"">
##$SW= 24.9337058887773
##$SWIBOX= (0..15)
0 0 2 0 0 0 0 0 0 0 0 0 0 0 0 0 
##$SW_h= 4990.01996007984
##$TD= 16384
##$TD0= 1
##$TE= 0
##$TE2= 300
##$TE3= 300
##$TEG= 300
##$TL= (0..7)
0 120 120 120 120 120 120 120 
##$TP= (0..7)
150 150 150 150 150 150 150 150 
##$TP07= 0
##$TPNAME0= <>
##$TPNAME1= <>
##$TPNAME2= <>
##$TPNAME3= <>
##$TPNAME4= <>
##$TPNAME5= <>
##$TPNAME6= <>
##$TPNAME7= <>
##$TPOAL= (0..7)
0.5 0.5 0.5 0.5 0.5 0.5 0.5 0.5 
##$TPOFFS= (0..7)
0 0 0 0 0 0 0 0 
##$TUNHIN= 0
##$TUNHOUT= 0
##$TUNXOUT= 0
##$USERA1= <user>
##$USERA2= <user>
##$USERA3= <user>
##$USERA4= <user>
##$USERA5= <user>
##$V9= 5
##$VALIST= <valist>
##$VCLIST= <CCCCCCCCCCCCCCC>
##$VD= 0
##$VDLIST= <DDDDDDDDDDDDDDD>
##$VPLIST= <PPPPPPPPPPPPPPP>
##$VTLIST= <TTTTTTTTTTTTTTT>
##$WBST= 1024
##$WBSW= 4
##$XGAIN= (0..3)
0 0 0 0 
##$XL= 0
##$YL= 0
##$YMAX_a= 135575
##$YMIN_a= -64156
##$ZGOPTNS= <>
##$ZL1= 120
##$ZL2= 120
##$ZL3= 120
##$ZL4= 120
##$ABSF1= 10
##$ABSF2= 0
##$ABSG= 5
##$ABSL= 3
##$ALPHA= 0
##$AQORDER= 0
##$ASSFAC= 0
##$ASSFACI= 0
##$ASSFACX= 0
##$ASSWID= 0
##$AUNMP= <proc_1d>
##$AZFE= 0.1
##$AZFW= 0.1
##$BCFW= 1
##$BC_mod= 2
##$BYTORDP= 1
##$COROFFS= 0
##$CY= 11.3945322036743
##$DATMOD= 1
##$DC= 2
##$DFILT= <>
##$DTYPP= 0
##$F1P= 16.9975609425685
##$F2P= -3.02152046262296
##$FCOR= 0.5
##$FTSIZE= 0
##$FT_mod= 4
##$GAMMA= 1
##$GB= 0.15
##$INTBC= 1
##$INTSCL= 1
##$ISEN= 128
##$LB= 0.24
##$LEV0= 0
##$LPBIN= 0
##$MAXI= 10000
##$MC2= 0
##$MEAN= 0
##$ME_mod= 0
##$MI= 1.114404
##$NCOEF= 0
##$NC_proc= 0
##$NLEV= 6
##$NOISF1= 3.799351
##$NOISF2= 2.8
##$NSP= 1
##$NTH_PI= 0
##$NZP= 0
##$OFFSET= 15.70392
##$PC= 1
##$PHC0= -9790.786
##$PHC1= 19.00086
##$PH_mod= 1
##$PKNL= yes
##$PPARMOD= 0
##$PSCAL= 0
##$PSIGN= 0
##$REVERSE= no
##$SF= 200.130013532006
##$SI= 16384
##$SIGF1= 3
##$SIGF2= 2
##$SINO= 400
##$SIOLD= 16384
##$SREGLST= <1H.CDCl3>
##$SSB= 0
##$STSI= 0
##$STSR= 0
##$SW_p= 3612.71676300578
##$SYMM= 0
##$S_DEV= 0
##$TDeff= 0
##$TDoff= 0
##$TI= <>
##$TILT= no
##$TM1= 0
##$TM2= 0
##$TOPLEV= 0
##$USERP1= <user>
##$USERP2= <user>
##$USERP3= <user>
##$USERP4= <user>
##$USERP5= <user>
##$WDW= 1
##$XDIM= 8192
##$YMAX_p= 0
##$YMIN_p= 0
$$ End of Bruker specific parameters
$$ ---------------------------------
##NTUPLES= NMR FID
##VAR_NAME=  TIME,          FID/REAL,        FID/IMAG
##SYMBOL=    X,             R,               I
##VAR_TYPE=  INDEPENDENT,   DEPENDENT,       DEPENDENT
##VAR_FORM=  AFFN,          ASDF,            ASDF
##VAR_DIM=   8192,          8192,            8192
##UNITS=     SECONDS,       ARBITRARY UNITS, ARBITRARY UNITS
##FACTOR=    0.0002004,     1,               1
##FIRST=     0,             0,               0
##LAST=      1.6414764,     0,               0
##MIN=       0,             -64156,          0
##MAX=       1.6414764,     135575,          0
$$ Real data points
##PAGE= N=1
##DATA TABLE= (X++(R..R)), XYDATA
$$ [...]
$$ plain form
2976 1321 1999 -2719 -496 2635 -1314 -2439 2243 474 -2828 660 1800 -2591 -688 2787 -1269
2991 -1269 -2544 2175 454 -2906 841 1899 -2658 -1045 2461 -1385 -2469 1931 428 -2807 573
3006 573 1954 -2685 -1173 2528 -1060 -2623 1757 878 -2814 321 2032 -2166 -1269 2418 -638 -2520
3022 -2520 1779 1015 -3124 242 2423 -2167 -1283 2655 -573 -2373 1660 1467 -2855 219 2595 -1576
3038 -1576 -1406 2685 -366 -2389 1574 1897 -2512 106 2465 -1298 -1620 2788 219 -2367 1731 2074
3054 2074 -2581 -65 2960 -1297 -1563 2625 639 -2178 1843 2138 -2093 -116 2959 -837 -1449 2736
3070 2736 878 -2338 1506 2085 -2338 -145 3029 -734 -1882 2798 702 -2464 1368 2507 -1991
3085 -1991 -349 2908 -726 -1878 2453 1205 -2347 1038 2471 -1931 -568 2747 -616 -2127 2002
$$ packed form
2976A321O78m718K223L131l949j125M682j769l302L488J140m391J903L475m056
2991a269j275M719j721l360L747J058m557J613L506l846j084M400j503l235L380
3006E73J381m639J512L701l588j563M380q79l692L135J711m198Q97L687l056j882
3022b520M299p64m139L366K181m590Q84L938l228j800M033j93m322L074K376m171
3038a576J70M091l051k023L963L23m409K618K359l763l22M408k569k586M098L43
3054B074m655K516L025m257k66M188j986k817M021K95m231J977L075l796o12M185
3070B736j858l216L844N79m423K193L174l763j148M680k096l166L832J139m498
3085a991J642L257l634j152M331j248l552L385J433m402J363L315l363j511M129
$$ plain form
3100 2002 1145 -2568 622 2019 -2036 -940 2600 -634 -2537 2042 843 -2840 404 1984 -2082
3115 -2082 -1153 2415 -740 -2269 1644 961 -2665 159 2196 -2023 -1808 2278 -129 -2440 1477 1042
3131 1042 -2941 -366 2250 -1702 -1884 2256 -219 -2742 1212 1474 -2699 -286 2462 -1578 -1873 2293
3147 2293 -125 -2326 1250 1561 -2452 -228 2333 -1398 -2009 1961 113 -2781 1100 1640 -2232 -611
3163 -611 2464 -1351 -1760 1958 893 -2505 1126 1899 -2215 -543 2857 -900 -2079 2040 868 -2393
3179 -2393 904 2357 -1659 -366 2552 -628 -1682 2413 1242 -2067 818 2182 -1979 -647 2773
3194 2773 -391 -1979 2236 1441 -2034 660 2518 -1562 -817 2680 -246 -1804 1977 1494 -2233 717
3210 717 2687 -1589 -1009 2498 -165 -2170 1597 1651 -2285 324 2528 -1405 -1173 2445 -279 -2287
$$ packed form
3100B002q57l713L190J397m055J096L540l234j903M579j199l683L244J580m066
3115b082R29L568l155j529L913o83l626K824K037m219K15M086k407k311L917m35
3131A042l983K575K616l952j82M140k475k523L954K62m173K413K748m040k95M166
3147B293k418k201L576L11m013K224K561l731o11L970j848k894L881N40l872J621
3163f11L075l815m09L718j065l398L631P73m114J672L400l757j179M119j172l261
3179b393L297J453m016J293K918l180j054M095j171l309K885J364m161J332L420
3194B773l164j588M215p95l475K694J858m080P45L497k926j558L781m83l727K950
3210G17J970m276N80L507k663k005L767N4l936K609K204l933K32L618k724k008
$$ plain form
3226 -2287 1621 1295 -2238 -52 2310 -1126 -1472 2255 206 -2274 1206 1518 -2341 -540 2122 -1441
3242 -1441 -1823 2141 -20 -2501 1410 1405 -2383 -529 1982 -1295 -2109 1782 228 -2630 717 1453
3258 1453 -2142 -649 2062 -1047 -1897 1663 676 -2473 750 1725 -2303 -1218 2131 -823 -2301 1693
3274 1693 322 -2587 513 1870 -1843 -1032 2275 -530 -2032 1636 707 -2464 227 1872 -1834
3289 -1834 -1212 2397 -595 -2334 1519 1140 -2313 344 2172 -1543 -1243 2528 -182 -2370 1951 1393
3305 1393 -1871 181 2456 -1474 -1284 2576 72 -2226 1506 1886 -2029 244 2525 -1206 -1243 2351
3321 2351 576 -2137 1379 1900 -1997 32 2588 -734 -1129 2173 506 -2293 1193 1958 -1829 -35
3337 -35 2374 -921 -1096 2428 828 -2136 953 2034 -1548 -230 2220 -742 -1868 2251 503 -2193
$$ packed form
3226b287L908l26l533K186K362l436l46L727k049k480L480L12l859J801K662l563
3242a441l82L964k161k481L911nl788J854K511l277q14L891j554k858L347P36
3258A453l595J493K711l109q50L560r87l149L223R75m028J085L349k954j478L994
3274A693j371k909L100J357l713Q11L307k805j502L668r29l171K691J645l706
3289a834O22L609k992j739L853l79l453K657J828l715L00L771k710k188M321n58
3305A393l264K052K275l930J90L860k504k298L732L80l915K273K281l731l7L594
3321B351j775k713L516N21l897K029K556l322l95L302j667k799L486P65l787J794
3337c5K409l295j75L524j600k964L089J081l582J318K450k962j126M119j748k696
$$ plain form
3353 -2193 566 1676 -1846 -540 2523 -615 -1832 1831 933 -2317 655 1871 -1698 -717 2135
3368 2135 -852 -2503 1333 829 -2231 384 1471 -1897 -1085 2184 -616 -2263 1065 623 -2305 211
3384 211 2004 -1756 -1621 1869 -554 -2183 1193 798 -2406 -230 1852 -2129 -1494 1930 -426 -2374
3400 -2374 967 900 -2335 -335 1690 -1375 -1668 2063 -310 -2425 1011 1016 -2027 -411 2109 -1329
3416 -1329 -1589 2000 219 -2270 1264 1288 -1976 -535 1844 -1026 -1541 1948 423 -1715 1078 1728
3432 1728 -1861 -268 2315 -938 -1327 1771 871 -1868 949 1749 -1516 -307 2301 -367 -1408 2099
3448 2099 693 -1906 861 1890 -1282 -483 2329 -166 -1186 1640 1425 -1816 659 1938 -1344
3463 -1344 -704 2449 -393 -1515 1828 865 -1815 664 2072 -1580 -817 2188 -90 -1824 1558 1077
$$ packed form
3353b193K759J110l522J306L063l138j217L663q98l250K972J216l569R81K852
3368B135k987j651L836n04l060K615J087l368Q12L269k800j647L328m42k928K516
3384B11J793l760J35L490k423j629L376l95l204K176K082l981O35L424k356j948
3400b374L341o7l235K000K025l065k93L731k373k115L436Nl043J616K520l438
3416a329k60L589j781k489L534K4l264J441K379k870n15L489j525k138K793O50
3432A728l589J593K583l253l89L098r00k739K817Q00l265J209K608k668j041L507
3448B099j406k599K767J029l172P99K812k495j020K826k15l241K475J279l282
3463a344O40L153k842j122L343r63k680K479J408l652P63L005k278j734L382m81
$$ plain form
3479 1077 -2068 62 2372 -949 -1084 1962 2 -1806 1295 1011 -2155 30 1937 -1381 -1298 1881
3495 1881 27 -2330 1134 1282 -2107 78 1621 -1093 -1503 1890 -239 -2317 671 1146 -1877 -291
3511 -291 1952 -935 -1766 1378 395 -2367 603 1456 -1830 -323 1712 -1034 -1451 1474 290 -2133
3527 -2133 539 1138 -1937 -746 1930 -782 -1845 1218 417 -2152 199 1539 -1842 -746 1684
3542 1684 -417 -1603 1443 721 -1859 36 1657 -1484 -826 1856 -238 -1775 1254 1035 -2087 201
3558 201 1644 -1249 -740 1799 -7 -1599 1644 1016 -1888 219 2089 -741 -898 1888 95 -1433
3574 -1433 1631 1268 -1418 265 2099 -849 -792 2175 102 -1506 1345 1325 -1517 51 2039 -868
3590 -868 -790 2230 528 -1919 1205 1560 -1582 -263 2141 -710 -1300 2002 482 -1895 876 1432
$$ packed form
3479A077l145K130K310l321j35L046j960j808L101k84l166K185J907l318Q3L179
3495A881j854k357L464J48l389K185J543k714m10L393k129k078K988M75l023J586
3511b91K243k887q31L144r83k762K970Q53l286J507K035k746m17K925j184k423
3527b133K672N99l075J191K676k712j063L063q01k569K351J340l381J096K430
3542A684k101j186L046p22k580J895J621l141O58K682k094j537L029k19l122K288
3558B01J443k893N09K539j806j592L243o28k904K107J870k830j57K786j793j528
3574a433L064l63k686J683J834k948N7K967k073j608K851k0k842J568J988k907
3590h68P8L020j702k447L124L55l142J319K404k851n90L302j520k377K771N56
$$ plain form
3606 1432 -1633 -174 1975 -617 -1558 1690 338 -1879 741 1469 -1699 -367 1922 -607 -1360 1606
3622 1606 495 -2101 506 1529 -1363 -773 1872 -435 -1555 1175 402 -1996 277 1369 -1453
3637 -1453 -956 1609 -688 -1895 1061 402 -2010 117 1425 -1487 -1245 1774 -516 -1969 935 881
3653 881 -2033 -142 1003 -1432 -1211 1662 -365 -2045 839 601 -1927 87 1548 -1448 -1289 1513
3669 1513 -210 -1543 1069 866 -1849 -333 1521 -802 -691 2003 99 -1965 782 1343 -1574 24
3685 24 1871 -1109 -1319 1835 273 -1668 1154 1448 -1516 -212 2008 -584 -1206 1675 531 -1307
3701 -1307 764 1583 -1507 -181 1729 -604 -1077 1715 796 -1492 853 1513 -1284 -694 1901 -443
3717 -443 -1584 1668 544 -1341 442 1511 -998 -773 2007 -251 -1285 1396 768 -2061 775 1682
$$ packed form
3606A432l065J459K149k592r41L248j352k217K620P28l168J332K289k529p53K966
3622A606j111k596K607J023k892N90K645k307j120K730p73k398K273J092k822
3637a453M97K565k297j207K956o59k412K127J308k912K42L019k290j453K904n4
3653H81k914J891J145k435K21K873k027j680K884k38k528K014J461k996J59K802
3669A513j723j333K612k03k715J516J854k323J11K694j904k064K747N61k917J598
3685B4J847k980k10L154j562j941K822K94k964J304K220k592o22K881j144j838
3701a307K071Q19l090J326J910k333m73K792r19k288K345O60k797N90K595k344
3717d43j141L252j124j885J783J069k509K25K780k258j034K681o28k829K836R07
$$ plain form
3733 1682 -1143 -719 1572 -187 -1785 1427 1437 -1581 93 1463 -790 -1112 1663 -499 -1720 1181
3749 1181 862 -1918 -11 1864 -957 -1233 1571 -127 -1752 757 819 -1675 -405 1613 -1276 -1224
3765 -1224 1329 -82 -1881 616 1136 -1690 -479 1376 -1152 -1534 1190 -250 -2022 416 740 -1664
3781 -1664 -596 1486 -797 -1519 1285 -46 -1798 681 1210 -1627 -606 1795 -971 -1338 1108 428
3797 428 -1687 320 1240 -1291 -563 1751 -503 -1467 1579 289 -1754 520 1232 -1461 -752 1383
3813 1383 -302 -1327 922 988 -1699 335 1336 -950 -608 1714 -106 -1184 1537 782 -1354 263
3829 263 1659 -921 -734 1769 88 -1223 1224 1102 -1758 262 1845 -824 -630 1887 325 -1510
3845 -1510 1127 996 -1439 274 1413 -484 -868 1820 85 -1523 916 1242 -1619 159 1887 -889
$$ packed form
3733A682k825M24K291j759j598L212J0l018J674J370k253l22K775k162j221K901
3749A181l19k780J907J875k821k76K804j698j625K509O2k494J270K018k889N2
3765a224K553j411j799K497N20k826J211J855k528l82K724j440j772K438L24k404
3781a664J068K082k283p22K804j331j752K479N29k837J021K401k766l67K446o80
3797D28k115K007R20k531P28K314k254r64L046j290k043K274P12k693P09K135
3813A383j685j025K249O6k687K034J001k286L42K322j820j078K721p55k136J617
3829B63J396k580J87K503j681j311K447j22k860K020J583k669J94K517j562j835
3845a510K637j31k435J713J139j897l84K688j735j608K439L26k861J778J728k776
$$ plain form
3861 -889 -822 1168 338 -1435 796 1622 -1107 163 1765 -623 -1125 1495 298 -1361 454 1335 -1743
3878 -1743 -506 1301 -519 -1250 1410 266 -1806 397 1027 -1129 -695 1355 -616 -1547 1174 482
3894 482 -1638 485 1048 -1469 -717 1562 -471 -1562 1167 503 -1634 275 1157 -1135 -868 1626
3910 1626 -307 -1505 1114 396 -1832 -94 1460 -1284 -1116 1425 -177 -1398 645 589 -1643 -322
3926 -322 1542 -1302 -837 1587 -126 -1622 1151 925 -1524 3 1323 -731 -868 1562 -101 -1653
3942 -1653 807 1234 -1591 57 1707 -853 -1103 1279 288 -1648 891 928 -1169 -169 1767 -844
3958 -844 -1029 1548 851 -1303 885 1413 -1341 -469 1786 -223 -1187 1698 587 -1463 859 1708 -1125
3975 -1125 -451 1796 -234 -891 1635 433 -1106 502 1480 -1198 -666 1579 -314 -1039 1250 830
$$ packed form
3861h89O7J990q30j773K231Q26k729J270J602k388n02K620j197j659J815Q81l078
3878a743J237J807j820p31K660j144k072K203O30k156M34K050j971r31K721o92
3894D82k120K123N63k517P52K279k033j091K729o64k137J909Q82k292K67K494
3910A626j933j198K619p18k228J738J554k744J68K541j602j221K043n6k232J321
3926c22J864k844M65K424j713j496K773k26k449J527J320k054j37K430j663j552
3942a653K460M27k825J648J650k560k50K382r91j936K539L7k097J000J936k611
3958h44j85K577o97k154K188N28k754Q72K255k009r64K885j111k050K322Q49k833
3975a125O74K247k030o57K526j202j539J608R78k678N32K245j893p25K289m20
$$ plain form
3991 830 -1350 636 1613 -1371 -710 1908 -386 -1593 1405 838 -1524 255 1447 -1122 -821 1479
4007 1479 -59 -1326 997 573 -1708 159 1257 -1227 -1086 1725 32 -1579 768 656 -1551 -79
4023 -79 1523 -1114 -1027 1351 272 -1504 779 820 -1877 -455 1094 -1108 -1309 1227 120 -1825 658
4040 658 898 -1595 -571 1071 -1146 -1399 998 109 -1819 433 1120 -1413 -364 1543 -988 -1456
4056 -1456 993 339 -1494 491 1143 -1350 -854 1690 -385 -1245 1303 538 -1690 323 1203 -1462
4072 -1462 -458 1578 -256 -1170 1204 586 -1478 570 991 -631 -329 1445 -325 -1193 1564 776
4088 776 -1183 480 1472 -659 -258 1875 -184 -1356 1080 934 -1164 48 1603 -1065 -980 1764
4104 1764 -135 -1349 1070 851 -1469 242 1591 -766 -733 1541 275 -1211 898 1042 -1651 -90
$$ packed form
3991H30k180J986R77k984O61K618k294j207K998n67k362J779J192k569L01K300
4007A479j538j267K323m24k281J867J098k484J41K811j693j611K347j12k207J472
4023g9J602k637Q7K378j079j776K283M1k697J422J549k202k01K536j107j945K483
4040F58K40k493J024J642k217k53K397q89j928K252O87k533J049J907k531m68
4056a456K449o54j833J985O52k493M96K544k075q60K548p65k228K013Q80k665
4072a462J004K036j834r14K374o18k064K048M21j622L02J774j770q68K757p88
4088G76j959J663R92k131M01K133k059j172K436j46k098J212J555k668Q5K744
4104A764j899j214K419k19k320J711J349k357L3K274j266j486K109J44k693J561
$$ plain form
4120 -90 1766 -764 -1022 1468 502 -1327 833 755 -1428 -290 1598 -814 -944 1045 286 -1603 481
4137 481 940 -1259 16 1761 -798 -1062 1202 557 -1633 597 1003 -1096 -539 1514 -464 -1511
4153 -1511 1156 476 -1504 438 1073 -1260 -911 1364 -582 -1494 925 202 -1808 52 1096 -1068
4169 -1068 -992 1326 -506 -1342 759 322 -1796 -10 1221 -1035 -857 1153 -327 -1525 1061 587
4185 587 -1651 172 1252 -978 -699 1569 -254 -1409 946 852 -1316 -33 1439 -1006 -897 1255
4201 1255 141 -1379 1055 1001 -1571 53 1300 -546 -593 1432 267 -1635 974 1408 -1255 -213
4217 -213 1354 -649 -718 1227 390 -903 827 1271 -1310 -382 1853 -664 -801 1311 719 -1278 975
4234 975 1335 -1357 -424 1522 -426 -853 1450 540 -1504 655 1381 -1394 -367 1561 83 -897 1321
$$ packed form
4120i0J856k530k58K490r66j829K160p8k183J138J888k412j30J989p59j889K084
4137D81M59k199J275J745k559k64K264o45k190K230M06k099N57K053j978j047
4153a511K667o80j980J942O35k333L49K275j946r12K419p23k010J860J044k164
4169a068P6K318j832q36K101m37k118J786J231k256J78K010j480j198K586m74
4185E87k238J823J080k230K79K268j823j155K355r4k168J283J472k445J09K152
4201A255j114j520K434n4k572J624J247j846m7K025j165j902K609M34k663J042
4217b13J567k003o9J945q37j293J730M44k581R28K235k517j37K112n92j997K253
4234I75L60k692R33J946j948m27K303r10k044K159P26k775J027J928j478r80K218
$$ plain form
4251 1321 568 -1759 568 1349 -1082 -467 1363 -101 -1300 1068 527 -1817 204 1205 -1059 -627
4267 -627 1463 -274 -1281 834 835 -1355 112 988 -995 -1012 1415 -220 -1074 1042 717 -1420 -267
4284 -267 1198 -969 -1137 1379 -42 -1525 771 682 -1661 -443 1247 -733 -1136 1097 113 -1914
4300 -1914 59 871 -1724 -102 1164 -665 -995 1530 195 -1624 650 1209 -1359 -389 1146 -695
4316 -695 -1007 1173 344 -1475 497 947 -1298 -591 1320 -657 -1242 1080 82 -1272 499 1222 -1129
4333 -1129 -383 1331 -447 -864 1170 664 -1090 491 1504 -1013 -282 1682 -47 -922 1298 868
4349 868 -1304 174 1616 -1167 -289 1675 -212 -1076 1166 708 -1520 797 1248 -851 -359 1459
4365 1459 -217 -878 1021 997 -1574 72 1254 -864 -739 1262 216 -1252 949 821 -1302 -145
$$ packed form
4251A321p53k327K327P81k431O15J830j464j199K368n41k344K021J001k264M32
4267f27K090j737j007K115Jk190J467Q76j983j7K427j635q54K116l25k137J153
4284b67J465k167j68K516j421j483K296q9k343J218J690j980m03K233r84k027
4300a914J973Q12k595J622J266j829l30K525j335j819K274N59k568R70J535j841
4316f95l12K180q29j819J972M50k245P07J911j977n85K322r98j354J771P23k351
4333a129P46J714j778m17K034n06j754J581J013k517P31J964j729q75K220m30
4349H68k172J478J442k783Q78J964j887q64K242m58k228K317M51k099M92J818
4365A459j676o61J899k4k571J646J182k118J25K001j046j468K201j28k123J157
$$ plain form
4381 -145 1355 -734 -471 1170 -66 -1351 688 1132 -1306 42 1390 -883 -981 1104 218 -1304
4397 -1304 488 762 -1316 -66 1145 -882 -1071 1121 -44 -1275 448 681 -1496 -555 1192 -766
4413 -766 -1193 1133 436 -1390 638 598 -1415 -366 1381 -580 -1349 864 -16 -1538 460 884 -1426
4430 -1426 -396 1201 -453 -1225 1085 359 -1309 64 1324 -1011 -559 998 -393 -1147 1025 688
4446 688 -1527 142 1220 -646 -280 1137 -61 -1204 571 818 -1348 40 1437 -707 -738 1297
4462 1297 31 -1229 853 676 -1252 263 1353 -398 -734 1222 -87 -1343 902 787 -1249 158
4478 158 1793 -593 -950 1758 173 -1241 629 1024 -1024 91 1536 -248 -848 1085 448 -1075
4494 -1075 567 1097 -1118 -124 1262 -596 -789 942 365 -1546 648 1033 -1163 -214 1433 -711
$$ packed form
4381a45J500k089K63J641j236j285K039M44k438J348J348k273r8K085q86j522
4397a304J792K74k078J250J211k027j89K192j165j231J723K33k177R41J747j958
4413g66m27K326o97j826K028m0k013J049J747j961p69K213q80j522J998M24k310
4430a426J030J597j654p72K310p26j668J373J260k335M52J557j391p54K172l37
4446F88k215J669J078j866L66J417j198j143J775K47k166J388J397k144l1K035
4462A297j266j260K082j77j928J515J090j751l36J956j309j256K245j15k036J407
4478A58J635k386l57K708j585j414J870L95k048J115J445j784o00J933o37j523
4494a075J642N30k215R94J386j858j93J731n77j911K194L85k196R49J647k144
$$ plain form
4510 -711 -985 1198 339 -1184 280 1142 -930 -265 1347 -239 -1074 937 899 -1278 466 988 -995
4527 -995 -255 1154 -277 -1140 947 510 -1308 17 1218 -1206 -781 1079 -197 -1121 443 487 -1317
4544 -1317 52 1199 -811 -779 902 -124 -1605 855 699 -1244 -117 1148 -1012 -1156 1051 -71
4560 -71 -1352 594 808 -1463 -499 958 -642 -968 878 45 -1233 538 722 -1351 -342 1132 -559
4577 -559 -983 1250 -19 -1057 478 738 -1173 -493 1266 -475 -1142 1170 406 -1245 437 978 -639
4594 -639 -343 1122 16 -512 947 212 -1491 737 1018 -850 -297 1571 -487 -971 984 564 -950
4611 -950 257 1437 -1048 -462 1274 -74 -1226 1010 632 -1109 499 1114 -1081 -537 1302 -83
4627 -83 -1080 659 625 -1184 303 1268 -673 -728 1422 -71 -896 812 891 -733 137 1025 -858 -561
$$ packed form
4510g11k74K183q59j523J464Q62k072O65J612j586q35K011l8k177J744N22j983
4527i95P40J409j431q63K087m37j818J325J201k424M25J860j276r24J564M4j804
4544a317J369J147k010L2J681j026j481K460j56j943J127J265k160j44K207j122
4560g1j281J946K14k271R64J457j600l26J846q33j278J771J84k073J009J474j691
4577e59m24K233j269j038J535K60j911O80J759j741o67K312p64j651J682N41j617
4594f39K96J465j106n28J459p35j703K228K81j868N53J868k058m84J955m20j514
4611i50J207J180k485N86J736j348j152K236l78j741J608O15k195N44J839j385
4627h3r97J739l4j809J487R65j941n5K150j493q25J708P9j624Q70Q88j883K97
$$ plain form
4645 -561 1233 0 -1304 685 768 -935 -78 1200 -802 -1101 1406 141 -1510 416 728 -1352
4661 -1352 -76 1354 -668 -845 1021 184 -1128 380 1003 -1068 -220 1173 -564 -1028 844 139
4677 139 -1497 566 970 -1118 -406 1465 -448 -1214 479 205 -1650 305 862 -1172 -274 1155 -283
4694 -283 -1126 636 523 -1327 275 870 -885 -565 1385 -318 -1184 1070 575 -1166 206 1130 -1116
4711 -1116 -735 1116 -215 -1189 673 569 -860 124 1100 -544 -603 1027 127 -1366 970 751 -1076
4728 -1076 -152 1185 -415 -553 1151 361 -884 592 875 -1095 331 1110 -539 -583 1308 404 -952
4745 -952 799 593 -1167 114 1258 -822 -892 1132 364 -828 557 803 -873 -143 1114 -395 -558
4762 -558 1175 287 -1010 147 933 -1000 28 1170 -283 -1020 880 359 -1275 399 730 -865
$$ packed form
4645e61J794j233j304J989Q3j703Q57J278k002k99K507j265j651J926L12k080
4661a352J276J430k022j77J866q37j312J508O23k071Q48J393j737m64J872p05
4677A39j636K063M04k088P12J871j913p66J693k74j855J955N57k034Q98J429j438
4694b83q43J762j13j850J602N95j755L20J950j703q66K254m95j741J372R24k246
4711a116L81J851j331r74J862j04j429R84R76j644n9J630r00j493K336k19j827
4728a076R24J337j600j38J704p90j245J476K83j970J426P79j649m4J891r04j356
4745i52J751k06j760J281J144k080p0K024p68j192J385K46j676P30J257j509j63
4762e58J733q88j297J157P86j933J028J142j453p37J900n21j634J674L31j595
$$ plain form
4778 -865 -34 1246 -672 -1065 1031 34 -1159 228 894 -900 -720 944 -340 -950 657 739 -1220
4795 -1220 423 875 -629 -649 894 -226 -1080 897 587 -1108 -7 864 -840 -584 998 -311 -1121
4812 -1121 671 598 -1249 -141 1009 -780 -688 963 -204 -1086 583 788 -872 -262 1055 -619 -663
4829 -663 1119 79 -1197 616 668 -1149 -10 862 -416 -723 938 -15 -1155 522 976 -938 -227
4846 -227 1282 -678 -770 1209 421 -968 1086 1079 -767 -270 1097 -319 -647 1065 688 -902 655
4863 655 777 -706 -305 1240 -194 -1131 814 415 -630 459 1266 -744 -396 1233 -269 -795 702
4880 702 546 -1163 68 870 -526 -446 1062 -75 -767 592 504 -815 186 1197 -1172 -679 1246
4897 1246 100 -1093 735 615 -1015 167 1247 -708 -456 1139 228 -1018 332 721 -1011 7
$$ packed form
4778h65Q31J280j918l93K096r97j193J387O66j794J80J664j284o10J607Q2j959
4795a220J643M52j504k0J543j120q54J977l10j695J101Q71j704K56J582j309q10
4812a121J792p3j847J108J150j789R2J651j167q82J669K05j660O10J317j674m4
4829f63J782j040j276J813N2j817J139Q72j278l07J661r53j140J677M54j914P11
4846b27J509j960r2J979p88j389K054pj846M97J367j416l28J712l77j590J557
4863F55J22j483M01J545j434r37J945l99j045J089Q07k010L48J629j502n26J497
4880G02j56j709J231Q02j396Q0J508j137o92J359q8j319J001J011k369M93J925
4897A246j146j193J828j20j630J182J080j955K52J595r11j246J350L89j732J018
$$ plain form
4913 7 1040 -469 -536 1082 -36 -1014 450 914 -1170 -321 868 -701 -723 688 -46 -1018 387 818
4931 818 -884 -376 1015 -115 -779 675 25 -1100 218 310 -883 -437 1007 -680 -884 965 273
4948 273 -825 107 580 -1050 -437 991 -195 -741 660 346 -1198 226 715 -693 -438 1054 -272
4965 -272 -989 933 585 -1031 259 958 -781 -550 1267 151 -1109 788 348 -710 37 1073 -860
4982 -860 -535 953 19 -561 755 688 -978 169 1090 -118 -541 1418 172 -881 549 482 -772
4999 -772 -73 907 -177 -624 842 32 -792 882 538 -1054 217 903 -565 -667 1081 109 -1023
5016 -1023 751 847 -1061 -381 1050 -579 -820 865 327 -960 637 552 -680 -254 658 -333 -795 1015
5034 1015 410 -750 511 722 -809 -273 854 -416 -951 866 466 -1034 168 937 -796 -447 897
$$ packed form
4913GJ033j509o7J618j118r78J464M64k084Q49J189j569k2J411p34r72J405M31
4931H18j702N08J391j130o64J454o50j125J318R2j193M46J444j687k04J849o92
4948B73j098R32M73j630O13J428j186n46J401l14j544J424M89j408K55J492j326
4965b72p17J922l48j616J290O99j739K31J817j116j260J897m40j058P47J036j933
4982h60L25J488r34n80J316o7j666J147R21j208m23J959j246j053J430o7j254
4999g72O99R80j084m47J466q10q24J674l44j592J271O86j468j02J748r72j132
5016a023J774R6j908O80J431j629k41J685n38j287J597q5j232M26R12r91m62J810
5034A015o05j160J261K11j531N36J127j270n35J817m00j500J202P69j733L49J344
$$ plain form
5051 897 -255 -870 611 365 -1319 -106 709 -906 -596 1012 -455 -966 508 168 -896 -105 860
5068 860 -699 -674 1120 -333 -983 477 497 -1099 -93 853 -879 -552 774 -108 -899 373 191 -1057
5086 -1057 -67 691 -580 -694 760 295 -772 439 787 -714 -57 812 -269 -385 770 66 -767
5103 -767 542 687 -756 -33 775 -536 -927 1038 237 -897 309 1012 -702 303 976 -25 -654
5120 -654 824 172 -846 128 625 -474 -17 998 -12 -595 938 415 -767 363 711 -620 -318
5137 -318 1014 -180 -938 906 454 -1069 190 737 -511 -222 899 -87 -772 579 345 -842 140
5154 140 840 -445 -171 831 15 -1088 195 501 -741 -1 1004 -927 -631 821 172 -1030 571
5171 571 239 -952 57 716 -308 -645 655 -68 -950 160 247 -841 -111 643 -648 -536 491 -166
$$ packed form
5051H97j152o15J481k46j684J213Q15j615L10J608j467n11J474l40j064P91R65
5068H60j559K5J794j453o50J460K0j596J006R46j732L27J326q82p91J272j82j248
5086a057R90P58j271j14J454m65j067J211L48j501O57Q69j081j16J155p04q33
5103g67J309J45j443P23Q08j311l91J965q01j134J206P03j714J005O73j001o29
5120f54J478o52j018R74M97j099M57J015j010n83J533n23j182J130L48j331L02
5137c18J332j194p58J844m52j523J259N47j248K89J121r86o85J351k34j187R82
5154A40P00j285K74J002q16j103J283L06j242P40J005j931K96J452o49j202J601
5171E71l32j191J009O59j024l37J300p23q82J110Q7j088P30P54j291J12J027o57
$$ plain form
5189 -166 -689 215 429 -596 -91 610 -499 -788 348 170 -822 408 497 -1126 -572 915 -478 -829
5207 -829 700 205 -938 311 657 -527 -430 972 -115 -833 528 46 -856 60 479 -644 -556 844
5225 844 -415 -796 757 590 -859 208 885 -481 -99 694 104 -655 541 483 -1006 340 798 -503
5243 -503 -279 809 -184 -765 562 549 -482 33 671 -520 -452 945 -78 -762 379 577 -741 -67
5261 -67 888 -160 -347 757 -233 -971 661 680 -510 -205 838 -397 -471 665 133 -1094 443 741
5279 741 -827 256 841 -222 -506 843 -45 -924 312 624 -657 -1 1012 -483 -599 563 426
5296 426 -562 162 699 -643 -68 831 -306 -655 480 137 -812 124 523 -413 -440 668 -209 -840 669
5315 669 155 -734 -332 608 -743 -368 949 -192 -765 390 376 -775 -46 767 -636 -380 889 -429
$$ packed form
5189a66n23R04K14j025N05P01j109k89J136j78r92J230Q9j623N54J487j393l51
5207h29J529m95j143J249L46j184R7J402j087p18J361m82r02R16M19j123Q8J400
5225H44j259l81J553j67j449J067O77j366L82P93n90p59J196n8j489J346M58j301
5243e03K24J088r93n81J327j3j031N15O38j191O8J397j023o84J141J98j318O74
5261f7R55j048j87J104r90p38J632J9j190L05J043j235p4J136n32j227J537K98
5279G41j568J083N85j063k84J349q88q79J236L12j281O56J013j495j16J162j37
5296D26r88P24N37j342N75Q99j137l49J135l43r49R36L99r36k7J108q77o31J509
5315F69n14q89M02R40j351L75J317j141n73J155j4j151P29Q13j403K56J269j318
$$ plain form
5333 -429 -558 399 91 -763 246 854 -428 -585 710 79 -818 331 456 -713 -44 524 -318 -604
5351 -604 715 128 -765 618 333 -886 77 737 -466 -455 927 -191 -517 288 565 -367 -172 798
5369 798 -384 -514 701 476 -737 319 626 -875 -159 772 -61 -333 616 430 -576 552 776 -577
5387 -577 12 1105 67 -325 920 137 -812 443 685 -533 22 777 41 -390 775 255 -722 9
5405 9 629 -769 -274 749 -158 -511 495 368 -718 -222 992 -521 -434 931 -44 -908 883 356
5423 356 -707 -93 413 -397 -396 682 -279 -870 467 586 -709 313 665 -765 -362 820 -164 -791
5441 -791 781 580 -592 23 684 -811 -597 522 229 -913 183 499 -591 -178 571 -337 -572 345
5459 345 -7 -586 269 543 -715 -257 673 -194 -662 497 285 -818 -39 570 -757 -65 581 -220 -522
$$ packed form
5333d29j29R57l08q54J009O08j282j57J295o31q97J149J25j169O69N68q42k86
5351f04J319n87q93J383k85j219R63O60j203J1J382j118l26Q05K77r32J95R70
5369G98j182j30J215k25j213J056L07j501P16R31q33k72R49j86j006J128K24j353
5387e77N89J093j038l92J245p83r49J255K42j218N55P55p36m31J165n20r77P31
5405IO20j398M95J023r07l53J006j27j086M96J214j513Q7J365r75q64J791n27
5423C56j063O14N06q10JJ078r61n91J337J19j295J022L52j430M03J182r84o27
5441g91J572k01j172O15O61j495K14J119k93j142J096L16j090M13P49r08k35R17
5459C45l52n79Q55K74j258M58R30q67m68J159k12j103P79O09j327O92O46q01l02
$$ plain form
5478 -522 516 219 -853 300 914 -493 -317 906 -88 -840 687 -73 -771 362 682 -297 -204 842
5496 842 -326 -698 607 209 -669 169 638 -516 -251 873 74 -629 598 457 -658 72 754 -352
5514 -352 -311 782 -126 -400 405 285 -579 170 985 -304 -462 764 135 -702 452 163 -805 19 530
5533 530 -618 -495 886 126 -963 333 509 -802 -34 781 -42 -643 625 143 -881 -111 530 -596
5551 -596 -92 537 -4 -666 444 140 -827 276 761 -435 -203 555 -417 -608 253 64 -500 83 467
5570 467 -646 -273 582 -164 -551 401 356 -506 146 497 -770 -229 803 -601 -692 242 177 -1060 25
5589 25 382 -730 -582 519 -167 -747 611 390 -887 253 599 -743 -434 978 220 -616 693 382
5607 382 -817 -119 805 -459 -412 560 -192 -630 431 531 -559 67 668 -359 -299 725 98 -711 614
$$ packed form
5478e22J038k97j072J153O14j407J76J223r94p52J527p60o98J133L20r79R3J046
5496H42j168l72J305l98q78Q38M69j154K65J124p99p03J227j41j115P30O82j106
5514c52M1J093r08k74Q05j20q64P49Q15j289j58J226o29q37J154k89r68Q24N11
5533E30j148J23J381p60j089J296J76j311P68Q15q23o01J268m82j024P70O41j126
5551e96N04O29n41o62J110l04r67J103M85j196K32P58r72j91Q61j89n64N83L84
5570D67j113L73Q55p46l87R52m5q62O52L51j267N41J032j404r1R34o5j237J085
5589B5L57j112J48J101o86n80J358k21j277J140L46j342L09J412p58q36J309l11
5607C82j199O98R24j264M7R72p52m38J061J00j090O26O01j027O0J024o27q09J325
$$ plain form
5626 614 479 -626 -169 576 -519 -284 646 132 -475 269 708 -706 -373 608 -171 -519 817 467 -857
5645 -857 211 590 -667 -91 806 98 -416 826 -175 -642 367 694 -498 -151 781 -217 -323 439
5663 439 214 -574 362 874 -584 -432 587 -187 -410 548 318 -324 46 775 -530 -344 614 35 -617
5682 -617 478 647 -386 -144 723 -524 -213 332 -175 -714 305 454 -799 -39 897 -483 -503 401
5700 401 151 -893 472 266 -765 -81 697 -678 -401 625 16 -485 566 296 -617 -188 650 -169
5718 -169 -534 390 35 -831 198 364 -815 -316 429 -374 -506 410 68 -748 293 554 -631 -294 354
5737 354 -410 -534 197 312 -509 195 537 -138 0 844 67 -714 503 362 -538 369 301 -771 126 350
5757 350 41 -588 369 44 -593 438 664 -608 -299 541 155 -431 562 177 -751 260 282 -306 -309 918
$$ packed form
5626F14j35j105M57P45j095K35R30n14o07P44M39j414L33R81p79l48J336l50j324
5645h57J068L79j257N76Q97p08n14J242j001m67J009L27j192L47R32r98j06P62
5663D39k25p88R36N12j458J52J019p74k23R58k30o42L70P29j305J86R58n79o52
5682f17J095J69j033K42Q67j247L11N45n07n39J019J49j253P60R36j380k0R04
5700D01k50j044J365k06j031O84P78j375K77J026o09n01J051k70r13M29Q38q19
5718a69l65R24l55q66J029J66j179M99P45q03j32R16l42q16J041K61j185L37O48
5737C54p64j24P31J15q21P04L42o75J38Q44p77p81J217j41r00R07o8j072Q97K24
5757C50l09o29R57l25o37J031K26j272L09Q40l86n86R93l85r28J011K2n88lJ227
$$ plain form
5777 918 -305 -454 298 188 -516 1 990 -386 -340 815 28 -634 401 495 -587 13 589 -362 -482
5796 -482 526 261 -468 527 315 -788 -164 758 -59 -492 349 -125 -545 507 420 -544 20 754 -395
5815 -395 -660 531 103 -750 308 801 -525 -248 721 -348 -664 373 31 -744 -1 512 -788 -272
5833 -272 523 -289 -496 37 201 -517 67 636 -418 -334 699 -337 -450 515 421 -766 -139 345 -446
5852 -446 -541 520 -183 -669 236 425 -498 40 705 -356 -418 998 -60 -755 537 140 -884 -62 667
5871 667 -360 -57 632 -162 -522 478 409 -738 25 660 -360 -197 585 177 -544 378 375 -580 -97 974
5891 974 -33 -144 483 125 -176 386 426 -415 -70 484 100 -711 674 552 -566 320 748 -512 -23
5910 -23 857 92 -329 553 34 -232 -194 432 -486 -146 760 -204 -466 591 314 -740 179 625 -538 -254
$$ packed form
5777I18j223j49P52j10p04N17R89j376M6J155p87o62J035R4j082O00N76r51j20
5796d82J008k65p29R95k12j103O24R22q17m33Q41m74m20J052q7r64N64P34j149
5815c95k65J191m28q53J058M93j326K77R69j069l16J037l42p75P43N13j300N16
5833b72P95q12k07N33J64p18N84N69j054Q4J033j036j13R65r4j187O27M84p91
5852d46r5J061p03m86R05J89r23N38O65j061o2J416j058o95J292l97j024Q22P29
5871F67j027L03O89p94l60J000o9j147P63O35j020J63P82m08p21R22lr55M83J071
5891I74j007j11O27l58l01N62M0q41L45N54l84q11J385j22j118Q86M28j260M89
5910b3Q80p65m21Q82n19k66L8O26r18L40R06r64k62J057k77j054R19M46j163K84
$$ plain form
5930 -254 580 -318 -688 588 135 -505 104 499 -777 19 774 -379 -643 408 321 -539 -147 389 -524
5949 -524 -211 368 -465 -649 436 250 -961 -31 571 -570 -240 540 85 -556 346 253 -528 -134 730
5968 730 -441 -553 599 -28 -747 204 655 -174 -447 767 -485 -651 342 -46 -605 370 366 -535 93
5987 93 703 -596 -583 392 173 -809 122 547 -505 188 700 -168 -439 450 326 -407 506 656 -402 -199
6007 -199 771 -139 -424 316 136 -684 402 316 -539 -214 1172 -20 -458 321 340 -586 269 528 -641
6026 -641 -205 559 -82 -661 433 391 -377 122 600 -280 -43 562 -143 -336 371 325 -616 -3 664 -270
6046 -270 -290 732 -154 -457 191 202 -635 -3 467 -273 -514 303 64 -517 421 581 -772 -91 629 -332
6066 -332 -632 431 3 -586 447 73 -344 -385 763 -477 -607 356 138 -617 -41 324 -378 -193 651
$$ packed form
5930b54Q34q98l70J276m53o40O09L95j276P96P55j153k64J051q7q60L92N36r13
5949e24L13N79q33j84J085j86j211R30O02j141L30P80m55o41R02r3p81L94Q64
5968G30j171j12J152o27p19R51M51q29k73J214j252j66R93l88n59R75mr01O28
5987I3O10j299J3R75k19r82R31M25j052O93N12q68k71Q89j24p33R13J50j058K03
6007a99R70r10k85P40j80q20J086q6q55L25J386j192m38P79J9r26Q55K59j169
6026f41M36P64o41n79J094m2p68M99M78q80K37O05p05j93P07m6r41O13O67r34
6046b70k0J022q86l03O48J1q37O32M70p40k41Q17k39n81R38J60j353O81P20r61
6066c32l00J063m28n89J033l74m17m1J148j240j30R63k18p55N76L65p02J85Q44
$$ plain form
6085 651 19 -489 593 37 -581 432 221 -618 -413 524 -253 -354 325 285 -423 -1 294 -921 -141
6104 -141 693 -29 -735 858 286 -748 1 518 -399 -77 326 -272 -698 245 166 -489 -229 438 -609
6123 -609 -39 571 -94 -411 419 440 -895 -63 481 -509 -161 407 -155 -597 363 431 -445 -185 564 -262
6143 -262 -342 678 -7 -536 342 435 -605 -268 515 38 -193 730 298 -514 60 418 -765 -200 686 -323
6163 -323 -336 348 291 -828 247 482 -391 317 610 154 -383 539 2 -462 85 211 -471 12 377 -260
6183 -260 -144 540 254 -724 179 414 -387 -350 637 157 -381 284 -104 -625 141 491 -473 -611 474 -169
6203 -169 -288 423 181 -655 133 400 -478 -614 296 182 -439 505 313 -646 -67 296 -398 -262 448 6
6223 6 -598 481 227 -583 315 293 -119 -386 773 -194 -324 81 128 -648 60 580 -250 -453 293 87 -440
$$ packed form
6085F51o32n08J082n56o18J013k11q39K05R37p77j01O79m0p08M22K95j215P80
6104a41Q34p22p06J593n72j034P49N17r17L22M03n98m26R43p9o55K60O67j047
6123f09N70O10o65l17Q30K1j335Q32N44r90L48N68n62m42R60O8q76K60P49q26
6143b62q0J020o85n29Q78R3j040L37P83m77k31R23m32q12N74L58j183N65Q86j009
6163c23j3O84n7j119J075K35q73P08K93m56n37R22n37m64N47J26o82M83L65o37
6183b60J16O84k86r78R03K35q01L7R87m80n38O65l88n21P66L50r64j38J085o43
6203a69j19P11k42q36P88K67q78j36R10j14o21R44j92r59N79L63o94J36P10m42
6223Fo04J079k54q10Q98k2m12k67J159r67j30M05M7p76P08N20q30k03P46k06n27
$$ plain form
6244 -440 285 584 -791 -52 342 -229 -689 582 15 -488 467 241 -420 117 357 -106 -353 404 -128
6263 -128 -584 41 143 -394 -65 631 -66 -405 557 172 -214 28 460 -110 -103 455 16 -687 92 388 -330
6284 -330 151 712 -199 -229 553 -392 -552 259 385 -363 570 276 -702 -157 326 -97 -920 276 147 -608
6304 -608 166 365 -146 -51 548 -8 -386 321 343 -97 54 457 -296 -339 377 413 -637 393 274 -506 -70
6325 -70 423 -153 -76 213 102 -855 75 526 -300 37 422 -184 -396 119 287 -397 127 129 -421 -174 497
6346 497 -489 -418 72 -246 -669 -234 279 -331 -348 340 -217 -513 115 166 -389 -61 428 -568 -189 519 -69
6367 -69 -341 236 565 -804 454 335 -370 -297 260 -361 -583 446 241 -319 26 584 -173 -484 221 -179
6387 -179 -336 487 442 -473 -109 157 -91 -229 511 -2 -600 315 -36 -501 70 304 -301 26 390 -185
$$ packed form
6244d40P25K99j375P39L94n71m60J271n67n03R55k26o61N37K40m63k47P57n32
6263a28m56O25J02n37L29O96o97l39R62l85l86K42M32n70PN58m39p03P79K96p18
6284c30M81N61r11l0P82r45j60Q11J26p48R33k94r78N45M83m23q23J196j29p55
6304f08P74J99n11R5N99n56l78P07K2m40J51M03p53m3P16L6j050J030j19p80M36
6325g0M93n76P7K89j11r57R30M51q26L37L85o06k12N15J68o84N24Kn50K47O71
6346D97r86P1M90l18m23M35N13o10j7O88n57k96O28N1n55L28M89r96L79P08n88
6367f9k72N77L29j369J258j19p05P3N57o21k22J029k05n60L45N58p57l11P05m00
6387a79j57Q23m5r15L64K66k48j38P40n13n98R15l51m65N71K34o05L27L64n75
$$ plain form
6407 -185 -567 525 137 -395 142 743 -298 -289 551 166 -252 270 268 -309 -209 518 -294 -493 489 156 -428
6428 -428 396 484 -704 -32 443 -8 -316 675 185 -441 387 345 -484 -150 326 -6 -270 436 92 -496
6448 -496 -365 575 -422 -101 732 -83 -387 417 344 -573 -119 174 -626 -270 707 -227 -543 471 66 -523
6468 -523 156 291 -178 -348 686 118 -661 27 -144 -282 -282 272 -403 -202 148 -68 -443 296 354 -545 -6
6489 -6 328 -502 -454 395 -39 -275 119 169 -398 141 261 -324 -405 669 80 -377 155 -19 -251 -169 249 -107
6511 -107 -216 283 148 -529 97 198 -172 53 542 -37 -202 458 -55 -411 492 352 -443 -151 545 62
6531 62 -640 590 84 -207 394 315 -558 -359 504 -292 -309 190 125 -317 124 -79 -518 -16 492 -379 -430
6552 -430 103 109 -678 546 647 -589 -85 161 -240 -349 246 418 -387 102 446 -276 -326 476 39 -358
$$ packed form
6407a85l82J092l88n32N37O01j041RQ40l85m18N22kn77J00P27q12j99R82l33n84
6428d28Q24Q8j188O72M75m51l08R91m90o26Q28m2q29L34M76l32k64P06l44n88
6448d96J31R40r97L21Q33q15l04Q04p3r17M54K93q00L56R77r34l16J014m05n89
6468e23O79J35m69j70J034n68p79O88j71j38%N54o75K01L50k16l75P39N8q99N39
6489fL34q30M8Q49m34k36L94N0n67N39J20n85q1J074n89m57N32j74k32Q2M18l56
6511a07j09M99j35o77O26J01l70K25M89n79j65O60n13l56R03j40p95K92O96m83
6531F2p02J230n06k91O01p9q73J99Q63p96j7M99o5m42M41k03m39N02N08q71n1
6552d30N33Op87J224J01j236N04K46m01j09N95J72q05M89L44p22n0Q02m37l97
$$ plain form
6572 -358 27 245 -415 316 772 -259 -131 497 132 -609 285 325 -318 -50 467 -144 -445 626 23 -591
6592 -591 101 357 -520 -246 369 -125 -578 182 104 -600 236 485 -380 -139 387 -264 -308 200 3 -16 363
6613 363 402 -320 93 541 -262 -314 422 21 -657 204 269 -444 -197 370 -89 -533 135 501 -401 111 264
6634 264 -279 -217 355 3 -327 -283 221 -227 -79 205 -73 -20 452 -434 -446 74 36 -481 -97 262 -343 -287
6656 -287 109 -12 -728 395 297 -125 -131 548 -178 -527 397 -19 -176 96 290 -127 56 458 -102 -19 490
6677 490 -204 -182 -79 304 -515 143 673 21 -330 239 -2 -302 105 243 167 94 500 8 -210 551 210
6698 210 -251 18 203 -404 -5 457 -78 -211 273 -39 -261 217 306 -52 165 325 -211 -870 306 6
6718 6 -412 88 223 -125 -445 178 -40 -495 121 136 -540 -260 293 -494 -370 149 -416 -460 9 417 -374
$$ packed form
6572c58L85K18o60P31M56j031J28O28l65p41Q94M0o43K68N17o11l01J071o03o14
6592e91O92K56q77K74O15m94m53P60p8p04Q36K49q65K41N26o51m4N08j97j9L79
6613C63L9p22M13M48q03n2P36m01o78Q61O5p13K47N67m59m44O68L66r02N12J53
6634B64n43O2N72l52l30M4N04m48J48K84k78N3M72q86j2N20l8n17L84L59o05N6
6656b87L96j21p16J123r8m22oO79p26l49R24m16j57K72J94m17J83M02n60Q3N09
6677D90o94K2J03L83q19O58N30o52l51N69k41l00M07J38p6p3M06m92k18P61l41
6698B10m61K69J85o07L99M62n35j33M84l12k22M78Q9l58K17J60n36o59J176l00
6718Fm18N00J35l48l20O23k18m55O16J5o76K80N53p87J24N19n65m4M69M08p91
$$ plain form
6739 -374 -126 422 -83 -222 267 59 -385 231 298 -461 -253 304 -327 -243 460 -108 -430 273 84 -14 -45
6760 -45 132 -340 -194 463 -8 -350 251 182 -329 95 413 -33 -234 490 42 -436 155 223 -457 -160 304
6781 304 -78 -359 394 251 -362 355 385 -210 -53 313 -108 -331 380 -107 -286 -18 212 -219 -298 581 -159
6802 -159 -303 1 143 -377 272 507 -206 -188 507 -63 -456 274 360 -227 -7 360 -291 -82 571 47 -148
6823 -148 387 119 -44 -7 552 -443 -424 343 19 -150 174 57 -379 286 280 -128 -136 524 -80 -415 419 57
6845 57 -278 37 209 -497 -152 165 -47 -562 -63 164 -308 263 320 -75 -114 130 150 -492 -6 551 -104
6866 -104 -3 112 -238 -268 283 -31 -360 124 131 -511 -156 184 -199 -247 253 220 -415 191 -134 -130 -52 275 -17
6889 -17 -235 42 360 -421 5 219 -233 -166 162 26 -270 26 179 -161 95 294 -375 151 460 -128 -238
$$ packed form
6739c74K48N48n05j39M89k08m44O16O7p59K08N57o31Q4P03n68l22P03j89r8l1
6760d5J77m72J46O57m71l42O01o9n11M24L18m46k01P24m48m78N91O8o80K97M64
6781C04l82k81P53j43o13P17L0n95J57L66m21k23P11m87j79K68K30m31p9Q79p40
6802a59j44L04J42n20O49K35p13J8O95n70l93P30Q6n87K20L67o51K09O53n24j95
6823a48N35k68j63L7N59r95J9P67l24j69L24j17m36O65om08qO60o04l35Q34l62
6845E7l35L15J72p06L45L17k12n15M99K27m72N71N7l95l9K44K0o42M86N57o55
6866a04J01J15l50l0N51l14l29M84Po42L55L40l83m8N00l3o35O06l25MP8L27k92
6889a7k18K77L18p81M26K14m52O7L28j36k96K96J53l40K56J99o69N26L09n88j10
$$ plain form
6910 -238 289 -69 -143 106 259 -356 -292 397 -173 -62 470 473 -362 -89 205 -178 2 538 116 -386 542
6931 542 411 -247 -185 241 -201 -307 486 -79 -501 97 392 -180 49 528 -155 -185 537 368 -119 158 300
6952 300 -308 -17 688 -163 -240 354 -80 -592 117 81 -107 204 313 -315 -235 513 -26 -321 -32 271 -197
6973 -197 10 236 -175 -362 163 247 -523 -107 43 -752 -345 254 -283 -67 -64 188 -261 241 192 -472 -293
6994 -293 110 9 -241 653 16 -321 -31 75 -241 -165 322 -227 -209 184 251 -503 -53 341 -437 -157 206
7015 206 -19 -362 242 499 -460 151 304 -309 -35 511 116 -384 86 116 -373 -66 544 -226 -181 506 91
7036 91 -330 216 300 -434 -41 358 -220 27 498 118 -281 522 238 -414 -258 354 -25 34 465 -12 -206
7057 -206 111 235 -337 -339 232 -139 -232 313 165 -290 117 426 -165 13 649 -106 -260 222 -102 -248 260
$$ packed form
6910b38N27l58p4K49J53o15O4O89n70J11N32Lq35K73K94l83J80N36m22n02R28
6931E42j31o58O2M26m42j06P93n65m22N98K95n72K29M79o83l0P22j69m87K77J42
6952C00o08K91P05q51p7N94m34n12P09l6j88L11J09o28Q0P48n39k95K89L03m68
6973a97K07K26m11j87N25Q4p70M16J50p95M07N99n37K16LK52m49N02m9o64J79
6994b93M03j01k50Q94o37l37K90J06l16P6M87n49J8L93O7p54M50L94p78K80L63
7015B06k25l43O04K57r59O11J53o13K74N46l95n00M70L0m89L07O10p70M5O87m15
7036I1m21N46Q4p34L93L99n78K47M71l80l99Q03k84o52J56O12l79N9M31m77j94
7057b06L17J24n72kN71l71r3N45j48m55M07L09n91J78O36p55j54M82l24j46N08
$$ plain form
7078 260 185 -199 -242 272 -53 -212 179 -114 -409 188 255 -245 -208 165 -235 -313 166 -34 -216 177 109 -278
7100 -278 -568 170 -81 -420 381 0 -363 -83 269 -448 -387 288 -120 -733 362 190 -487 -51 364 -41
7120 -41 -46 310 -11 -391 481 143 -409 -267 458 -231 191 444 8 -109 -6 233 -267 -279 143 146 -695 268
7142 268 76 -331 116 -124 -135 -243 307 -53 -215 511 366 -442 20 81 -455 -163 82 -91 -480 231 70
7163 70 -390 153 201 -287 0 348 -362 -406 287 226 -307 -126 432 -78 -366 301 -10 -225 263 256 -199 124
7185 124 267 -111 -167 428 46 -751 297 52 -507 47 357 -190 -493 294 -61 -407 170 3 -374 -75
7205 -75 120 -335 -42 461 300 -200 76 359 -151 -224 -75 -184 -303 307 -42 -154 -19 480 -323 -92 228
7226 228 -32 -109 447 -136 -78 247 416 -366 197 360 -58 -276 511 132 -327 -63 -136 -190 100 246 117
$$ packed form
7078B60p5l84m3N14l25j59L91k93k95N97O7n00L7L73m00p8M79k00j82L93o8l87
7100b78k90P38k51l39Q01l81l63K80L52p17O1O75m08o13J095j72o77M36M15m05
7120d1nL56l21l80Q72l38n52J42P25o89M22K53m36j17J03K39n00j2M22Lq41R63
7142B68j92m07M47k40j1j08N50l60j62P26j45q08M62O1n36K92K45j73l89P11j61
7163G0m60N43M8m88K87L48p10m4O93o1n33J81N58n10k88O67l11k15M88pm55L23
7185A24J43l78n6N95l82p97J048k45n59N54L10n47l03P87l55l46N77j67l77K99
7205g5J95m55K93N03j61n00K76K83n10p3J49j09j19O10l49j12J35M99q03K31L20
7226B28k60p7N56n83N8L25J69p82N63J63m18k18P87l79m59K64p3n4K90J46j29
$$ plain form
7247 117 -154 96 164 -127 242 414 -247 -182 315 147 -199 135 175 -186 119 375 -527 -256 90 -300 -275
7268 -275 379 -63 -395 -12 636 -133 29 249 -65 -306 18 39 -382 13 311 -62 -269 289 190 -323 282
7289 282 363 -261 60 210 -306 -21 262 104 -332 158 113 -134 197 370 129 -102 364 41 -286 138 343
7310 343 -488 -92 236 -158 -404 366 66 -305 476 85 1 193 148 -114 -45 592 -179 -276 414 279 -228
7331 -228 -58 417 -52 -24 226 -206 -288 -71 371 -199 -55 90 -343 -228 382 295 -224 -58 133 -293 71
7352 71 282 -299 -489 285 -5 -443 73 38 -373 -145 432 100 -352 276 76 -269 -197 265 -78 -418 165
7373 165 179 -317 251 -223 -405 -68 221 -536 -141 171 -4 -454 310 382 -158 68 331 93 -388 216 77
7394 77 -566 161 -183 -418 159 369 96 -217 68 89 -208 -61 -208 -596 49 224 -39 -82 263 187 -169
$$ packed form
7247A17k71K50O8k91L69J72o61O5M97j68l46L34M0l61L05K56r02K71L46l90K5
7268b75O54m42l32L83O48p69J62K20l14k41L24K1m21L95K98l73k07N58r9n13O05
7289B82Q1o24L21J50n16K85K83j58m36M90m5k47L31J73k41k31M66l23l27M24K05
7310C43q31L96L28l94k46P70l00l71P81l91q4J92m5k62O9O37p71r7O90j35n07
7331b28J70M75m69K8K50m32q2K17M42n70J44J45m33J15O10q7n19J66J91m26L64
7352G1K11n81j90P74k90m38N16l5m11K28N77l32m52O28k00l45P2M62l43l40N83
7373A65J4m96N68m74j82L37K89p57L95L12j75m50P64P2n40K26K63k38m81O04j39
7394G7o43P27l44k35N77K10k73l13K85K1k97J47j47l88O45J75k63m3L45p6l56
$$ plain form
7415 -169 129 315 -348 -6 545 -201 109 191 356 -132 15 544 -164 22 393 122 -50 228 419 -432
7435 -432 233 352 -235 -28 213 -21 -147 189 116 -303 -41 224 -251 -5 287 -198 -458 213 204 -48 -165
7456 -165 -88 -351 -274 284 197 -248 114 308 -393 234 320 -86 -59 339 137 -254 155 233 -51 86 413 156
7478 156 79 283 9 -260 -107 181 189 -147 374 -11 -322 107 -186 -381 88 179 81 137 339 -70 -55 321
7500 321 252 -452 206 205 -506 231 151 -275 -106 64 -47 -324 -69 77 -264 -190 11 -81 -48 251 94 -414
7522 -414 11 244 -126 6 303 -220 -40 21 113 -309 297 204 -298 -83 603 114 -265 313 128 -271 227
7543 227 160 -43 -1 357 16 -301 270 -73 -354 -182 257 -135 -115 146 -65 -344 222 135 -329 43 116 -85
7565 -85 -179 300 -190 -182 222 200 -121 -363 386 -86 -149 209 -115 -421 155 400 -115 -80 87 -276 -197 25 -13
$$ packed form
7415a69K98J86o63L42N51p46L10Q2J65m88J47N29p08J86L71k71j72K78J91q51
7435d32O65J19n87K07K41k34j26L36p3m19K62K65m75K46K92m85k60O71rk52j17
7456a65P7k63P7N58q7m45L62J94p01O27Q6m06K7L98k02l91M09P8k84J37L27k57
7478A56p7K04k74k69J53K88Ql36N21l85l11M29k93j95M69R1r8N6K02m09J5L76
7500C21o9p04O58jp11P37q0m26J69J70j11k77K55J46l41P4K01r2L3K99j57n08
7522d14M25K33l70J32K97n23J80O1R2m22O06r3n02K15O86m89l79N78j85l99M98
7543B27o7k03M2L58l41l17N71l43k81J72M39l92K0K61k11k79N66q7m64L72P3k01
7565h5r4M79m90QM04k2l21k42P49m72o3L58l24l06N76K45n15L5J67l63P9K22l8
$$ plain form
7588 -13 -515 398 231 61 2 395 189 -196 314 134 30 54 78 -505 -125 292 -113 -327 394 81 -239
7609 -239 82 179 -391 -193 110 64 -234 -92 33 -297 267 -97 -101 -67 253 -52 -98 253 9 -246 114 305
7631 305 -318 -174 241 -114 -203 270 74 -361 70 163 -239 -255 372 38 -382 174 388 -344 -141 234 -249
7652 -249 -93 310 9 -169 173 107 -48 -59 283 269 -308 86 80 -443 74 137 -243 -115 233 -192 -90 203
7674 203 -222 -269 33 171 -189 251 151 -230 -354 -16 139 -179 109 216 12 -192 275 -213 -259 130 149
7695 149 -19 301 203 -134 -164 -19 104 -508 131 102 -421 -141 190 69 104 212 -80 -132 296 210 -65 143
7717 143 127 -223 -64 263 166 -394 357 173 -49 47 31 -180 -183 150 -37 -161 37 104 -216 -138 65 20 -188
7740 -188 236 174 -228 160 -22 -445 -16 18 -75 -193 -61 -380 -330 149 -38 -227 17 59 -131 -306 100 64
$$ packed form
7588a3n02R13j67j70n9L93k06l85N10j80j04K4K4n83L80M17m05k14P21l13l20
7609b39L21R7n70J98L03m6k98J42J25l30N64l64mL4L20l05m6L51k44k55L60J91
7631C05o23J44M15l55q9M73j96m35M31R3m02j6O27l34m20N56K14p32K03L75m83
7652b49J56M03l01j78L42o6j55j1L42j4n77L94on23N17O3l80J28L48m25J02K93
7674B03m25m7L02J38l60M40j00l81j24L38J55l18K88J07k04k04M67m88m6L89J9
7695A49j68L20r8l37l0J45J23o12O39k9n23K80L31j21L5J08k92n2M28q6k75K08
7717A43j6l50J59L27r7n60P51j84k22R6j6k11lL33j87j24J98O7l20P8K03m5k08
7740a88M24o2m02L88j82m23M29L4r3j18J32l19N0M79j87j89K44M2j90j75M06l6
$$ plain form
7762 64 -88 198 325 -398 -146 142 55 -185 67 102 -110 94 245 -477 107 434 106 -25 163 -54 -266
7783 -266 -63 44 -190 -136 7 -181 -98 3 -20 -227 200 140 -104 -162 241 -207 -382 212 181 -246 165 187
7805 187 -224 -95 -123 67 -142 19 -45 -163 75 412 -310 -75 311 187 -166 270 -23 -56 28 150 -248
7826 -248 151 249 -126 -115 29 164 -61 158 346 95 -409 106 47 -367 -119 311 -406 -31 285 -64 -49
7847 -49 9 1 -190 198 244 -591 -273 473 -23 -141 133 -114 -92 -223 90 136 -161 286 -12 -166 197 -92
7869 -92 -421 -5 194 -333 88 364 -367 -501 154 27 -98 330 -14 -133 92 165 10 -1 396 30 -456
7890 -456 -213 131 -262 146 5 -328 -47 -245 102 -416 190 255 -319 -28 114 7 2 117 135 -169 -173 83
7912 83 -282 -31 333 33 -81 191 -41 -148 -47 -90 -109 -380 249 95 -188 149 212 -492 -277 290 -349
$$ packed form
7762F4j52K86J27p23K52K88q7k40K52L5k12K04J51p22N84L27l28j31J88k17k12
7783b66K03J07k34N4J43j88Q3J01k3k07M27o0k44n8M03m48j75N94l1m27M11K2
7805A87m11J29k8J90k09J61o4j18K38L37p22K35L86j24l53M36k93l3Q4J22l98
7826b48L99R8l75J1J44J35k25K19J88k51n04N15n9m14K48M30p17L75L16l49J5
7847d9N8qj91L88M6q35L18P46m96j18K74k47K2j31L13M6k97M47k98j54L63k89
7869i2l29M16J99n27M21K76p31j34O55j27j25M28l44j19K25P3j55j1L97l66m86
7890d56K43L44l93M08j41l33K81j98L47n18O06O5n74K91J42j07nJ15J8l04mK56
7912H3l65K51L64l00j14K72k32j07J01m3j9k71O29j54k83L37O3p04K15N67o39
$$ plain form
7933 -349 -206 4 105 -197 -61 -135 -5 -112 128 -34 -164 -103 -165 -314 128 250 -109 -440 -68 -30 -76 143
7955 143 105 -69 18 310 -248 -9 375 -52 159 62 -88 -462 116 -158 -29 58 473 -191 -95 61 154 -148
7977 -148 126 122 -224 -10 136 -210 -130 110 134 -493 -190 260 -44 -223 309 156 -47 320 80 -92 17
7998 17 86 -89 68 187 127 -298 320 336 -501 -105 -25 -204 -273 -71 -107 -124 299 137 -329 21 84 -158 -264
8021 -264 212 16 -226 -75 92 -43 -238 243 -92 -240 253 114 -97 198 -90 -226 -59 101 -24 -248
8041 -248 -14 162 -134 51 217 105 -69 118 -17 -214 -21 58 -392 -72 36 -93 -104 210 81 -194 318
8062 318 133 -257 44 27 -39 -20 44 -149 -178 87 -42 80 301 11 122 229 396 2 -177 -57 160 -310
8084 -310 -200 45 -187 30 -68 154 -330 281 -327 -238 39 584 227 -135 348 110 -37 210 145 -180 9
$$ packed form
7933c49J43K10J01l02J36p4J30j07K40j62j30O1o2j49M42J22l59l31L72L8m6K19
7955A43l8j74Q7K92n58K39L84m27K11r7j50l74N78k74J29Q7M15o64R6J56R3l02
7977a48K74ml46K14J46l46Q0K40K4o27L03M50l04j79N32j53k03L67k40j72J09
7998A7O9j75J57J19o0m25O18J6q37L96Q0j79o9K02l6j7M23j62m66L50O3k42j06
8021b64M76j96k42J51J67j35j95M81l35j48M93j39k11K95k88j36J67J60j25k24
8041b48K34J76k96J85J66j12j74J87j35j97J93P9m50L20J08j29j1L14j29k75N12
8062C18j85l90L01j7o6J9O4j93k9K65j29J22K21k90J11J07J67l94j79J20K17m70
8084c10J10K45k32K17r8K22m84O11o08Q9K77N45l57l62M83k38j47K47o5l25J89
$$ plain form
8105 9 443 -379 114 294 -26 -187 65 131 -114 -58 57 -27 15 1 48 -68 -65 266 -82 -100 262 -35 129 103
8129 103 31 -71 8 204 -220 201 270 -286 -134 211 177 -142 150 308 -166 -149 90 -134 -39 245 235 -698
8151 -698 121 281 -78 139 250 -106 -261 242 -264 -190 93 303 -310 -39 -49 -70 -212 461 -126 -233 339
8172 339 361 217 -113 142 96 54 241 151 -25 210 461 150 -169 7 145 -194 107 137 -339
$$ packed form
8105IM34q22M93J80l20j61K52O6k45N6J15q4M2j4M7j16LL31l48j8L62k97J64k6
8129A03p2j02P9J96m24M21O9n56J52L45l4l19K92J58m74J7K39k24R5K84j0r33
8151f98Q19J60l59K17J11l56j55N03n06P4K83K10o13K71j0k1j42O73n87j07N72
8172C39K2j44l30K55m6m2J87r0j76K35K51l11l19J76J38l39L01L0m76
8191c39
$$ Imaginary data points
##PAGE= N=2
##DATA TABLE= (X++(I..I)), XYDATA
$$ plain form
0 0 0 0 0 0 0 0 0 0 8 -8 8 -8 13 -16 16 -24 24 -32 39 -44 51 -59 69 -80 92 -106 121 -137 153 -175 196 -221
32 -221 246 -277 309 -344 383 -424 470 -521 577 -639 706 -784 868 -962 1071 -1192 1333 -1498
50 -1498 1692 -1924 2211 -2576 3054 -3712 4678 -6246 9217 -16832 76237 135575 -30938 -2224
64 -2224 70321 48135 7726 29465 1207 788 54271 54967 6998 32141 42136 5490 23043
77 23043 47762 -18825 -30303 48006 36493 -32685 13075 54441 -6673 -15227 41536 10019
89 10019 -35670 7145 19142 -23976 -2326 25961 -11391 -10314 26448 -4576 -23573 22977
101 22977 6649 -48068 -3530 36562 -22499 -35751 19854 1475 -29176 14662 10582 -48835
113 -48835 -16704 35602 -15260 -47828 -2481 -431 -23402 3078 -4247 -45209 -8468 28573
$$ packed form
0@%%%%%%%%Qj6J6j6K1k9L2m0M8n6P1q3R5j10J28j49J72j98K27k58K90l28L71m17
32b21M67n23N86o53P27q07Q94r91J098j216J345j490J652j830K033k263K525k831
50a498L190l616M135m787N630o766Q390j0924J5463k6049R3069N9338j66513K8714
64b224P2545k2186m0409K1739k8258m19N3483O96m7969K5143R995l6646J7553
77B3043K4719o6587j1478P8309j1513o9178M5760M1366o1114q554N6763l1517
89A0019m5689M2815J1997m3118K1650K8287l7352J077L6762l1024j8997M6550
101B2977j6328n4717M4538M0092n9061j3252N5605j8379l0651M3838m080n9417
113d8835L2131N2306n0862l2568M5347K050k2971K6480p325m0962L6741L7041
$$ plain form
125 28573 -24520 -41888 7037 -7775 -38779 5000 8929 -46919 -20569 32696 -9199 -37016
137 -37016 8503 2550 -31985 3287 14920 -33884 -18787 27384 -1873 -21980 14276 3386
149 3386 -21917 17553 18690 -36958 -12370 39707 -4956 -34296 22095 23689 -24657 2036 28181
162 28181 -15269 -15556 25208 338 -25217 12651 15617 -13934 8120 17669 -18979 901 36727
175 36727 -11192 -35087 26918 29226 -27805 -5270 32981 -3036 -10228 30100 8073 -23093
187 -23093 13964 25779 -9942 28 17903 -7640 4593 36489 -3197 -26742 27934 31621
199 31621 -24043 -5510 31543 -5774 -14847 29876 10731 -26618 11523 30138 -11909 -9529
211 -9529 18555 -3960 -8256 20953 -1921 -24759 18737 23764 -24591 -7819 29198 -6176 -20232
$$ packed form
125B8573n3093j7368M8925j4812l1004M3779L929n5848K6350N3265m1895k7817
137c7016M5519n953l4535L5272J1633m8804J5097M6171k9257k0107L6256j0890
149C386k5303L9470J137n5648K4588N2077m4663k9340N6391J594m8346K6693K6145
162B8181m3450k87M0764k4870k5555L7868K966k9551K2054R549l6648J9880L5826
175C6727m7919k3895O2005K308n7031K2535L8251l6017p192M0328k2027l1166
187b3093L7057J1815l5721R970J7875k5543J2233L1896l9686k3545N4676L687
199C1621n5664J8533L7053l7317r073M4723j9145l7349L8141J8615m2047K380
211i529K8084k2515m296K9209k2874k2838M3496N027m8355J6772L7017l5374j4056
$$ plain form
224 -20232 21615 6907 -28764 8246 26848 -19319 -14933 24158 1293 -17211 13173 4355
236 4355 -22317 9022 19112 -23838 -13239 24710 -3692 -22459 14353 6014 -26389 5123
248 5123 20513 -25211 -20317 22958 -1024 -26781 6576 7517 -23165 330 17461 -21706 -19681
261 -19681 18996 -984 -24932 4995 5453 -21623 2531 17484 -22713 -17647 24615 -163 -28926
274 -28926 6819 13037 -22254 -3564 20613 -14398 -19066 20690 6095 -23261 3388 12290 -15251
287 -15251 -1113 15654 -15700 -12854 24743 1677 -26927 10067 18443 -19876 -5069 23178
299 23178 -10957 -19862 22043 11104 -24206 2189 19806 -9567 -4307 15894 -8056 -10869 22098
312 22098 4704 -22955 10192 21912 -16022 -5069 25095 -4817 -17432 21921 13245 -22988
$$ packed form
224b0232M1847j4708l5671L7010J8602m6167M386L9091k2865j8504L0384q818
236D355k6672L1339J0090m2950J0599L7949k8402j8767L6812q339l2403L1512
248E123J5390m5724M894M3275k3982k5757L3357R41l0682K3495J7131l9167K025
261a9681L8677j9980k3948K9927M58k7076K4154J4953m0197N066M2262k4778k8763
274b8926L5745O218l5291J8690K4177l5011m668L9756j4595k9356K6649Q902k7541
287a5251J4138J6767l1354K846L7597k3066k8604L6994Q376l8319J4807K8247
299B3178l4135q905M1905j0939l5310K6395J7617k9373N260K0201k3950k813L2967
312B2098j7394k7659L3147J1720l7934J0953L0164k9912j2615L9353q676l6233
$$ plain form
324 -22988 3284 24902 -8166 -9198 18331 654 -10307 17362 7609 -19364 8432 22551
336 22551 -13406 -8232 22534 -621 -15708 19181 12730 -22275 2359 26214 -7948 -13820 16865
349 16865 3239 -12483 13826 9526 -19004 3745 22728 -10361 -12621 18511 1428 -16380
361 -16380 13167 11615 -20757 56 23379 -9473 -16143 16667 4854 -17218 7927 10949 -18711
374 -18711 -963 20301 -11366 -16827 16517 4331 -20000 5457 10803 -18330 -3537 18546
386 18546 -11293 -18443 15171 4548 -20757 3616 10794 -18711 -5578 18864 -11141 -21382
398 -21382 13942 6680 -21579 173 11587 -16326 -7297 16466 -8898 -19119 12484 5235 -20319
411 -20319 1340 12112 -16591 -7127 18273 -8210 -20477 14121 9693 -21275 -1921 15468
$$ packed form
324b2988K6272K1618l3068j032K7529j7677j0961K7669r753k6973K7796J4119
336B2551l5957N174L0766k3155j5087L4889o451l5005K4634K3855l4162n872L0685
349A6865j3626j5722K6309m300k8530K2749J8983l3089k260L1132j7083j7808
361a6380K9547j552l2372K0813K3323l2852o670L2810j1813k2072K5145L022k9660
374a8711J7748K1264l1667n461L3344j2186k4331K5457N346k9133J4793K2083
386A8546k9839p150L3614j0623k5305K4373P178k9505J3133K4442l0005j0241
398b1382L5324p262k8259K1752J1414k7913R029K3763k5364j0221L1603p249k5554
411b0319K1659J0772k8703R464K5400k6483j2267L4598m428l0968J9354J7389
$$ plain form
423 15468 -11006 -8918 15064 -4199 -16800 12733 9216 -18371 335 15384 -10997 -7127 18145
436 18145 -3344 -18016 14945 14227 -17964 -1812 18634 -6156 -8921 16300 1068 -14437 12877
449 12877 13056 -14784 482 18784 -6836 -7887 18208 2041 -15618 13764 15833 -15905 -2104
462 -2104 21999 -2733 -10831 15248 5238 -12248 11187 14023 -14441 -892 20926 -3530 -10697
475 -10697 15825 4796 -14499 10464 15944 -15684 -4862 21380 -1616 -13845 12130 6604
487 6604 -13628 6611 13166 -14284 -4587 18264 -4169 -15013 12701 5795 -17019 4430 14126
500 14126 -14494 -8425 17589 -2856 -17101 8783 7071 -15620 1226 10863 -13865 -7738 15864
513 15864 -4667 -17803 9318 6834 -17437 -840 12788 -13456 -11181 15074 -2052 -18878
$$ packed form
423A5468k6474K088K3982j9263j2601K9533l517k7587J8706J5049k6381L870K5272
436A8145k1489j4672L2961p18l2191J6152K0446k4790k765K5221j5232j5505K7314
449A2877J79k7840J5266J8302k5620j051K6095j6167j7659K9382K069l1738J3801
462b104K4103k4732q098K6079j0010j7486K3435K836k8464J3549K1818k4456p167
475a0697K6522j1029j9295K4963N480l1628J0822K6242k2996j2229K5975n526
487F604k0232K0239O555k7450R697K2851k2433j0844K7714o906k2814K1449R696
500A4126k8620O069K6014k0445j4245K5884j712k2691J6846R637k4728O127K3602
513A5864k0531j3136K7121k484k4271J6597J3628k6244K275K6255j7126j6826
$$ plain form
525 -18878 5808 7870 -15298 -2769 10573 -12038 -9852 13692 -3358 -18664 7390 8790 -16886
538 -16886 -2851 13349 -10690 -11870 14194 120 -18418 5868 10569 -13770 -3993 12669 -8029
551 -8029 -10012 13922 813 -16628 7601 12558 -14084 -3761 15535 -5860 -10847 14109 3848
564 3848 -15870 6538 14134 -11230 -4248 15549 -3150 -9603 14032 4363 -14567 7346 15422
577 15422 -10948 -4737 17119 -1117 -10316 13660 6944 -12992 5787 15424 -9225 -4635 16905
590 16905 -626 -10201 12941 7866 -12829 5282 16486 -8988 -6772 16635 1875 -11214 10293
603 10293 8436 -11891 3231 14299 -8612 -6197 15348 87 -11879 10166 7972 -13978 1787
616 1787 15350 -9398 -10008 14634 2287 -14664 6004 8888 -11976 -1213 12261 -8459 -9397
$$ packed form
525a8878K4686K062k3168J2529J3342k2611K186K3544j7050j5306K6054J400k5676
538a6886J4035J6200k4039j180K6064j4074j8538K4286M701k4339R777J6662k0698
551h029j983K3934j3109j7441K4229M957k6642J0323J9296k1395m987K4956j0261
564C848j9718K2408P596k5364O982J9797j8699o453K3635r669j8930K1913Q076
577A5422k6370O211K1856j8236r199K3976o716j9936J8779R637k4649M590K1540
590A6905j7531r575K3142n075k0695J8111J1204k5474K216K3407j4760j3089K1507
603A0293j857k0327J5122J1068k2911K415K1545j5261j1966K2045k194k1950J5765
616A787J3563k4748o10K4642j2347j6951K0668K884k0864J0763J3474k0720r38
$$ plain form
629 -9397 12260 116 -14621 6471 7286 -14573 -1364 13690 -9647 -12815 12790 2519 -17029
642 -17029 2481 9201 -12656 -4730 11395 -7202 -11432 10019 1119 -15169 3742 7843 -13602
655 -13602 -3922 12566 -8300 -13578 11185 3044 -17227 1655 11180 -11345 -7197 11292 -4914
668 -4914 -11972 9199 3686 -14834 1820 10385 -10197 -5873 11661 -4482 -11798 11250 5432
681 5432 -14666 1528 13000 -8685 -6621 12480 -1440 -11228 10061 7084 -12837 1443 13352
694 13352 -6890 -6662 13070 43 -10638 9308 8278 -11639 1660 14419 -6094 -6646 13469
707 13469 1568 -10066 9213 8817 -11256 1452 15437 -5429 -8094 13378 3838 -10416 7657
720 7657 9961 -10239 -87 14897 -3943 -7827 12057 3661 -10190 7582 9584 -10804 -737
$$ packed form
629i397K1657j2144j4737K1092Q15k1859J3209J5054k3337l168K5605j0271j9548
642a7029J9510O720k1857P926J6125j8597m230K1451q900j6288J8911M101k1445
655a3602R680J6488k0866n278K4763q141k0271J8882R525k2525M148J8489j6206
668d914p058K1171n513j8520J6654Q565k0582M324J7534j6143p316K3048n818
681E432k0098J6194J1472k1685K064J9101j3920r788K1289k977j9921J4280J1909
694A3352k0242K28J9732j3027j0681J9946j030j9917J3299J2759k0513n52K0115
707A3469j1901j1634J9279l96k0073J2708J3985k0866k665K1472r540j4254J8073
720G657K304k0200J0152J4984j8840l884J9884q396j3851J7772K002k0388J0067
$$ plain form
733 -737 15138 -4224 -9449 12176 5014 -11903 4992 11019 -9731 -3152 13117 -3417 -9367
746 -9367 10003 4251 -11449 3832 8944 -10307 -3140 12738 -4840 -11958 10136 5342 -13872
759 -13872 1301 10348 -9415 -6188 11222 -3053 -11774 7223 4573 -12060 436 8197 -10433
772 -10433 -5408 11112 -4478 -13567 7835 5500 -14266 -1277 10030 -9005 -8841 9846 -1488
785 -1488 -12942 5187 5286 -11613 -1461 8709 -7826 -7189 9835 -2293 -12583 7051 6390 -14000
799 -14000 -2435 11600 -6946 -9374 10131 428 -12558 5127 8229 -11042 -2924 10851 -4626
812 -4626 -7431 9778 990 -11324 6236 8680 -10861 -2289 12512 -4021 -8469 10545 3272
825 3272 -11102 5246 10366 -9185 -2821 12661 -2185 -8300 10026 4735 -9974 5000 10634
$$ packed form
733g37J5875j9362n225K1625p162j6917J6895O027k0750O579J6269j6534n950
746i367J9370n752j5700J5281N112j9251P167J5878j7578p118K2094m794j9214
759a3872J5173R047j9763L227J7410j4275q721J8997k650j6633J2496P761j8630
772a0433N025J6520j5590r089K1402k335j9766J2989J1307j9035J64J8687j1334
785a488j1454J8129R9j6899J0152J0170j6535O37J7024j2128j0290J9634o61k0390
799a4000J1565J4035j8546k428J9505r703j2986J7685L102j9271Q118J3775j5477
812d626k805J7209q788j2314J7560K444j9541Q572J4801j6533m448J9014p273
825C272j4374J6348N120j9551O364J5482j4846o115J8326n291j4709J4974N634
$$ plain form
838 10634 -8080 -2729 13140 -1340 -8247 9886 5266 -9334 4672 10751 -7754 -2962 13852
851 13852 -513 -9294 9289 6602 -9238 3188 11565 -6556 -4824 12164 663 -8923 7533
864 7533 6290 -8864 2110 10343 -6980 -4539 12150 -203 -10490 7701 7054 -10557 292
877 292 11429 -6548 -6950 10730 1027 -11133 4889 6964 -9545 -846 9359 -6525 -6956 9716
891 9716 -499 -11701 4957 6846 -11385 -2584 10286 -6538 -9524 8886 964 -12365 2728
904 2728 7304 -10201 -3863 8293 -5358 -8970 7797 381 -12313 3348 6937 -11225 -4323
917 -4323 9858 -5550 -10516 7753 2478 -12415 1214 8085 -9301 -4961 8725 -3547 -9258
930 -9258 6659 2038 -11295 2059 8266 -9058 -4720 10417 -2391 -9751 7513 4365 -10949
$$ packed form
838A0634j8714N351J5869j4480o907J8133m620j4600J4006O079j8505M792J6814
851A3852j4365q781J8583k687j5840J2426Q377j8121J732J6988j1501r586J6456
864G533j243j5154J0974Q233j7323K441J6689j2353j0287J8191o47j7611J0849
877B92J1137j7977m02J7680r703j2160J6022K075j6509Q699J0205j5884m31J6672
891I716j0215j1202J6658J889j8231Q801J2870j6824k986J8410p922j3329J5093
904B728M576j7505O338J2156j3651l612J6767p416j2694J5661L589j8162O902
917d323J4181j5408m966J8269n275j4893J3629O871j7386M340J3686j2272n711
930i258J5917m621j3333J3354O207j7324M338J5137j2808p360J7264l148j5314
$$ plain form
943 -10949 1332 9929 -7093 -5434 10073 -756 -8845 6944 5122 -9083 1807 10268 -6280
956 -6280 -4820 10652 676 -8402 7290 6660 -8991 1844 11163 -4957 -5349 10885 1869 -8479
970 -8479 6904 7691 -8250 985 11744 -3925 -5643 10785 2783 -8815 6023 8074 -7796
983 -7796 -194 11019 -3657 -5811 10431 2610 -8850 5631 8381 -8268 -651 11320 -3320
996 -3320 -6986 9840 3668 -9848 3447 8624 -7352 -2423 9500 -3289 -7136 8414 2963
1009 2963 -9909 2882 7760 -8120 -3156 9491 -3691 -9156 7749 3788 -10649 845 7868
1022 7868 -7655 -4960 8439 -2391 -9257 5536 3041 -10359 690 7235 -8255 -5453 8562
1035 8562 -2643 -10259 5398 3883 -10929 -783 8035 -7001 -6864 7276 -1268 -9895 4558
$$ packed form
943a0949J2281Q597j7022J659J5507j0829q089J5789j822j4205J0890Q461j6548
956f280J460J5472r976r078J5692o30j5651J0835R319j6120l92J6234r016j0348
970h479J5383P87j5941R235J0759j5669j718J6428q002j1598J4838K051j5870
983g796P602J1213j4676k154J6242p821j1460J4481K750j6649P617J1971j4640
996c320l666J6826o172j3516J3295N177j5976M929J1923j2789l847J5550n451
1009B963j2872J2791M878j5880M964J2647j3182n465J6905l961j4437J1494P023
1022G868j5523K695J3399j0830o866J4793k495j3400J1049O545j5490K802J4015
1035H562j1205p616J5657j515j4812J0146Q818j5036J37J4140q544q627J4453
$$ plain form
1048 4558 3932 -10577 -707 8178 -6753 -6628 7994 -1088 -10264 4769 5350 -10317 -1432 9044
1062 9044 -5352 -6894 7993 284 -9691 4343 6062 -8740 -1153 9258 -4640 -6747 8685
1075 8685 1331 -9346 4718 7113 -8397 -1656 10101 -3080 -6974 8748 3047 -8535 4179
1088 4179 7707 -6865 -1528 10870 -2352 -6861 8913 3982 -7985 4002 8300 -6329 -1870
1101 -1870 10817 -1202 -6749 8156 4869 -7637 3521 8748 -5897 -2044 10762 -865 -7201
1114 -7201 8081 5471 -8204 2417 9191 -5381 -3414 9613 -261 -7655 7013 5362 -8134
1127 -8134 1572 8872 -5631 -3734 9253 -895 -8384 6277 5665 -9136 -73 8893 -5274 -5871
1141 -5871 8232 -372 -9232 4467 5353 -8636 -797 7938 -5914 -6034 7949 -344 -9880 3984
$$ packed form
1048D558o26j4509R870Q885j4931J25J4622r082r176J5033N81j5667Q885J0476
1062I044j4396j542J4887p709r975J4034J719j4802P587J0411j3898k107J5432
1075H685p354j0677J4064K395j5510O741J1757j3181l894J5722n701j1582J2714
1088D179L528j4572N337J2398j3222m509J5774m931j1967J1987M298j4629M459
1101a870J2687j2019n547J4905l287j2506J1158N227j4645L853J2806j1627o336
1114g201J5282k610j3675J0621O774j4572J967J3027r874p394J4668j651j3496
1127h134R706P300j4503J897J2987j0148p489J4661o12j4801R063Q966j4167n97
1141e871J4103q604q860J3699Q86j3989P839Q735j3852j20J3983q293r536J3864
$$ plain form
1155 3984 5359 -9574 -2270 8186 -5332 -7482 6845 532 -10025 2940 5308 -8748 -2592
1168 -2592 7409 -4717 -7657 6652 245 -10228 2756 5873 -9147 -3484 8188 -3896 -8172
1181 -8172 6094 1353 -9737 1852 6325 -7639 -4039 7906 -2820 -7544 6500 2161 -9345
1194 -9345 2156 7270 -7366 -3923 8515 -1688 -7689 6216 3885 -8352 1517 7783 -5992
1207 -5992 -3655 8899 -665 -7270 6425 4325 -7877 1798 8360 -5226 -3892 9511 331 -7275
1221 -7275 6127 6030 -7207 1363 9307 -4305 -3977 9236 858 -7173 6272 6163 -7161 907
1235 907 9307 -3965 -4569 9344 1757 -7411 5361 6706 -6498 -99 9231 -3503 -4412 8783
1249 8783 1763 -7684 4642 6677 -6949 -815 9014 -3383 -5861 8176 2659 -8636 3718
$$ packed form
1155C984J375j4933P304J0456j3518k150J4327o313j0557J2965K368j4056O156
1168b592J0001j2126k940J4309o407j0473J2984L117j5020N663J1672j2084m276
1181h172J4266m741j1090J1589M473j3964L600J1945j0726m724J4044m339j1506
1194i345J1501N114j4636L443J2438j0203o001J3905k331j2237R869O266j3775
1207e992K337J2554r564o605J3695k100j2202R675O562j3586J334J3403r180p606
1221g275J3402r7j3237Q570P944j3612L28J3213q378q031J3445j09j3324Q068
1235I07Q400j3272o04J3913p587r168J2772J345j3204O399R330j2734r09J3195
1249H783p020r447J2326K035j3626O134R829j2397k478J4037n517j1295J2354
$$ plain form
1262 3718 6750 -6693 -1777 8469 -2782 -6405 7021 2114 -8404 2711 6592 -7113 -3141
1275 -3141 8053 -2850 -7422 6252 2487 -9171 1321 6256 -6720 -4063 7447 -2240 -8026
1288 -8026 4957 2432 -9209 642 6464 -7006 -4688 7342 -1993 -8468 4797 2853 -9003
1301 -9003 189 6390 -6533 -5335 6912 -1678 -8262 4141 3240 -8909 -427 6840 -6039 -5623
1315 -5623 7331 -535 -8659 4395 4688 -8216 -865 7545 -4661 -5651 7091 480 -7765 3994
1329 3994 4660 -7640 -379 8082 -4230 -5782 7936 1431 -7828 3815 5929 -6784 -1133 8572
1343 8572 -2676 -5448 7450 2354 -7052 3768 6708 -6070 -982 8785 -2191 -5199 7580
1356 7580 3228 -6958 3488 7444 -5234 -1530 8600 -1333 -5565 7087 3722 -6938 2659
$$ packed form
1262C718L032j3443M916J0246j1251l623J3426m907j0518J1115L881j3705L972
1275c141J1194j0903m572J3674l765j1658J0492M935j2976K657J1510r687n786
1288h026J2983k525j1641R851N822j3470K318J2030r335o475J3265j944j1856
1301i003R192O201j2923J198J2247q590o584J2403r01j2149Q482P267j2879M16
1315e623J2954p866q124J3054K93j2904P351Q410j2206r90J2742o611q245J1759
1329C994O66j2300P261Q461j2312j552J3718o505r259J1643K114j2713N651R705
1343H572j1248k772J2898n096r406J0820K940j2778N088R767j0976l008J2779
1356G580m352j0186J0446L956j2678L704J0130r933m232J2652l365j0660R597
$$ plain form
1369 2659 7574 -4765 -2154 8577 -1204 -5865 6707 4220 -7329 2092 7769 -4693 -3165 8054
1383 8054 -402 -6332 6050 4147 -7321 1058 7084 -4808 -3424 7885 -999 -7483 5195 4154
1397 4154 -7738 192 7218 -4949 -4507 7316 -334 -7863 3985 4045 -7718 -650 6688 -5237
1411 -5237 -5068 6489 -74 -8139 3332 4467 -7829 -1543 6992 -4559 -6352 5999 348 -8491
1425 -8491 2598 4307 -7955 -1925 6400 -4524 -6738 5949 570 -8563 2388 4804 -7784
1438 -7784 -2846 6897 -3562 -6580 5142 1575 -8098 1943 5422 -6440 -2705 6875 -2626 -6462
1452 -6462 5926 2302 -7618 1513 6081 -5753 -3119 7346 -1388 -6200 5577 3324 -7101 1544
1466 1544 6233 -5077 -2586 7429 -1065 -6418 5778 3987 -6923 1617 7496 -4426 -2963 8039
$$ packed form
1369B659M915j2339K611J0731r781m661J2572k487j1549R421N677j2462J528J1219
1383H054q456n930J2382j903j1468Q379O026j1892J384J1309q884o484J2678j041
1397D154j1892P930P026j2167M42J1823p650p529J1848O0j1763P068P338j1925
1411e237J69J1557o563q065J1471J135j2296O286Q535j1551j793J2351n651q839
1425h491J1089J709j2262O030Q325j0924k214J2687n379r133J0951K416j2588
1438g784M938R743j0459l018J1722l567r673J0041L479j1862L735R580r501l836
1452f462J2388l624r920R131M568j1834K634J0465q734m812J1777k253j0425Q645
1466A544M689j1310K491J0015q494n353J2196j791j0910Q540N879j1922J463J1002
$$ plain form
1480 8039 418 -6245 5160 4817 -5829 1155 7223 -3721 -3079 8001 499 -6131 5375 5157
1494 5157 -6117 838 7756 -3187 -3646 7508 1746 -6325 4566 5370 -5892 -24 7400 -2802
1508 -2802 -4177 7062 1251 -6714 4196 5302 -5994 -647 7331 -2432 -4732 6802 1682 -6846
1522 -6846 3128 5558 -6100 -1803 7002 -2764 -5679 5642 1671 -7289 2060 5160 -6170 -2177
1536 -2177 6685 -2618 -6159 4628 1623 -7409 1119 5313 -6081 -3393 6427 -2437 -6640 4359
1550 4359 1978 -7668 479 5139 -6000 -4128 5895 -1517 -7078 4094 2531 -7558 27 5533
1564 5533 -5598 -4135 6046 -1481 -7097 3853 3112 -7277 -85 5891 -4819 -4507 6032 -596
1578 -596 -6630 3803 3704 -6754 -298 6397 -4133 -4155 6402 96 -6525 3707 4284 -6112 -440
$$ packed form
1480H039p621o663J1405l43j0646O984O068j0944O42J1080p502o630J1506k18
1494E157j1274O955O918j0943m59J1154n762q071J0891Q04j1262N868P424j0202
1508b802j375J1239n811p965J0910J106j1296N347P978r763k300J1534n120q528
1522f846R974K430j1658M297Q805r766k915J1321l971q960R349L100j1330L993
1536b177Q862r303l541J0787l005r032Q528M194j1394K688R820q864m203J0999
1550D359k381r646Q147M660j1139J872J0023p412n561J1172j563j0089P585N506
1564E533j1131J463J0181p527n616J0950p41j0389P192N976j0710L12J0539o628
1578e96o034J0433r9j0458O456O695j0530k2J0557o306o621J0232N77j0396N672
$$ plain form
1593 -440 6968 -3464 -4318 6815 1037 -6193 3787 4920 -5727 -482 6903 -1972 -4487 6659
1607 6659 1962 -5982 3563 5281 -5082 -639 7492 -1710 -4460 6234 2725 -6083 2921 6278
1621 6278 -4785 -1190 7355 -1131 -4395 5807 2667 -5918 2754 6041 -4260 -1495 7244 -1190
1635 -1190 -4797 5974 3282 -5879 1685 6433 -4284 -2333 6580 -552 -5453 4685 3184 -6175
1649 -6175 1360 5774 -4499 -3221 6868 -783 -5888 4226 3051 -6435 258 5774 -4545 -3648
1663 -3648 6057 -544 -6673 3419 3341 -6478 -841 5332 -4699 -4576 5450 -524 -6783 2955 3258
1678 3258 -6641 -1064 5382 -3982 -4986 5054 -129 -6840 2320 3543 -6624 -1623 5454 -3446
1692 -3446 -5201 4440 147 -6817 2139 3915 -6222 -2024 5606 -2905 -5165 4883 1078 -6473
$$ packed form
1593d40P408j0432q54J1133n778p230R980J133j0647N245P385q875k515J1146
1607F659m697p944R545J718j0363M443Q131r202k750J0694l509q808R004L357
1621F278j1063L595Q545q486l264J0202l140q585Q672L287j0301K765Q739q434
1635a190l607J0771k692r161P564M748j0717J951Q913p132m901J0138j501r359
1649f175P535M414j0273J278J0089p651n105J0114j175r486O693N516j0319Q97
1663c648R705o601o129J0092p8r819N637O173j0031J23J0026n974o259R738L03
1678C258r899N577O446r364j004J0040n183o711R160J223j0167N001P077q900
1692c446j755R641m293o964Q956J776j0137M198P630q511k260J0048l805p551
$$ plain form
1706 -6473 1725 4405 -5492 -1831 5967 -2232 -5298 4669 1789 -6286 1549 5058 -4913 -1841 6178
1721 6178 -1502 -4883 4448 2445 -5670 1876 5381 -4002 -1992 6454 -831 -4899 4831 3252 -5730
1736 -5730 1745 6037 -3842 -2250 6678 -112 -4831 4786 3847 -5199 1265 6350 -3299 -2453 6135
1751 6135 344 -4571 4686 3908 -5256 838 6542 -2698 -2977 6224 720 -4852 4009 3980 -4832 310
1767 310 6260 -2849 -3222 5954 890 -5526 3144 3946 -4971 -874 5920 -2336 -4267 5117 1090 -5715
1783 -5715 2519 4060 -5291 -1209 5544 -2525 -4618 4594 1071 -5928 1944 3910 -5169 -1778 5087
1798 5087 -2431 -5080 3886 1174 -6287 1092 3838 -5244 -2726 4972 -2230 -5396 4040 1306 -6387
1813 -6387 891 3927 -5031 -2869 4712 -1484 -5566 3265 1615 -6426 127 4172 -4481 -3356 4729
$$ packed form
1706f473Q198K680r897L661P798q199l066R967k880q075P835L509r971L072Q019
1721F178p680l381R331k003q115P546L505r383K010Q446p285m068R730j579q982
1736e730P475M292r879J592Q928o790m719R617r39r046O464N085r649Q46Q588
1751F135n791m915R257p78r164O094N704r240k79R201n504n572Q861k9q812N142
1767C10N950r109l73R176n064o416Q670Q02q917M097O794q256j931R384m027o805
1783e715Q234J541r351M082O753q069k093R212l523o999P872J966r079L391O865
1798E087p518k649Q966k712p461P379K746r082K518P698p202l166R436k734p693
1813f387P278L036q958K162P581o196m082Q831j650q041O553M045q653J125Q085
$$ plain form
1828 4729 -1324 -5477 3367 2349 -6020 131 4767 -4081 -3033 5136 -726 -5585 3153 3051 -5754
1843 -5754 212 5026 -3349 -3250 5296 -7 -5373 3034 3265 -4757 -355 5545 -2722 -3431 5383 735
1859 735 -5167 2998 4033 -4266 -280 5940 -1879 -2894 5337 1321 -4635 3004 4045 -4239 -173
1874 -173 5878 -1202 -3360 5261 2042 -4610 2484 4879 -3667 -665 5575 -1331 -3481 5026 2015
1889 2015 -4473 1976 4955 -3814 -992 5839 -937 -3881 4520 2081 -5042 1528 4840 -3553 -2049
1904 -2049 5329 -857 -4296 3858 2004 -4866 938 4805 -3737 -2377 5201 -1056 -4757 3240 2678
1919 2678 -4994 93 4561 -3595 -3083 4670 -1243 -4977 3106 2262 -5307 -218 4398 -3630 -3424 4214
1935 4214 -565 -5553 2167 2585 -5437 -656 4212 -2966 -3875 3948 -181 -5702 2210 2461 -4874 -1135
$$ packed form
1828D729o053m153Q844j018q369O151M636q848J048Q169n862m859Q738j02q805
1843e754N966M814q375R9Q546n303n366Q407K31q022M402N900q267p09Q814m648
1859G35n902Q165J035q299L986O220p819j015Q231m016n956P639J041q284M066
1874a73O051p080k158Q621l219o652P094K395q546L002O240o906k150Q507l011
1889B015o488O449K979q769K822O831o776k944Q401k439p123O570L312q393J504
1904b049P378o186l439Q154j854o870N804L867q542J360P578o257l701P997n62
1919B678p672N087M468q156N12P753n913l734Q083q44p569N089M616q028K06P638
1935D214m779m988P720M18q022M781M868p178r09P823m129n521P912K51p335L739
$$ plain form
1951 -1135 4113 -2908 -3868 4437 195 -5526 1615 3299 -4604 -1187 4462 -2736 -3745 3613 756
1966 756 -5286 1750 3447 -4167 -1346 4640 -1899 -3931 4023 1209 -4750 1587 4054 -3679 -1546
1981 -1546 5128 -1284 -3823 3978 1578 -4429 1701 4547 -3380 -1419 5431 -798 -3437 4184 2315
1996 2315 -4456 1942 4715 -2966 -1432 5148 -450 -3586 3988 2672 -3903 1122 4972 -2209 -1823
2011 -1823 5270 -31 -3981 3970 3533 -4062 926 4952 -2353 -1999 5077 543 -3909 3298 2991 -4049
2027 -4049 258 5007 -2428 -2474 4862 268 -4177 2789 3219 -3887 -300 4829 -2290 -3223 4205 453
2043 453 -4669 2016 2677 -4198 -921 4140 -2270 -3582 3607 452 -4832 1578 3042 -4512 -1383
2058 -1383 4234 -2242 -4155 3282 482 -4819 867 2869 -4279 -1835 3758 -2008 -4146 2948 655
$$ packed form
1951a135N248p021r60Q305m242n721P141J684p903L417N649p198j009P358k857
1966G56o042P036J697p614K821N986o539k032P954k814n959O337K467p733K133
1981a546O674o412k539P801k400o007O130K846p927J961O850o229k639P621j869
1996B315o771O398K773p681J534O580n598l136P574j316o575N025L850p181L86
2011a823P093n301l950P951m37p595M988M026p305L54P076m534m452P207l07p040
2027d049M307M749p435m6P336m594m445O966M30p106L587N129p119r33P428l752
2043D53n122O685O61o875L277N061o410j312P189l155n284O410J464p554L129
2058a383N617o476j913P437k800n301N686K002p148K444N593n766k138P094k293
$$ plain form
2073 655 -5085 846 3446 -4073 -2291 4085 -1747 -4243 3086 1238 -4759 702 3329 -4024 -1976
2088 -1976 3873 -1064 -4405 2878 1800 -4233 478 3561 -3005 -2163 4362 -494 -4106 2707 2430
2103 2430 -4240 -56 4366 -2811 -2235 4854 -177 -3945 2817 2504 -3679 383 4439 -2106 -2202 4219
2119 4219 374 -3473 3008 3414 -3318 156 4662 -1637 -2217 4388 807 -3769 2579 3388 -3401 -112
2135 -112 4747 -1023 -2355 4498 1446 -3533 2351 3608 -2904 -518 4767 -993 -2968 4216 1590
2150 1590 -3841 1837 3687 -3128 -1056 4504 -1115 -3201 3853 1559 -3866 1407 3501 -3077 -1229
2165 -1229 4016 -1091 -3445 2855 1925 -4276 896 3602 -3030 -2055 4068 -806 -3985 2801 1562
2180 1562 -4306 305 3213 -3216 -2084 3622 -734 -4108 2432 1225 -4270 75 3291 -3381 -2896
$$ packed form
2073F55n740N931K600p519J782O376n832k496P329j848n997N461K627p353K048
2088a976N849m937l341P283j078o033M711L083o566Q42O525m856l612O813k77
2103B430o670M184M422p177N76P089n031l768O762l13o183M062M056o545r6O421
2119D219l845l847O481M06o732L474M506o299n80O605l581m576O348Q09o789L289
2135a12M859n770j332O853l052m979N884J257o512K386N285n760j975P184k626
2150A590n431N678J850o815K072N560n619k086P054k294n425N273K094o578J848
2165a229N245n107k354O300r30o201N172K706o632R75O123m874l179O786j239
2180A562n868M611K908o429J132N706m356l374O540j207n495M345L216o672M85
$$ plain form
2195 -2896 3375 -414 -4629 1918 1875 -4422 -708 3386 -2900 -2982 3147 -310 -4458 1543 2175 -4312
2211 -4312 -600 3519 -2457 -3135 3337 86 -4304 1718 2626 -3992 -532 3775 -2210 -3242 3246
2226 3246 517 -3984 1717 2714 -3754 -1077 3835 -1624 -2808 3391 879 -3693 1649 3194 -3174
2241 -3174 -878 4091 -1160 -3026 3707 1353 -3732 1561 3479 -2643 -684 4199 -936 -2853 3368
2256 3368 1939 -3291 1139 4106 -2412 -947 4325 -317 -2704 3301 1930 -3116 1370 3860 -1968
2271 -1968 -1181 4529 197 -2991 2655 2415 -3265 856 3860 -2473 -1697 3850 191 -3511 2642 2328
2287 2328 -3436 538 4101 -2142 -2177 3907 322 -3677 2140 2557 -3614 -383 3652 -1933 -2828 3348
2303 3348 102 -4094 1644 2013 -3797 -503 3280 -2180 -2999 2774 214 -3884 1047 2423 -3662
$$ packed form
2195b896O271l789m215O547m3o297L714M094o286q2O129l457m148O001O32o487
2211d312L712M119n976o78O472l251m390O022R08o618L460M307n985j032O488
2226C246k729m501N701R97o468K677M912n459j184O199k512m572N342J545o368
2241c174K296M969n251j866O733k354n085N293J918o122J959M883n135j917O221
2256C368j429n230M430K967o518J465N272m642k387O005j371n046M486K490n828
2271a968P87N710m332l188N646k40n680M121L004o333P76N547l659l702O153l14
2287B328n764L974L563o243l5O084l585l999N817M17o171L231M035n585q95O176
2303C348l246m196N738L69n810L294L783n460q19N773k560m098M931J376o085
$$ plain form
2318 -3662 -1228 3233 -1671 -3315 2882 422 -4324 682 2348 -3374 -1568 3128 -1808 -3506 2736
2333 2736 597 -4390 514 2685 -3541 -1615 3639 -1131 -3463 2471 875 -4114 340 2901 -3233
2348 -3233 -1441 3627 -984 -3557 2548 1360 -3973 248 2965 -2855 -1861 3788 -808 -3283 2417
2363 2417 2014 -3374 670 3317 -2168 -1705 3507 -216 -3109 2449 2175 -2945 530 3815 -1703 -1843
2379 -1843 3785 497 -3315 2286 2561 -3351 517 3917 -1481 -1743 3825 823 -3078 2208 2987 -2894
2395 -2894 170 3965 -1519 -1901 3714 1033 -3124 2010 3003 -2630 28 3899 -1275 -2072 3287 910
2411 910 -3233 1591 3014 -3109 -702 4146 -899 -2315 3665 1102 -3366 1339 3005 -2999 -977
2426 -977 3716 -1110 -2985 2655 1061 -3394 739 2713 -2871 -1584 3519 -1103 -3068 2062 1243
$$ packed form
2318c662K434M461m904j644O197k460m746N006J666n722J806M696m936j698O242
2333B736k139m987M904K171o226J926N254m770k332N934j596m989M454K561o134
2348c233J792N068m611k573O105j188n333M221K717n820R94N649m596k475N700
2363B417m03n388M044K647n485M63N212l723k893N558k74n120L475L285n518j40
2379a843N628l288l812N601K75n912L868L400n398k62N568l002l901N286P79n881
2395b894L064L795n484l82N615k681m157N134R93n633K658L871n174p97N359k377
2411I10m143M824J423o123K407M848n045j416N980k563m468M705J666o004K022
2426i77M693m826j875N640j594m455M133J974n584J287N103m622j965N130q19
$$ plain form
2441 1243 -3755 397 2797 -2950 -1990 3127 -843 -3484 2085 1131 -3838 -195 2555 -2934 -1941 2866
2457 2866 -670 -3577 1595 1593 -4003 -489 2731 -2269 -2183 3007 -470 -3596 1692 1412 -3379 -88
2473 -88 3019 -2208 -2285 2992 -142 -3693 1592 2189 -3432 -715 3191 -1740 -2208 3115 214 -3396
2489 -3396 1393 2416 -3100 -702 3359 -1724 -2264 3247 790 -3335 1569 2816 -2682 -478 3740
2504 3740 -941 -2260 3258 1087 -3245 1373 3115 -2601 -455 3877 -536 -2363 2852 1726 -2936
2519 -2936 1350 3114 -2403 -900 3820 -275 -2527 3290 1793 -3193 795 3339 -2140 -1236 3791
2534 3791 -213 -2563 2732 2031 -2867 1090 3075 -1893 -1549 3593 -374 -2693 2180 1658 -3128 58
2550 58 3377 -2040 -2002 3206 -45 -3111 2012 2032 -2878 -251 3002 -1822 -2164 2794 -113 -3519 1498
$$ packed form
2441A243m998M152K400n747R60N117l970k641N569r54m969L643K750n489R93M807
2457B866l536k907N172kn596L514L220n000Q6N190l477l126N288k80m791L291
2473h8L107n227p7N277l134l551N285N97n621K717L906m931m68N323k901l610
2489c396M789J023n516K398M061n083n40N511k457m125M904J247n498K204M218
2504C740m681j319N518k171m332M618J742n716K146M332m413j827N215j126m662
2519b936M286J764n517J503M720m095k252N817j497m986L988K544n479R04N027
2534C791m004k350N295p01m898L957J985m968L44N142l967k319M873n22m786L186
2550E8L319n417L8N208l251l066N123K0m910K627L253m824l42M958k907l406N017
$$ plain form
2567 1498 2399 -3119 -621 2939 -1993 -2417 2844 -144 -3713 1367 1916 -3448 -961 2798 -1746 -2927
2583 -2927 2438 70 -3611 727 1892 -2850 -1197 2942 -1459 -2781 2296 436 -3784 746 2256
2598 2256 -2990 -1213 2902 -1356 -2592 2158 1059 -3449 709 2340 -2775 -1262 3252 -918 -2882
2613 -2882 2671 1340 -3124 791 2707 -2573 -1369 3164 -769 -2642 2536 1608 -2985 607 3269
2628 3269 -1934 -1330 3244 -112 -3165 2230 2007 -2882 644 3415 -1998 -1493 3213 104 -2662 2391
2644 2391 2170 -2941 489 3360 -1352 -1760 3766 417 -2541 2487 2696 -2761 130 3303 -1486 -1701
2660 -1701 3451 712 -2515 1708 2566 -2508 -120 3495 -1140 -1886 3068 879 -2993 1578 2608
2675 2608 -2489 -609 3325 -1289 -2444 2870 962 -3276 1150 2531 -2679 -773 3012 -1158 -2557
$$ packed form
2567A498R01n518K498L560m932m24N261k988l569N080N49n364K487L759m544j181
2583b927N365k368l681M338J165m742J653M139m401j322N077j860m220M530J510
2598B256n246J777M115m258j236M750j099m508M158J631n115J513M514m170j964
2613b882N553j331m464L915J916n280J204M533l933j873N178r28m593L592K662
2628C269n203O04M574l356l053N395k23m889L526K771n413N05M706l109k766N053
2644B391k21n111L430K871m712m08N526l349k958N028K09n457K891L173m789k15
2660a701N152k739l227M223Q58n074K388L615m635p46M954k189l872M571J030
2675B608n097J880L934m614j155N314j908m238M426J381n210J906L785m170j399
$$ plain form
2690 -2557 2658 759 -3651 825 2072 -2698 -1005 2900 -1068 -2937 2300 931 -3104 571 2490
2705 2490 -2841 -1512 2761 -968 -3116 2118 1403 -3767 152 2090 -2315 -1756 2753 -688 -3313
2720 -3313 1572 1348 -3486 -218 2593 -2205 -2067 2754 -442 -3182 1245 1534 -3245 -146 2487 -2234
2736 -2234 -2194 2565 -205 -3072 1541 1686 -3149 -342 2864 -1618 -1848 2801 112 -2915 1639 1956
2752 1956 -2636 -12 3512 -1015 -1952 2939 671 -2837 1625 2505 -2387 -230 3338 -802 -2079
2767 -2079 2849 907 -2736 1289 2765 -2187 -401 3262 -555 -1958 3027 1286 -2609 1428 2962
2782 2962 -2012 -534 3422 -534 -2204 2935 1454 -2499 945 2888 -1910 -1067 3294 -393 -2315
2797 -2315 2387 1706 -2756 610 3114 -1883 -1330 3107 -495 -2667 2029 1692 -2728 147 2934 -1956
$$ packed form
2690b557N215j899m410M476J247m770J693L905l968j869N237j369m035L675J919
2705B490n331J329M273l729k148N234p15n170L919J938m405N59M509l441k625
2720c313M885k24m834L268K811m798J38M821l196k740M427K89m779L099K633m721
2736b234M0M759k770k867M613J45m835K807L206m482k30M649k689l027M554L17
2752A956m592K624L524m527r37M891k268l508M462Q80m892K157L568m140j277
2767b079M928j942l643M025J476m952J786L663l817j403M985j741l895M037J534
2782B962m974J478L956l956j670N139j481l953L444J943m798Q43M361l687j922
2797b315M702o81m462L366K504m997N53M437l602k172M696l37m420K875K787m890
$$ plain form
2813 -1956 -1397 2947 -59 -2803 2011 1431 -3063 35 2666 -1792 -1881 2589 -316 -3123 1413 1461
2829 1461 -2854 -249 2468 -1966 -2333 2438 -134 -2999 1193 1655 -3038 -680 2384 -1595 -2478 2058
2845 2058 116 -3553 1149 1708 -2731 -495 2736 -1639 -2451 2324 181 -3158 953 1654 -2830 -1166
2861 -1166 2634 -1209 -2635 2215 807 -3016 589 2221 -2412 -926 2880 -955 -2566 2285 1077
2876 1077 -3061 692 2484 -2427 -1115 3075 -396 -2483 2041 1386 -2701 727 2673 -1859 -1107
2891 -1107 3123 -305 -2554 2487 1739 -2736 661 2872 -1644 -995 3412 115 -2710 2308 1607 -2332
2907 -2332 576 3107 -1640 -1283 3083 502 -2467 2013 1902 -2760 158 3128 -1456 -1555 2980 738
2923 738 -2635 1780 2139 -2487 -52 3113 -1302 -1767 2819 447 -2870 1494 2196 -2556 -386 2721
$$ packed form
2813a956N59M344l006k744M814n80m494L098K631m458q9M470k905k807M536M8
2829A461m315K605K717m434l67M771k572k865M192M62m693K358L064l979q83M536
2845B058j942l669M702N59m439K236L231m375q12M775k143l339M111P01m484J664
2861a166L800l843j426M850j408l823L605J632m633J486L806l835j611M851j208
2876A077m138L753J792m911J312M190l471k087M524o55m087L428J946m532P52
2891a107M230l428k249N041p48m475L397K211m516O49M407l297k825N018p01l939
2907b332K908K531m747L57M366k581k969M480j11m662K918K970m584r9M535k242
2923G38l373M415L59m626K435L165m415m65M586k372l317M364P02m752K170L107
$$ plain form
2939 2721 -833 -2107 2506 554 -2817 1093 1958 -2612 -651 2849 -1681 -2316 2264 751 -3046
2954 -3046 601 2178 -2571 -941 2492 -1023 -2803 1993 508 -3153 708 1793 -2317 -1421 2327
2969 2327 -1094 -2800 1840 668 -2908 245 2050 -2385 -1523 2436 -761 -2839 1616 1020 -3206
2984 -3206 432 2391 -2165 -1945 2523 -333 -2690 1543 1551 -2923 -67 2169 -1706 -1615 2651 -25
3000 -25 -2800 1587 1537 -2704 126 2503 -1623 -1385 2697 139 -2669 1683 2100 -2084 -15 2497
3016 2497 -962 -1856 2847 374 -2494 1290 2102 -2236 -354 2916 -1075 -1636 2745 899 -2470 1697
3032 1697 2204 -2154 -593 2933 -609 -1665 2430 1150 -2280 1242 2517 -1701 -483 3241 -399
3047 -399 -1861 2516 954 -2436 951 2612 -1740 -719 2897 -367 -2326 2172 933 -2543 298
$$ packed form
2939B721l554j274M613j952l371L910Q65m570J961L500m530o35M580j513l797
2954c046L647J577m749J630L433l515j780M796j485l661L861J085m110Q96L748
2969B327l421j706M640j172l576L153J805m435Q62L959l197k078M455n96m226
2984c206L638J959m556K20M468k856k357M233Qm474K856K236l875R1M266k676
3000b5k775M387n0m241K830K377m126K38M082k558k808M352M17m184K069K512
3016B497l459q94M703k473k868L784Q12m338J882L270l991n61M381j846l369M167
3032A697N07m358J561L526l542j056M095j280l430L522J275m218J218L724l640
3047c99j462M377j562l390L387J661m352J021L616l264j959M498j239l476K841
$$ plain form
3062 298 2149 -2167 -1101 2813 -83 -2070 1631 1396 -2946 489 2350 -1940 -1259 2395 -583 -2425
3078 -2425 1823 1245 -2527 -57 2283 -1925 -1680 2104 -527 -2278 1516 1252 -2621 -377 2252 -1705
3094 -1705 -1867 2130 -268 -3134 969 1285 -2668 -750 2233 -1637 -1779 1751 -297 -2799 1233 1466
3110 1466 -2779 -507 2487 -1452 -2092 2220 234 -2633 1124 1669 -2478 -967 2720 -1233 -2026 2174
3126 2174 361 -2649 679 2088 -2204 -698 2572 -575 -2159 1971 955 -2721 1004 2187 -1952
3141 -1952 -718 2605 -632 -2041 2065 962 -2272 701 2410 -1951 -980 2862 36 -1813 1955
3156 1955 1021 -2277 540 2631 -1524 -1140 2581 41 -1760 1875 1810 -2259 583 2577 -1304 -966
3172 -966 2948 489 -2017 2178 1644 -2360 365 2660 -1198 -1080 2429 88 -1805 1611 1808 -2283
$$ packed form
3062B98J851m316J066L914k896j987L701k35m342L435J861m290O81L654k978j842
3078b425M248n78l772K470K340m208K45L784k631j751L794k64l873K244K629l957
3094a705j62L997k398k866M103L16l953J918K983l870j42L530k048k502M032K33
3110A466m245K272K994l939o40M312j986k867L757N45m147J511L687l953p93M200
3126B174j813l010L328J409m292J506L270l147j584M130j016l676L725J183m139
3141a952J234L323l237j409M106j103l234K973J709m361R71L842k826j849L768
3156A955r34l298K817K091m155L84L721k540j801L635o5m069K842J994l881L38
3172i66L914k459k506M195n34m004K725K295l858J18L509k341j893L416J97m091
$$ plain form
3188 -2283 -6 2463 -1077 -1513 2478 429 -2315 1324 1954 -1928 -175 2405 -1325 -1899 2357 283
3204 283 -2465 1013 1797 -2383 -388 2300 -1000 -2103 2209 324 -2568 726 1601 -2364 -750 2129
3220 2129 -1229 -2140 1889 731 -2960 597 1540 -2029 -1038 2070 -817 -2706 1412 733 -2209 438
3236 438 2116 -2073 -1566 2170 -648 -2186 1470 1006 -2380 29 2136 -1920 -1127 2162 -539 -2037
3252 -2037 1600 1104 -2476 24 2058 -1557 -1435 2290 -120 -2207 1378 1301 -2219 285 2549 -1743
3268 -1743 -1341 2271 27 -2301 1591 1253 -2310 442 2270 -1242 -1059 2398 482 -2321 1532 1712
3284 1712 -2251 112 2560 -878 -1269 2376 860 -2284 1541 1866 -2082 -62 2372 -936 -1472 2189
3300 2189 830 -2052 1230 1909 -1912 -527 2506 -492 -1575 1916 1054 -2174 825 1841 -2096
$$ packed form
3188b283K277K469l540m36L991k049k744L639O30l882J753K580l730n74M256k074
3204B83k748L478P84m180J995K688l300j103M312j885k892L294Q75l965J614K879
3220B129l358r11M029j158l691L557R43l569R91L108k887j889M118o79k942K647
3236D38J678m189N07L736k818j538L656m64l386K409K107m056P93L289k701j498
3252b037L637m96l580K500K034l615J22L725k410k087L585p7l520K504K264m292
3268a743M02L612k244k328L892l38l563K752J828l512J83L457j916k803L853J80
3284A712l963K363K448l438l91L645j516l144L825L25l948K020K434l308n36L661
3300B189j359k882L282O79l821J385L033k998j083L491q62l228K999J016l937
$$ plain form
3315 -2096 -572 2528 -689 -1649 1924 951 -2124 588 2175 -1526 -992 2270 -436 -1986 1884 981
3331 981 -2494 398 1853 -1431 -1112 2204 -546 -2202 1205 738 -2518 287 1665 -1639 -1305 2078
3347 2078 -630 -2117 1204 1056 -2217 106 2110 -1740 -1487 1613 -404 -2399 867 1043 -2344 -717
3363 -717 2029 -1387 -1662 1896 -45 -2298 940 1286 -2282 -263 2063 -1342 -1967 1831 225 -2544
3379 -2544 672 1488 -2255 -420 2138 -1068 -1928 1740 247 -1914 805 1617 -1838 -708 2150 -812
3395 -812 -1813 1984 534 -2200 1015 1513 -1393 -639 2362 -543 -1541 1524 1007 -1972 736 1825
3411 1825 -1457 -664 2364 -297 -1437 1844 1140 -1816 836 2178 -1274 -714 2703 200 -1579 1891
3427 1891 1184 -1661 592 2258 -1162 -644 2294 -68 -1721 1555 1192 -1684 258 2303 -1074 -1020
$$ packed form
3315b096J524L100l217r60L573r73l075K712J587l701N34L262k706j550L870r03
3331I81l475K892J455l284L19L316k750j656L407m67l256K805J378l304L34L383
3347B078k708j487L321j48l273K323K004l850K53L100k017j995L266J76l387J627
3363g17K746l416k75L558j941k253L238L46l568K019K326l405o25L798j606k769
3379b544L216Q16l743J835K558l206q60L668j493k161K719Q12l455J130K858k962
3395h12j001L797j450k734L215M98k906P54L001k905r98L065n17k979K708J089
3411A825l282P93L028k661j140L281p04k956K652J342l452N60L417k503j779L470
3427A891p07k845K253J666l420N18K938k362j653L276l63k876J942K045l377N4
$$ plain form
3443 -1020 2223 -222 -1884 1127 1604 -1678 192 1938 -1310 -1530 2084 198 -2237 1102 1511 -1787
3459 -1787 -128 2120 -1099 -1635 1585 9 -2507 816 1354 -1937 -557 2207 -1216 -1796 1583 225
3475 225 -2390 528 1099 -1899 -1002 1873 -966 -2005 1407 85 -2262 409 1396 -2132 -767 1506
3491 1506 -1024 -2131 1769 706 -2359 464 1537 -1868 -1007 1726 -662 -1980 1564 865 -2376
3506 -2376 231 1636 -1329 -1097 1683 -699 -2038 1245 643 -2007 422 1969 -1341 -742 2153 -498
3522 -498 -1910 1101 1206 -1980 111 1905 -1174 -1009 1977 25 -2009 1286 1514 -1514 382 2258
3538 2258 -688 -1256 1881 221 -1504 1384 1496 -1753 -82 2127 -672 -1033 1957 365 -1596 1060
3554 1060 1975 -1425 -77 2182 -892 -1156 1973 534 -1544 1217 1681 -1587 -117 2446 -574 -1199
$$ packed form
3443a020L243k445j662L011M77l282J870J746l248k20L614j886k435L339M09l298
3459a787J659K248l219n36L220j576k516L323N38l291J380K764l423n80L379j358
3475B25k615K918N71k998Q97K875k839j039L412j322k347K671R87l528J365K273
3491A506k530j107L900j063l065K823J073l405Q61K733k388j318L544o99l241
3506b376K607J405k965K32K780k382j339L283o02k650K429J547l310N99K895k651
3522d98j412L011J05l186K091J794l079J65K986j952k034L295K28l028J896J876
3538B258k946n68L137j660j725K888J12l249J671K209k799l61K990j592j961K656
3554A060R15l400J348K259l074k64L129j439k078K761M64l268J470K563l020o25
$$ plain form
3570 -1199 1675 445 -1809 640 1237 -1582 -486 1925 -476 -1290 2018 345 -1748 548 1620
3585 1620 -1401 -746 1924 -127 -1730 1346 404 -2155 467 1630 -1465 -813 1829 -850 -1421 1192
3601 1192 627 -1983 291 1344 -1559 -1242 1541 -347 -1771 1098 834 -1955 89 1658 -1079 -1196
3617 -1196 1450 91 -1930 963 621 -1891 -301 1578 -1322 -1363 1638 -109 -2134 701 1031 -1827
3633 -1827 -307 1842 -1047 -1474 1412 -161 -1897 767 852 -1741 -414 1679 -907 -1235 1693 403
3649 403 -1730 883 1308 -1773 -437 2165 -524 -1268 1556 552 -1513 796 1719 -1360 -526 1722
3665 1722 -323 -1335 1534 983 -1784 770 1668 -1133 -409 1870 -116 -1125 1396 1200 -1666 608
3681 608 1532 -1254 -447 1930 21 -1617 1468 1335 -1637 177 1716 -1077 -778 1973 1 -1503
$$ packed form
3570a199K874j230k254K449N97k819J096K411k401q14L308j673k093K296J072
3585A620l021O55K670k051j603L076r42k559K622J163l095O52K642k679n71K613
3601A192n65k610K274J053k903L17K783j888j424K869k64k789K044J569k737j17
3617a196K646j359k021K893l42k512J590J879k900m1L001j747k025K835L30k858
3633a827J520K149k889m27K886j573j736K664Q5k593J327K093k586l28K928j290
3649D03k133K613M25l081J336K602k689p44K824j004k065K309R23l079Q34K248
3665A722k045j012K869n51k767K554Q98k801P24K279j986j009K521j96k866K274
3681F08R24k786Q07K377j909j638L085j33k972J814J539k793K99K751j972j504
$$ plain form
3697 -1503 1398 1018 -1658 695 1549 -974 -810 1869 -114 -1606 871 1236 -1635 117 1869 -1052
3713 -1052 -884 1938 -206 -1864 820 1047 -1691 -3 1464 -714 -820 1410 103 -2063 738 1318
3729 1318 -1811 -420 1654 -1120 -1395 1492 216 -1827 574 1221 -1714 -337 1808 -832 -1693 1061
3745 1061 559 -1767 678 1418 -1700 -667 1428 -893 -1563 1235 -7 -1928 358 1271 -1309 -815
3761 -815 1939 -329 -1682 1091 224 -1838 319 1274 -1516 -894 1732 -512 -1365 1208 846 -1902
3777 -1902 428 1505 -1263 -875 1856 -369 -1440 1255 924 -1772 286 1561 -1020 -812 1667 -86
3793 -86 -1539 1233 1093 -1345 417 1772 -718 -641 1516 171 -1426 1100 1468 -1491 -124 1683
3809 1683 -665 -987 1862 272 -1470 1121 1251 -1274 -138 1629 -763 -1123 1887 710 -1508 1212
$$ packed form
3697a503K901l80k676K353Q54k523J64K679j983j492K477L65k871J752J752k921
3713a052J68K822k144j658K684K27k738J688J467k178j06K230j307k166K801N80
3729A318l129J391K074k774k75K887j276k043K401O47k935J377K145k640q61K754
3745A061n02k326K445P40l118J033K095k321o70K798j242j921K286R13k580M94
3761h15K754k268j353K773q67k062K157R55k790O22K626k244q53K573l62k748
3777a902K330J077k768L88K731k225j071K695l31k696K058J275k581K08K479j753
3793h6j453K772j40k438J762J355k490P7K157j345j597K526L68k959J367J807
3809A683k348l22K849j590j742K591J30k525J136J767k392l60L010j177k218K720
$$ plain form
3825 1212 1457 -1218 -311 1914 -587 -1244 1489 46 -1763 1054 1169 -1592 -286 1740 -353 -1373
3841 -1373 1429 382 -1748 337 1275 -1475 -514 1675 -234 -1148 1068 635 -1539 608 1273 -1560
3857 -1560 -592 1395 -376 -1692 1387 467 -1964 270 1116 -1283 -1037 1352 -790 -1754 1023 621
3873 621 -1798 141 1300 -1167 -991 1509 -399 -1770 935 1041 -2092 -234 1554 -954 -1193 1285
3889 1285 95 -1905 725 544 -1486 -164 1612 -1053 -797 1649 -15 -1700 460 1118 -1505 -212
3905 -212 1613 -599 -1018 1569 306 -1460 738 1283 -1531 -417 1858 -719 -1304 1649 519 -1299
3921 -1299 697 1333 -1289 -280 1835 -579 -1098 1642 278 -1320 986 1615 -1141 -473 1947 -209
3937 -209 -1305 1526 785 -1497 774 1621 -840 -494 1913 -259 -1094 1469 761 -1454 583 1592
$$ packed form
3825A212K45k675R07K225k501o57K733j443j809K817J15k761J306K026k093j020
3841a373K802j047k130K085R38k750R61K189j909r14K216m33k174K147O65k833
3857a560R68J987j771j316L079r20k431K234Q46k399K46K389k142r64K777m02
3873F21k419J939J159k467J76K500j908j371K705J06l133J858J788k508k39K478
3889A285j190k000K630j81k030J322J776k665K56K446j664j685K160O58k623J293
3905b12J825k212m19K587j263j766K198N45k814J114K275k577n85K953j130j818
3921a299J996O36k622J009K115k414n19K740j364j598K306O29k756O68K420k156
3937b09j096K831p41k282K271Q47k461L46K407k172q35K563p08k215K037J009
$$ plain form
3953 1592 -891 -385 1443 84 -1433 1263 1064 -1753 445 1434 -893 -862 1663 -31 -1417 842
3969 842 579 -1708 140 1557 -605 -741 1400 -206 -1638 874 843 -1554 -278 1346 -1068 -977 1500
3986 1500 -149 -1526 867 873 -1490 -312 1399 -913 -1210 1150 85 -1812 705 980 -1638 -771
4002 -771 1518 -708 -1337 1280 413 -1904 391 834 -1496 -766 1435 -695 -1308 1271 199 -1777
4018 -1777 434 1323 -1410 -563 1438 -473 -1092 1421 174 -1426 341 1293 -1086 -588 971 -450
4034 -450 -1447 977 636 -1541 321 1060 -1004 -941 1599 -393 -1105 1147 560 -1543 394 1624 -967
4051 -967 -462 1623 -257 -1578 1440 748 -1217 218 1582 -711 -605 1678 0 -1201 1091 868
4067 868 -1148 182 1745 -685 -332 1527 -68 -1199 1072 931 -994 -7 1579 -469 -993 1668
$$ packed form
3953A592k483N06J828j359j517K696j99k817K198R89k327L1K525j694j386K259
3969H42k63k287J848J417k162j36K141j606j432K512l1k397J276J624k414R1K477
3986A500j649j377K393Ok363J178J711k312k97K360j065j897K517K75k618Q67
4002g71K289k226o29K617q67k317K295M43k330P30K201k130o13K579j072j976
4018a777K211Q89k733Q47K001j911o19K513j247j600J767R52k379M98J559j421
4034d50r97K424l41k177J862P39k064O3K540j992p12K252n87k103J937J230k591
4051i67N05K085j880j321L018o92j965J435J364k293J06K283j678j201K292k23
4067H68k016J330J563k430L53J859j595j131K271j41j925R87J586k048n24K661
$$ plain form
4083 1668 283 -1143 963 1186 -1148 -412 2090 -695 -1306 1373 244 -1487 687 1257 -1116 -195
4099 -195 1385 -519 -1107 1350 210 -1291 527 1012 -1247 -88 1780 -804 -1314 1095 354 -1834
4115 -1834 415 1346 -1093 -829 1328 -676 -1351 1107 329 -1380 254 1083 -1251 -774 1549 -44
4131 -44 -1447 1027 578 -1505 139 874 -1378 -794 1299 -444 -1207 1061 704 -1791 -62 1245 -1131
4148 -1131 -796 1378 -130 -1522 849 845 -1522 -181 1412 -636 -863 1347 -88 -1414 601 1085
4164 1085 -1336 -243 1687 -899 -968 1482 433 -1409 684 1106 -1255 -38 1675 -625 -718 1341
4180 1341 504 -1145 525 1286 -1010 -185 1613 -506 -1206 1232 538 -1477 869 1486 -1009 -447 1796
4197 1796 -87 -1035 1167 599 -1334 518 1060 -876 -274 1664 -331 -1002 1382 558 -1279 271
$$ packed form
4083A668j385j426K106K23k334P36K502k785o11K679j129j731K174N70k373R21
4099a95J580j904n88K457j140j501J818M85k259J159J868k584n10K409p41k188
4115a834K249R31k439K64K157k004o75K458p78j709J634Q29k334M77K323j593
4131d4j403K474m49k083J644P35k252N84K093j743p63K268l57k495J729J307k376
4148a131L35K174j508j392K371mk367J341J593k048k27K210j435j326K015M84
4164A085k421J093J930k586o9K450j049j842K093M22k361J217J713k300r3K059
4180A341q37j649J670P61k296Q25J798k119p00K438o94k015K346O17k495N62K243
4197A796j883r48K202n68j933J852N42j936O02J938j995o71K384q24j837J550
$$ plain form
4213 271 1501 -1335 -227 1468 -472 -1381 1262 931 -1300 517 1265 -851 -834 1377 -77 -1318
4229 -1318 976 701 -1423 106 1389 -877 -814 1315 -304 -1472 943 715 -1285 -311 1505 -1227
4245 -1227 -982 1397 -132 -1448 544 768 -1395 -141 1733 -630 -1252 1469 135 -1612 589 855
4261 855 -1519 -231 1343 -747 -1238 967 -114 -1518 646 1061 -1173 -501 1332 -821 -1079 1146
4277 1146 151 -1539 42 963 -1106 -506 1585 -458 -1172 1248 307 -1254 421 1034 -1038 -289 1471
4294 1471 16 -1174 841 428 -1476 449 1091 -975 -536 1659 -434 -1337 1157 517 -1114 358
4310 358 1200 -956 -379 1457 -182 -1406 1512 844 -1219 302 1461 -510 -652 1459 -24 -1255
4326 -1255 1142 916 -1282 296 1525 -919 -570 1451 233 -1235 747 1222 -1199 130 1613 -582
$$ packed form
4213B71J230k836J108J695j940r09K643l31k231J817P48k116J7K211j454j241
4229a318K294k75k124J529J283k266O3K129j619j168K415k28k000R74J816k732
4245a227K45K379j529j316J992K24k163J254J874k363o22K721j334j747K201K66
4261H55k374J288J574k090m91K205j081j404K164M15k234O72J833k153k58K225
4277A146r95j690J581R21k069O00K091k043p14K420r41j561J675O13k072P49J760
4294A471j455j190K015m13j904J925O42k066M39K195k093r03K494o40j631J472
4310C58Q42k156N77J836j639j224K918o68k063J521J159j971j42K111j483j231
4326a255K397k26k198J578J229k444L49K021j218j468J982M75k421J329J483k195
$$ plain form
4342 -582 -895 1395 35 -1296 647 863 -1263 -361 1538 -652 -1134 1209 429 -1168 654 956 -1159
4359 -1159 -382 1243 -500 -972 1343 192 -1510 529 1288 -1038 -499 1510 -790 -1232 1165 264
4375 264 -1225 319 1023 -1374 -656 1686 -366 -1517 924 353 -1417 103 928 -1384 -814 1429
4391 1429 -508 -1166 785 679 -1714 30 1444 -1239 -757 929 -507 -1517 725 636 -1646 147
4407 147 1495 -1326 -809 1407 -384 -1432 629 609 -1088 5 1356 -1086 -725 1294 -103 -1308
4423 -1308 876 738 -1438 24 1368 -589 -999 1673 -157 -1117 702 596 -1360 -82 1699 -801
4439 -801 -1104 1300 353 -864 560 1135 -1113 -247 1731 -519 -524 1170 542 -1162 356 983 -872
4456 -872 -2 1649 -137 -857 1282 492 -1266 808 1167 -1184 -171 1505 -55 -1122 1224 647
$$ packed form
4342e82l13K290j360j331J943K16k126R02J899k190m82K343p80j597J822L02k115
4359a159P77J625j743m72K315j151j702K039P59k326N39K009k300m42K397r01
4375B64j489J544P04k397P18K342k052j151K441n71j770J520Q25k312N70K243
4391A429j937o58J951j06k393J744J414k683M82J686j436j010K242q9k282J793
4407A47J348k821N17K216j791j048K061k0j697J093J351k442L61K019j397j205
4423a308K184j38k176J462J344j957m10K672j830r60J819j06j956J278J781k500
4439h01l03K404r47j217J424N75k248Q66J978k250nJ694o28j704J518O27j855
4456h72Q70J651j786p20K139p90j758K074L59k351J013J676j560j067K346n77
$$ [...]
8191B35
##END NTUPLES=NMR FID
##END=
