##TITLE=1H_EC-3210(22)
 CDCl3, 8 sc, 
 21.11.2019
##JCAMPDX= 6.0         $$ Bruker NMR JCAMP-DX V2.0
##DATA TYPE= NMR FID
##DATA CLASS= NTUPLES
##ORIGIN= UXNMR, Bruker Analytische Messtechnik GmbH
##OWNER= root
$$ XWIN-NMR		Version 3.5
$$ Thu Nov 21 13:54:07 2019 Russian Standard Time (UT+4h)  she@DPX200
##.OBSERVE FREQUENCY= 200.1315
##.OBSERVE NUCLEUS= ^1H
##.DELAY= (6, 6)
##.ACQUISITION MODE= SIMULTANEOUS
##.ACQUISITION SCHEME= undefined
##.AVERAGES= 8
##.DIGITISER RES= 18
##SPECTROMETER/DATA SYSTEM= spect
##.PULSE SEQUENCE= zg30
##.SOLVENT NAME= CDCl3
##.SHIFT REFERENCE= (INTERNAL, CDCl3, 0, 15.7039)
##AUDIT TRAIL= $$ (NUMBER, WHEN, WHO, WHERE, WHAT)
$$ ##TITLE= Audit trail, XWIN-NMR		Version 3.5
$$ ##JCAMPDX= 5.01
$$ ##ORIGIN= Bruker BioSpin GmbH
$$ ##OWNER= she
$$ F:/spectra/data/she/nmr/H-F/1/audita.txt
$$ ##AUDIT TRAIL=  $$ (NUMBER, WHEN, WHO, WHERE, WHAT)
(   1,<2019-11-21 13:53:01.78 +0400>,<she>,<DPX200>,
      <created by zg, POWCHK disabled, PULCHK disabled
       configuration hash MD5:
       00 E9 B6 7A A2 85 ED C7 34 08 36 98 17 FE 4E 26
       data hash MD5: 16K
       69 EE D3 54 9E 2D 25 52 21 0E AA CE B4 60 36 E0>)
$$ ##END=
$$ 
$$ hash MD5
$$ 53 6F 97 AA 4C D2 5A 0B 96 D7 27 20 16 7D 20 D2
##$RELAX= 
##$RELAX= 
##$RELAX= 
##$RELAX= 
##$RELAX= 
##$RELAX= 
$$ Bruker specific parameters
$$ --------------------------
##$DU= <F:/spectra>
##$EXPNO= 1
##$NAME= <H-F>
##$PROCNO= 1
##$TYPE= <nmr>
##$USER= <she>
##$AMP= (0..31)
100 100 100 100 100 100 100 100 100 100 100 100 100 100 100 100 100 100 
100 100 100 100 100 100 100 100 100 100 100 100 100 100 
##$AQSEQ= 0
##$AQ_mod= 1
##$AUNM= <au_zg>
##$AUTOPOS= <>
##$BF1= 200.13
##$BF2= 200.13
##$BF3= 200.13
##$BF4= 200.13
##$BF5= 200.13
##$BF6= 200.13
##$BF7= 200.13
##$BF8= 200.13
##$BYTORDA= 1
##$CFDGTYP= 0
##$CFRGTYP= 5
##$CHEMSTR= <none>
##$CNST= (0..31)
1 1 145 1 1 1 1 1 1 1 1 1 1 1 1 1 1 1 1 1 1 1 1 1 1 1 1 1 1 1 1 1 
##$CPDPRG= <>
##$CPDPRG1= <>
##$CPDPRG2= <>
##$CPDPRG3= <>
##$CPDPRG4= <mlev>
##$CPDPRG5= <mlev>
##$CPDPRG6= <mlev>
##$CPDPRG7= <mlev>
##$CPDPRG8= <mlev>
##$CPDPRGB= <>
##$CPDPRGT= <>
##$D= (0..31)
0 1.2 0 0 0 0 0 0 0 0.06 0 0.03 0 0 0 0 0.0002 0 0 0 0 0 0 0 0 0 0 0 0 
0 0 0 
##$DATE= 1574329981
##$DBL= (0..7)
120 120 120 120 120 120 120 120 
##$DBP= (0..7)
150 150 150 150 150 150 150 150 
##$DBP07= 0
##$DBPNAM0= <>
##$DBPNAM1= <>
##$DBPNAM2= <>
##$DBPNAM3= <>
##$DBPNAM4= <>
##$DBPNAM5= <>
##$DBPNAM6= <>
##$DBPNAM7= <>
##$DBPOAL= (0..7)
0.5 0.5 0.5 0.5 0.5 0.5 0.5 0.5 
##$DBPOFFS= (0..7)
0 0 0 0 0 0 0 0 
##$DE= 6
##$DECBNUC= <off>
##$DECIM= 24
##$DECNUC= <off>
##$DECSTAT= 4
##$DIGMOD= 1
##$DIGTYP= 9
##$DL= (0..7)
0 120 120 120 120 120 120 120 
##$DP= (0..7)
150 150 150 150 150 150 150 150 
##$DP07= 0
##$DPNAME0= <>
##$DPNAME1= <>
##$DPNAME2= <>
##$DPNAME3= <>
##$DPNAME4= <>
##$DPNAME5= <>
##$DPNAME6= <>
##$DPNAME7= <>
##$DPOAL= (0..7)
0.5 0.5 0.5 0.5 0.5 0.5 0.5 0.5 
##$DPOFFS= (0..7)
0 0 0 0 0 0 0 0 
##$DQDMODE= 0
##$DR= 18
##$DS= 0
##$DSLIST= <SSSSSSSSSSSSSSS>
$$ [...]
##$SUBNAM2= <"">
##$SUBNAM3= <"">
##$SUBNAM4= <"">
##$SUBNAM5= <"">
##$SUBNAM6= <"">
##$SUBNAM7= <"">
##$SUBNAM8= <"">
##$SUBNAM9= <"">
##$SW= 24.9337058887773
##$SWIBOX= (0..15)
0 0 2 0 0 0 0 0 0 0 0 0 0 0 0 0 
##$SW_h= 4990.01996007984
##$TD= 16384
##$TD0= 1
##$TE= 0
##$TE2= 300
##$TE3= 300
##$TEG= 300
##$TL= (0..7)
0 120 120 120 120 120 120 120 
##$TP= (0..7)
150 150 150 150 150 150 150 150 
##$TP07= 0
##$TPNAME0= <>
##$TPNAME1= <>
##$TPNAME2= <>
##$TPNAME3= <>
##$TPNAME4= <>
##$TPNAME5= <>
##$TPNAME6= <>
##$TPNAME7= <>
##$TPOAL= (0..7)
0.5 0.5 0.5 0.5 0.5 0.5 0.5 0.5 
##$TPOFFS= (0..7)
0 0 0 0 0 0 0 0 
##$TUNHIN= 0
##$TUNHOUT= 0
##$TUNXOUT= 0
##$USERA1= <user>
##$USERA2= <user>
##$USERA3= <user>
##$USERA4= <user>
##$USERA5= <user>
##$V9= 5
##$VALIST= <valist>
##$VCLIST= <CCCCCCCCCCCCCCC>
##$VD= 0
##$VDLIST= <DDDDDDDDDDDDDDD>
##$VPLIST= <PPPPPPPPPPPPPPP>
##$VTLIST= <TTTTTTTTTTTTTTT>
##$WBST= 1024
##$WBSW= 4
##$XGAIN= (0..3)
0 0 0 0 
##$XL= 0
##$YL= 0
##$YMAX_a= 176465
##$YMIN_a= -66669
##$ZGOPTNS= <>
##$ZL1= 120
##$ZL2= 120
##$ZL3= 120
##$ZL4= 120
##$ABSF1= 10
##$ABSF2= 0
##$ABSG= 5
##$ABSL= 3
##$ALPHA= 0
##$AQORDER= 0
##$ASSFAC= 0
##$ASSFACI= 0
##$ASSFACX= 0
##$ASSWID= 0
##$AUNMP= <proc_1d>
##$AZFE= 0.1
##$AZFW= 0.1
##$BCFW= 1
##$BC_mod= 2
##$BYTORDP= 1
##$COROFFS= 0
##$CY= 11.3945322036743
##$DATMOD= 1
##$DC= 2
##$DFILT= <>
##$DTYPP= 0
##$F1P= 16.9975609425685
##$F2P= -3.02152046262296
##$FCOR= 0.5
##$FTSIZE= 0
##$FT_mod= 4
##$GAMMA= 1
##$GB= 0.15
##$INTBC= 1
##$INTSCL= 1
##$ISEN= 128
##$LB= 0.24
##$LEV0= 0
##$LPBIN= 0
##$MAXI= 10000
##$MC2= 0
##$MEAN= 0
##$ME_mod= 0
##$MI= 1.114404
##$NCOEF= 0
##$NC_proc= 0
##$NLEV= 6
##$NOISF1= 3.799351
##$NOISF2= 2.8
##$NSP= 1
##$NTH_PI= 0
##$NZP= 0
##$OFFSET= 15.70392
##$PC= 1
##$PHC0= -9787.743
##$PHC1= 17.20086
##$PH_mod= 1
##$PKNL= yes
##$PPARMOD= 0
##$PSCAL= 0
##$PSIGN= 0
##$REVERSE= no
##$SF= 200.130013532006
##$SI= 16384
##$SIGF1= 3
##$SIGF2= 2
##$SINO= 400
##$SIOLD= 16384
##$SREGLST= <1H.CDCl3>
##$SSB= 0
##$STSI= 0
##$STSR= 0
##$SW_p= 3612.71676300578
##$SYMM= 0
##$S_DEV= 0
##$TDeff= 0
##$TDoff= 0
##$TI= <>
##$TILT= no
##$TM1= 0
##$TM2= 0
##$TOPLEV= 0
##$USERP1= <user>
##$USERP2= <user>
##$USERP3= <user>
##$USERP4= <user>
##$USERP5= <user>
##$WDW= 1
##$XDIM= 8192
##$YMAX_p= 0
##$YMIN_p= 0
$$ End of Bruker specific parameters
$$ ---------------------------------
##NTUPLES= NMR FID
##VAR_NAME=  TIME,          FID/REAL,        FID/IMAG
##SYMBOL=    X,             R,               I
##VAR_TYPE=  INDEPENDENT,   DEPENDENT,       DEPENDENT
##VAR_FORM=  AFFN,          ASDF,            ASDF
##VAR_DIM=   8192,          8192,            8192
##UNITS=     SECONDS,       ARBITRARY UNITS, ARBITRARY UNITS
##FACTOR=    0.0002004,     1,               1
##FIRST=     0,             0,               0
##LAST=      1.6414764,     0,               0
##MIN=       0,             -66669,          0
##MAX=       1.6414764,     176465,          0
$$ Real data points
##PAGE= N=1
##DATA TABLE= (X++(R..R)), XYDATA
0 0 0 0 0 0 0 0 0 0 0 8 -8 8 -8 8 -16 16 -24 24 -32 33 -40 48 -56 64 -75 85 -97 109 -125 141 -159 180
32 180 -200 224 -250 281 -312 347 -384 428 -473 523 -579 640 -709 787 -876 972 -1084 1217
50 1217 -1370 1552 -1775 2054 -2414 2899 -3586 4658 -6572 11055 -47751 22980 76193 -22473
64 -22473 -27797 -31222 -34633 9755 23559 -66669 -59729 43950 49251 -16425 -3378 1490 -23461
77 -23461 18142 48440 -21379 -30004 41214 23057 -34208 10247 40158 -3347 4489 30854 -14399
90 -14399 -16299 42275 12804 -43857 7815 46357 69 -3188 22050 -15184 -12581 49713 19038
103 19038 -50474 -9708 37966 6112 9095 35044 -8146 -21707 32870 15279 -38202 4121
115 4121 42275 1366 4767 38888 -5692 -31060 23548 22204 -24442 10418 39370 -10858 -13866
128 -13866 29436 1060 -24169 21447 19270 -24693 5416 27722 -24934 -22792 31252 6411
140 6411 -26123 16363 16504 -31694 -6979 22750 -20404 -19493 30615 3638 -34107 8112 18465
153 18465 -24143 -6032 17956 -24343 -21775 30831 4851 -37526 4746 22686 -20792 -10169
165 -10169 15115 -21942 -22328 28214 6351 -34491 4085 20615 -23236 -13473 17365 -15670 -20165
178 -20165 26390 4831 -36582 3300 24210 -21205 -14764 22134 -4329 -17492 18579 422
190 422 -33011 10748 32822 -15569 -16154 20491 -2672 -14579 22159 5446 -31425 10364 37209
203 37209 -12139 -17948 19966 1223 -13773 21504 9671 -27232 8259 33356 -13681 -17705
215 -17705 23117 3846 -16252 18330 10832 -26826 5008 30916 -13620 -18379 24937 6845
227 6845 -20081 11489 11389 -20918 6526 27957 -17587 -21026 25879 10353 -20041 9754 12880
240 12880 -20763 3166 27551 -14256 -21089 24937 11751 -20312 6981 13672 -19031 -324
252 -324 24952 -12699 -18914 24248 10016 -23996 4738 15578 -18900 -3939 23885 -9256 -20304
265 -20304 19115 7424 -25018 3747 17313 -17137 -6998 20581 -9550 -20877 17645 7791
277 7791 -25246 2833 18237 -17502 -10403 20862 -6591 -22431 13893 8084 -23410 2326 18368
290 18368 -17779 -12732 19684 -4674 -22230 12620 8027 -23803 1587 19818 -17066 -14471 20338
303 20338 -1902 -23460 9592 10009 -21036 1435 18863 -17157 -16078 19885 172 -21980 9854
316 9854 11686 -20420 -309 19303 -14948 -15987 21325 3815 -21834 7877 14463 -16055 -789
329 -789 18596 -13107 -13870 22993 6544 -20644 7301 15473 -14676 -805 21052 -9469 -13499
342 -13499 22837 8415 -19921 7133 18755 -11450 -1834 19985 -6694 -11509 23033 9996
354 9996 -19533 7293 20120 -11095 -2641 21512 -3324 -12216 20523 10422 -18776 6588 21218
367 21218 -9538 -5183 20296 -1845 -11984 19152 10077 -19474 5378 21383 -10195 -6902 20668
380 20668 -715 -15390 15781 10855 -18406 3688 20571 -10528 -10351 18114 -149 -15561 13100
393 13100 9417 -20003 1464 19546 -11404 -13039 16875 -201 -18328 9813 9542 -19449 -1423
406 -1423 17712 -12059 -15170 14370 -69 -18784 7198 8351 -20060 -3377 16788 -11978 -16616
419 -16616 13272 453 -21006 4306 9978 -18329 -6256 14263 -11446 -16888 12974 1757
431 1757 -20808 2714 10158 -17491 -6455 14660 -9992 -17507 12699 3651 -20588 2192 12044
444 12044 -15260 -7728 14742 -7175 -16080 12592 5451 -18629 2814 13617 -13979 -6996 17067
457 17067 -3846 -15379 12387 7788 -16288 4213 16666 -11798 -8043 17747 141 -13283
469 -13283 13000 9029 -15299 4353 18161 -9674 -7180 19021 1997 -13052 12869 11718 -13588
482 -13588 3431 18961 -7359 -7790 18970 4118 -12292 12039 12394 -12753 3089 18778 -6529
495 -6529 -8079 19197 5026 -13917 9794 13496 -11279 1349 18133 -6405 -9429 17832 6527
508 6527 -14303 7459 12605 -11141 98 17093 -5999 -10714 15921 5958 -15427 5552 12757
521 12757 -11188 -2832 15477 -5948 -12444 13853 5376 -16323 3124 11771 -11899 -4890 14007
534 14007 -6188 -13946 11566 4699 -17604 1376 12150 -12233 -8124 11998 -5516 -15089 9339
547 9339 4288 -18122 -806 11284 -12377 -9044 11919 -4911 -16560 8103 5084 -17561 -1224
560 -1224 11764 -11672 -10529 11889 -3361 -16224 7107 6026 -16591 -2241 12232 -10449 -10512
573 -10512 12064 -1830 -15872 7067 7943 -15368 -2357 12914 -8707 -10678 12106 623 -14304
586 -14304 7011 9313 -13337 -1960 13970 -6725 -10102 12935 2551 -13531 7027 11044 -11772
599 -11772 -1963 14873 -4585 -9662 13398 4939 -12514 6170 12367 -9642 -2108 15633 -2863
612 -2863 -9057 13525 6415 -11820 6084 13733 -8384 -2385 15724 -1485 -9226 13134 7834
625 7834 -11473 5145 14087 -7615 -3250 15581 -551 -9758 12168 7533 -12144 4111 14388
638 14388 -8020 -5559 14554 257 -10791 10282 8020 -12201 2102 13396 -7899 -6666 13237
651 13237 -132 -12262 8554 7263 -12979 575 12953 -7985 -8432 12173 27 -13227 6177
664 6177 7352 -12934 -1443 11581 -7885 -9692 10442 167 -14174 4903 6792 -12601 -3003
677 -3003 11229 -8278 -11355 9898 764 -14588 2772 7214 -12563 -4367 10249 -7232 -11944
690 -11944 9085 1318 -14330 2037 7334 -11781 -5096 10598 -6670 -12219 8364 2895 -14108
703 -14108 1450 8407 -10916 -5376 10864 -4943 -11616 8659 3757 -13214 1816 10068 -9650
716 -9650 -5455 11723 -2934 -11040 8905 5971 -11679 1785 11137 -7626 -5127 12299 -875
729 -875 -10187 9440 7106 -10927 1849 12235 -6485 -4971 12967 814 -9782 9271 8520
742 8520 -10016 1523 12964 -4807 -4911 12736 2098 -9782 8541 9395 -9189 935 12952
755 12952 -4364 -5804 12667 2781 -9742 7536 9643 -8492 -160 12677 -3478 -6747 11521
768 11521 3093 -10168 6102 9597 -8858 -1520 11997 -3552 -7508 10386 3520 -10831 4325
781 4325 9473 -8825 -2994 11304 -3418 -8744 8666 2929 -11791 2795 8865 -9786 -4726
794 -4726 10031 -3940 -10245 7732 2995 -12767 1136 8767 -9652 -6434 9478 -3675 -11036
807 -11036 6207 3081 -12807 -54 8557 -9296 -7095 8710 -3403 -11673 5855 3739 -12597
820 -12597 -1253 8855 -8510 -8090 8771 -2389 -11807 5078 4560 -12130 -1487 9267 -7494
833 -7494 -7995 8796 -1168 -11204 4834 5755 -10808 -1626 9757 -5980 -7754 9079 620 -10425
847 -10425 4827 6446 -9662 -1116 10701 -4936 -7456 9312 2260 -9592 4970 8114 -8226
860 -8226 -1317 11220 -2852 -7061 9792 3848 -8950 4884 8965 -7255 -1048 11589 -2151
873 -2151 -6387 9841 5182 -8596 4729 9973 -6236 -1816 11761 -606 -7244 9702 5867
886 5867 -8777 3616 10097 -5730 -2593 11251 -753 -7550 8933 6122 -8970 2543 10142
899 10142 -5880 -3573 11172 -608 -8515 7463 5774 -9096 1087 9340 -6246 -4917 9616
912 9616 -675 -9219 5862 5576 -9738 -218 8967 -6023 -6277 8562 -777 -10244 4393 5303
926 5303 -9805 -1592 8233 -6253 -7407 8015 -440 -11057 3560 5240 -9936 -2950 8076
939 8076 -5783 -7929 6849 42 -11062 2137 5901 -9549 -3467 7453 -5129 -8465 6758
952 6758 546 -10920 2024 6033 -9232 -3993 8066 -4316 -8667 6514 1640 -10775 1596
965 1596 7227 -8493 -4244 8164 -3350 -8164 6862 2664 -9793 1928 7815 -7094 -3812
978 -3812 9202 -1960 -7909 7169 4120 -9179 1640 8614 -5786 -4071 9169 -884 -7397
991 -7397 7363 5333 -8342 2037 9548 -4897 -3618 9853 719 -7405 6982 6481 -7345 1575
1005 1575 10138 -3918 -4192 9790 1565 -6898 6669 7342 -7232 860 10392 -3118 -4398 9528
1019 9528 2020 -7228 5747 6931 -6860 -94 10033 -3051 -5209 8684 2376 -7442 4901
1032 4901 6808 -7555 -961 9439 -2686 -6430 7771 2130 -8379 3672 6682 -7540 -2343
1045 -2343 8491 -2881 -7175 6401 1916 -9167 2431 6264 -7830 -3465 8371 -2854 -8240
1058 -8240 6007 2408 -10011 791 6567 -7544 -4657 7407 -3019 -8838 4876 2330 -9712
1071 -9712 144 6203 -7479 -5067 7364 -2769 -9131 4447 3066 -9467 -375 6843 -7400
1084 -7400 -5624 7177 -1648 -9173 4204 3720 -9085 -542 6881 -6096 -5746 7215 -492 -8618
1098 -8618 4187 4344 -8355 -741 7519 -4964 -5770 7546 421 -8206 4144 5713 -7475 -495
1112 -495 8373 -3448 -5282 7837 1675 -7531 4239 6874 -6216 -1019 8769 -2545 -5356 8072
1126 8072 2834 -7233 4153 7324 -5638 -831 9191 -1768 -4855 7881 3753 -6856 3600
1139 3600 7966 -5205 -1200 9287 -1124 -5447 8186 4369 -7000 2650 8302 -4928 -1961
1152 -1961 8900 -706 -5975 7065 4221 -7451 2204 7801 -5021 -2828 8298 -545 -6767 6206
1166 6206 4240 -7415 1363 7488 -5273 -4095 7580 -644 -7101 5074 4326 -8420 -91 7237
1180 7237 -4681 -4973 6822 -799 -8105 4052 4182 -7985 -1252 6591 -4907 -5789 6350 -806
1194 -806 -8293 2829 4243 -8246 -2109 6662 -4738 -6499 5627 -283 -8871 2472 4393 -7790
1208 -7790 -2290 6403 -4417 -6752 5233 346 -9081 2091 5111 -7413 -2958 6761 -3691 -6715
1222 -6715 5501 1380 -8045 1876 5647 -6775 -3085 7060 -2470 -6963 5694 2290 -7835 2067
1236 2067 6348 -5958 -2891 7548 -1511 -6247 5819 3614 -7165 1814 7174 -4788 -2954 7749
1250 7749 -410 -5758 5960 4244 -6256 1910 7775 -3864 -2890 8084 447 -5658 5787 5113
1264 5113 -5957 1265 7892 -3160 -3110 7787 1352 -5720 5492 5415 -5580 790 8353 -3079
1278 -3079 -3794 7691 1608 -5948 4599 5671 -5917 -209 7578 -2924 -4432 7330 2015 -6474
1292 -6474 3943 5432 -5918 -792 7423 -2471 -5020 6284 1875 -6892 2655 5475 -5818 -2190
1306 -2190 6930 -2898 -6261 5713 1626 -7429 1713 4759 -6306 -2753 6382 -2796 -6715 4969
1320 4969 1418 -8022 1101 5069 -6143 -3808 5961 -2822 -7069 4327 1812 -7966 29 5404
1334 5404 -6340 -4050 5911 -2343 -7357 3880 2361 -7766 -531 5595 -5528 -4530 5514 -1333
1348 -1333 -7161 3889 2962 -7333 -531 5866 -5016 -4301 5938 -583 -6861 3490 3662 -6838
1362 -6838 -591 6413 -3555 -4128 5941 695 -6407 3713 4533 -6033 -606 7005 -2833 -3846 6669
1377 6669 1429 -6154 3577 5382 -5326 -582 7297 -2206 -3651 6822 2146 -5836 3691 5856
1391 5856 -4613 -838 7386 -1054 -4077 6445 2659 -5548 3177 6529 -4513 -1083 7541 -1062
1405 -1062 -4370 6108 2834 -5860 2942 6581 -4395 -1655 7366 -643 -5101 5454 3129 -5978
1419 -5978 1804 6154 -4265 -2690 6820 -545 -5359 4600 3391 -6238 847 5821 -4176 -3258 6258
1434 6258 -571 -5923 3867 3092 -6468 -67 5813 -4414 -4216 5671 -544 -6825 2885 3224 -6650
1449 -6650 -745 5273 -4168 -4712 4836 -495 -6856 2319 3024 -6486 -1422 5172 -4006 -5361 4836
1464 4836 125 -7150 1802 3427 -6664 -1333 5299 -3467 -5438 4827 421 -6789 1668 3720
1478 3720 -6009 -2241 5596 -3038 -5476 4627 1537 -6395 1465 4349 -5425 -2039 6032 -1935 -5210
1493 -5210 4668 2088 -6159 1904 5093 -4680 -2172 6466 -1303 -5053 5122 2942 -5642 1617 5696
1508 5696 -3802 -2119 6336 -759 -4504 4970 3711 -5547 1518 6259 -3165 -2245 6443 197 -4587
1523 -4587 4981 4108 -4963 1147 6334 -2766 -2085 6305 781 -4715 4478 4449 -4557 653 6417 -2523
1539 -2523 -3104 6351 1308 -4959 3815 4393 -4876 179 6156 -2389 -3456 5617 1089 -5346 3143
1554 3143 4575 -5069 -811 6068 -2604 -3946 5054 1265 -5629 2244 4443 -4961 -1315 5535 -2524
1569 -2524 -4668 4412 883 -6097 1407 3764 -5325 -2412 4679 -2589 -5087 4030 1120 -6628 813
1584 813 3998 -5002 -2895 4690 -1986 -5903 3201 1334 -6408 418 4130 -4947 -3410 4656 -1417
1599 -1417 -5791 3020 1639 -6300 -214 4399 -4133 -3212 4522 -1198 -6125 2687 2475 -5871 -186
1614 -186 4642 -3767 -3783 4736 -50 -5493 2780 3035 -5194 -398 5096 -3072 -3428 5152 225 -5133
1630 -5133 2747 3724 -4662 -380 5884 -2070 -3197 5332 1033 -4598 3176 3997 -4129 -202 5910
1645 5910 -1503 -3425 4986 1696 -4314 2945 4821 -3656 -611 6155 -1209 -3315 5065 2256 -4514
1660 -4514 2363 4982 -3603 -972 6032 -564 -3453 4722 2380 -4378 1860 4905 -3779 -1369 5561
1675 5561 -656 -3846 4177 2653 -4679 1361 5094 -3804 -1937 5015 -630 -4648 3510 2700 -4787
1690 -4787 724 4735 -3627 -2754 4696 -596 -4791 3037 2731 -4998 -39 4402 -3216 -3207 4109 -378
1706 -378 -5428 2346 2824 -5475 -875 4114 -3395 -3758 3787 -344 -5509 1869 2450 -5039 -1543 4044
1722 4044 -3145 -4255 3847 -179 -5381 1547 2866 -4952 -1590 4160 -2653 -4151 3739 361 -5486
1737 -5486 1433 3053 -4536 -1443 4474 -2658 -4261 3683 1002 -4861 1386 3835 -4091 -1823 4492
1752 4492 -1472 -4317 4204 1804 -4902 1495 3933 -3669 -1609 5060 -1022 -3855 3985 2366 -4942
1767 -4942 1462 4574 -2962 -1670 5017 -149 -3602 3622 2928 -4070 938 4884 -2231 -1598 5227
1782 5227 358 -3434 3546 2986 -3511 937 4797 -2120 -2084 4934 602 -3329 3487 3222 -3615 752
1798 752 4869 -2024 -2315 4713 876 -3973 2663 3389 -3518 -69 5032 -1944 -2778 4649 764 -4161
1814 -4161 2244 3281 -3725 -670 4464 -1939 -2972 3562 846 -4413 1602 3100 -4017 -1250 4149
1829 4149 -1773 -3609 3335 765 -4714 848 3025 -4009 -1920 3885 -2030 -4018 2777 1075 -5004
1844 -5004 495 2974 -3715 -2214 3429 -1224 -4243 2585 887 -4906 -3 3490 -3771 -2689 3573
1859 3573 -1066 -4387 2333 1185 -4555 131 3423 -3442 -2919 3667 -700 -4208 2355 1795 -4474
1874 -4474 -233 3576 -2938 -2745 3536 -240 -3918 2520 2147 -4004 -162 3766 -2425 -2551 3611 427
1890 427 -3760 2609 2487 -3501 76 4241 -1703 -2292 3792 922 -3535 2538 3320 -3130 -539 4445
1906 4445 -1158 -2308 4245 1679 -3353 2411 3576 -2770 -252 4446 -661 -2732 4193 1486 -3358
1921 -3358 1884 3690 -2665 -739 4747 -601 -2800 3650 1781 -3311 1359 3713 -2488 -979 4541
1936 4541 -468 -2887 3108 2058 -3179 834 3686 -2739 -1767 3938 -821 -3332 2634 1656 -3643
1951 -3643 566 3664 -2608 -2228 3353 -636 -3857 2277 1741 -4024 0 3058 -2596 -2189 2984 -816
1967 -816 -4025 1522 1716 -3937 -610 3158 -2717 -2844 3291 -654 -4331 1349 1894 -4033 -937 3313
1983 3313 -2598 -2851 2891 114 -4518 1297 2108 -3813 -1120 3059 -2234 -3033 2484 101 -4106 925
1999 925 2218 -3397 -1225 3454 -2022 -3090 2845 845 -3844 1160 2871 -2953 -1181 3627 -1083
2014 -1083 -2925 2722 1242 -3405 876 3167 -2474 -815 3951 -641 -2716 2892 1496 -3091 1141
2029 1141 3456 -2179 -1116 4228 -90 -2692 2907 2083 -2919 1200 3508 -1949 -1358 3986 186
2044 186 -2473 2691 2377 -2660 724 3421 -1635 -1373 3998 537 -2901 2434 2263 -2760 412 4009
2060 4009 -1844 -1846 3699 394 -2905 2411 2463 -2889 -113 3510 -1429 -2059 3102 416 -2895 2009
2076 2009 2369 -2842 -646 3442 -1777 -2573 2807 324 -3547 1546 2134 -3147 -957 3452 -1433 -2920
2092 -2920 2500 381 -3698 1120 1993 -3257 -1022 2656 -1377 -3057 1835 528 -3888 448 2247
2107 2247 -3154 -1804 2894 -1312 -3211 1966 901 -3914 196 2085 -3237 -2049 2811 -1032 -3437
2122 -3437 1730 1249 -3490 116 2562 -2574 -1554 2626 -483 -3220 1896 1367 -3256 132 2662
2137 2662 -2272 -1638 2878 -121 -3169 1786 1441 -3076 192 2928 -2050 -2033 2789 436 -3075 2268
2153 2268 2386 -2389 73 3325 -1285 -1574 3190 510 -2347 2073 2943 -2486 99 3603 -886 -1682
2169 -1682 3156 951 -2765 1862 2521 -2332 -116 3646 -920 -1626 2935 1149 -2851 1786 2642 -1958
2185 -1958 -492 3414 -661 -2044 2836 1142 -2552 1136 2693 -2017 -790 3044 -409 -2564 2237
2200 2237 1119 -2730 901 2639 -2107 -1370 2981 -462 -2565 2217 1214 -3057 355 2353 -2080
2215 -2080 -1755 2838 -573 -2759 1559 1186 -3191 185 2135 -2301 -1988 2361 -309 -2755 1296 1090
2231 1090 -3375 -226 2258 -2205 -2418 2141 -645 -3358 1365 1441 -3099 -579 2182 -2061 -2303 2572
2247 2572 -477 -3152 1272 1580 -2824 -663 2628 -1611 -2195 2260 -63 -3051 1085 1738 -2578 -721
2263 -721 2485 -1583 -2110 2199 431 -2984 1394 2091 -2536 -914 2878 -925 -2079 2494 700 -2896
2279 -2896 1326 2323 -2162 -764 3062 -188 -1880 2607 1353 -2302 983 2857 -1890 -796 2989
2294 2989 -79 -1820 2278 1410 -2145 903 2942 -1190 -619 3125 177 -1954 2456 1908 -2086 482
2310 482 2820 -1295 -878 2981 206 -1809 1975 1724 -2055 632 2761 -1227 -1063 2821 146 -2235
2326 -2235 1594 1534 -2287 461 2926 -1500 -1301 2664 135 -2453 1237 1819 -2551 -233 2201 -1474
2342 -1474 -1646 2354 139 -2816 881 1469 -2566 -756 2500 -1450 -2135 2219 17 -2773 473 1574
2358 1574 -2480 -865 2046 -1382 -2517 1582 181 -2966 453 1892 -2495 -1195 2106 -1473 -2492
2373 -2492 1341 318 -2929 257 1934 -2323 -955 2159 -954 -2665 1490 1075 -2769 175 1870
2388 1870 -2035 -1127 2287 -605 -2397 1898 986 -2687 278 2250 -1577 -1399 2433 -178 -2113 1462
2404 1462 1071 -2219 182 2267 -1567 -1404 2562 69 -2144 2020 1772 -1944 285 2714 -1118 -1493
2420 -1493 2557 246 -2138 1675 2072 -1973 7 2353 -564 -1128 2548 678 -2248 1585 2290 -1710
2436 -1710 -79 2732 -796 -1325 2321 838 -2024 1236 2262 -1694 -321 2727 -555 -1542 2388
2451 2388 1259 -2408 1123 2262 -1741 -363 2825 -695 -1959 1886 1104 -2511 632 1939 -2031
2466 -2031 -720 2589 -614 -2203 1499 791 -2768 151 1752 -1771 -1402 2322 -506 -2439 1397
2481 1397 1102 -2462 -35 1873 -1806 -1363 1848 -445 -2274 1119 617 -2662 -169 1659 -2005 -1765
2497 -1765 1793 -850 -2444 949 860 -2421 -523 1939 -1623 -1543 2070 -179 -2455 820 1434 -2201
2513 -2201 -492 2279 -1636 -1728 2028 132 -2241 804 1397 -2062 -432 2367 -931 -1762 2042 403
2529 403 -2289 866 1732 -2061 -102 2342 -867 -1462 1847 492 -2179 1028 2020 -1812 -382 2843
2545 2843 -694 -1476 2316 956 -1804 961 2339 -1354 -510 2869 -137 -1507 1830 1018 -1896 965
2561 965 2393 -1206 -502 2715 -259 -1688 1977 1265 -1888 577 2120 -1560 -781 2437 -195 -1689
2577 -1689 1767 1513 -2333 327 2339 -1469 -804 2458 -388 -1618 1561 1234 -1860 189 2245 -1470
2593 -1470 -1205 2021 176 -2105 1104 1267 -2146 -121 1949 -1180 -1498 1819 -81 -2313 771 1224
2609 1224 -2218 -456 1757 -1104 -1517 1306 175 -2424 768 1342 -2318 -480 1808 -1139 -1681 1647
2625 1647 264 -2536 534 1310 -2061 -894 2094 -919 -1866 1444 450 -2620 563 1420 -1970 -1000
2641 -1000 1894 -870 -2042 1480 710 -2289 212 1690 -1975 -1027 2022 -446 -1743 1444 605 -2236
2657 -2236 255 1828 -1527 -980 2460 -428 -1644 1578 1033 -1925 329 1986 -1283 -1125 2221 243
2673 243 -1650 1818 1165 -1816 432 1843 -1015 -1026 2387 157 -1996 1795 1505 -1765 489 2134
2689 2134 -571 -1040 2294 278 -1629 1278 1601 -1486 -81 2361 -601 -1164 2238 663 -1584 1281
2705 1281 1695 -1427 -168 2173 -788 -1228 2093 896 -2055 1206 1617 -1687 -227 2081 -722 -1608
2721 -1608 1663 414 -2058 736 1731 -1716 -651 1810 -863 -1761 1317 256 -2282 641 1531 -1952
2737 -1952 -905 1618 -919 -2126 1304 406 -2235 35 1273 -1734 -1077 1543 -554 -2257 918
2752 918 994 -2266 -11 1560 -2029 -1374 1621 -344 -2218 1387 667 -2430 -94 1235 -1808 -1237
2768 -1237 1626 -121 -2086 921 729 -1996 96 1718 -1244 -1563 1913 63 -2013 790 1177 -1852
2784 -1852 -157 1810 -1258 -1540 1753 473 -1948 1245 1320 -1498 -233 1919 -863 -1252 1860 695
2800 695 -1663 814 1566 -1394 -196 1923 -507 -1188 2082 741 -1522 972 1865 -1293 -102 2458
2816 2458 -322 -1412 1559 869 -1680 854 1860 -1082 -352 2457 -103 -1455 1640 1092 -1685 788
2832 788 1671 -1349 -876 2071 -194 -1576 1537 1483 -1802 625 1794 -1251 -721 1951 -102 -1865
2848 -1865 1397 770 -1831 428 1674 -1031 -898 1515 -21 -2183 1255 1026 -1930 29 1730 -1503
2864 -1503 -1269 1910 -35 -2330 827 878 -1977 58 1492 -1217 -1312 1672 -135 -1943 624 979
2880 979 -1846 -575 1650 -1033 -1450 1243 -341 -2133 513 1023 -1850 -830 1523 -942 -1580 1236
2896 1236 632 -2188 576 1414 -1693 -529 1586 -959 -1395 1480 451 -1893 389 1558 -1692 -886
2912 -886 1661 -586 -1630 1337 408 -1846 499 1436 -1405 -399 1906 -532 -1375 1599 855 -1625
2928 -1625 419 1824 -914 -601 2109 3 -1479 1800 868 -1785 377 1814 -946 -707 2091 -204
2944 -204 -1193 1222 1185 -1712 522 1977 -811 -792 1903 487 -1875 1131 1386 -1327 83 2214 -974
2961 -974 -959 1701 -89 -1475 903 1434 -1602 -6 2011 -802 -950 1560 487 -1593 817 1244
2977 1244 -1415 -292 1881 -650 -1242 1339 135 -1635 519 1374 -1579 -613 1853 -641 -1562 1180
2993 1180 303 -1758 294 1309 -1606 -832 1378 -463 -1591 963 464 -1920 291 1328 -1442 -943
3009 -943 1533 -715 -1739 829 638 -1987 80 1163 -1700 -845 1427 -441 -1613 843 425 -1751
3025 -1751 -124 1432 -1673 -1063 1174 -416 -1945 833 727 -1933 1 1390 -985 -1184 1312 261
3041 261 -1854 1072 1094 -1530 102 1664 -946 -684 1533 228 -1420 1162 1305 -1336 107 1793
3057 1793 -582 -1215 1485 200 -1446 958 1503 -1285 -50 1746 -437 -982 1872 425 -1447 951
3073 951 1285 -1333 -416 1817 -130 -1121 1724 229 -1191 771 1404 -1019 -18 1816 -204 -1121
3089 -1121 1291 765 -1563 532 1560 -1176 -126 2009 -83 -991 1460 735 -1342 566 1578 -1072
3105 -1072 -615 1476 -256 -1507 1105 573 -1521 325 1413 -1064 -810 1419 -339 -1413 927 814
3121 814 -1465 120 1386 -1175 -1239 1409 -427 -1753 711 638 -1540 -313 1277 -1151 -1184 1452 -165
3138 -165 -1903 423 640 -1736 -253 1302 -644 -1089 898 94 -1591 637 809 -1495 -733 1340
3154 1340 -1002 -1291 996 157 -1727 765 1027 -1581 -754 1290 -659 -1226 1458 149 -1609 719
3170 719 1214 -1177 -345 1666 -409 -1133 1320 533 -1517 347 1266 -1208 -392 1409 -174 -998 1369
3187 1369 840 -1403 387 1376 -1254 -168 1765 -150 -1482 1158 951 -1061 366 1447 -925 -285
3203 -285 1882 24 -1118 1312 1111 -1539 344 1375 -802 -410 1783 -2 -1222 1124 1056 -1510
3219 -1510 51 1597 -623 -583 1707 137 -1421 848 1180 -1213 -206 1452 -597 -1009 1377 -85
3235 -85 -1242 843 922 -1471 -94 1570 -923 -980 1296 90 -1323 454 894 -1401 -336 1291 -990
3252 -990 -1134 1175 36 -1663 384 1058 -1442 -876 1161 -560 -1243 697 271 -1508 212 1080 -1410
3269 -1410 -774 1505 -579 -1402 807 471 -1516 81 1176 -1306 -886 1090 -412 -1455 595 470
3285 470 -1540 49 1175 -1220 -625 1558 -362 -1500 635 870 -1384 246 841 -1180 -677 1529
3301 1529 10 -1616 1301 898 -1301 -197 1605 -829 -896 1140 -45 -1426 1086 1036 -1170 4
3317 4 1228 -468 -845 1420 322 -1109 726 1099 -907 -156 1281 -376 -927 1479 574 -1144 803
3334 803 1333 -591 9 1190 -718 -604 1282 505 -1162 962 1226 -1109 49 1216 -356 -824 1398
3351 1398 635 -1059 520 1192 -854 -370 1178 -252 -984 1258 516 -1107 584 1029 -882 -452 1045
3368 1045 -549 -936 945 731 -1229 266 783 -792 -558 1226 -286 -1255 794 447 -1408 2
3384 2 1517 -751 -952 1283 -264 -1350 664 289 -1129 -224 843 -704 -955 929 -332 -1371 405
3401 405 524 -1670 -240 928 -888 -766 974 21 -1280 395 927 -1314 -208 1098 -687 -1074
3417 -1074 843 57 -1199 281 701 -986 -461 920 -647 -1083 924 161 -1219 166 708 -866
3433 -866 -414 1100 -842 -906 1069 370 -1029 220 802 -973 -262 1022 -332 -877 1147 585 -1171
3450 -1171 367 1282 -619 -306 1658 -99 -1122 1083 789 -1043 217 1195 -670 -311 1322 -129
3466 -129 -1051 1118 571 -1194 246 1150 -542 -594 1073 104 -1097 892 697 -1200 7 955 -583
3483 -583 -725 948 -23 -1128 982 859 -1206 24 1206 -888 -473 715 200 -1387 602 854 -1023
3500 -1023 -383 1018 -807 -960 994 322 -1394 118 890 -1359 -64 988 -560 -1237 1068 31
3516 31 -1466 16 470 -1155 -399 700 -750 -880 796 316 -1180 105 814 -1193 -705 820 -449
3533 -449 -1115 684 -39 -1134 5 765 -923 -517 1276 -463 -1087 627 298 -1258 71 648 -832
3550 -832 -446 1137 -75 -1117 621 389 -1170 96 826 -957 -473 943 -84 -813 894 676 -870
3567 -870 52 778 -810 -389 1010 -45 -987 756 611 -1130 210 1078 -713 -521 1305 294 -1011
3584 -1011 667 706 -1057 -37 1089 -45 -567 1284 -42 -747 482 1007 -726 5 1609 -384
3600 -384 -550 1275 375 -791 631 893 -868 29 1067 -332 -817 760 234 -850 -12 959 -560
3617 -560 -179 1026 -301 -832 807 374 -1009 291 969 -848 -880 890 -462 -934 600 109 -1012
3634 -1012 144 634 -585 -741 830 -242 -797 751 434 -1207 130 754 -953 -840 1036 -100
3650 -100 -1216 320 131 -1052 126 891 -949 -728 1284 -308 -1041 381 108 -927 -209 741 -156
3667 -156 -783 652 -20 -1045 425 422 -844 -107 725 -440 -714 876 -26 -1117 411 473 -817 -211
3685 -211 844 -565 -687 671 11 -1054 455 613 -912 -21 837 -362 -800 739 216 -754 399
3702 399 1046 -929 -20 1110 31 -658 1175 416 -1101 436 990 -632 -140 1082 -53 -483 1086
3719 1086 612 -829 292 1018 -197 -417 1066 146 -973 774 687 -941 47 1138 -377 -213 923
3736 923 150 -632 681 510 -912 34 1083 -374 -394 1067 -76 -794 715 377 -664 -150 932
3753 932 -413 -897 884 -224 -842 509 543 -820 -233 746 -594 -847 452 -39 -1062 644 535
3770 535 -744 -263 972 -295 -571 543 0 -1126 121 354 -916 -15 868 -435 -725 587 127
3787 127 -1052 331 811 -800 -370 591 -857 -899 750 266 -1018 132 614 -772 -511 829 -457
3804 -457 -1134 620 280 -896 459 613 -788 -603 606 -298 -932 705 557 -1241 183 733 -775
3821 -775 -422 712 -78 -603 689 281 -1035 -19 818 -640 -270 881 -76 -608 682 394 -807
3838 -807 108 719 -335 -475 1076 -6 -575 569 607 -510 126 1139 -682 -520 970 135 -660 864
3856 864 647 -783 305 1173 -449 -124 858 157 -628 161 549 -666 59 825 121 -485 534 192
3874 192 -842 162 782 -725 -348 930 -149 -962 555 454 -859 210 555 -1020 -222 912 -237
3891 -237 -751 579 86 -944 260 266 -715 -290 721 -337 -856 464 263 -948 195 490 -878 -373
3909 -373 692 -335 -736 510 359 -912 235 904 -646 -347 973 -380 -1170 334 258 -861 -250
3926 -250 655 -748 -730 647 -188 -805 553 332 -597 -275 538 -600 -420 861 -312 -883 607 413
3944 413 -848 -266 739 -144 -562 646 199 -821 446 653 -743 70 997 -129 -720 1110 320
3961 320 -741 216 654 -498 -373 1198 -285 -430 699 312 -680 236 562 -556 -320 644 -423 -336
3979 -336 672 483 -1055 311 485 -620 -221 660 220 -753 635 371 -806 129 835 -761 -159 691
3997 691 -279 -521 508 371 -841 142 629 -759 -203 741 -60 -643 357 154 -689 332 716 -442
4015 -442 -296 795 -14 -568 477 466 -666 -201 566 -457 -655 730 -184 -604 327 319 -790 -304 493
4034 493 -381 -465 813 55 -791 293 515 -735 -258 635 -348 -647 386 -7 -1033 127 255 -833
4052 -833 -116 560 -601 -849 488 -49 -949 443 731 -735 16 795 -668 -618 635 24 -748 185
4070 185 659 -491 -124 803 -134 -745 631 278 -743 284 487 -1001 -316 857 16 -423 691 321
4088 321 -697 411 924 -356 -182 700 206 -823 528 643 -452 512 996 -100 -301 797 -89
4105 -89 -703 170 264 -420 409 1138 4 -193 777 67 -676 429 313 -354 -65 639 -318 -442 521 113
4125 113 -494 666 504 -364 -80 543 -145 -333 630 424 -500 285 468 -317 117 430 -129 -490 675
4144 675 56 -767 152 756 -735 -346 685 -658 -534 507 -48 -660 440 691 -855 -53 548 -294
4162 -294 -730 433 81 -1027 59 466 -416 -465 709 -12 -480 583 263 -881 -123 593 -956 -367
4180 -367 779 -140 -884 249 218 -968 -125 416 -806 -634 609 -177 -828 292 25 -729 -190 556
4198 556 -473 -400 644 45 -482 280 448 -524 64 642 -402 -277 554 33 -738 278 243 -442 140
4217 140 1076 -255 -363 642 286 -583 512 595 -702 -305 762 -161 -451 976 102 -874 146 786
4235 786 -287 -245 586 -118 -507 309 112 -522 323 605 -512 -109 936 126 -532 898 125 -587 305
4254 305 639 -693 -179 609 -386 -454 833 216 -804 285 432 -405 -424 713 -130 -328 482 -65 -692
4273 -692 205 757 -417 -40 447 -84 -408 586 179 -744 -9 313 -859 -323 770 193 -988 425
4291 425 293 -825 -237 528 -589 -615 457 183 -579 133 297 -652 -54 509 -370 -653 392 -255 -723
4310 -723 209 456 -784 -82 552 -300 -685 498 114 -798 454 563 -413 -120 428 -233 -711 462 108
4329 108 -417 268 532 -915 -314 921 25 -327 812 266 -515 144 827 -541 -189 384 -332 -605 484
4348 484 433 -637 -115 295 -562 -490 768 -79 -626 656 214 -598 272 761 -421 -170 901 96 -554
4367 -554 501 621 -565 155 662 -265 -388 678 -70 -417 385 653 -820 -125 853 -315 -379 696
4385 696 195 -668 507 260 -586 -38 601 -400 -468 759 -72 -619 231 393 -736 186 542 -195 -570
4404 -570 359 -143 -588 431 335 -663 -124 405 -339 -462 515 51 -498 407 489 -497 -374 461 -383 -578
4424 -578 324 47 -837 231 341 -472 -330 485 -392 -585 708 28 -516 93 330 -774 -430 361 -86
4443 -86 -440 248 174 -431 -301 335 -299 -432 375 -94 -686 756 191 -471 -45 127 -686 -413 326 -197
4463 -197 -471 591 431 -697 -78 596 -551 -57 612 243 -427 106 222 -574 2 879 -44 -137 927
4482 927 67 -373 408 588 -459 13 601 -326 -2 486 -34 -345 -208 876 -594 -24 789 22 -378
4501 -378 695 258 -500 95 586 -499 56 642 -68 -612 604 59 -301 499 453 -337 33 820 -255
4520 -255 -183 660 445 -505 219 402 -364 -174 539 -118 -450 399 398 -394 107 522 -275 -206 600 214 -516
4541 -516 265 145 -520 -180 404 -522 -551 627 65 -469 498 613 -580 65 517 -612 -459 244 140
4560 140 -480 -116 180 -562 -56 276 -415 -361 503 26 -589 454 506 -472 -105 551 -517 -448 361 20
4580 20 -344 117 391 -776 -144 659 -310 -441 653 -69 -856 129 404 -577 -210 492 -137 -201 700 41
4600 41 -649 -129 294 -385 -428 418 -145 -434 102 224 -394 413 612 -346 -268 692 68 -427 398 598 -467
4621 -467 170 402 -291 -52 913 -49 -527 412 547 -500 35 533 -351 -21 526 116 -713 685 419
4640 419 -536 79 550 -247 -125 735 145 -344 67 309 -554 62 578 -531 -242 366 -139 -786 324
4659 324 513 -373 208 448 -96 -389 566 125 -635 314 138 -432 88 470 -65 -563 789 -85 -647 175
4679 175 274 -398 -148 667 -333 -585 409 150 -567 -51 493 -753 -256 169 -341 -337 644 114 -528 214
4699 214 388 -345 19 522 -293 -790 54 -39 -603 133 392 -134 -375 298 128 -904 267 67 -524 -82
4719 -82 430 -55 -243 474 45 -624 330 90 -185 140 306 -409 -445 396 0 -591 179 412 -453 92 503
4740 503 -388 -192 313 -45 -436 544 426 -578 71 346 -272 -300 484 112 -310 225 564 -253 -191 337
4760 337 145 -215 407 251 -426 238 197 -368 67 445 -261 -263 465 471 -385 183 360 -343 155 250 -223 -417
4782 -417 350 76 -397 267 209 -363 -287 308 -104 -353 266 166 -566 -41 217 -266 -149 526 -84 -348 567
4803 567 152 -226 -127 367 -452 -146 275 -44 -545 407 358 -369 -57 319 -477 -149 549 -162 -628 354 223
4824 223 -311 108 86 -396 -502 403 -4 -376 21 88 -542 -130 408 -198 -557 629 127 -608 120 183 -402
4845 -402 -129 167 -168 -439 541 437 -356 98 415 -562 -3 530 -152 -467 262 -10 -554 165 725 -355
4865 -355 5 348 27 13 421 -54 -636 174 121 -297 -25 479 71 -627 461 87 -585 308 318 -389 22
4886 22 672 114 -220 544 134 -333 10 524 -26 -356 332 255 -450 300 338 -524 195 601 -260 -422 499
4907 499 -378 -409 40 250 -543 -165 532 -285 58 603 38 -428 62 117 -381 -187 302 -212 -302 545 -119
4928 -119 -533 65 310 -292 -169 289 -556 -408 259 81 -529 90 246 -227 70 201 -117 -404 182 11
4948 11 -432 60 279 -244 -259 277 -240 -158 68 -86 -318 31 383 -353 -206 436 -382 -365 289 226 -186 -292
4970 -292 363 -564 -156 217 49 -504 610 114 -572 71 382 -265 -617 277 -114 -332 4 378 -447 -22
4990 -22 288 -228 -95 733 152 -617 369 394 -489 80 612 -168 -115 503 -28 -770 102 413 -134 -233 245
5011 245 -227 -379 458 121 -560 431 426 -341 -131 636 -386 -352 416 34 -399 315 222 -193 121 410 -497
5032 -497 -452 307 132 -25 105 176 -140 -156 402 -149 -315 503 64 -329 -43 133 -153 -11 415 -4 -359
5053 -359 275 335 -522 91 336 -386 142 450 -290 -341 269 83 -240 15 274 -394 -195 90 -61 -377 463
5074 463 158 -414 -109 418 -651 -400 291 -44 -350 -48 302 -246 -213 629 -97 -439 199 -120 -399 133
5094 133 268 -258 -107 136 -305 -107 354 -27 -399 74 94 -277 -119 278 -103 -306 657 -117 -284 284
5114 284 188 13 295 258 -363 -33 337 319 -309 141 236 -409 197 206 -321 -445 548 245 -321 335 328 -194 309
5137 309 237 -59 -437 409 185 -443 312 281 -324 -393 275 52 -295 435 107 -489 -66 458 -81 50 384
5158 384 -53 -244 190 216 6 -69 310 -52 -286 570 -358 -356 256 310 -264 199 229 -487 -293 506 -220 -67
5180 -67 112 305 -234 -30 138 -393 -301 342 -95 -469 191 -4 -413 32 283 -404 156 438 19 -299 210
5201 210 278 -447 -17 204 -368 -252 223 101 -393 204 26 -340 82 442 -170 -176 97 -167 -448 -187 147
5222 147 -282 -57 505 -184 -381 -142 9 -172 265 28 -184 -81 336 -10 -305 472 19 -459 104 393
5242 393 20 41 -15 -73 -300 312 285 -368 31 234 66 -93 255 307 -505 327 -20 -307 -108 172 -230 112
5264 112 238 -188 -176 110 157 -156 104 453 -15 -303 220 140 -469 117 328 -211 -8 353 -165 -118 287
5285 287 310 -160 171 108 -94 133 347 94 -152 384 387 -351 -95 255 -238 21 357 -97 14 259 72
5306 72 -100 297 341 -85 -180 484 -268 97 -47 -235 -389 186 134 -272 17 261 37 -379 -30 -147 -260
5327 -260 -115 23 -42 -626 181 -244 -350 218 105 -226 80 240 -310 -493 356 -108 -302 67 69 -486 -42
5348 -42 160 -86 -207 423 -125 -412 -69 -13 -494 121 405 -195 -281 315 25 -294 273 145 -402 -212 592
5369 592 -315 -239 566 635 -265 57 146 -143 -154 410 64 -149 -144 -5 -172 356 65 -577 -107 96 -45 70
5391 70 384 212 -364 -40 276 -306 -99 64 139 -139 228 17 -122 139 167 -544 164 420 -153 -182 480
5412 480 80 -229 162 312 -442 20 126 -187 -311 143 154 -173 189 435 -67 32 240 -23 -218 351 228
5433 228 -117 -22 448 49 49 19 -13 -114 126 86 -501 -150 22 -126 -141 196 282 -152 -112 -65 -431 -137 425
5456 425 -114 -320 516 61 -323 141 291 -475 -64 -41 -354 -132 -56 -66 -81 9 255 -137 131 2 -196 -234
5478 -234 261 41 -472 159 74 -264 -213 185 -462 47 521 73 -308 263 237 -142 -79 169 -86 -291 202
5499 202 149 -113 -83 182 -114 -104 434 -84 -300 288 92 -356 -56 436 -279 -148 202 273 59 232 163 -146
5521 -146 -2 234 -505 -339 505 -10 -96 -243 272 -152 203 306 -122 321 247 -75 -324 373 310 -563 -21
5542 -21 487 -41 -153 28 227 -179 205 0 -242 116 270 -120 -38 229 139 -396 64 159 65 114 419 -180
5564 -180 -219 169 -255 -165 -97 -100 -100 -138 91 29 -279 -227 -131 -129 101 229 -455 -38 79 24 -94 321 -74 -628 114
5589 114 9 -311 -170 128 -279 -476 214 117 -345 280 238 -288 -106 324 255 -276 175 -110 -164 -5 321
5610 321 -183 -172 156 10 -206 299 349 -244 -95 -26 143 -180 -105 54 -381 261 159 -90 164 315 -93
5631 -93 -109 635 -148 -95 -102 90 -37 -155 171 -68 90 513 -75 -175 141 86 -862 -112 215 92 -229 403
5653 403 127 -205 40 147 -64 77 288 -134 -240 94 22 -302 1 -32 -67 -399 187 33 -207 -46 -47 -373
5675 -373 249 35 -159 -321 225 -51 -254 182 154 -279 207 367 -209 -156 200 -219 10 -34 175 -571 36
5696 36 423 -201 -198 688 6 -129 298 178 -335 -146 219 -402 217 524 -142 -19 652 34 50 -35 67 -234
5718 -234 -390 207 11 -253 61 240 -334 -339 45 -141 -96 99 133 29 74 443 -363 50 285 -423 0 7
5740 7 -171 -334 -2 253 -36 232 330 -88 -227 155 -117 -186 25 267 -543 -58 298 89 -444 311 26
5761 26 -425 225 59 -262 -129 452 -40 -132 251 269 -321 243 502 -370 -29 81 -30 130 96 412 -138
5782 -138 -129 -76 -114 113 139 -77 -525 -56 59 -225 96 258 -275 -134 370 154 -125 389 329 -367 -57 301
5804 301 -99 -233 170 182 -77 -66 66 -463 -108 78 -272 -58 -230 55 -256 -284 -58 -232 -56 265 -390
5825 -390 -344 -77 232 -153 -148 109 -112 22 371 -77 18 640 -67 -127 58 113 -61 -57 111 -17 -188 74 251
5848 251 127 -62 -144 -67 -81 217 -29 -330 195 323 -495 -49 199 -201 -317 581 125 -403 344 252 -194
5869 -194 -67 364 -310 -148 296 -102 -329 242 212 -279 -82 33 -94 -355 -61 134 -324 -146 132 -135
5889 -135 128 194 -114 53 -116 96 -593 220 -79 -528 -87 393 82 -103 135 112 -396 79 1 -317 -4
5910 -4 85 -95 -16 -67 -58 -134 160 120 23 -91 370 160 -269 250 88 -155 282 412 -40 230 337 -26 -240
5933 -240 306 108 -400 39 33 -16 127 270 146 119 5 -130 -48 -171 405 -293 108 192 -145 -206 122 223
5955 223 -156 235 285 -56 65 131 -303 -144 -30 1 -211 260 252 -324 -268 57 -95 -285 271 177 -195 -135 38
5978 38 -59 2 260 -216 -335 50 72 -410 146 -125 -52 -182 -14 -153 -253 207 228 -56 -128 32 -70 -234
6000 -234 249 55 -193 83 384 -111 68 -35 -104 -53 73 260 30 -83 211 -130 -30 254 -287 99 293
6021 293 34 -134 -142 -6 84 143 435 185 150 198 158 -56 184 423 -90 -186 349 -151 -149 430 265 -275 -9
6044 -9 149 -23 217 119 -237 -142 378 32 -210 175 311 -105 -213 259 5 -173 287 70 -72 163 158 -281
6066 -281 -126 177 36 -173 100 243 -416 -176 294 278 -51 227 149 -268 219 -135 -103 -96 351 229 -367 -217
6088 -217 105 -479 82 -74 -378 -106 220 -182 -106 63 -190 98 58 49 -351 -207 241 160 40 191 84 82
6110 82 -246 326 -269 -148 19 -227 -202 242 -110 -295 18 204 -278 41 141 -306 -196 38 -53 114 73
6131 73 93 -144 142 109 -23 -84 123 45 -215 93 133 -118 -41 170 98 -179 -57 87 -341 107 37 -118 288
6154 288 95 -52 -355 -5 22 -282 213 19 6 149 15 252 -175 64 -20 -74 43 301 -279 -171 222
6175 222 5 -26 -35 75 68 -203 -29 -319 -322 -122 -177 92 102 201 -13 -190 -76 -301 29 -13 -80 -186 84 326
6199 326 -108 148 143 -78 -174 20 101 -295 -42 72 -64 20 28 91 -346 34 378 -127 195 -2 -80 28 -86
6222 -86 26 -136 -55 148 -169 12 199 -347 -38 309 -119 -40 167 -28 -181 -169 261 -65 83 -40 -193
6243 -193 -261 220 192 -112 -68 77 -193 -262 20 -125 -41 -28 305 -112 -9 206 -275 16 442 -81 -461 -2
6265 -2 223 -109 74 235 16 54 -79 -93 -105 152 186 -234 1 112 -1 -4 -94 90 -220 196 -25 -2 198
6288 198 170 -101 103 43 88 -21 -46 162 -244 159 296 -88 -281 -33 6 -109 -130 -115 93 -67 442 -159
6310 -159 212 215 -13 112 11 65 -380 -210 84 -272 -50 518 -91 -107 -52 386 -12 6 112 -126 -314 336
6332 336 43 -210 -128 4 -184 32 413 -140 -230 -26 195 237 214 191 -202 -171 411 61 -65 -52 -56 7 -63 124
6356 124 -242 -235 169 302 -120 540 91 -132 -152 104 176 -110 93 -57 -17 -243 31 -186 -197 -81 -252 -187
6378 -187 117 185 -109 334 171 -66 91 100 -224 -37 221 291 -269 82 6 -284 106 362 158 -63 58 114
6400 114 152 -102 146 -153 96 217 85 -408 50 -123 -204 -116 91 -26 54 25 260 -44 173 20 -210 78
6422 78 326 10 -184 120 -35 -220 -11 193 -41 52 94 -176 1 106 -301 41 251 276 -140 243 -92
6443 -92 -69 -12 158 25 -188 -3 -29 -28 -100 65 7 73 -144 -89 -140 107 190 -276 -97 181 -65 -260 109 169
6467 169 -189 -97 21 -4 81 -25 -146 162 83 -6 -9 69 49 -3 3 -113 128 -288 129 47 54 171 349 28 192
6492 192 -85 -243 -126 12 118 -184 -19 34 -31 -305 459 206 -216 242 -55 27 98 123 -53 84 36 136
6514 136 -130 -476 -213 -306 -93 336 84 19 171 -179 -180 154 95 -78 -119 96 -129 -25 80 117 94 121 -41
6537 -41 -293 -122 227 -285 -203 173 164 -288 -3 204 -34 -28 105 87 134 182 -114 -77 101 132 -80 -40 134 -185
6561 -185 -38 173 -18 -40 224 9 -365 -54 269 -121 -88 8 -224 85 51 301 8 -18 175 223 -164 21
6583 21 259 -226 164 465 -65 -363 297 -91 -220 -77 -34 -188 211 58 13 -117 18 199 0 276 212
6604 212 -170 45 385 -101 -53 90 103 -105 -45 -105 -239 447 -170 -32 102 113 76 -301 205 166 -82 158
6626 158 193 37 -185 132 -32 -208 101 163 -56 -258 22 131 -86 149 -31 106 -220 -163 -88 -124 -13 14
6648 14 -92 -133 199 -285 52 152 -256 55 207 36 139 192 36 63 34 -38 -19 23 53 100 80 -170 70 -165
6672 -165 -175 -53 -269 -73 17 -201 -135 128 -105 -31 120 -84 -57 -235 147 -54 -250 487 457 199 -81 284
6694 284 -162 102 272 260 -230 68 -216 -46 28 211 24 -384 70 -124 -234 -217 264 -23 171 175 164 -119
6716 -119 214 49 -148 155 55 -29 -288 164 90 -418 306 -16 -124 -132 131 -317 40 -58 -111 -207 40 72 -279
6739 -279 70 314 -122 -103 483 -287 -138 132 -57 -169 -321 -151 -279 -154 -369 -123 30 70 198 -67 109
6760 109 -86 61 -357 122 265 -244 -127 -179 292 67 -26 -44 -219 214 -384 -227 -16 49 22 -168 85 -16
6782 -16 -107 227 -100 -269 154 306 -108 -223 3 -82 -83 143 307 -17 174 -99 50 -128 214 -81 163 175
6804 175 193 -107 30 412 146 -14 -56 -170 -258 126 124 -258 -169 87 -76 64 336 -3 89 -77 246 -175
6826 -175 113 143 302 1 292 357 -200 47 251 128 -477 160 -219 -94 -300 146 -342 148 -128 -38 -232
6847 -232 -113 65 45 0 -5 -96 79 -47 -232 -164 -153 -176 -210 -24 29 227 218 89 83 100 -94 -122 29 -43 -23 77
6873 77 26 56 -67 -11 130 120 120 55 -201 -95 -337 -1 -354 167 71 -245 -205 -11 -227 50 -53 77 -88
6896 -88 -136 -133 -138 -187 105 -204 123 -74 348 59 -95 -108 -155 190 -195 -73 25 -124 105 239 -93 -165 -131 -163
6920 -163 -50 -6 193 53 43 298 18 1 33 -131 -6 -38 -36 47 76 -148 198 -70 -9 114 -283 200 -87
6943 -87 -234 31 148 -38 -168 -238 96 302 -92 -119 16 111 -296 -116 270 -22 -132 85 103 -185 -10 -120
6965 -120 197 14 45 79 -253 104 -129 -142 -403 -175 -162 -186 -21 -49 -47 -98 92 -148 -186 -100 -24 -309 78 126
6989 126 -219 98 83 -69 -191 188 -288 72 187 96 -16 -78 58 -99 -393 331 -193 20 109 -60 -315
7010 -315 -20 27 -293 201 138 -87 -125 59 -83 -170 82 115 -264 -109 166 -42 5 -119 107 -106 225 160
7032 160 -149 96 365 -111 25 -63 -106 37 237 158 193 -58 309 133 -126 -103 257 -267 -63 216 -274 11
7054 11 251 -177 165 338 3 -133 -167 248 223 -47 -88 255 190 -175 379 353 32 374 -80 3 -246 31
7076 31 -223 216 168 -63 30 -125 166 16 182 78 -150 -306 86 35 65 -107 76 -195 39 35 -114 203
7098 203 -219 16 -163 104 -94 197 -86 267 403 -124 141 -202 90 367 -105 -135 -26 106 -240 -12
7118 -12 259 -47 -63 88 49 -122 35 152 -174 -343 -161 -8 150 13 -30 -245 151 -241 9 -339 -165
7139 -165 81 -134 46 -190 -113 -229 77 -168 213 -152 -109 125 66 -56 2 128 97 -53 33 118 -112 0
7161 0 -198 115 -268 182 149 -3 -45 -181 -25 -359 -20 -95 -83 180 111 -62 -155 -132 50 -80 138 -29 -304
7184 -304 101 75 -113 14 14 141 -86 271 132 -66 107 -179 -260 -219 233 18 -135 23 69 -18 209 120 87
7207 87 224 71 -5 -109 -164 -5 -290 44 146 -116 27 261 200 80 212 -182 68 234 80 47 -63 212
7229 212 42 -243 -13 -240 193 8 439 -29 39 64 -358 -166 -97 186 -136 -72 205 83 -246 60 456
7250 456 105 178 358 112 169 86 -48 -199 -161 -190 123 -124 264 -81 -13 -39 -35 -251 15 -95 -153 53 19 -54
7274 -54 -82 140 -264 9 67 -220 72 -72 9 -44 -24 275 33 38 429 -344 -247 223 -263 -94 -18 136 152 34
7298 34 -76 81 64 -103 50 -130 -24 -9 -157 -168 -104 112 -118 -325 67 123 170 -40 137 -82 107 58 -187
7321 -187 54 36 -90 71 373 51 -273 58 -136 124 11 112 -162 -139 121 -14 -78 -3 103 -95 -48 10
7343 10 81 -244 59 385 -131 36 -240 5 -49 52 -52 -218 93 10 234 208 13 96 -81 208 -107 125
7365 125 -46 148 28 -90 205 162 25 109 -63 211 -148 -116 246 147 47 3 18 -11 -84 -113 10 62 -139
7388 -139 -65 -243 -275 -320 -205 10 -198 2 -196 17 97 31 -148 13 24 2 31 -16 223 -126 4 -7 -88 -249
7412 -249 39 81 -140 -97 -95 -2 -36 24 -38 184 33 -14 -292 -138 113 17 -122 113 128 167 -66 -237 -63 -218
7436 -218 0 -91 31 -54 -103 -5 -40 184 -206 9 128 -244 -316 32 166 -106 36 -190 125 89 143 295 -141
7459 -141 -143 -110 -205 311 -68 168 266 -12 15 -188 67 -188 213 64 50 -99 230 -35 97 8 271 14 -73
7482 -73 -102 -9 -67 -12 194 -44 189 -9 -156 98 -162 161 -63 46 186 104 -180 150 247 -105 26 -299
7504 -299 -70 -131 -20 76 36 92 94 -258 361 -212 271 -97 81 -194 -79 -58 -55 -159 125 156 -147 -124 44 -41
7528 -41 -311 290 120 -201 129 -35 -251 88 104 423 93 -220 17 -111 -12 225 -252 98 -23 3 49 339
7550 339 95 -4 -211 -58 93 -152 391 64 -123 -165 32 -204 -269 56 -66 1 -8 98 -47 56 -28 -176
7572 -176 -342 171 29 -435 16 329 138 -196 -195 -402 -41 247 -40 -33 85 13 -45 26 213 12 -89 211
7594 211 -293 -186 198 117 -241 -60 -175 -106 -194 209 76 -105 99 -145 -188 46 -50 -64 103 365 87 -119
7616 -119 150 95 138 -340 23 64 -7 102 -120 105 -142 -24 194 -206 24 82 -56 232 250 237 -111 -88 -241
7639 -241 -186 101 -128 -201 -203 -344 -38 512 -8 -542 -99 139 0 17 -182 78 247 71 230 -64 63 255
7661 255 194 -145 -38 311 -127 -45 -47 32 -18 277 -168 132 15 -118 88 116 -110 -123 -87 45 51 -98 -1 -19
7685 -19 -176 -34 186 8 84 -66 -62 -63 -91 -122 -46 -112 94 65 126 321 145 68 -45 145 -11 -24 374 176 9
7710 9 -71 3 -22 -116 93 -22 32 24 -204 275 227 -258 -84 -184 66 -112 96 243 210 153 302 42 -109 137
7734 137 33 -78 83 35 -234 -102 -93 18 -124 -44 -70 -67 27 -128 -21 -92 -121 -140 -234 78 17 -104 42 427
7758 427 162 -12 183 35 -81 -80 108 -68 -89 18 241 -57 125 81 -86 62 112 17 173 133 -14 25 24
7781 24 113 3 -6 230 -4 52 33 69 -305 92 101 116 -85 14 -204 -46 -46 -173 -154 -204 -27 187 -64 25 -98
7806 -98 -148 -55 -41 -189 -185 63 -97 265 -91 -32 442 -124 230 -263 152 187 34 78 93 163 -329 88 67 17
7830 17 180 397 88 -71 140 -46 -200 9 211 -138 -103 306 219 -199 -32 91 -19 244 62 -86 -131
7851 -131 447 271 -15 -192 118 -312 69 292 -254 -136 45 -95 -49 161 31 -20 -51 206 -308 -84 158
7872 158 122 -447 124 80 128 215 50 51 -121 42 -85 -188 330 61 -22 109 290 -91 -248 -113 40 23 -48
7895 -48 28 -112 54 427 201 -206 337 -184 -103 -88 -37 10 -210 116 -65 207 68 -58 -110 259 -102 7
7917 7 8 -23 3 88 -54 123 390 7 -119 26 185 319 61 -180 -107 39 -83 75 183 -200 104 -214 -56
7940 -56 -94 -15 96 -285 151 315 272 -223 92 260 -118 422 288 -96 285 84 62 -45 11 122 49 -221
7962 -221 0 220 -62 54 164 -1 206 -170 -85 -125 19 -145 75 240 -303 -2 72 280 40 278 201
7983 201 27 16 42 -317 222 13 3 -227 -72 154 -284 -235 39 321 132 152 115 -97 91 173 -20 125
8005 125 -154 75 -82 -68 -500 177 -209 -146 -65 62 82 -42 199 -76 132 160 -284 230 -47 -191 249 0
8027 0 -16 34 -13 -93 22 11 12 -84 41 83 20 -72 -105 -19 13 16 -40 293 -15 -122 -91 183 266 26 -199 -12 162
8054 162 -69 314 -160 91 -136 -29 -296 29 16 -3 171 -106 157 101 80 130 33 -26 -111 7 -286 -284 -12
8077 -12 476 -245 18 395 51 209 -19 159 71 181 14 -230 -48 -12 -50 49 40 -74 64 50 40 294 11
8100 11 57 -126 -204 -327 -277 148 302 -74 55 212 188 202 -36 -2 78 -53 -64 -40 -92 -32 -182 202 114 104 127
8125 127 -32 179 -219 325 114 -184 188 14 -308 68 38 -62 -149 -52 52 182 -230 185 174 47 -224
8146 -224 -1 -30 20 364 -75 47 -97 33 23 223 -122 -181 3 188 -414 198 56 -381 69 -57 -199
8167 -199 -211 281 53 -119 -412 167 116 -115 -48 276 136 -224 12 -57 16 -255 46 69 -32 153 -151 -258
8189 -258 305 -19
8191a9
$$ Imaginary data points
##PAGE= N=2
##DATA TABLE= (X++(I..I)), XYDATA
0 0 0 0 0 0 0 0 0 -5 8 -8 8 -8 16 -16 23 -24 31 -34 41 -48 57 -66 77 -88 103 -117 134 -150 172 -194 219
31 219 -245 274 -306 342 -382 424 -470 521 -578 640 -709 786 -869 964 -1070 1188 -1325 1482
49 1482 -1664 1879 -2137 2459 -2863 3395 -4128 5209 -6965 10304 -18929 86801 176465 7871
63 7871 -5903 24118 33878 50978 67994 -6922 -4063 93847 95149 -763 1880 32389 12880
76 12880 29442 59853 -2402 -24362 45991 42012 -27006 5763 48478 1218 -13305 21778
88 21778 -8482 -24408 29111 15370 -44913 -1417 47109 -5474 -28944 7566 -11106 -23449
100 -23449 27653 9716 -58885 -20125 42825 5541 -18344 9102 -17901 -40314 10648 9923
112 9923 -45346 -12210 36237 -7993 -28113 8249 -18303 -49794 3118 17466 -34548 -16121
124 -16121 22413 -22401 -40271 8826 -4291 -39978 -128 12135 -35213 -18664 15999 -26663
136 -26663 -35791 21595 7500 -38061 -3197 13284 -34020 -20717 21413 -12624 -26547 22583
148 22583 7575 -38483 -1911 23409 -20915 -16237 19268 -11520 -22243 28344 13370 -36487
160 -36487 -401 30544 -14382 -17363 18733 -5433 -17907 28666 17735 -30094 1049 30816
172 30816 -12079 -14814 24850 2856 -14868 26772 17839 -28176 3912 36785 -6747 -13769 28850
185 28850 11528 -15111 18013 15411 -20327 12676 42147 -7170 -19515 24669 12468 -12857
197 -12857 18655 16651 -21824 8767 41494 -6908 -24301 20796 13702 -14001 14819 16357 -21926
210 -21926 2582 34539 -8768 -23897 21877 13655 -18108 9591 16056 -22044 -1072 32279
222 32279 -7817 -23970 21899 14075 -22222 3782 18090 -15778 -1976 26467 -11654 -24764
234 -24764 23520 17067 -23548 44 17321 -16412 -5776 24737 -9423 -25600 20144 16306
246 16306 -24694 -3854 16242 -15703 -8945 21637 -8242 -24823 17523 12490 -27640 -5467
258 -5467 17822 -14893 -12398 20304 -5345 -26059 11978 11922 -25813 -4229 20034 -13801 -15816
271 -15816 16823 -4025 -24235 11803 12470 -24994 -4789 20463 -12952 -17517 17841 -503 -25231
284 -25231 8731 14187 -21467 -4970 19924 -12527 -18514 17880 2613 -23397 7425 14267 -20177
297 -20177 -4491 21885 -10666 -18672 18366 5596 -23334 6243 17686 -15999 -4522 21128
309 21128 -9342 -18021 19809 9580 -20994 6205 19101 -14230 -4856 21991 -6117 -16564
321 -16564 21210 12908 -20681 4658 21577 -10444 -5235 20875 -3556 -14120 21920 13763 -20327
334 -20327 2863 22121 -8529 -5378 21680 -1677 -15016 19710 14501 -19754 1882 23107
346 23107 -7097 -8101 19003 -178 -14214 17492 13215 -19995 618 22388 -7985 -10344 18546
359 18546 1155 -16661 13589 12696 -19991 -1657 21493 -8063 -13511 16009 1900 -17055 10408
372 10408 11286 -20872 -3499 20487 -8760 -15629 14758 1409 -20100 7032 11988 -19340 -5479
385 -5479 18769 -9619 -18283 12850 2947 -20039 4656 10632 -19883 -6957 18296 -9323 -19757
398 -19757 11875 3891 -21202 2454 11663 -17695 -8146 17153 -8048 -19848 11158 5476 -20001
411 -20001 1578 12220 -16245 -8024 17170 -6104 -19223 11577 7546 -19499 924 15381
423 15381 -12566 -9418 16156 -3253 -16762 12518 9399 -17896 686 16781 -9983 -8256 17705
436 17705 -1179 -16074 12899 12214 -15696 744 18502 -7578 -8823 17675 2436 -13965 12502
449 12502 13558 -13987 775 19439 -6524 -8903 18602 4242 -14744 10943 14492 -12918 444
462 444 19824 -5760 -10557 17415 6352 -13919 9296 13724 -12849 -736 19251 -5500 -11635
475 -11635 16312 6122 -15528 7145 14339 -12713 -3202 17905 -5042 -13291 14806 6982 -16095
488 -16095 4312 13100 -12807 -5153 16373 -5184 -14089 13032 6119 -17638 1666 13610 -12135
501 -12135 -7420 14249 -5061 -15830 11453 6629 -18263 -1323 12215 -11652 -8468 13053 -5268
514 -5268 -16784 9510 6687 -18560 -2191 12910 -11075 -10826 11649 -3591 -16719 7850 6848
527 6848 -18149 -3705 12530 -9918 -10913 11341 -2713 -17025 6894 7440 -17055 -3360 13849
540 13849 -8850 -12315 11105 101 -16315 6886 9580 -15722 -3677 14698 -6646 -11114 12022
553 12022 1641 -15375 6722 11672 -13539 -3152 15826 -5202 -11166 12654 4093 -14015 6318
566 6318 12841 -11714 -3022 16392 -3153 -10729 13080 5855 -12945 6464 14258 -9963 -3537
579 -3537 16989 -1542 -10692 13075 8141 -11970 5445 14452 -8544 -3864 16585 -218 -10499
592 -10499 12276 8864 -11407 4268 15274 -7657 -5184 15817 545 -11154 11148 9141 -12068
605 -12068 1889 14443 -6947 -6012 14355 524 -11977 9748 8881 -12545 534 13624 -7241
618 -7241 -8167 13027 1056 -12978 7418 8526 -13321 -1896 12844 -7115 -9906 11494 376
631 376 -14550 5146 8038 -13528 -3063 12161 -7515 -11584 10147 936 -15000 3440 7912
644 7912 -13649 -4714 11727 -6992 -12354 8988 1056 -15210 2254 8212 -13564 -5428 11575
657 11575 -6583 -13517 8629 2747 -14903 1334 8612 -11951 -6650 11553 -5041 -12880 8175
670 8175 3586 -14452 897 9555 -10328 -6242 11496 -3575 -12635 8663 5573 -13752 184
683 184 10731 -8718 -6071 11510 -1974 -12086 8387 6918 -12138 709 11960 -6597 -5973
696 -5973 12278 -124 -10943 8909 8613 -10897 707 13190 -5019 -5673 12712 1787 -9773
709 -9773 8723 9852 -9721 507 14088 -4042 -6353 12752 3168 -10180 8300 10588 -9004
722 -9004 -319 14243 -3171 -6639 11918 3831 -10245 7127 10440 -8832 -1124 13712 -2855
735 -2855 -7744 11715 4191 -10534 5617 10865 -9059 -3030 12765 -2686 -8774 9733 3777
748 3777 -11409 3962 10117 -9223 -4273 11299 -2703 -9968 8652 3995 -12375 1690 9761
761 9761 -9294 -5820 10396 -2900 -11123 6794 3761 -12883 141 8836 -9484 -7436 9122
774 9122 -2523 -12077 5817 3734 -12713 -1307 8714 -8549 -8268 8687 -1932 -12322 4456
787 4456 4473 -12664 -2074 9090 -8216 -8886 8580 -1183 -11958 4655 5250 -12260 -2307 9797
801 9797 -6939 -8998 8576 660 -11834 4247 6787 -10876 -2054 10526 -5441 -8922 8916
814 8916 1702 -10899 4755 8099 -9796 -2438 11630 -3420 -8111 9262 3511 -10254 4615
827 4615 9593 -7907 -2081 12096 -2303 -7929 9954 5205 -8987 4175 10596 -7081 -2126
840 -2126 12277 -643 -7387 9596 6064 -8535 4088 10409 -5919 -2455 12128 -249 -7702
853 -7702 9196 6775 -8446 2888 10778 -5293 -3154 11366 486 -8431 8250 7189 -8498
866 -8498 1786 10652 -5317 -4508 10681 391 -8893 6961 6435 -9326 70 9864 -5224 -6098
880 -6098 9768 408 -9903 5499 6610 -9770 -1543 9297 -5586 -7202 8634 263 -10828
893 -10828 3972 6076 -10111 -2883 8959 -5576 -8440 7359 277 -11749 2718 5902 -10075
906 -10075 -3989 8148 -5374 -9002 7122 866 -11880 1839 6485 -9667 -4796 8530 -4773
919 -4773 -9588 6135 1708 -11525 1303 7055 -8705 -4740 8671 -3700 -9255 6292 2638
932 2638 -10845 1039 7351 -7840 -5006 8476 -2230 -8853 6244 3599 -10167 857 8629
945 8629 -6509 -4647 9031 -1177 -8251 6647 5044 -8888 1347 9680 -5034 -4549 9967
958 9967 569 -8065 6642 6470 -8225 1405 10359 -3905 -4664 9990 1723 -7575 6709 7056 -7302
973 -7302 825 10856 -3429 -4821 10262 2663 -7272 6106 7800 -7131 -22 10707 -2635
986 -2635 -4992 9471 3240 -7525 5066 7642 -6730 -721 10523 -2320 -6378 8920 2917
999 2917 -8050 4135 7955 -7059 -2097 9631 -2428 -7003 7550 3069 -8737 2780 7411
1012 7411 -7394 -3566 8766 -2334 -7938 6226 2865 -9410 1355 6969 -7594 -4412 8370
1025 8370 -2348 -9063 5501 2683 -9484 357 6798 -7493 -5589 7655 -2164 -9497 4406
1038 4406 3093 -9699 -747 6581 -7150 -5807 6726 -1815 -9625 3766 3484 -9769 -919 7018
1052 7018 -6342 -6630 7281 -547 -9651 3916 4494 -9143 -1633 7583 -5110 -6440 7402 254
1066 254 -9049 3629 5389 -8234 -1570 8290 -4453 -6406 7802 1425 -8862 3922 6594 -7142
1080 -7142 -1305 8686 -3287 -6041 7740 2908 -7816 3865 7362 -6343 -1386 9351 -2090
1093 -2090 -5839 7856 3883 -7150 3651 8284 -5296 -1602 9644 -683 -5532 7534 4680
1106 4680 -6857 3391 8527 -4700 -2190 9572 -284 -5856 7125 4507 -6762 2537 8674
1119 8674 -4361 -2937 8842 161 -6310 6713 5097 -7206 1474 8504 -4534 -3855 8556 -31
1133 -31 -7008 5706 4925 -7614 407 8194 -4696 -4938 7259 -63 -8048 4556 4594 -8146 -903
1148 -903 7290 -4560 -5790 7021 -168 -8416 3232 4541 -8099 -1760 7326 -4647 -6533 6163
1162 6163 191 -8835 2632 4678 -8399 -2738 6809 -4256 -7415 5507 461 -8940 1831 4649
1176 4649 -7999 -3443 6618 -3666 -7098 5118 1332 -8860 1505 5430 -7047 -3562 6876
1189 6876 -2906 -7266 5376 2064 -8255 1188 5861 -6334 -3430 7301 -1765 -6824 5222 3198
1203 3198 -7840 1305 6914 -5564 -3528 7806 -248 -6793 5685 3859 -6874 1264 7374 -4512
1217 -4512 -3359 8411 454 -6299 5563 5221 -6151 1114 8297 -3723 -3234 8391 1292 -6163
1231 -6163 5335 5556 -6100 467 8502 -2713 -3670 8298 1889 -6402 4906 6042 -5544 358
1245 358 8449 -2617 -4732 7752 2300 -6636 3892 6471 -5739 -485 8419 -2152 -5058 6941
1259 6941 2319 -6903 3211 5955 -5910 -1537 7276 -2160 -5818 6190 2165 -6978 2081 5612
1273 5612 -5835 -2660 7149 -2265 -6220 5055 2360 -7602 690 5550 -5967 -3580 6161 -2263
1287 -2263 -7099 4209 2324 -7621 153 5111 -6102 -4514 5980 -2402 -7928 3738 2410 -8021
1301 -8021 -461 5318 -5787 -4983 5906 -1829 -7762 3230 3037 -7755 -875 5734 -4975 -5004 5787
1316 5787 -576 -7706 3126 3847 -7477 -867 6233 -4547 -5043 5823 -66 -7366 3463 4515
1330 4515 -6739 -1342 6612 -3417 -5080 6243 1034 -6742 3282 5100 -5623 -800 7230 -2495
1344 -2495 -4493 6289 2265 -6160 3102 5690 -5136 -1270 7662 -1670 -4688 6479 2844 -6137
1358 -6137 2776 6355 -4253 -1565 7663 -703 -4529 6118 3351 -5781 2962 6906 -4143 -1770
1372 -1770 7541 -257 -4526 5842 3569 -5921 1875 6886 -4001 -2615 7443 -166 -5253 5105
1386 5105 3524 -6000 1180 6952 -4145 -3312 6888 -407 -6053 4346 4015 -6403 387 6174
1400 6174 -4391 -4057 6001 143 -6209 3240 3528 -6569 -812 5866 -4202 -4610 5633 0
1414 0 -6956 2782 3663 -6706 -1437 5589 -4130 -5457 5115 75 -7326 1490 3593 -6498 -2207
1429 -2207 5618 -3670 -5526 4610 454 -7329 1359 3716 -6461 -2792 5401 -2957 -5796 4413
1443 4413 1166 -6935 1213 4506 -5653 -2402 5627 -2195 -6018 4307 1575 -6599 1009 5170
1457 5170 -5106 -2806 6064 -1586 -5590 4401 3043 -6159 1354 5539 -4067 -2366 6488 -907 -5409
1472 -5409 4575 3661 -5272 1288 6229 -3488 -2490 6666 165 -5358 4729 4317 -5132 885 6878
1487 6878 -2791 -2873 7025 806 -5377 4269 4904 -4891 785 6761 -2312 -3031 6951 1407 -4904 4104
1503 4104 4942 -4407 -49 6605 -2186 -3409 6360 1571 -5346 3266 4831 -4456 -476 6469 -2043
1518 -2043 -3778 5600 1438 -5749 2516 4840 -4680 -1351 5987 -2007 -4621 4906 1573 -6025 1680
1533 1680 4409 -5122 -2112 5490 -1982 -5030 4253 1543 -6256 819 4340 -4755 -3147 5044 -2009
1548 -2009 -5863 3680 1925 -6554 234 4202 -5013 -3500 4814 -1656 -5878 2856 1640 -6549 -413
1563 -413 4664 -4582 -3901 4657 -1215 -6141 2825 2190 -6674 -482 4960 -4313 -4337 4727 -598 -6009
1579 -6009 2860 2557 -5759 -425 5291 -3522 -3820 4958 -10 -5604 2852 3975 -5505 -601 5870
1594 5870 -2739 -3849 5106 1005 -5252 2425 4029 -4491 -834 5781 -1660 -3522 5330 1942 -4930
1609 -4930 2685 4942 -3921 -552 6168 -1276 -3442 5076 2302 -4801 2582 4890 -3864 -1134 6146
1624 6146 -493 -3619 5213 2816 -4432 2182 5448 -3321 -1375 6240 -283 -3924 4526 2756 -4480
1639 -4480 1481 5088 -3095 -1918 5835 -102 -4019 4147 2990 -4698 1004 5240 -3291 -2618 5290
1654 5290 -325 -4844 3379 3156 -4883 50 4817 -3250 -3305 4670 -357 -5293 2104 2882 -5457 -758
1670 -758 4797 -3427 -3798 4205 16 -5563 1741 2516 -5343 -1151 4491 -3103 -4365 4087 89 -5726
1686 -5726 1400 3207 -4940 -1740 4110 -2758 -4620 3601 772 -5734 1101 3075 -4894 -1759 4352
1701 4352 -2357 -4563 3187 957 -5143 545 3905 -4430 -2346 4239 -1815 -4832 3499 1739 -5583
1716 -5583 845 4061 -3843 -1824 4379 -844 -4366 3507 2084 -4809 1049 4768 -3390 -2122 5020
1731 5020 -138 -3991 3680 2866 -4315 864 4895 -2549 -2160 5253 150 -4237 3872 3436 -4085 672
1747 672 5275 -2330 -2042 5021 847 -3807 3610 3440 -3874 407 5292 -1669 -2318 5093 936 -3572
1763 -3572 3152 3773 -3695 121 5413 -1820 -2524 4468 1083 -4013 2428 3687 -3427 -760 5027
1778 5027 -1210 -3041 3974 1384 -4408 2044 3715 -3573 -1526 4034 -1235 -3699 3753 1371 -4615
1793 -4615 1173 3350 -3737 -1787 4064 -1608 -4157 3477 1204 -4809 423 3419 -3808 -2283 4074
1808 4074 -1497 -4534 2653 1133 -4970 138 3328 -3864 -2886 3889 -1108 -4722 2268 1599 -5220
1823 -5220 -37 3351 -3642 -3196 3559 -958 -4864 2275 2001 -4623 -237 3833 -3324 -3188 3607 -301
1839 -301 -4420 2228 2479 -4339 -370 4185 -2655 -2829 3715 253 -4318 2361 2617 -4164 -517 4307
1855 4307 -1821 -3094 4092 832 -3984 2045 3393 -3391 -422 4680 -1490 -2865 4128 1390 -3733
1870 -3733 1908 3687 -2762 -714 4420 -878 -2721 4227 1736 -3680 1795 3991 -2874 -645 4694
1885 4694 -332 -2755 3740 2186 -3427 1314 4336 -2452 -980 4849 -203 -2963 3504 2240 -3557
1900 -3557 1227 3968 -2590 -1660 4331 -118 -3275 2887 1965 -3669 583 3978 -2838 -1986 3879 -312
1916 -312 -3945 2393 2194 -4241 49 3446 -2863 -2366 3674 -95 -4235 2252 2277 -4243 -398 3591
1932 3591 -2581 -2861 3231 -468 -4182 1489 2106 -4077 -1197 3609 -2271 -3253 2941 -286 -4303 1279
1948 1279 2030 -4047 -1185 3516 -2237 -3369 2791 321 -4345 696 2255 -3664 -1720 3643 -1657
1963 -1657 -3226 2798 400 -4261 507 2784 -3223 -1487 3405 -1124 -3260 2609 1261 -3986 840
1978 840 3160 -2798 -1473 3738 -745 -3183 2896 1864 -3407 954 3689 -2574 -1505 4139 -717
1993 -717 -3268 2814 2024 -3237 840 3918 -2143 -1565 4253 269 -2686 2859 2288 -3202 658 3919
2009 3919 -1666 -1425 4080 624 -2839 2798 2838 -2500 594 4115 -1534 -1738 3744 798 -2620 2480
2025 2480 2834 -2509 278 4040 -1371 -2126 3712 822 -3263 1750 2720 -2902 -344 3783 -949 -2386
2041 -2386 3297 817 -3698 1474 2750 -3078 -710 3310 -1160 -2634 2797 843 -3539 846 2520
2056 2520 -3145 -1027 3169 -1159 -3212 2549 970 -3827 464 2427 -3165 -1957 2903 -1222 -3491
2071 -3491 2120 932 -3845 361 2444 -3127 -2139 2543 -1058 -3802 1729 1055 -3729 337 2315
2086 2315 -2983 -2263 2624 -1114 -3365 1454 1321 -3773 -312 2689 -2443 -2193 2963 -421 -3298 1787
2102 1787 1834 -3462 -102 3253 -2047 -2358 3157 103 -3015 1663 2221 -2673 -11 3090 -1722 -1998
2118 -1998 3161 396 -2953 1697 2661 -2444 -297 3525 -1062 -1917 2872 1027 -2774 1768 2566 -2162
2134 -2162 -247 3854 -672 -2036 3148 1042 -2342 1430 2775 -2172 -392 3622 -675 -2100 3086
2149 3086 1511 -2636 1291 3018 -1927 -709 3451 -497 -2000 2635 1568 -2726 1046 3188 -2088
2164 -2088 -1144 3529 -494 -2293 2057 1381 -3055 729 2906 -2256 -1618 2724 -280 -2812 1996 1550
2180 1550 -3157 161 2467 -1968 -1944 2691 -356 -3198 1489 1614 -3377 -255 2540 -2255 -2268 2457
2196 2457 -124 -3186 1264 1637 -3067 -526 2527 -2100 -2584 2283 -448 -3381 1197 1545 -2868 -889
2212 -889 2369 -1645 -2236 2464 5 -3308 762 1634 -3033 -1005 2315 -1705 -2577 1986 504 -3340
2228 -3340 831 1839 -2555 -1101 2571 -1308 -2189 2347 795 -2931 1056 2204 -2224 -1075 2806
2243 2806 -817 -2282 2500 1120 -2736 834 2647 -2011 -947 3120 -208 -1930 2634 1473 -2457
2258 -2457 845 3040 -1768 -892 3293 203 -2299 2603 1843 -2227 474 2906 -1494 -894 3328 387
2274 387 -2071 2107 1928 -2275 905 2701 -1187 -1411 3165 425 -2371 1819 1861 -2199 422 2972
2290 2972 -971 -1474 2587 754 -2310 1443 1915 -2257 -241 2763 -1013 -1921 2553 672 -2556 1167
2306 1167 2227 -2017 -863 2430 -898 -2026 2350 285 -2730 913 1764 -2315 -1036 2770 -953
2321 -953 -2179 1797 575 -2862 595 1592 -2537 -1141 1988 -1177 -2628 1565 532 -3098 304
2336 304 1886 -2269 -1648 2268 -1064 -2561 1739 832 -2907 316 1996 -2083 -1690 2207 -721 -2830
2352 -2830 1353 696 -2812 107 2298 -1784 -1655 2043 -311 -2733 1168 1569 -2154 5 2385 -1409
2368 -1409 -1843 2472 116 -2289 1697 1717 -2410 401 2617 -1276 -1193 2677 447 -1991 1380 2097
2384 2097 -2052 41 2903 -708 -1299 2340 836 -2144 1738 2291 -1913 -67 3076 -668 -1364 2382
2400 2382 1141 -1991 1365 2189 -1751 -345 2799 -585 -1476 2628 1096 -1840 1228 2078 -1962 -313
2416 -313 2643 -77 -1837 2234 1030 -2293 856 1731 -1423 -1062 2449 -498 -1815 2257 1056 -2381
2432 -2381 319 2163 -1887 -1074 2350 -382 -2299 1551 848 -2575 332 2135 -1722 -1207 2131 -559
2448 -559 -2646 1122 968 -2766 72 1970 -1679 -1730 1938 -360 -2616 1167 906 -2567 -435 1980
2464 1980 -1438 -1698 1836 -306 -2455 678 1199 -2685 -571 2128 -1493 -2257 1671 118 -2520 988
2480 988 1351 -2131 -561 1927 -1451 -1909 1578 204 -2272 794 1639 -2043 -374 2204 -1104 -1910
2496 -1910 1961 837 -2183 646 2135 -2119 -580 2577 -668 -1820 2062 1058 -2341 1143 2190
2511 2190 -1682 -487 2566 -145 -1466 2155 1227 -1881 794 2400 -949 -524 2429 -437 -1731
2526 -1731 1659 1677 -1823 402 2079 -1174 -762 2276 346 -1773 1605 1683 -1695 647 2518 -1110
2542 -1110 -1086 2637 201 -1853 1772 1407 -2237 709 2458 -1226 -1399 2105 80 -2009 1360 1816
2558 1816 -2005 -198 2067 -1398 -1423 1897 475 -2234 1206 1546 -2138 -583 1914 -965 -1744 1666
2574 1666 -40 -2503 625 1454 -2140 -672 2142 -1405 -2003 1812 178 -2405 481 1440 -2323 -590
2590 -590 1932 -806 -2064 1619 366 -2511 343 1448 -2327 -1017 2066 -1061 -2244 1270 295
2605 295 -2647 387 1458 -2126 -982 1989 -750 -2233 1156 640 -2594 278 1689 -1574 -1009 1787
2621 1787 -452 -2214 1341 860 -1948 183 2162 -1480 -1070 2091 111 -1853 1430 1230 -2080 167
2637 167 1892 -1216 -956 2237 199 -1566 1229 1188 -1938 -26 2380 -1108 -1236 1940 439 -1843
2653 -1843 1401 1706 -1435 39 2505 -637 -801 2222 640 -1636 1420 1846 -1546 -115 2506 -519
2669 -519 -1461 2194 407 -2030 917 1836 -1635 -291 2290 -485 -1462 1779 719 -2077 800 1591
2685 1591 -1622 -432 1856 -568 -1499 1309 534 -2208 363 1643 -1562 -1404 2038 -486 -2189 1493
2701 1493 461 -1983 288 1654 -1562 -1165 1940 -581 -1904 1370 909 -2193 425 1517 -1961
2716 -1961 -1077 2003 -572 -2093 904 844 -2368 -268 1559 -1387 -1313 1552 -526 -2076 1038 725
2732 725 -2204 -416 1527 -1330 -1448 1635 -88 -1865 967 1093 -2203 -275 2064 -1252 -1648 1839
2748 1839 171 -2297 994 1506 -1948 -499 2050 -765 -1320 1722 462 -1789 952 1574 -1311 -224
2764 -224 2421 -647 -1225 1914 800 -1688 1162 1507 -1156 -462 2360 -116 -1536 1966 849 -1631
2780 -1631 696 2006 -1464 -327 2237 -83 -1377 1852 948 -1667 742 2110 -996 -243 2658
2795 2658 99 -1648 1570 1441 -1368 559 1934 -1095 -949 2397 26 -1262 1207 1151 -1812 199
2811 199 2036 -995 -1218 1708 61 -1734 1092 1091 -1863 -191 1574 -1223 -1248 1946 -8 -2140 973
2828 973 1094 -1981 -150 1944 -828 -1396 1704 -272 -2001 887 1151 -2145 -272 1197 -1162 -1613
2844 -1613 1424 191 -2466 315 1070 -2088 -796 1642 -838 -1754 1216 100 -2150 252 1354
2859 1354 -1592 -930 1814 -1002 -1775 1302 408 -1932 445 1360 -1679 -814 1988 -611 -1666 1341
2875 1341 396 -1872 461 1157 -1411 -1032 1668 -491 -1658 1457 790 -1920 302 1655 -1513 -799
2891 -799 1883 261 -1724 1383 1355 -1838 285 1978 -971 -930 2151 334 -1452 1111 1081 -1840 490
2908 490 1924 -897 -700 1990 393 -1532 1208 1447 -1312 184 2104 -770 -834 1929 508 -1380
2924 -1380 972 1223 -1333 42 2083 -427 -1293 1868 392 -1639 1047 1684 -1477 -346 2136 -760
2940 -760 -1187 1624 606 -1638 1070 1408 -1428 -696 1620 -582 -1718 1222 313 -1717 316 1390
2956 1390 -1626 -736 1971 -724 -1687 1359 434 -2020 356 1466 -1506 -800 1363 -471 -1757 1103
2972 1103 547 -1998 200 1283 -1259 -920 1477 -371 -1856 694 844 -1922 62 1433 -1301 -1150
2988 -1150 1418 -318 -1861 813 781 -1757 148 1725 -824 -1335 1221 -134 -1706 834 1005 -1798
3004 -1798 -104 1594 -1106 -974 1499 -74 -1766 728 1074 -1619 -115 1562 -691 -1036 1602 65
3020 65 -1237 1057 1531 -1316 -287 1673 -553 -1264 1539 693 -1435 846 1373 -1079 -407 1972 -146
3037 -146 -1051 1844 656 -1633 1023 1567 -976 -497 1771 -320 -1193 1732 645 -1301 550 1516
3053 1516 -773 -354 1540 124 -1099 1373 727 -1505 336 1746 -852 -835 1589 -98 -1083 1464
3069 1464 1084 -1433 345 1216 -1139 -756 1649 -345 -1779 955 761 -1630 12 1511 -870 -1008
3085 -1008 1403 -37 -1634 687 674 -1602 45 1303 -993 -1276 1354 60 -1864 751 866 -1837
3101 -1837 -404 1367 -1052 -1290 1355 133 -1662 434 1083 -1361 -335 1411 -889 -1339 1249 266
3117 266 -1807 436 694 -1747 -412 1164 -421 -1204 888 412 -1873 429 1346 -1328 -557 1431
3133 1431 -488 -1216 1238 399 -1617 485 1307 -1462 -626 1105 -532 -1449 1349 701 -1395 67
3149 67 1346 -928 -683 1566 -135 -1103 966 962 -1380 299 1367 -787 -653 1532 -13 -1020 1228
3166 1228 1120 -1431 407 1793 -583 -558 1537 246 -1028 1255 1067 -1116 173 1737 -599 -639
3182 -639 1337 252 -1531 889 1232 -1083 277 1705 -539 -1146 1491 501 -1246 639 1280 -1280
3198 -1280 -185 1506 -524 -919 1631 253 -1445 492 1004 -1058 -125 1306 -577 -937 1274 49
3214 49 -1419 485 1231 -1158 -652 1409 -689 -1195 890 552 -1465 68 1040 -1093 -693 1224 -503
3231 -503 -1454 774 567 -1423 -88 806 -1293 -784 1076 -538 -1555 949 251 -1705 -132 988
3247 988 -1292 -744 1053 -307 -1817 738 371 -1281 -353 1296 -1114 -1174 1354 -13 -1733 921
3263 921 765 -1337 -108 1041 -838 -601 1149 164 -1449 724 882 -1481 221 1195 -697 -1026 1576
3280 1576 147 -1256 777 1118 -990 -187 1588 -436 -1071 1417 416 -1158 916 1212 -1142 115
3296 115 1503 -471 -701 1037 416 -1445 657 921 -803 -95 1673 -49 -1233 1267 590 -1291
3312 -1291 604 1326 -888 -362 1408 -238 -860 1329 470 -1380 485 1090 -910 -504 1253 -310
3328 -310 -1391 976 663 -1304 62 1334 -939 -757 1098 -337 -1130 932 581 -1193 -6 1383
3344 1383 -901 -905 1014 5 -1370 579 446 -1351 -270 1145 -1006 -1026 1215 -371 -1560 652
3360 652 614 -1235 -239 907 -1168 -1294 629 -149 -1364 486 747 -1272 -333 987 -938 -1091 751
3377 751 154 -1453 285 698 -1173 -550 879 -643 -1204 1083 348 -1351 245 1072 -1098 -243 1131
3394 1131 -496 -1276 978 522 -1273 256 1140 -978 -371 1693 -43 -1097 967 755 -1042 346
3410 346 1006 -886 -361 1396 -116 -748 1184 715 -733 409 1212 -614 -541 1563 -189 -808 990
3427 990 529 -1012 420 1092 -817 -382 1706 89 -1090 984 827 -899 354 1417 -623 -690 1420
3444 1420 84 -1137 563 911 -1229 -1 1365 -545 -828 1008 249 -1177 604 960 -1233 -155
3460 -155 1142 -602 -1058 1180 147 -1223 530 1053 -811 -86 1031 -702 -733 766 51 -1031 375
3477 375 530 -904 -347 1059 -476 -1297 1056 -63 -1524 538 814 -1234 -465 751 -329 -1034 941
3494 941 79 -1340 103 810 -778 -896 1210 -461 -1439 566 351 -1458 -270 1000 -1341 -748 1104
3511 1104 -267 -1088 546 573 -1109 -215 637 -904 -656 978 -286 -1141 467 644 -1081 45 1285
3528 1285 -572 -820 891 56 -953 736 839 -1248 -230 1187 -601 -611 1180 254 -969 603
3544 603 786 -852 119 1378 45 -879 1156 253 -1143 716 954 -675 109 1406 -84 -445 858
3561 858 584 -676 557 1010 -747 -301 1324 -177 -643 948 581 -1025 370 1029 -1004 70 1244
3578 1244 -160 -926 862 624 -879 -46 949 -678 -586 1074 -1 -867 1007 546 -849 11 840
3595 840 -682 -522 940 63 -933 519 735 -1222 22 919 -688 -653 1151 -164 -967 539 875
3612 875 -1149 -144 919 -652 -999 817 75 -963 297 406 -1136 32 623 -585 -893 823
3628 823 -127 -1143 593 365 -1039 -215 1027 -564 -794 703 221 -745 332 420 -884 -391 1023
3645 1023 -324 -774 433 -3 -1244 203 720 -991 -170 969 -272 -900 783 336 -728 490
3661 490 964 -913 -296 1113 -459 -836 724 406 -1103 224 1105 -611 -381 1107 -376 -585 745
3678 745 519 -1106 158 722 -470 -341 1028 145 -777 959 435 -487 136 782 -302 -280 921 100
3696 100 -869 920 553 -633 251 1157 -651 -414 1209 68 -900 713 511 -1045 -150 1042 -193
3713 -193 -753 993 78 -1043 613 656 -824 -185 872 -549 -520 838 167 -902 421 434 -680 -148
3731 -148 937 -128 -928 607 14 -881 442 382 -717 -268 832 -403 -1196 540 -382 -830 119 522
3749 522 -587 -469 558 -506 -808 479 262 -1125 344 548 -644 -249 918 -297 -854 684 -7
3766 -7 -1386 -329 770 -913 -380 795 -185 -716 245 407 -1190 93 838 -500 -341 589 7 -982
3784 -982 572 422 -848 102 911 -513 -539 630 -89 -690 333 487 -741 -83 1048 -724 -557 780
3802 780 204 -740 392 529 -696 125 847 -224 -674 900 -73 -522 717 822 -743 -43 1087 -312
3820 -312 -284 1050 318 -571 269 668 -614 -185 1155 -97 -398 548 462 -952 464 554 -514 -252 1090
3839 1090 -320 -622 489 77 -695 427 801 -846 -158 1030 -190 -702 432 590 -893 17 826
3856 826 -563 -231 813 -291 -978 674 177 -687 210 752 -360 -555 625 -233 -1016 612 432 -1015
3874 -1015 -361 712 -524 -594 646 -28 -1108 367 325 -893 23 676 -493 -457 631 113 -949 174
3892 174 458 -950 -121 646 -706 -550 841 -254 -787 104 457 -698 -271 925 -625 -765 552
3909 552 -63 -848 329 266 -746 -245 939 -212 -614 868 208 -699 363 563 -493 -239 1075 -528
3927 -528 -536 786 216 -433 96 903 -305 -378 782 16 -756 726 469 -668 188 659 -647 -377 987
3946 987 -148 -402 259 414 -634 383 1027 -634 -435 788 111 -433 850 817 -863 135 852 -134
3964 -134 -491 1205 223 -501 667 282 -521 66 911 -200 -578 763 -90 -997 385 446 -810 -133
3982 -133 569 -494 -549 591 88 -705 574 454 -626 -86 681 -779 -168 819 262 -537 112 486 -884
4001 -884 -16 490 -379 -912 507 13 -1185 344 452 -811 -146 681 -239 -666 371 212 -869 70
4019 70 595 -685 -156 767 -440 -479 410 -106 -945 275 638 -743 -280 706 -209 -398 668 336 -957
4038 -957 3 731 -763 49 490 -133 -1005 688 703 -733 132 465 -513 -386 859 -125 -522 642 406
4057 406 -534 269 630 -191 -370 624 -22 -639 608 428 -708 181 985 -464 -404 962 -18 -460 482
4076 482 699 -282 153 733 -373 -172 524 -25 -772 284 540 -722 1 641 -393 -306 552 312 -877
4095 -877 409 480 -769 5 660 -196 -580 403 45 -649 298 346 -363 -96 693 -520 -675 640 268
4114 268 -788 -37 230 -771 -484 712 -523 -496 383 45 -575 109 590 -665 -472 694 -482 -831
4132 -831 261 -44 -931 -238 687 -715 -556 752 -363 -811 314 48 -886 123 491 -760 -584 734
4150 734 -333 -825 558 340 -750 -195 716 -632 -372 722 -55 -463 302 423 -544 -234 602 -216
4168 -216 -347 506 104 -801 421 252 -560 310 774 -17 -574 418 108 -624 281 422 -630 59 829
4187 829 -279 -671 610 -63 -448 437 540 -533 -199 791 -88 -685 582 110 -537 394 1181 -331
4205 -331 -62 684 -103 -305 324 599 -514 496 709 -631 61 535 -116 -677 579 408 -453 408 867
4224 867 -459 -402 750 -51 -478 541 456 -696 80 987 -333 -216 751 -56 -664 441 568 -769
4242 -769 -357 569 -181 -517 758 -272 -783 375 262 -839 -172 610 -688 -340 648 -150 -928 257
4260 257 459 -733 3 660 -614 -739 373 -303 -529 203 400 -669 -87 423 -352 -466 612 25
4278 25 -920 14 588 -517 330 341 -452 -467 466 -26 -947 118 366 -521 -509 665 -5 -486 629 55
4298 55 -701 -30 572 -465 -196 518 -319 -821 459 56 -722 403 640 -415 -215 773 -3 -428 486
4317 486 276 -440 58 441 -181 -315 589 240 -567 358 456 -530 190 750 -145 -226 741 176 -717 616
4337 616 518 -759 -5 631 -400 -383 842 -95 -443 339 570 -878 144 865 -141 -445 498 35 -752
4356 -752 338 277 -522 -183 628 -99 -447 555 142 -694 318 572 -520 -104 430 12 -466 286 236
4375 236 -582 281 368 -589 -296 797 -114 -479 322 210 -903 -77 396 -640 -31 606 -132 -556 277
4394 277 127 -625 56 323 -423 -369 721 157 -429 404 133 -916 27 523 -736 -350 500 -566 -450
4413 -450 545 260 -760 226 187 -513 -201 285 0 -786 190 256 -744 -292 764 -485 -460 637 -282
4432 -282 -645 586 144 -876 -140 373 -512 -440 917 21 -591 308 715 -344 17 803 -247 -436 471
4451 471 645 -615 19 576 -248 90 707 -329 -257 673 268 -455 211 434 -563 -14 792 -173 -426 423
4471 423 170 -430 217 725 -243 177 741 -17 -640 529 209 -532 234 686 -366 -116 845 13 -431
4490 -431 435 296 -585 192 491 -719 -229 361 -185 -484 632 309 -659 159 585 -294 -488 570 -184
4509 -184 -709 515 21 -754 -272 324 -808 -435 515 97 -676 235 36 -738 -373 774 -291 -485 637
4528 637 274 -468 257 365 -801 119 515 -334 -621 636 -153 -853 -217 352 -558 -262 429 -397 -354 653
4548 653 202 -758 251 591 -405 -138 584 -183 -573 364 441 -661 106 730 -782 -283 616 45 -438
4567 -438 562 479 -602 196 501 -377 -59 619 -69 -325 293 438 -357 180 437 -343 -265 708 361 -398
4587 -398 548 328 -546 377 382 -280 -207 530 -71 -420 300 534 -510 38 643 -296 -95 544 290 -206 538
4608 538 291 -441 -98 656 3 -184 805 -1 -221 433 435 -639 -153 622 -661 -552 534 -21 -553 423
4628 423 321 -748 -206 534 -338 -411 588 213 -652 86 384 -711 -1 512 -373 -337 195 221 -385 -70
4648 -70 423 -513 -455 557 -216 -437 247 398 -588 -7 481 -305 154 425 -10 -420 419 104 -587 127
4668 127 267 -230 -360 733 26 -395 361 25 -799 55 685 -548 -154 551 -66 -183 169 359 -539
4687 -539 -164 529 -509 -472 488 -100 -563 417 191 -469 100 519 -99 -348 582 74 -274 235 236 -427 -26
4708 -26 777 -22 -625 356 165 -466 568 424 -313 12 478 -75 -258 621 241 -566 403 605 -295 144
4728 144 683 -438 -487 415 158 -632 289 445 -181 -147 511 199 -222 345 341 -545 169 419 -353 -86 488
4749 488 -134 -408 516 402 -600 -114 372 -504 -368 598 -393 -347 214 137 -455 206 301 -523 -167 297 237
4770 237 -451 298 268 -676 -20 324 -555 -288 312 -257 -506 449 259 -459 -132 515 -26 -597 410 -139
4790 -139 -201 158 233 -894 -85 290 -258 -363 332 195 -830 67 374 -302 -191 375 -156 -457 535 238
4810 238 -630 359 334 -538 -227 185 -259 -303 283 297 -642 95 364 -541 0 561 -599 -84 355 96 -528
4831 -528 -110 171 -399 -78 472 -95 -424 798 39 -299 -126 522 -531 -84 483 6 -223 316 262 -350
4851 -350 272 746 -180 -110 588 -28 -105 226 656 -332 14 215 -123 -179 221 -60 -313 150 398 -303 398
4872 398 318 -221 -289 493 410 -180 208 224 -376 -71 163 218 -312 669 224 -364 349 174 -243 -67 548 -398
4894 -398 -388 335 131 -430 -190 33 -377 -200 285 -148 -257 347 -254 -465 115 231 -452 -175 328 -145
4914 -145 -627 296 29 -777 42 424 -285 -137 574 -186 -688 218 -105 -500 11 204 -260 -186 203 -276
4934 -276 -518 216 -226 -400 -106 241 -296 -78 442 149 -484 172 142 -371 182 590 -224 -395 553 -131
4954 -131 -550 364 48 -335 47 466 -197 -55 -19 112 -294 319 242 -223 59 441 -34 -271 604 -184 -351
4975 -351 53 128 -307 380 721 163 -27 85 141 -253 304 438 -272 16 571 -96 -366 335 332 -265 249
4996 249 514 -259 -1 362 -239 4 448 93 -430 272 498 -270 -274 503 -6 -148 -13 -127 -756 411
5016 411 541 -337 -77 189 -138 -220 138 252 -370 -131 278 -223 7 399 -293 -507 418 294 -400 144
5036 144 491 -530 -135 227 -336 -438 100 100 -668 -256 297 52 -307 49 39 -441 102 177 -589 -150 353
5057 353 -319 -239 281 125 -436 10 418 -480 5 513 -110 -354 603 -29 -307 -286 140 -491 -121 566 -350
5078 -350 -172 280 -3 -196 157 788 89 62 443 13 -100 335 33 -607 -145 268 31 22 11 28 -62 268
5100 268 202 -180 253 295 -407 -21 309 -120 -32 199 235 -411 141 374 -220 -109 225 150 -394 262 440 -305
5122 -305 -17 439 -439 -176 184 -414 -40 98 253 -355 -27 377 -371 -103 95 247 -452 240 200 -283
5142 -283 139 412 -46 -400 312 -16 -209 -247 155 -456 -678 514 -50 -93 87 187 -692 162 197 -36 -197
5163 -197 108 -493 -316 217 -26 -304 75 282 -544 -80 29 41 -511 -56 248 -460 170 215 -223 -136 27
5184 27 -232 -293 192 -132 -552 -108 439 -356 -245 193 -530 -150 172 249 -194 37 543 -310 -51 50 80
5205 80 -98 -69 218 -367 -128 454 -269 100 446 87 -290 290 69 39 42 417 116 222 591 -158 62 274
5227 274 244 -324 144 259 -22 -90 217 160 -190 276 325 133 213 277 -185 -44 344 216 -183 242 447 -142
5249 -142 -62 5 -4 -109 350 -226 -201 272 47 -185 -86 386 -104 -377 22 242 -205 -96 377 -152 61 130
5271 130 77 -51 73 145 -451 35 -60 -145 177 -126 -28 -375 87 197 -498 187 438 -121 -110 259 -23 -409
5293 -409 291 186 -273 234 150 -98 -242 41 7 -154 74 -98 -221 -14 181 -160 139 170 -13 -311 -395
5314 -395 -21 -422 -31 409 -40 -152 168 -124 -347 96 113 -349 -133 257 -162 -326 43 -183 -176 97 380
5335 380 -81 62 344 -212 -338 95 9 -360 147 539 -296 72 274 -186 -434 256 237 -225 145 272 -155
5356 -155 51 230 7 -29 360 298 -15 10 248 -273 268 164 -398 21 -120 23 33 95 370 -178 225 401
5378 401 -341 -146 368 -284 157 86 314 -227 -135 372 -105 -193 461 211 -183 185 326 -117 -358 412 -111
5399 -111 -300 252 214 -310 120 159 -129 -306 -155 -98 -177 303 82 -530 -111 278 -161 -126 646 -78 -150 107
5421 107 3 -287 -227 129 -250 -123 -36 -150 -389 218 235 -267 288 122 -290 -1 185 -93 -756 105 482
5442 482 -411 -79 533 -318 -206 62 241 -89 -163 278 -357 -108 380 16 -196 87 65 -493 231 34 -199
5463 -199 15 343 169 -123 351 115 -229 208 51 -268 91 94 -72 -129 167 -116 -63 -61 -15 -61 -21 245 122
5486 122 20 3 -117 -463 13 314 -113 67 121 -92 -173 224 194 -119 153 306 202 49 454 -181 -89 221
5508 221 237 -222 -91 267 -270 -246 294 63 -316 -7 89 -14 -336 151 -196 -108 47 -140 -240 209 200 -97
5530 -97 -202 285 -69 -119 104 -86 -256 41 157 -109 -154 324 -339 -44 228 -28 -358 -295 176 -323 3
5551 3 120 4 36 171 191 -106 74 -5 -519 -62 181 -97 -184 -70 182 -424 -121 367 -469 -255 377 -265
5573 -265 -238 379 59 -228 -197 207 -54 -194 277 136 -20 345 331 -165 -4 514 -243 25 119 58 -511 271
5595 271 134 -55 -33 222 -97 -143 436 1 -210 104 71 -187 -101 274 -200 -256 132 72 -282 231 64 -124
5617 -124 -103 550 -19 -14 38 288 -377 -95 137 -328 122 131 -257 -228 271 123 251 102 381 -198 13 -153
5639 -153 -11 -238 151 247 -246 80 277 -310 -227 339 17 36 129 340 -58 97 280 -161 -73 208 14 -220
5661 -220 96 453 -424 -44 123 -151 46 167 5 -391 352 -63 -185 -198 283 -73 -122 203 98 -143 404
5682 404 16 -203 -339 383 -62 -267 198 143 -132 31 41 -309 -130 346 -225 -72 281 413 -339 359 -76
5703 -76 -350 295 398 -18 -158 75 -39 -313 -355 68 -302 -245 259 -87 -151 171 164 -69 38 133 -423 -251
5725 -251 140 -32 -90 299 324 -362 65 65 -191 331 88 49 -527 207 -145 -37 96 171 -219 91 271 -195
5747 -195 -267 328 38 119 118 493 1 -338 170 4 -341 378 372 49 -31 416 80 -398 461 206 -257 -83
5769 -83 -103 -390 47 142 -338 -348 227 210 -161 -124 273 -293 -212 144 -392 -187 215 -114 -99 117 68 -65 10
5792 10 401 -348 -472 257 84 -152 -4 46 -233 189 101 -81 -292 32 -70 -64 156 412 -248 -381 121 75
5814 75 -332 63 -22 -48 35 75 -231 -181 385 -164 -171 179 -32 -190 139 269 -35 129 5 -78 42 134 21
5837 21 -263 61 299 -234 -120 28 9 -104 22 -2 -95 -50 196 -347 -275 270 87 -61 239 160 135 59 592
5860 592 67 -255 199 27 -392 49 -27 -395 -127 236 -168 12 245 93 -281 -32 -8 -4 0 463 51 -230
5882 -230 113 95 149 -38 174 -157 221 136 27 -327 392 -135 -59 190 199 -320 -241 334 58 130 21 96 -297
5905 -297 38 220 -68 -92 481 -188 -212 208 -155 47 43 39 125 -390 40 -166 -123 -130 104 -277 306 99 -40
5928 -40 70 318 -39 -270 171 -113 -51 -16 295 -80 -3 203 -40 -105 -77 266 -318 26 112 -19 -160 -103 -161
5951 -161 -221 118 162 112 211 340 -282 81 289 -146 -129 3 89 -361 -269 315 -135 -117 3 -317 -486 230 -28
5974 -28 -337 -24 398 28 -255 223 -126 -298 99 256 7 30 97 -126 -290 142 167 -85 129 279 63
5995 63 -230 234 214 -3 -36 140 -172 -208 67 -180 -109 -170 -269 -274 109 132 -200 133 265 194 -101 238 -49 169
6019 169 104 85 -118 -150 405 -142 -145 315 -49 -2 356 84 -487 85 401 -94 95 -9 -92 -133 -58 250 -129
6042 -129 55 251 69 -246 -102 -60 -331 -92 340 -36 -28 101 -239 -92 164 0 -235 68 -44 -63 176
6063 176 15 126 31 203 171 -469 378 23 -307 178 347 -63 5 190 131 107 198 -72 101 -168 -78 17 -50
6086 -50 332 141 34 5 227 260 -272 138 -275 -228 100 0 -340 -308 117 -245 -77 172 -217 202 -27 18
6108 18 -268 8 155 80 -225 162 -208 -168 93 54 -294 -150 163 -200 -6 160 318 -132 122 206 -44 101
6130 101 549 -287 -101 549 30 -161 166 41 113 238 316 -229 -253 212 -152 -331 -83 17 -40 -27 141 -243
6152 -243 -101 43 -50 -96 50 168 31 -162 383 -79 23 398 199 -267 364 223 -167 88 -51 49 -390
6173 -390 80 27 20 294 32 -78 -17 0 -76 -43 205 157 -120 -108 184 -211 -58 268 21 -195 136 30 71
6196 71 -188 298 -230 -211 92 -295 -63 325 315 -4 -164 152 192 -70 158 35 -128 187 290 -179 253
6217 253 95 -98 -227 190 330 -1 22 -99 -197 -165 86 209 -262 240 31 -267 -66 329 -133 -13 89
6238 89 119 -143 -113 -175 -247 290 -105 -136 -317 246 -198 -553 463 172 29 148 273 109 -246 125 113 75
6260 75 131 104 -64 -39 79 -35 199 15 -203 117 -71 53 -176 7 157 -9 184 19 -177 -123 338 -12
6282 -12 -124 144 83 -4 -189 -32 116 -199 -178 183 -229 189 -186 -183 -5 215 -391 170 150 8 -163 -219 395
6305 395 -101 -69 123 321 -20 96 -169 -120 105 162 -112 -112 -40 -66 52 -112 128 -224 -15 239 -95 -265
6327 -265 274 -16 -223 -90 -83 -250 -489 166 -99 -128 57 -77 -75 -56 -149 -265 108 165 -89 -2 181 -161 -468
6350 -468 -90 -11 0 83 8 196 -273 153 -120 -233 -146 33 127 40 184 -68 -264 59 30 70 -71 -215 -204
6373 -204 36 278 -67 -217 127 222 1 41 231 -174 95 310 213 -223 245 204 -100 -11 43 -23 110 350
6395 350 -18 -103 42 53 -250 -26 259 -134 24 61 -104 89 291 72 104 -221 321 -23 -147 189 -237
6416 -237 -9 31 -13 -293 -115 -7 -148 -191 118 112 -198 213 250 76 250 41 -134 -53 -164 127 -77 174
6438 174 153 -198 -17 92 217 182 271 354 -20 186 18 -218 320 -145 -83 -262 16 23 -266 229 183 -371 90
6461 90 258 -187 -182 149 84 -114 367 61 -177 -289 69 83 -287 343 386 -35 150 17 251 -180 -3 -127
6483 -127 -91 124 -149 -308 -333 80 156 27 -88 42 129 172 51 176 55 176 -196 -104 151 -73 -48 -10 84
6506 84 -342 -186 147 -361 -107 -11 -79 -236 29 51 -113 -237 16 110 -107 215 97 -36 -93 168 -178 11
6528 11 -30 -34 91 210 267 -312 287 171 -113 73 -72 26 14 251 -171 46 -170 250 -7 -249 -94 -87 -53
6551 -53 167 -105 -32 -10 271 -292 -166 -101 -321 -84 -113 224 10 112 343 105 -25 261 -94 24 382 -136
6573 -136 -124 91 -233 -234 -265 306 -158 -106 -27 -14 -175 121 419 -117 44 332 166 -196 12 215 -223 67
6595 67 127 9 178 -64 -243 63 -229 -56 -42 -13 322 60 53 72 176 -179 25 -111 -136 -264 3 -98 47
6618 47 238 125 252 -119 301 -379 76 196 131 119 112 126 -41 -5 108 3 -34 296 -23 -164 -83 -171 195
6641 195 224 272 285 62 145 -21 36 -31 131 54 -146 266 -242 -173 171 -115 -356 51 268 -72 268 141 110
6664 110 -115 226 -22 -425 -104 212 -12 -290 38 -50 -4 -18 254 -73 -84 221 -190 162 -167 -60 17 -50
6686 -50 -45 -416 23 245 -140 -138 261 -20 -7 145 -93 -122 291 255 147 38 -79 -245 -98 398 107 -465 38
6709 38 108 -211 -147 378 254 6 380 -152 135 112 213 36 87 -94 -149 -65 171 275 -56 -255 305 -155
6731 -155 -443 36 -97 -422 -105 -1 -289 -252 -250 -119 -57 163 101 -125 -169 52 -360 -64 199 -2 -151 73
6753 73 469 288 29 214 -70 1 149 105 -50 289 200 -67 68 -281 -203 -90 138 -29 -60 140 9 -85
6775 -85 -58 24 -187 213 228 -233 81 5 215 41 236 158 141 53 -25 253 234 -23 116 183 -22 6 -161 -52
6799 -52 267 149 -4 191 243 -207 186 -70 -113 -132 88 5 -146 -62 186 -36 -93 78 -89 33 342 161
6821 161 -244 89 -86 -272 -185 103 -50 51 113 72 -219 -34 126 -101 222 -107 -91 -213 112 28 142 -140
6843 -140 -360 -95 -50 257 -167 -402 136 105 -211 -29 138 -129 143 -371 -261 -413 -168 5 -452 107 -113
6864 -113 -54 51 -43 66 226 -101 120 -114 -43 -10 294 -28 219 257 -233 -61 4 9 -14 -86 43 -251 -73
6887 -73 -148 -387 -2 65 81 320 301 -228 180 17 -35 -54 100 216 -8 -96 -23 -84 51 -226 -37 137 -8
6910 -8 54 43 11 -45 -27 134 208 -318 -149 -154 -29 -131 99 19 172 -330 143 35 97 99 28 0 170 69 -326
6935 -326 201 -215 38 -2 -376 176 -205 -165 80 -39 -153 -10 -12 -205 233 -152 -64 131 -26 -192 -90 52
6957 52 -167 -61 48 101 -53 75 133 -93 -320 -199 -152 -56 84 178 -239 -133 195 198 -105 155 -139 -268 -9
6980 -9 235 136 -94 -106 -296 32 201 108 -32 5 -49 153 -223 181 68 -103 345 -43 -15 -92 84 51 -139
7003 -139 191 18 -145 153 -106 -95 -27 -195 -257 -127 -8 -1 139 28 -254 -106 92 27 -142 -135 115 50 -8
7026 -8 -151 -1 -436 88 -237 64 43 63 158 -267 -259 207 74 124 6 -133 63 -177 13 -76 233 142 -77
7049 -77 -104 166 -366 -60 12 -278 71 -322 -49 -127 92 257 98 -221 161 -73 -247 -140 18 -62 -203 209
7071 209 -130 -51 240 -290 69 -95 88 33 -261 -437 -228 98 156 116 2 43 42 -33 -127 45 -47 271 49
7094 49 -152 -406 -295 -41 43 16 -112 21 -105 183 115 -134 -84 4 -278 -38 77 -135 102 -89 -126 -146 -25
7117 -25 -9 -138 74 156 437 -105 -262 29 -55 89 203 34 -232 -77 -96 -76 203 94 -165 -17 -151 64
7139 64 -59 27 -72 -20 153 226 110 -6 202 60 -329 -73 -267 118 -245 250 -54 -82 208 -78 121 149
7161 149 382 42 -46 227 76 63 88 163 -248 126 141 -61 49 191 -145 -191 77 -127 31 248 -163 -284
7183 -284 -16 6 174 -82 265 -22 -112 -160 58 -200 90 122 -224 -240 63 -165 38 -275 -138 -52 -387 131
7205 131 -130 -156 21 -265 -168 -177 224 301 -131 1 -34 -298 246 4 -147 19 68 -394 -86 -132 287 -47 172
7228 172 186 -56 215 -66 301 -255 202 -112 -138 -84 315 180 -13 -74 -31 210 -164 -158 -452 97 -208 201
7250 201 103 -175 -81 79 -43 205 -364 100 -38 5 -332 125 -129 -433 139 80 -81 229 30 -215 -43
7271 -43 48 196 -71 61 73 -232 -228 -185 -223 47 -9 -338 13 207 4 85 -89 79 46 -157 -23 -143 -50 24
7295 24 -224 94 138 245 98 -466 -104 -302 -100 88 -151 -79 176 99 2 -112 -250 -26 95 40 306 -162
7317 -162 -128 42 -122 -201 -18 -169 -188 -146 -100 244 144 162 41 -177 178 239 -73 -23 44 -173 -91 -236 41
7340 41 43 426 -13 -617 -35 107 -191 -109 35 161 -94 187 10 392 142 338 214 -233 -174 -112 88 152
7362 152 213 17 108 -79 -219 22 -42 -74 -14 212 8 -85 67 15 328 -46 95 -109 -70 -136 -61 -298 105
7385 105 260 -71 -43 84 -81 -25 -248 42 -9 35 184 98 -339 56 67 -135 22 299 -129 -41 197 -67
7407 -67 -39 131 103 -90 58 280 -267 -109 343 -1 271 32 338 -127 0 -77 -241 222 168 -162 -116 126
7429 126 -199 -253 -235 -139 -96 68 256 53 142 12 -211 -28 33 16 -106 62 168 9 -155 55 106 -170 276
7452 276 173 -168 23 13 126 99 227 149 355 233 97 61 -91 -145 -212 -113 151 127 102 249 160 -28 82
7475 82 36 7 -187 84 13 -135 143 -54 -253 -12 32 184 -125 -171 -155 -117 161 323 69 71 209 212 -98 -18
7499 -18 19 -29 -13 29 -223 -124 144 63 78 9 9 -131 -187 59 13 -116 -159 222 -71 -73 -70 -63 12 -77 -25 -52 16 167
7527 167 -48 234 105 35 216 45 54 -129 -80 57 98 54 -115 265 81 54 -36 -97 85 129 -65 -107 -23 -7
7551 -7 -45 -118 43 90 109 -76 -13 16 -22 -272 94 228 -68 118 131 35 -313 117 -97 -48 -140 43 55 -83 119
7576 119 -140 -18 117 -95 -198 71 245 -230 259 231 90 98 -67 168 -172 103 181 161 26 -244 -141 -228
7598 -228 -81 -67 -89 142 -108 183 65 -274 -50 -199 127 231 -432 -297 -35 174 56 204 -48 -209 -160
7619 -160 97 -161 -127 188 181 -92 -216 136 -62 118 128 13 1 -87 -107 -236 -51 68 42 -62 25 103 -199
7642 -199 -23 -185 -180 -172 -19 63 169 -38 -122 -129 -198 429 13 -265 -13 -185 147 125 -49 -16 -57 265 -4 -143
7666 -143 155 152 36 17 -74 -29 236 151 -11 47 122 252 280 187 -130 152 -67 15 94 165 440 -171 -70 -110 15
7691 15 -119 59 309 120 16 -16 10 266 355 231 -189 -127 -113 188 -109 181 133 -18 -226 29 47 -59 -163
7714 -163 -59 143 197 176 26 -70 55 -30 -192 121 59 9 339 58 -69 144 158 -225 286 146 171 -164 53
7737 53 -46 -279 108 -44 37 -219 105 -2 -25 51 128 -248 74 193 -200 -9 82 -11 -202 73 -272 -201 -133
7760 -133 -95 -423 254 -95 73 0 -61 242 -185 55 113 284 -72 99 233 215 -54 -116 156 156 1 -159 157
7783 157 -43 -420 -264 -73 13 54 -107 -63 -85 -153 185 1 -224 120 -208 -88 22 -50 -119 -47 -102 54 58 -105
7807 -105 156 219 -207 216 -90 -110 375 171 97 -225 158 158 324 -2 -235 72 9 111 -42 -185 -92 59
7829 59 128 285 -96 301 256 17 135 -109 180 189 183 -212 247 -65 230 163 -21 -57 205 -102 -169 -151 -391 -385
7853 -385 109 -134 42 -127 8 -357 7 -66 54 -57 309 135 -250 -60 53 -249 -431 -93 -107 -196 -61
7874 -61 95 268 44 147 -36 -102 -125 -301 -161 318 226 -109 -111 -13 -101 159 -101 -64 -107 -310 245 -123 15
7897 15 54 -130 -286 -208 -91 -217 168 114 61 42 -86 -430 -476 -83 -20 -235 -46 35 72 -252 226 -175 -263 77
7921 77 -18 -62 -218 -45 -6 42 -59 -137 39 205 -115 165 29 113 -65 -28 -90 -377 -5 421 174 -348 -46
7944 -46 3 -123 81 195 132 26 185 405 -4 -6 -142 19 136 71 245 -68 28 85 -70 17 4 5 -39 137
7968 137 -197 -160 32 -27 -75 131 18 21 -278 130 -8 -254 -404 77 -44 143 360 -304 105 20 176 38
7990 38 -118 189 -181 50 26 117 80 156 -261 -23 224 235 -80 95 -205 34 -11 138 -6 -92 38 75 170
8013 170 -159 14 -251 -209 -32 162 -66 -170 60 -224 -58 371 98 -57 -141 439 209 141 258 -239 76
8034 76 98 -180 -87 -112 -213 -154 -205 -103 97 174 31 166 37 3 -55 137 -55 -12 7 48 86 -50 -111 26 -73
8059 -73 23 -359 -25 -132 36 277 -299 261 248 157 84 -128 64 -17 185 -19 33 -47 -176 82 -260 -88 -10
8082 -10 -162 -96 -39 -108 -237 208 -106 -114 157 115 -55 64 -223 -84 -181 53 -247 154 67 3 321 -93 143
8105 143 144 -109 -81 45 -17 265 258 -113 -38 187 -207 -19 35 99 -292 280 -86 -131 -417 -149 44 -196 -16
8128 -16 -280 56 -56 59 175 157 320 -28 -51 -61 194 -242 277 -211 -154 -145 -56 96 -338 -150 -101 -367 -24
8151 -24 113 -61 385 -151 144 -194 -208 185 205 18 77 -21 -120 25 -122 -39 188 135 -33 -28 42 351 93 75
8175 75 -243 -91 -3 186 149 139 -153 1 -48 139 -3 148 -140 -161 137 -33
8191c3
##END NTUPLES=NMR FID
##END=
