##TITLE=1H_EC-3210(21)
 CDCl3, 8 sc, 
 21.11.2019
##JCAMPDX= 6.0         $$ Bruker NMR JCAMP-DX V2.0
##DATA TYPE= NMR FID
##DATA CLASS= NTUPLES
##ORIGIN= UXNMR, Bruker Analytische Messtechnik GmbH
##OWNER= root
$$ XWIN-NMR		Version 3.5
$$ Thu Nov 21 13:58:51 2019 Russian Standard Time (UT+4h)  she@DPX200
##.OBSERVE FREQUENCY= 200.1315
##.OBSERVE NUCLEUS= ^1H
##.DELAY= (6, 6)
##.ACQUISITION MODE= SIMULTANEOUS
##.ACQUISITION SCHEME= undefined
##.AVERAGES= 8
##.DIGITISER RES= 18
##SPECTROMETER/DATA SYSTEM= spect
##.PULSE SEQUENCE= zg30
##.SOLVENT NAME= CDCl3
##.SHIFT REFERENCE= (INTERNAL, CDCl3, 0, 15.7039)
##AUDIT TRAIL= $$ (NUMBER, WHEN, WHO, WHERE, WHAT)
$$ ##TITLE= Audit trail, XWIN-NMR		Version 3.5
$$ ##JCAMPDX= 5.01
$$ ##ORIGIN= Bruker BioSpin GmbH
$$ ##OWNER= she
$$ F:/spectra/data/she/nmr/H-F/1/audita.txt
$$ ##AUDIT TRAIL=  $$ (NUMBER, WHEN, WHO, WHERE, WHAT)
(   1,<2019-11-21 13:57:55.65 +0400>,<she>,<DPX200>,
      <created by zg, POWCHK disabled, PULCHK disabled
       configuration hash MD5:
       00 E9 B6 7A A2 85 ED C7 34 08 36 98 17 FE 4E 26
       data hash MD5: 16K
       C8 FF B4 66 C9 22 F3 0B 64 74 74 9D D5 B4 9E BF>)
$$ ##END=
$$ 
$$ hash MD5
$$ 67 24 CD F2 B8 E4 A4 F9 83 DD 0E 47 A1 A6 69 7C
##$RELAX= 
##$RELAX= 
##$RELAX= 
##$RELAX= 
##$RELAX= 
##$RELAX= 
$$ Bruker specific parameters
$$ --------------------------
##$DU= <F:/spectra>
##$EXPNO= 1
##$NAME= <H-F>
##$PROCNO= 1
##$TYPE= <nmr>
##$USER= <she>
##$AMP= (0..31)
100 100 100 100 100 100 100 100 100 100 100 100 100 100 100 100 100 100 
100 100 100 100 100 100 100 100 100 100 100 100 100 100 
##$AQSEQ= 0
##$AQ_mod= 1
##$AUNM= <au_zg>
##$AUTOPOS= <>
##$BF1= 200.13
##$BF2= 200.13
##$BF3= 200.13
##$BF4= 200.13
##$BF5= 200.13
##$BF6= 200.13
##$BF7= 200.13
##$BF8= 200.13
##$BYTORDA= 1
##$CFDGTYP= 0
##$CFRGTYP= 5
##$CHEMSTR= <none>
##$CNST= (0..31)
1 1 145 1 1 1 1 1 1 1 1 1 1 1 1 1 1 1 1 1 1 1 1 1 1 1 1 1 1 1 1 1 
##$CPDPRG= <>
##$CPDPRG1= <>
##$CPDPRG2= <>
##$CPDPRG3= <>
##$CPDPRG4= <mlev>
##$CPDPRG5= <mlev>
##$CPDPRG6= <mlev>
##$CPDPRG7= <mlev>
##$CPDPRG8= <mlev>
##$CPDPRGB= <>
##$CPDPRGT= <>
##$D= (0..31)
0 1.2 0 0 0 0 0 0 0 0.06 0 0.03 0 0 0 0 0.0002 0 0 0 0 0 0 0 0 0 0 0 0 
0 0 0 
##$DATE= 1574330274
##$DBL= (0..7)
120 120 120 120 120 120 120 120 
##$DBP= (0..7)
150 150 150 150 150 150 150 150 
##$DBP07= 0
##$DBPNAM0= <>
##$DBPNAM1= <>
##$DBPNAM2= <>
##$DBPNAM3= <>
##$DBPNAM4= <>
##$DBPNAM5= <>
##$DBPNAM6= <>
##$DBPNAM7= <>
##$DBPOAL= (0..7)
0.5 0.5 0.5 0.5 0.5 0.5 0.5 0.5 
##$DBPOFFS= (0..7)
0 0 0 0 0 0 0 0 
##$DE= 6
##$DECBNUC= <off>
##$DECIM= 24
##$DECNUC= <off>
##$DECSTAT= 4
##$DIGMOD= 1
##$DIGTYP= 9
##$DL= (0..7)
0 120 120 120 120 120 120 120 
##$DP= (0..7)
150 150 150 150 150 150 150 150 
##$DP07= 0
##$DPNAME0= <>
##$DPNAME1= <>
##$DPNAME2= <>
##$DPNAME3= <>
##$DPNAME4= <>
##$DPNAME5= <>
##$DPNAME6= <>
##$DPNAME7= <>
##$DPOAL= (0..7)
0.5 0.5 0.5 0.5 0.5 0.5 0.5 0.5 
##$DPOFFS= (0..7)
0 0 0 0 0 0 0 0 
##$DQDMODE= 0
##$DR= 18
##$DS= 0
##$DSLIST= <SSSSSSSSSSSSSSS>
$$ [...]
##$SUBNAM2= <"">
##$SUBNAM3= <"">
##$SUBNAM4= <"">
##$SUBNAM5= <"">
##$SUBNAM6= <"">
##$SUBNAM7= <"">
##$SUBNAM8= <"">
##$SUBNAM9= <"">
##$SW= 24.9337058887773
##$SWIBOX= (0..15)
0 0 2 0 0 0 0 0 0 0 0 0 0 0 0 0 
##$SW_h= 4990.01996007984
##$TD= 16384
##$TD0= 1
##$TE= 0
##$TE2= 300
##$TE3= 300
##$TEG= 300
##$TL= (0..7)
0 120 120 120 120 120 120 120 
##$TP= (0..7)
150 150 150 150 150 150 150 150 
##$TP07= 0
##$TPNAME0= <>
##$TPNAME1= <>
##$TPNAME2= <>
##$TPNAME3= <>
##$TPNAME4= <>
##$TPNAME5= <>
##$TPNAME6= <>
##$TPNAME7= <>
##$TPOAL= (0..7)
0.5 0.5 0.5 0.5 0.5 0.5 0.5 0.5 
##$TPOFFS= (0..7)
0 0 0 0 0 0 0 0 
##$TUNHIN= 0
##$TUNHOUT= 0
##$TUNXOUT= 0
##$USERA1= <user>
##$USERA2= <user>
##$USERA3= <user>
##$USERA4= <user>
##$USERA5= <user>
##$V9= 5
##$VALIST= <valist>
##$VCLIST= <CCCCCCCCCCCCCCC>
##$VD= 0
##$VDLIST= <DDDDDDDDDDDDDDD>
##$VPLIST= <PPPPPPPPPPPPPPP>
##$VTLIST= <TTTTTTTTTTTTTTT>
##$WBST= 1024
##$WBSW= 4
##$XGAIN= (0..3)
0 0 0 0 
##$XL= 0
##$YL= 0
##$YMAX_a= 174216
##$YMIN_a= -58686
##$ZGOPTNS= <>
##$ZL1= 120
##$ZL2= 120
##$ZL3= 120
##$ZL4= 120
##$ABSF1= 10
##$ABSF2= 0
##$ABSG= 5
##$ABSL= 3
##$ALPHA= 0
##$AQORDER= 0
##$ASSFAC= 0
##$ASSFACI= 0
##$ASSFACX= 0
##$ASSWID= 0
##$AUNMP= <proc_1d>
##$AZFE= 0.1
##$AZFW= 0.1
##$BCFW= 1
##$BC_mod= 2
##$BYTORDP= 1
##$COROFFS= 0
##$CY= 11.3945322036743
##$DATMOD= 1
##$DC= 2
##$DFILT= <>
##$DTYPP= 0
##$F1P= 16.9975609425685
##$F2P= -3.02152046262296
##$FCOR= 0.5
##$FTSIZE= 0
##$FT_mod= 4
##$GAMMA= 1
##$GB= 0.15
##$INTBC= 1
##$INTSCL= 1
##$ISEN= 128
##$LB= 0.24
##$LEV0= 0
##$LPBIN= 0
##$MAXI= 10000
##$MC2= 0
##$MEAN= 0
##$ME_mod= 0
##$MI= 1.114404
##$NCOEF= 0
##$NC_proc= 0
##$NLEV= 6
##$NOISF1= 3.799351
##$NOISF2= 2.8
##$NSP= 1
##$NTH_PI= 0
##$NZP= 0
##$OFFSET= 15.70392
##$PC= 1
##$PHC0= -9800.922
##$PHC1= 33.20086
##$PH_mod= 1
##$PKNL= yes
##$PPARMOD= 0
##$PSCAL= 0
##$PSIGN= 0
##$REVERSE= no
##$SF= 200.130013532006
##$SI= 16384
##$SIGF1= 3
##$SIGF2= 2
##$SINO= 400
##$SIOLD= 16384
##$SREGLST= <1H.CDCl3>
##$SSB= 0
##$STSI= 0
##$STSR= 0
##$SW_p= 3612.71676300578
##$SYMM= 0
##$S_DEV= 0
##$TDeff= 0
##$TDoff= 0
##$TI= <>
##$TILT= no
##$TM1= 0
##$TM2= 0
##$TOPLEV= 0
##$USERP1= <user>
##$USERP2= <user>
##$USERP3= <user>
##$USERP4= <user>
##$USERP5= <user>
##$WDW= 1
##$XDIM= 8192
##$YMAX_p= 0
##$YMIN_p= 0
$$ End of Bruker specific parameters
$$ ---------------------------------
##NTUPLES= NMR FID
##VAR_NAME=  TIME,          FID/REAL,        FID/IMAG
##SYMBOL=    X,             R,               I
##VAR_TYPE=  INDEPENDENT,   DEPENDENT,       DEPENDENT
##VAR_FORM=  AFFN,          ASDF,            ASDF
##VAR_DIM=   8192,          8192,            8192
##UNITS=     SECONDS,       ARBITRARY UNITS, ARBITRARY UNITS
##FACTOR=    0.0002004,     1,               1
##FIRST=     0,             0,               0
##LAST=      1.6414764,     0,               0
##MIN=       0,             -58686,          0
##MAX=       1.6414764,     174216,          0
$$ Real data points
##PAGE= N=1
##DATA TABLE= (X++(R..R)), XYDATA
$$ [...]
2760A809m638K461K739m257j18M926l391k994M732P08m875J978L487m274j56M530
2776B667k868l210M624R52n264K422L305l717j097M683k189l156M550M47m816
2791b667J997L998m226j340M296j111l371L885R20m907J971L886m194j577M752
2806B312j240l737L733J527m915J724L867l778k063N064q62m190L291J795m289
2821a761J104L855l734j919M918l69m730L154K205m426R10L772l356k340N270
2836B553q00m693L026L049m571N2L898k838k262M905n58m779L016L113m764m45
2852b098M422k424k382M107j12m951L276L349m934n60M271j563l208L553Q19m361
2868b796K615K791m554m66M886j870l589L428J159m036J830L327m360j010M973
$$ plain form
2760 1809 -2829 -368 2371 -1886 -2004 2922 -469 -3463 1269 1977 -2898 -920 2567 -1707 -1863 2667
2776 2667 -201 -3411 1213 2165 -3099 -677 2628 -1089 -2186 2497 308 -2848 1702 2149 -2667
2791 -2667 -670 3328 -898 -2238 2058 947 -2424 1461 2381 -2526 -555 3331 -863 -2440 2312
2806 2312 1072 -2665 1068 2595 -2320 -596 3271 -507 -2570 2494 1632 -2558 733 2528 -1761
2821 -1761 -657 3198 -536 -2455 2463 2094 -2636 518 2723 -1703 -793 2979 -377 -2717 2553
2836 2553 1753 -2940 86 3135 -1436 -1384 2514 -324 -2586 2319 1761 -3018 -2 3111 -1653 -2098
2852 -2098 2324 -100 -2482 1625 1513 -3438 -162 3187 -1747 -2307 1964 401 -2807 746 1565 -2796
2868 -2796 -181 2610 -1944 -2410 2476 606 -2983 445 1604 -2432 -602 2725 -1635 -2645 2328
2883B328j629l695L433J360m264J225L706l792j057M585j509l969L615J891m609
2898b381J085L723l448j597M587j039m383L818K100m606Q16M232l342j928M399
2913B036j161l836L628K225m892M32M181k608k325M149m58l783L083J951m808
2928b186O54M674l020k779M344K66m115K577K275m203r0M876k758l258M380O53
2944B290m382K353K465m167K41M399k816l285M595R28m544J286L374l703n26M446
2960B954k579l341M625Q60m658J448L401l459j139M281k038l177L943J397m782
2975b264J291L894l278j776M189j115l393L338J319m522J166L920l331k160M543
2990A821m51l862K932J436m285J143L968l424k193M623q3m133K530J853l895O30
$$ plain form
2883 2328 699 -2996 437 1797 -2467 -1242 2464 -1328 -2385 2200 691 -3278 337 2228 -2381
2898 -2381 -1296 2427 -1021 -2618 1969 930 -3453 365 2465 -2141 -1325 2907 -435 -2363 2036
2913 2036 875 -2961 667 2892 -2000 -1568 2613 5 -2320 1829 1371 -2412 671 2622 -2186
2928 -2186 -1532 3142 122 -2657 1687 1953 -2162 415 2690 -1513 -1603 3273 515 -2743 1637 2290
2944 2290 -2092 261 2726 -1441 -1200 3199 383 -2902 1693 2621 -1923 -637 2737 -966 -1492 2954
2960 2954 375 -2966 1659 2519 -2139 -691 2710 -749 -1888 2393 355 -2822 1121 2518 -2264
2975 -2264 -973 2921 -357 -2133 2056 941 -2452 886 2205 -2317 -1151 2769 -562 -2722 1821
2990 1821 1370 -2492 440 1876 -2409 -1266 2702 -722 -2915 1708 1625 -2508 22 1875 -2020 -1390
3006a390L689k804k349M452l14m119K546K302l772J39L931k960k317M455Q7m473
3022b897K342K652l605k74L866k358k532M546j20m479K484K924l667q89M202j866
3038C29l173M501O3m425K136L528m215q41M109j359k935L244P16m169K326L178
3054C013m092q07M281j662l054L155J042l778J437L514l793j691M986j467l359
3069b275L080J261l639J031L477l640j172M586j515l604K941J786l833Q53L280
3084B617l022j322M023q46l893L005K413m487L25M052k738k203M263r08m120L275
3100D34K340m480o5L863k055k183L621m40l315K709K354m491j77M069j883k563
3116b262L178O62l896K034K807m198j38M424k169l085L450P99l557J546K596l995
$$ plain form
3006 -1390 2299 -505 -2854 1598 1284 -2835 -289 2013 -1759 -1620 2311 -649 -2966 1489 1576 -2897
3022 -2897 -555 2097 -1508 -1782 2084 -274 -2806 1740 1620 -2859 -375 2549 -1118 -2007 2195 329
3038 329 -2844 1657 1720 -2705 -569 2959 -1256 -2097 2012 653 -2282 962 1678 -2491 -165 3013
3054 3013 -1079 -1886 2395 733 -2321 834 1876 -1902 -465 3049 -744 -2435 2551 1084 -2275
3069 -2275 805 2066 -1573 -542 2935 -705 -1877 2709 1194 -2410 531 2317 -1516 -663 2617
3084 2617 -405 -1727 2296 1450 -2443 562 2975 -1512 -1187 2865 127 -2076 2187 1279 -2841 434
3100 434 2774 -1706 -1771 2092 37 -2146 1475 1035 -2280 429 2783 -1708 -1885 2184 301 -2262
3116 -2262 916 1578 -2318 -284 2523 -1675 -1813 2611 442 -2643 807 1606 -1951 -405 2191 -1804
3132a804j25M083j867l444L942J204m376J361L003l161q96L999j712l204L588
3147E91J401m311J354L004k707j490L812q13l581L505J554m480R13L473k661j951
3163b387M137j092l138L140J358m134P54L918k885k257M184m14l628K908J753
3178B217m257P19L800k569k145L640M78l910K237K024l605L05L831k775k152L661
3194A499N82m000K158J975l342L4L587k221k686L871N38m181J931K959l321l11
3210i28L157j967k446L953K64m035J318L444l422q26L544j488k463L122M87l716
3226b002J915K448k475j938M023r91k966L027O66l765J381L097l153j737M400
3241A930q88l191K438J668l851J254L000l117j419L887n15l793K600J830l416
$$ plain form
3132 -1804 -1929 2154 287 -3157 785 1989 -2387 -1026 1977 -1184 -2080 1919 207 -2997 591
3147 591 1992 -2319 -965 2039 -668 -2158 1654 841 -2740 765 2319 -2161 -1248 2225 -436 -2387
3163 -2387 1750 658 -2480 660 2018 -2116 -1362 2556 -329 -2586 1598 1184 -2444 464 2217
3178 2217 -2040 -1321 2479 -90 -2235 1405 1883 -2027 210 2234 -1371 -1066 2765 -10 -2162 1499
3194 1499 2081 -1919 239 2214 -1128 -1094 2493 272 -2414 1457 1995 -2186 -255 2704 -617 -928
3210 -928 2229 262 -2184 1769 2033 -2002 -684 2760 -662 -1488 2056 568 -1895 1227 1714 -2002
3226 -2002 -87 2361 -114 -2052 1971 980 -1986 1041 1707 -2058 -677 2420 -733 -2470 1930
3241 1930 1042 -2149 289 1957 -1894 -640 2360 -757 -2176 1711 1196 -2597 3 1833 -1583
3256a583O42K955k837j497M074m55m136K913J704l079J39L135k614j827L892j31
3272A295l816K490K109l619k00L483j872k062L418l60l499K419K321l449o51L950
3288A957j793k175L150ql268K074K362l647m54L775j318k847K682P02k959J396
3304c71K717l234q50L513j013l136L008R05l180J442K397l098q55M013j498l055
3320b295L031J156l242Q80K543k691p14L315j377l101K931K000l420R0L265k536
3336a65j488L538q29l100K933J529m017O26L158k368j349K982q22k670K669J605
3352B232l894N20L334j773k407L114q7k698K046J620l255j39L612k032k333L318
3368A178J68l421K162J612k836o1L266j862k809L272O43l081J288J852k725l7
$$ plain form
3256 -1583 -941 2014 -823 -2320 1754 1299 -2837 76 1780 -1299 -1160 1975 -639 -2466 1426 1295
3272 1295 -2521 -31 2078 -1541 -1741 1742 -130 -2192 1226 866 -2633 -214 2107 -1342 -1993 1957
3288 1957 164 -2011 1139 1131 -2137 -63 2299 -1348 -1802 1973 655 -2192 490 1192 -1767 -371
3304 -371 2346 -888 -1738 1775 762 -2374 634 1539 -1641 -199 2198 -900 -1755 2258 760 -2295
3320 -2295 736 1892 -1350 -470 2073 -618 -1332 1983 606 -2495 436 2436 -984 -894 2371 -165
3336 -165 -1653 1885 1056 -2044 889 2418 -1599 -973 2185 -183 -1532 1450 628 -2042 627 2232
3352 2232 -1662 -1142 2192 419 -1988 1126 1039 -1659 387 2007 -1248 -1387 2225 193 -2140 1178
3368 1178 1346 -2075 87 1699 -1137 -1198 2068 206 -2603 669 1312 -1769 -481 1371 -1354 -1391
3384a391L508j954k537L196M92l340J279K340k356j014L365j801k326L408Q28
3399A697l575O89K938k145j346L349j418k199K667P29l394J023K915k568j361
3414a999L157o70k440K556P50l415J021L417k930j458L296p71k231J972J536l364
3430a573Q89K765k525j449L279k11l094J983J729k883N56L097k796j914L742j3
3446A582l451J843K164k820j99K951k330j565L424q1l618K281J776k472o59L034
3462A860j632j897K761N06l648J952K489l064m39K716j202k212L035R4k967J589
3478e9K368k810j327L519j065k434K501Q37l075J311K239k608r45L219q55k791
3494a975K373P38k589J137K039k207j222L304q08l026K214J843l152O05K434k368
$$ plain form
3384 -1391 2117 163 -2374 822 1314 -2026 -747 1593 -763 -1777 1588 -213 -2539 869 1697
3399 1697 -1878 -1189 1749 -396 -1742 1607 189 -2010 657 1386 -2008 -985 1930 -638 -1999
3414 -1999 1158 488 -1952 604 1354 -2061 -1040 2377 -553 -2011 1285 514 -1717 255 1791 -1573
3430 -1573 -684 2081 -444 -1893 1386 1175 -1919 64 1793 -1090 -534 2563 -233 -2147 1595 1582
3446 1582 -1869 -26 2138 -682 -881 2070 -260 -1825 1599 1518 -2100 181 1957 -515 -1174 1860
3462 1860 228 -1669 1092 1598 -2050 -98 2391 -673 -1112 1604 402 -1810 1225 1319 -1648 -59
3478 -59 2309 -501 -1828 1691 626 -1808 693 1530 -1545 -234 2005 -603 -1548 1671 816 -1975
3494 -1975 398 1136 -1453 -316 1723 -484 -1706 1598 790 -2236 -22 1821 -1331 -726 1708 -660
3510f60j178L205r62k833K531J703l147K9L029k180j289K870o20k668J689K214
3526A733k993n0K991j843j442K546k38k847J906J600k586k60L078j580j916K477
3542E76K91k432J680J707l332J64K960j785j789K874J96k711J553J765k904l38
3558a525L335j403k347K597Q04l211J365J867k365k71L048j280k558K638R81l157
3574a482P21K326j879o93K539p82l016K826Q98k966P67K540j999r59K423p21k075
3591a532K432J092l489J091K332j910j064K266p01j987K078J110l303R75K662
3606B052j847j562K605j92k646K165R61k520K46K839k088j802K831N11l258J953
3622B48J392k669K62K398j753j668K773L86l334J543K031k616L7K351j513j542
$$ plain form
3510 -660 -1838 1367 405 -2428 103 1806 -1341 -1312 1717 -463 -1752 1118 498 -2170 -481 1733
3526 1733 -1260 -1310 1681 -162 -1604 942 704 -2143 -237 1363 -1223 -1483 1595 15 -1901 576
3542 576 867 -1565 115 1822 -1510 -1346 1614 -171 -1960 914 1110 -1601 -48 1717 -1187 -1525
3558 -1525 1810 407 -1940 657 1461 -1750 -385 1482 -883 -1154 1894 614 -1944 694 1675 -1482
3574 -1482 -761 1565 -314 -1007 1532 750 -2266 560 1458 -1508 -741 1799 -200 -1159 1264 543 -1532
3591 -1532 900 1992 -1497 -406 1926 16 -1048 1218 517 -1470 608 1718 -1585 -610 2052
3606 2052 205 -1357 1248 1056 -1590 575 1536 -984 -738 2101 13 -1789 1042 1553 -1705 248
3622 248 1640 -1029 -767 1631 -122 -1790 983 1369 -1965 -422 1609 -1007 -970 1381 -132 -1674
3638a674K521J64l039J421K285k362o78K711j030k139K541K12k699J318K014k211
3654f45j046K982j051j901K282P54l019J352K039k582r23K828n77k401K056R50
3670A098k528Q49K408k502r56K757k66k595J882J092k447M17K351k141j062K561
3686I18M3l039J854J723k649M05K001j594j352K999l29k555J796J052k096j15
3702i38K588j819j285K568j13k568J708J804k854j69K816j441j850K838l63k182
3718a260J325J842k856m1K622r55j867K110Q0k194J315J666k315p53L010j025
3734G04j785J358R72k305J108J629k453l0K243q55k125K280P61k771P54K088k077
3751e04m22K455r21k591K442Q12k458M52K347k124r56K707p03k525K356J283l071
$$ plain form
3638 -1674 847 1011 -2028 -607 1678 -684 -1362 1349 319 -1820 721 933 -1766 -448 1566 -645
3654 -645 -1691 1291 240 -1661 621 1375 -1644 -292 1747 -835 -1758 1070 493 -1908 148 1098
3670 1098 -1430 -581 1827 -675 -1631 1126 860 -1735 147 1239 -1208 -791 1560 -581 -1643 918
3686 918 961 -2078 -224 1499 -1150 -745 1256 -338 -1690 1309 980 -1575 221 1273 -823 -938
3702 -938 1650 -169 -1454 1114 1001 -1567 141 1945 -909 -1078 1738 297 -1553 1285 922 -1260
3718 -1260 65 1907 -949 -990 1632 677 -1190 920 1000 -1194 121 1787 -528 -1281 1729 704
3734 704 -1081 277 1249 -1056 52 1681 -772 -802 1441 586 -1539 741 1502 -1269 -515 1573 -504
3751 -504 -926 1529 608 -1983 459 1271 -1187 -735 1612 -512 -1468 1239 536 -1989 367 1650 -1421
3768a421P72J948j745j368K828o42k321K135J123k484K18K498j553j384K396k86
3784G14k295J900O85k691L74K847j807j464K274K33k276J369J612k794K41K444
3800A366j296j940K369O01k814J137J724j845j40K229j343j657K692K42k752J044
3816c83J756k152n04K829j712j381K108O85k216N20K042j969o11K351q16k254
3832a707K749K47k579Q85K053j824r91K343l68k411K327Q75k674Q19K063j837
3848c0j309K298o0j964J383P75k241Q23J880j961j365K949q5k224J526J110k694
3865a189O39K376j984j355K601Q3k405J506J261k060p0K118j641j371K474J59
3881A142k484J077J806k394q4K199j490j495K651K30k579J231J576j999o80K240
$$ plain form
3768 -1421 -649 1299 -446 -1814 1014 372 -1949 186 1309 -1175 -957 1541 -12 -1396 1000 714
3784 714 -1581 319 1004 -1687 -1313 1534 -273 -1737 537 770 -1506 -137 1475 -1319 -1078 1366
3800 1366 70 -1870 499 1100 -1714 -577 1147 -698 -838 1391 48 -1609 1083 1325 -1427 -383
3816 -383 1373 -779 -1283 1546 -166 -1547 561 1246 -970 -450 1592 -377 -988 1363 547 -1707
3832 -1707 1042 1289 -1290 -405 1648 -176 -1167 1176 808 -1603 724 1599 -1075 -256 1807 -30
3848 -30 -1339 959 899 -1065 318 1093 -1148 -325 1555 -406 -1771 1178 1093 -1131 395 1505 -1189
3865 -1189 -550 1826 -158 -1513 1088 1171 -1234 272 1533 -527 -597 1521 -120 -1491 983 1142
3881 1142 -1342 -265 1541 -853 -937 1262 -228 -1723 928 1158 -1421 -190 1386 -613 -1293 947
3897I47j013j375K039K29k275J118K052k378k10J840m80j900J690N62k031P76
3913d09J799j958r71K499l92k068J564P01k251J160J489j794p38K285l11k337
3929a732J832P97j873K14J978j923o95K414m75k326J887R07j938J42J814j226
3945b03j112K445n86k130J740J510k547J40K197j666q81K043l39k218J532J546
3961A471k430k64K567j257j249J988r6j820J233J468k556l74K582r73j519K146
3977I17J34k030Q07J745k609J22K612j373j654K010O33k091P27J399k079p7K448
3994A641j294k010K257Q33k711P78J788j698m75K169p39k099K173Q18k770R23
4010d16J691j584p88K194r56j672J917O25k098N09K044j701q03J713m48j695J760
$$ plain form
3897 947 -66 -1441 598 827 -1448 -330 1722 -656 -866 974 494 -1406 284 846 -1185 -409
3913 -409 1390 -568 -1539 960 568 -1500 64 765 -1486 -326 1163 -631 -1369 916 605 -1732
3929 -1732 100 897 -976 -762 1216 -707 -1402 1012 537 -1789 98 1005 -933 -791 1023 -203
3945 -203 -1315 1130 544 -1586 154 1664 -883 -743 1454 -212 -1093 950 611 -1607 -75 1471
3961 1471 -959 -1223 1344 87 -1162 826 730 -1090 143 1611 -945 -1319 1263 290 -1229 917
3977 917 1051 -979 -172 1573 -1036 -914 1698 325 -1329 681 1314 -777 -50 1349 -730 -807 1641
3994 1641 347 -1663 594 1427 -1284 -506 1282 -416 -891 1278 539 -1560 613 1431 -1339 -416
4010 -416 1275 -309 -1097 1097 141 -1531 386 1011 -1087 -578 1466 -235 -1038 675 227 -1468 292
4027B92R04k345L03K125j403j600K447K14k457J560J014j936r1K021r94j578K297
4044G73Q8k305J270J172k049M79J596r43j687K082N47k457R72J382j646j3J482
4061G43r00j520K361K30k092P91J665j896q3J989j324j170J633P36k310P83J696
4078A332j639p60K106o25j449J869N1k244P80J963j178j407K505n97k032J757
4094D32P04k325O49J814j789o92K412n09j611J431O37j757M80J590j815p45K207
4111A113l01k084J330J000j920M94J771j269j146J991N9k052J168J082j737l28
4127h29J954j228j003J816J43j912J279J501k308n27J979j044o39J797l64j810
4143a195J002J523k123l96K697j022j812K004o2j811J219J373k509l7K339r62
$$ plain form
4027 292 1196 -1149 -846 1279 -124 -1724 723 937 -1520 40 1054 -882 -973 1048 54 -1524 773
4044 773 861 -1444 -174 998 -1051 -572 1024 81 -1606 476 1023 -1434 -462 920 -726 -739 743
4061 743 -157 -1677 684 914 -1178 -387 1278 -618 -701 1288 -36 -1206 427 1163 -1147 -364 1332
4078 1332 -307 -1067 1039 414 -1035 834 885 -1359 -579 1384 206 -1201 1304 707 -1325 432
4094 432 1136 -1189 -540 1274 -515 -1207 1205 696 -915 516 1153 -604 -124 1466 -349 -1094 1113
4111 1113 812 -1272 58 1058 -862 -368 1403 134 -1012 979 1038 -1014 154 1236 -501 -829
4127 -829 1125 -103 -1106 710 853 -1059 220 1721 -587 -1114 865 -179 -818 979 615 -1195
4143 -1195 -193 1330 -793 -1189 1508 486 -1326 678 616 -1195 24 1397 -1112 -1149 1190 228
4159B28j382J281N94j891Q79J513j617p36K088o11j742J710N36j969L96J657j696
4176g62j96J866p34j735J609R79j971M35J391j363q43K180l99k047J660J203j998
4193g25j18J588p28j006J859p10j469J587O17j988K42J938j206r39J702k2j804
4210a182J362J037j992r5K027j107j242J912K51j814J151P41j849J31K119j268
4226A82j138J740J9j883J063J199j814J6J905j094j449K170L55k078J008R68j891
4243g22J5J904r77j512K125L46j919M42J803j607o42K065j026j539J664N22j958
4260a016O45J714j368q69J905m31j583J402O0j301M35J867j537j226K116k33j798
4277a218J396O20k181R81J719j411j224J947o2j499Q83J021j895L93J900j524
$$ plain form
4159 228 -1154 127 721 -1170 -291 1222 -395 -1131 957 346 -1396 314 850 -1119 -723 934 -762
4176 -762 -958 908 174 -1561 48 1027 -944 -509 882 -481 -1324 856 457 -1590 70 1273 -725
4193 -725 -843 745 17 -989 870 160 -1309 278 895 -1093 -851 1087 -119 -1058 644 622 -1182
4210 -1182 180 1217 -775 -870 1157 50 -1192 720 971 -843 308 1049 -800 -669 1450 182
4226 182 -956 784 803 -1080 -17 1182 -632 -616 1289 195 -1254 916 1271 -807 201 1169 -722
4243 -722 -707 1197 220 -1292 833 1179 -740 -298 1505 -102 -744 1321 295 -1244 420 942 -1016
4260 -1016 -371 1343 -25 -894 1011 580 -1003 399 459 -842 -407 1460 -77 -1303 813 580 -1218
4277 -1218 178 798 -1383 -402 1317 -94 -1318 629 567 -932 -49 972 -923 -530 1370 -154
4293a54r81J808j23j767J286R79j788jJ998j306j343K111j93j716J043J366k043
4310h24o9J533r71o53J521M6j580P17J576j602r16K173r20j242J666K93k067J264
4328e5J088j653l59J846o97j200J745k08j551N12J919j815l81J777o33j426J454
4345C63O10k113J046J200j196r89K016l96j444J006Q91j694K93J600j418p91K001
4362I85j69j601O90J213j780L18J663j329j135K302p36j629J531Q40j695P4J414
4379I56r94r89J766l7k005J534R26j625j43J719q85j222J870j96j662J110J248
4396A371k239K60J511m93j436J840l01j439J046Q62j694j39K156j122j435J463
4412B11M75j840P98J245j664k11K135q01j597J655O75k057O70J061j307q5J559
$$ plain form
4293 -154 -1135 673 550 -1217 69 1048 -740 -741 1257 -49 -1392 719 526 -1190 -147 1219 -824
4310 -824 -893 640 -331 -984 537 583 -997 -280 1296 -306 -1222 951 31 -1211 455 748 -1319 -55
4328 -55 1033 -620 -979 867 170 -1030 715 507 -1044 -532 1387 -428 -809 968 335 -1091 363
4345 363 973 -1140 -94 1106 -90 -1079 937 541 -903 103 994 -700 -407 1193 -225 -1016 985
4362 985 816 -785 -95 1118 -662 -344 1319 -10 -1145 1157 421 -1208 323 1163 -532 -458 956
4379 956 -38 -1027 739 702 -1303 231 1157 -468 -611 1108 223 -999 871 675 -987 123 1371
4396 1371 -868 -608 903 410 -1026 814 513 -926 120 982 -712 -851 1305 183 -1252 211
4412 211 686 -1154 -356 889 -775 -986 1149 348 -1249 406 1081 -976 -306 755 -552 -637 922
4429I22o20j488J512Q55k108N59J480j480o58J933p95j609J818P31k168M20J489
4446G93j212p19J850n40j514J581Q03k063K62J780r15j086J692j11j869J479R62
4463A173j722k06J638p39j284J811k9j960J140J287j822K36J478q25j142J674
4479G08L45j992Q32J102j301l71J618j009r18J638M14j933O44J516j521k93J280
4496G59n41j385J865K67j973P52J553j496o67J955p00j241J415J66j343J25J610
4513A121j284p07J668l83j176J146M07j950Q02J840j671j132K232m41j256J022
4529B38O92j808L53J574j552p49K088k73j638J283P30j682L75J503j561m72J318
4546D19P5j474R75P86j572L80R99q14r66J516L82j665N09J097j396J0J774j082
$$ plain form
4429 922 302 -1186 326 1181 -927 -368 1112 -368 -1026 907 112 -1497 321 1052 -1116 -696 793
4446 793 -419 -1138 712 172 -1342 239 1042 -1021 -759 1021 106 -980 712 601 -1268 211 1173
4463 1173 -549 -755 883 144 -1140 671 642 -1318 -178 1109 -713 -477 1001 176 -966 708
4479 708 1053 -939 -107 995 -306 -677 941 -68 -986 652 1066 -867 -223 1293 -228 -521 759
4496 759 218 -1167 698 965 -1008 -256 1297 -199 -866 1089 389 -852 563 729 -614 -489 1121
4513 1121 -163 -870 798 415 -761 385 792 -1158 -356 1484 -187 -1319 913 472 -784 238
4529 238 930 -878 -525 1049 -503 -1252 836 563 -1075 208 938 -744 -369 1134 -427 -899 419
4546 419 494 -980 -5 781 -791 -411 588 -226 -1192 324 706 -959 -450 647 -749 -739 1035 -47
4564d7j026J339Q1j705R08J446j699j32J580o46j401J821P3j844J223J140j793
4581f82l87J871n03j320J276N32j650Q35J012j322n25J889q46j056J064N88j754
4598i78P87J302j511o34K112q37j221J060Q88j416J86J393j296n23J485n93j202
4615i98J386O29j741J64J415r51q58J704k64j200J030O81j395k51J771o28j070
4632e76J297m32j078J161Q30k006K15J841j017j244J783k02j819J552M50j420
4648f65Q2J769q71j501J717L80j853J108O66j467k72J907j041r14J650j14j326
4665g45J08J549j644rJ622o60j390J522M44j680M98J344j409k03J503p61r21J154
4683C22M26j722M27J561j157p58J613o14q09Q67P85j962M51J404j168p51J567
$$ plain form
4564 -47 -1073 266 347 -1358 -450 996 -703 -835 745 99 -1302 519 592 -1252 -29 1111 -682
4581 -682 -1069 802 299 -1021 255 787 -863 -28 984 -338 -863 1026 180 -876 188 776 -978
4598 -978 -191 1111 -400 -1034 1078 241 -980 80 968 -448 -262 1131 -165 -688 797 204 -998
4615 -998 388 1017 -724 -560 855 -96 -954 750 486 -714 316 997 -398 -649 1122 494 -576
4632 -576 721 289 -789 372 1202 -804 -589 1252 235 -1009 774 572 -1247 305 755 -665
4648 -665 -583 1186 315 -1186 531 911 -942 166 832 -635 -907 1000 -41 -955 695 581 -745
4665 -745 -637 912 -732 -741 881 221 -1169 353 797 -883 -385 959 -450 -653 850 89 -832 322
4683 322 748 -974 -547 1014 -143 -901 712 98 -711 156 941 -1021 -570 834 -334 -1085 482
4700D82j3j011N88Q23j868L83J551j323n34J313L02j494J120L74j214L69J224
4717A072j164p67J573j39j866J025R02q91l08J653j045q64J760k34j671P44Q72
4734F52j241P8J293p16r67J367J89j482Q00Q75j174j51J364n18j249J392j9j322
4752h29O02J084j187q1R56l66q80J448l43j080N10J313j515k44J628m46j332J139
4770C77K88j432M10J447j334n80J501m24r56P32Q21j651M66R76q64m22J603q65
4788I3j107J210O86j466L25J221j441o2J339n22j319J164R63j817J4J562j143
4805c00l12J252l56j259R78O69j522J03J344q62n12J258j9j394J094M51j185j93
4823g65J319o56n82J022N0j233Q46R02j308l47J435m83j320J608K34j638P03J102
$$ plain form
4700 482 469 -542 46 869 -999 -616 935 -388 -922 391 693 -801 319 693 -521 -152 1072
4717 1072 -92 -859 714 575 -1291 -266 636 -255 -563 1090 45 -819 941 707 -964 -220 652
4734 652 -589 -511 782 66 -901 466 655 -827 -27 848 -326 -477 887 369 -880 512 493 -829
4752 -829 -227 857 -330 -411 545 179 -701 747 404 -676 -166 1147 -368 -612 1016 570 -762 377
4770 377 665 -767 -357 1090 -244 -824 677 253 -703 29 850 -801 -335 641 -223 -645 958 93
4788 93 -1014 196 882 -584 -259 962 -479 -541 798 276 -1043 121 1084 -733 -719 843 -300
4805 -300 -612 640 284 -975 3 672 -850 -747 597 -265 -777 481 462 -932 162 613 -572 -765
4823 -765 554 -102 -684 338 388 -845 1 903 -405 -752 683 200 -1120 488 722 -916 -213 889
4841H89j414K2J628p84j505J619J66j320M90R39j089p6Q27m06q96J331L45j497
4859g31M35R88q27n89J526o73j101J291O02j546K19J316q17n76J449n43j245J001
4877A79Q60j468L3J534j505o21J479r8j663J416P54j511M36J118j146p73J620
4894F44j98j237J093J65j017P7J114p80l95J191m4j240O85Q28j362j10J425j040
4912b01n71J176L78j556N60J068r21j31N96m53r92J556k7j478N97J321j265j34
4930d77J399p01j118J409L43j573L44R72q79k24J060n82p53J185R4j275N93R44
4948G61j087m35J153j59j250J454m63q16N08R70r42l35J008j26r42Q62J71r40
4966f08L91Q09p61o66J472k81j133N80Q72j415J68J557j043n87J044o8j310P51
$$ plain form
4841 889 -525 -503 1125 341 -1164 455 621 -699 -209 730 -359 -435 392 -14 -910 421 766 -731
4859 -731 -296 692 -135 -724 802 129 -972 319 921 -625 -406 910 93 -483 966 423 -822 179
4877 179 1039 -429 -396 1138 -367 -988 491 393 -1270 146 900 -611 -175 943 -203 -976 644
4894 644 446 -791 302 467 -550 -473 641 -139 -534 657 613 -627 58 886 -476 -586 839 -201
4912 -201 -772 404 782 -774 -214 854 -67 -198 398 -55 -1047 509 482 -996 -399 922 -343 -477
4930 -477 922 221 -897 512 855 -718 -374 598 -281 -505 555 -27 -780 405 499 -776 -183 761
4948 761 -326 -761 392 233 -1017 437 -26 -842 -334 636 -306 -641 367 241 -701 161 332 -608
4966 -608 -217 592 -169 -835 637 356 -777 -197 675 -740 -572 985 -58 -645 399 331 -979 -228
4984b28J020j247K45J113p68n42J052j65j118J075M09q96l26J111l77r54R52J21
5002D77j070N35R36j460M6J357q46o00J157l7p26MR24j016k94J227l04q60R10
5021C60J96r99L92P98j144k18J165j99j015O51O68j062L65O79o60n21J062m28
5039I0q93J081M53j128K03O05o31l43J045q5j071R93K81j225L89R76r25m60J294
5058F49n99j078Q68N96p99j14J072n36p45J077j80j249J237L02r83N1J055o06
5076A8r49J316O7j126R71J51q47j41J142o85p39J150M62j147J95P87r52j20J096
5095F49n29o56P26K68q11K6R34r22j30R50m16q89J113J39j141M06Q28o03k32R10
5115F20j46j164R57L73j204Q7J271j102l95J137l74o76P12N53r04L69P41p15q51
$$ plain form
4984 -228 792 -455 -210 903 135 -407 645 480 -638 437 846 -50 -376 735 358 -596 356 477
5002 477 -593 -58 878 -582 -536 821 -25 -625 532 495 -231 -227 697 -319 -613 614 310 -550 360
5021 360 556 -443 -51 747 -397 -615 550 351 -664 -13 655 -407 -42 637 -23 -544 518 90
5039 90 -803 278 731 -397 -194 411 -220 -563 482 397 -674 319 600 -625 -236 740 -185 -645 649
5058 649 50 -1028 -160 436 -363 -477 595 59 -686 391 211 -1038 199 501 -482 -431 624 18
5076 18 -931 385 452 -674 297 448 -399 -540 602 -83 -822 328 790 -357 -162 625 -327 -447 649
5095 649 120 -536 190 458 -353 -327 607 -315 -445 505 89 -800 313 452 -689 -283 545 -58 -290 620
5115 620 474 -690 267 640 -564 -477 794 -308 -703 434 60 -616 96 649 -255 114 855 140 -711
5134g11J186k19o68N26O36j242L75J170j033q65J354l9j139Q14P7p96M29R44j126
5153c27r7P69K49j011N11M39j027M13N88k93q63J216j47j120P87O87q02k0M71
5172D23n65j57O79j26j108J039N82j101J15R29n31p31J061Q0j019M49O33p66m21
5191e35J011m93m40N29J34q50M67P99j087j22J089l43p65O76J44q29Q3J032j078
5210e78l27J267k30r18Q56K10q81O72L76j005o1Q73R8j051P97O20j085K0N33m41
5230b55l63R51q9r09P42M64j276K15J280o23n58J042l95p23N70N70q26r7R74k61
5250D33q58M83M48q72O44M85j194k21J297m20n58O03K70r53N62O93j087m81J332
5269F06m32n76N74J50o90L64P56q11l25J021m31r60P65M59r53P5J117r85k87J129
$$ plain form
5134 -711 475 256 -412 114 750 -492 -117 1053 20 -845 509 470 -669 145 222 -574 -145 799 -327
5153 -327 -424 345 594 -417 94 533 -494 -81 507 214 -649 567 420 -700 87 774 -28 -48 423
5172 423 -142 -299 380 254 -854 185 767 -334 -219 710 179 -552 509 589 -430 19 652 -114 -535
5191 -535 476 -17 -457 72 206 -644 -177 622 -465 -587 502 159 -606 70 214 -615 -532 500 -578
5210 -578 -905 362 132 -786 70 280 -601 71 447 -558 -619 254 352 -699 98 718 -367 -347 186 -255
5230 -255 -618 333 244 -665 77 541 -735 -520 760 137 -421 621 226 -497 73 643 -183 -280 694 433
5250 433 -425 58 506 -366 278 763 -431 -652 645 225 -333 270 540 -413 149 842 -245 -726 606
5269 606 174 -402 172 322 -368 -4 752 -59 -384 637 206 -754 11 470 -483 -408 709 -276 -563 566
5289E66p6j157J066n8o90K05O71o62m67J016k22n19L64N79j069L88O48m13p98
5308f28O79J58m04J60r6l89m8J187o91k97P65j86o17M14M55p90J27O44l90n40
5328d87R55R7j177Q12J60n95k95J255r86m89R93N7r41M11Q09q81rN53k78q36R53
5349H1K71j109O89Q64j085L24N75n58j062J269K53j082K60O62n05m46R06k6p81
5368e00P53Q4j048L20J033r15o1J147o68n23K81M57p54K33Q66p13r3M66o3q53
5388e51P99J13n31O64l2p19l76J027J0q28M86L39o17K3P13p66l99J212J72j420
5408f81N32O27j002L21R58n77p85J015j39r66O82L74n13o2R96p42o56Q96j9j005
5428g46P27M28m03k54O82m63j21L35J9n70M67N16j007k65J018l57l75N99j00n42
$$ plain form
5289 566 490 -667 399 341 -349 -144 527 -135 -602 414 192 -327 37 616 -453 -65 583 170 -628
5308 -628 51 209 -195 -35 -131 -520 -568 619 -72 -369 396 210 -407 7 462 -328 -201 443 53 -487
5328 -487 468 565 -612 200 360 -235 -530 725 -261 -750 243 300 -641 -230 579 -302 -311 242 -36 -872 81
5349 81 352 -757 -68 796 -289 35 610 52 -1010 259 512 -570 -310 352 -153 -599 307 281 -500
5368 -500 253 337 -711 -391 642 -273 -334 813 145 -378 -97 360 -394 -161 705 -8 -101 365 302 -551
5388 -551 248 361 -170 494 462 -257 -633 394 404 -424 62 401 -216 -193 520 -246 -645 567 739 -681
5408 -681 -149 478 -524 -203 755 178 -607 408 269 -697 -15 359 -154 -216 780 38 -618 278 259 -746
5428 -746 -19 409 6 -248 434 -29 -150 185 204 -366 101 617 -390 -655 363 6 -369 230 130 -412
5448d12K94P85q37k94J244o90n67N94K51q87L21R31j142n4R97k23r03O03J44o04
5468d49J49P88o91J9M26k76n93N42Q6m55Q5P32k53j48M65k52m67P56l58o12L50
5489a56M05p19J07O68k90l96O48K34p87l7O54l42j96M96q3m24N27J57o75K3N75
5510C89l78p48Q42J71m93K05N73n73q5P49l62m31K63k8m21Q4O68q16j59J226p48
5531g2m00Q38k36n70J29Q66o01n49J084p50j31M41K04n07L85N29p57k63Q98k44
5551B94p46N94K96r97L94N68n02n1L82rp65N21K96o97l2R26l63p80J098l25l91
5572b89N17J94j143N85M99m40m86M51K78o81L77O69p65K51J97k69o06J010o0o91
5592d02J09O50n61j31Q20l73n79P54J15q25K71M85o03j00R88o77l84O67L45j214
$$ plain form
5448 -412 -118 667 -170 -464 780 90 -477 117 368 -519 -198 733 -409 -463 534 311 -592 11 155 -449
5468 -449 -300 488 -203 -184 242 -34 -627 -85 1 -454 -369 363 110 -38 427 175 -292 464 106 -506 -156
5489 -156 249 -470 -363 305 15 -381 267 501 -286 -323 331 -11 -207 289 206 -218 309 466 -209 -186 389
5510 389 11 -737 105 276 -217 -12 561 -12 -97 652 290 -141 122 94 -327 -243 425 -391 -550 676 -72
5531 -72 -472 366 130 -440 -311 555 -46 -595 489 -261 -392 49 253 -254 131 660 -97 -360 538 294
5551 294 -452 142 438 -559 -165 403 -99 -150 232 223 -542 -21 275 -422 -454 472 109 -671 427 102 -289
5572 -289 228 422 -721 -136 363 -77 -563 -112 166 -515 -138 531 -234 17 214 -55 -661 349 289 -402
5592 -402 -293 357 -204 -335 485 112 -467 287 402 -423 -152 333 -270 -370 618 -59 -443 224 569 -645
5612f45N41N37q90N3J095o54k45N87n7o47k0O52p72nJ124n35n79P76K59r15P6
5633b64R00o70l89R41k25p42O75J28o34j56J054q20l67Q87l88l07O91P1j032O14
5653c3O31n27l74N61o8m49L34N19q70l9P48m09l58O89r6q71P85K78n08J51M79
5674E73m53m71M11L03o48L94M26r62L4J003m55m71Q32k09q04N79N92j113K97O08
5694D66k37p81M62M73r54K79O48p35j15Q82k46q85J090j22o85L43M95o52r2O40
5714B74m00l35O74j1l90J72L52n12n5N58k99o17P43L73r04k19J128o54m23R44
5734C99l97n59P04R4o45L85Q50o73n21O93o0n87M00J63n01L8J037o93n38O10O5
5755B64l23J21K26p46K25N11k89l50M17M36r08K95M69m66j18P09n81m04Q48M1
$$ plain form
5612 -645 -104 433 -457 -404 691 37 -208 379 322 -325 -345 307 -465 -470 654 119 -460 316 575 -340 -264
5633 -264 636 -34 -423 518 293 -449 226 354 -280 -436 618 -202 -569 318 -70 -377 314 385 -647 -33
5653 -33 598 71 -303 258 190 -259 75 594 -276 -315 433 24 -334 355 259 -612 173 451 -57 94 573
5674 573 120 -351 60 363 -285 109 535 -427 -393 610 155 -316 516 307 -497 82 674 -439 -142 466
5694 466 229 -552 -90 383 -571 -292 356 -379 -494 388 142 -743 347 225 -460 -117 378 -274 -366 274
5714 274 -126 -461 213 202 -188 -16 336 -176 -231 327 28 -589 154 527 -377 -596 532 -122 -545 399
5734 399 2 -557 147 241 -404 -19 831 158 -363 330 270 -317 83 246 -255 -217 820 127 -411 199 264
5755 264 -59 62 288 -458 -233 278 -11 -361 56 492 -416 -121 348 -118 -236 473 -108 -512 336 377
5775C77n44J12L90p67K67L82J29o93O84p2l26J42M12o15L3K80j17m58P95j79o79
5796d47M13L15l87K9J75nm96N68Q6r54R67J03l43l87O79l02k02L32P8r16O78N43
5818E27n42k12M04k75l49N94k44k22J72N47l08p10Q47P8o94M68L14p89J01O88
5838C95m04k86O89k29o20M50N12p26j5M40l66j35L64L29j007O84L98o05j22P55
5858E01k82o31N04J18p40M41J88k89n0O25l00k90N09M1n68j67O86m52J43R7O4
5879A48m64M34K0n86K17L51j27j99M58j02q32Q68K57p93L26O19p47J5O13n07k91
5900c22N53K74q83j21O60n29j11R47k15p49M33L93o23J03P07m44m37P63K5j032
5920f08Q04K50n34o9Q40p15j80J82K80o15M27M73q98K2N98l09j05K07J69n91J78
$$ plain form
5775 377 -167 -55 335 -432 -165 217 346 -347 337 265 -61 81 493 -122 -89 191 74 -384 411 232 -447
5796 -447 -34 281 -106 -77 98 93 -403 165 251 -703 264 367 24 -363 316 14 -188 144 222 -694 -16 527
5818 527 -15 -227 177 -98 -447 147 -97 -319 -147 400 92 -618 229 307 -387 81 395 -394 -293 395
5838 395 -9 -295 394 165 -455 -5 507 -219 -234 206 -160 -295 69 398 -609 75 473 -132 -254 501
5858 501 219 -412 92 210 -530 -89 99 -190 -240 385 85 -205 304 345 -223 -390 296 -156 -13 84 148
5879 148 -316 118 138 -448 -231 120 -7 -206 252 150 -682 186 443 -350 -24 595 -152 -137 476 -31 -322
5900 -322 231 505 -378 -499 161 -368 -479 468 253 -496 -63 330 -293 -190 517 73 -364 399 424 -608
5920 -608 196 446 -88 -157 683 -32 -212 -30 250 -365 62 535 -363 -341 257 -52 -157 50 219 -372 -194
5941a94N47m83j61Q04q65qN06K92q73L90M70q20M17L61p62K08N20l50k46J52O07
5962E12o32j50P33o10k15P15j48p78N25L53m35J39L95k59o13O31K18n65M3K85
5982A44j86k7J89j82j64M56J22p48J74M58k93m85P51j96m2P2J19n30P3O29n31
6003a97O2K52np49P63K25r06M64M16m57j29M08k56m68N77J88j76n9N03j55l87
6024h6K29M2m58M24k16k32m3P10O5p20N81j16m30L53M09r28L40K65j24l58M93
6045B00N8o32N75L33p71N2K20j20k54N78k20k48L57K98q78j4Q98p8p48L03L45
6066B54q97N93N40q11j03O59m2o74O37J34m11j82P52o47j36L90J4l14J16K60m50
6087c18K51L59l55n05R57m28m19M18L49l85l35P07l90n99Q38J93o16Q8P01p38
$$ plain form
5941 -194 353 -130 -291 513 -352 -360 146 438 -435 -45 425 -395 22 383 -379 -171 349 -1 -247 -95 512
5962 512 -120 -270 463 -147 -362 353 205 -573 -48 305 -130 9 404 145 -468 163 381 -184 -141 144
5982 144 -42 -69 120 -62 -226 230 352 -396 -222 236 -57 -542 209 13 -29 43 162 -368 -295 334 -197
6003 -197 -135 117 112 -637 126 351 -555 -91 325 -132 -261 147 -109 -577 0 188 12 -47 456 301 -86
6024 -86 143 185 -273 151 -65 -297 -340 370 435 -285 296 180 -250 103 512 -416 -76 189 65 -293 200
6045 200 258 -374 201 534 -237 -185 35 -85 -339 239 19 -229 128 426 -452 -466 432 354 -394 -91 254
6066 254 -643 -50 490 -321 -424 235 193 -481 156 290 -121 -303 449 -198 -334 56 70 -244 -128 132 -318
6087 -318 -67 292 -63 -568 389 -39 -458 -40 309 -76 -411 296 -94 -693 145 338 -278 -190 511 -227
6107b27K65N88q45j12M49J46o89J68M66n00L64J84l37k72L91J69l98N0M72l94
6127f2j20M32q4q51J089j61o33Q0O34n90o9N06k89l53N17K05k97KK83l10k01Q02
6149E30m49l00M60j13J2l58L91k62j20M81j44k20M88k03n00K02M41j61k18M29
6169C86j40m64K10N73r45K58N18m64l1J33L02n46L72J51o49N14J01k20k27K06
6189C8L6m51N12J92o98K36N31k17o04N22k11m06R24k19l62m9L19N9m60K11N85
6210D88p83J27L23k25j78K88k52o9N18K54p43K71K31l16J16K64l68l64N60J73
6230C15o48M80R9o21q0P90J2o41K57M22p24r9K70l21MO31l40o2P48l91l56K26
6252b9L19m43k79N20j97k94O77j85l06l8P32m08l18M23ln63L63J33l28j5M19l33
$$ plain form
6107 -227 38 626 -219 -331 118 264 -425 -257 209 -291 73 257 -80 -352 39 208 -190 -140 332 -62
6127 -62 -182 250 166 -685 404 243 -390 -310 324 -266 -335 171 -118 -471 46 251 -46 -44 239 -71 -272 530
6149 530 81 -219 241 128 140 -218 173 -89 -209 272 128 -92 396 193 -307 -105 336 175 -43 386
6169 386 246 -218 -8 565 -380 -122 396 -68 -99 34 336 -210 162 313 -336 178 279 59 -168 38
6189 38 74 -377 135 327 -371 -135 396 179 -425 97 -114 -520 404 185 -177 -226 93 152 -308 -97 488
6210 488 -295 -168 155 -70 -248 40 -212 -281 237 491 -252 19 250 -66 50 314 -54 -418 142 315
6230 315 -333 147 246 -375 -455 335 347 -294 -37 385 -339 -438 -168 -489 -485 146 -194 -256 492 101 -255 -29
6252 -29 290 -153 -432 88 -109 -403 274 89 -217 -255 477 69 -249 174 171 -392 -29 104 -224 -239 180 -153
6274a53k06O37l03l58M05J93l58N2M00L2m39K69J66m74J20L95n00KJ21J73l31
6295a57L77ro50K70M94m67p4P82o55k22L47L80o20K53J99n31K35J90R1l69N3L87
6317C04l93j8M69k58k66K47j26l85K12O33l86k6L53m56p5M00j36o30O75J07l60
6338a15k0K40k13j66M73l4m18K39J84k87J61K06k10j14M59m66r4J51L81n57j80
6359c80O43l66k02L60p7l17L71N5n14M30K45l44k49N17j21j45M27Pn85j82O46
6380B19l77p2L53N7n47M88m9k38m4N85l17j95L59lo00M39L06l79k28N27j68k48
6402a32M14j10j44n5K72j99k86L31j3m04P13k10p21K75M76l26R9J99j3o09N77
6423A34J79m38j6O70n37q5M76l41m12N26k14P1J35o5j89j77P46m50m44P77l36
$$ plain form
6274 -153 -359 278 -25 -383 22 215 -143 -91 309 341 -98 171 337 -137 -17 378 -122 -120 1 174 -157
6295 -157 220 211 -439 -169 325 -142 -216 566 -89 -311 36 416 -204 49 248 -283 -48 142 233 -136 -83 304
6317 304 -89 -107 362 104 -162 85 -41 -426 -214 419 33 7 360 -96 -171 229 93 -537 138 245 -115
6338 -115 -135 105 -108 -274 199 165 -253 -14 170 -117 44 250 40 -74 385 -81 -175 -24 357 -200 -380
6359 -380 263 -103 -305 55 -22 -339 32 87 -427 3 248 -96 -345 172 51 -94 333 340 -245 -427 219
6380 219 -158 -230 123 180 -367 121 72 -166 -210 375 58 -137 222 219 -381 58 364 -15 -243 284 116 -132
6402 -132 282 172 28 -27 245 46 -240 91 78 -326 387 177 -544 -269 207 -119 -20 179 166 -443 134
6423 134 313 -125 -141 529 -8 -93 383 42 -370 156 -58 13 148 83 -106 -283 463 13 -431 346 10
6444A0m98L15L59k81j13N57l30j63J8L69l16k00L63r8k01K80P6m44L96ll56J59
6466a01M71j97j70J24n0m49M12J79m75r8M57K11n31J76J65l05J88L44n22Q5K84
6487A98j94l80M14L41l86J48K12p59J04M84k43j23L81j21m56K42M61n68L00K08
6507B63k11j4J9K80l13j95K42l64L2L29q8l44M60K86m82K26K90m60R4L9N1l11
6529a71J33K34l85P9L71j95o96P58K71l87K2J68k60m3J92l36k34P02r8k47L86
6550B64nn55J92M31m66o6P54l76l82L75k08k12M57J99n17j47K72r2L3o9r5J18
6572i5K2K13Q0l84J79M85o72J04J37l48K37Q4k6l16J45L89l70L1M79o46R2L74
6594A94J11l72K29P7o69M74L10o18l42O05L28m41L42l29j31KM41k98j04Q5r4j30
$$ plain form
6444 10 -488 -173 186 -95 -208 349 19 -144 -126 243 -73 -273 90 -8 -209 71 147 -297 99 96 -260 -101
6466 -101 370 173 3 127 77 -372 40 219 -256 -354 103 314 -217 -41 124 -181 7 351 -171 -86 198
6487 198 4 -376 38 379 -7 141 353 -406 -302 182 -61 -184 197 76 -380 -138 323 -245 55 263
6507 263 52 38 57 337 24 -171 71 -293 -261 68 -20 -364 96 382 -100 126 416 -44 50 89 140 -171
6529 -171 -38 196 -189 -110 261 66 -630 128 399 12 34 202 -58 -101 91 -245 -479 223 125 -122 264
6550 264 259 -296 -104 327 -139 -205 549 173 -209 166 -42 -254 203 402 -115 -262 10 -82 -49 -118 -213 -95
6572 -95 -73 140 220 -164 15 500 -172 -68 69 -279 -42 42 16 -300 -155 234 -136 -105 374 -272 -180 194
6594 194 305 -67 162 239 -430 44 354 -264 -606 -1 327 -114 228 -101 -232 -230 211 -87 -191 -106 -200 -330
6616c30M07J38m19L6K50k41j18O34n32K90k11L39k85k09N59p32K26M08j2m10J35
6637g7K68k86k4M14k89k71K62K32p09N06M23n38K5J56l06P1K37K47n95L90j73
6658c7m63N50J12Lm02N14j35m69O73j17l05k88M79j7k63J47J49k43J80L51m48
6679b9k62M50k25m04M00K27m5l38K21q0L37n3k82j0J76P3m89O06n28J84k94N81
6701B16P7m02J45K92o76J92N20m19j9K1K62m51K15Q5j40l02P04m58K5K11q6k27
6723b15J90m2m76N42K78J08m90N90j69p53N58L23m73n5M63n33k29L60m7J30k92
6744b32L10j42o0K90j74j84K45J7k51L55r9k3j95O8J6j07K92Q9n72K77M42k03
6766A59m09K45K02o04N52J38l50k5L55n24j42J037n43k58K83K2l78J34K75j5l28
$$ plain form
6616 -330 77 215 -204 -168 82 -159 -277 357 -175 115 -96 243 -42 -251 308 -424 -198 210 198 -212 -77
6637 -77 191 -95 -119 295 6 -265 -3 229 -480 26 449 -89 -64 92 -214 -143 94 341 -254 136 -37
6658 -37 -500 50 162 165 -237 277 142 -327 346 229 -76 -364 115 98 -165 -18 131 -112 68 419 -29
6679 -29 -291 159 -66 -470 -70 157 112 -226 -5 -85 252 199 -83 -93 83 156 -333 273 -255 -71 -365 216
6701 216 293 -109 36 328 -348 -156 364 -55 -74 -53 209 -242 -27 58 -82 -384 320 -138 -113 98 12 -215
6723 -215 -25 -67 -543 -1 277 385 -105 485 316 -437 121 444 -29 -84 379 -154 -383 -23 -70 60 -232
6744 -232 78 -64 -124 166 -8 -192 53 70 -181 174 75 52 -143 -75 -59 -166 126 215 -357 -80 362 159
6766 159 -250 -5 197 -407 145 283 -67 -92 263 -261 -403 634 91 -167 116 138 -240 -106 169 154 -174
6787a74K10K09p42O93m0m24K41M48o92J89K03k50J0J74J09n13J73K18l00j82N23
6808H3K34k71j19M08n58K83N45o87l35Q09J36o17m2M72k54k70N35l83J16J81j36
6829A30l34J88K49k01k6K72j63p6j24l8N6j54M79l46M9K87k91k75L76K42l06q6
6851i2K77j87n5L70M2k92L1R3n23L25M4j39K1N07l20l57q1M81n78N77O0K3m17
6874a90K41p5k04J93r1Q6J22j6k36m5M06P6l98M01p9k15J45J88m75Q2L49l08j20
6897a63N09j56n37L19o6j00P4N52q6l64R0L50n96J73N10n58j76J72K63n29L64
6918D5K15m79J45M46j32m18K45j22k80N45N7l71j1J00L4j29J49N8j67q7N17l03
6940E7l76N42l84J65j67K47k67J16L34m63K8L18j10k52K14L99n76L72K61m97J95
$$ plain form
6787 -174 36 245 -497 196 156 -268 -27 421 -271 -82 121 -129 -119 55 164 -349 -176 42 -258 -440 83
6808 83 317 46 -73 335 -223 60 605 -82 -417 392 528 -89 -131 341 87 -183 352 -31 85 266 130
6829 130 -204 -16 233 32 6 278 115 39 -85 -123 -67 -221 258 -88 -39 248 -43 -318 58 300 -6 -92
6851 -92 185 -2 -57 313 355 63 94 187 -336 -11 33 -106 -85 422 102 -255 -336 145 -433 144 204 227 -190
6874 -190 51 -24 -228 -35 -126 -40 82 66 -170 -215 191 267 -131 270 191 -24 121 309 -166 -84 265 -43 -163
6897 -163 346 190 -347 -28 -94 -194 -120 432 346 -18 72 422 -174 -1 509 -49 -225 -53 210 -319 45
6918 45 260 -219 -74 372 240 -178 67 -55 -335 210 267 -104 -115 -15 19 -110 39 97 -70 -157 360 57
6940 57 -319 223 -161 4 -163 84 -183 -67 267 -196 -168 150 40 -212 2 401 -175 197 458 -39 156
6961A56q9o0j34K49J67l95K31q8j09k32N16J59o33L21K45n15J72J99J2l05o2J47
6983d8p3J88j08l35K92r3L2nJ31J11m21N50j10k02K55J8l46J76M04m60j72j58
7005c74N11j79K70Q3l33N0R2N5r4m08N50J38l01J23k2l46L37O8k69p5Q8ok4L40
7029B74l32j29K77l2q0Q6J03k61L6q0k4j05M94k44l03N16pl18o3M46k76m2K41
7052A77rl60K80J68n76L43J11Rk74L26j8m13K81J4r9n5L33M6k14j81M42o41P6
7075b34L45N4kR5j71j84Q4K13j9m87P71l22m45O56m57K49M4K10n36J97O6k46K93
7098A74j53J48j99K08K0k41j12J98J08l29N70j06p45K85K94l11K58Q6q2m14N61
7119B18j98j69J38M4k39J57J76J53j79J79l62J03J32o6K67m72L64k59m96O45j41
$$ plain form
6961 156 67 7 -127 122 289 -106 125 37 -72 -304 212 371 -262 59 304 -211 -39 160 172 -133 -195 -48
6983 -48 -121 67 -41 -376 -84 -177 -145 -150 -19 92 -329 221 111 -91 164 182 -164 12 416 -44 -216 -374
7005 -374 137 -42 228 311 -22 28 120 175 81 -327 223 361 60 183 161 -185 152 220 -49 -124 -36 -42 -66 274
7029 274 -58 -187 90 58 -22 64 167 -94 -58 -138 -162 -267 227 -17 -320 196 189 -129 -192 254 -22 -64 177
7052 177 168 -192 88 256 -320 23 134 143 -131 195 177 -236 45 59 -40 -95 238 284 70 -111 331 -310 -234
7075 -234 111 165 163 258 87 -97 -13 200 181 -306 465 143 -302 354 -103 146 190 400 -136 61 127 -119 174
7098 174 21 169 -30 178 198 -43 -155 43 151 -178 392 286 -459 -174 120 -191 67 153 71 -343 218
7119 218 20 -149 -11 33 -206 -49 127 280 101 280 -82 21 153 87 354 -118 246 -13 -509 136 -5
7140eL3j61K99k70O9N3l51J79jN17l64K42q4l39O6J53J09j85J45j98r3K27J57
7163A98k16k8L35j84k98O45l16j59k94J88m9K71R1j09k09J27O1k08j51O15m78
7184a68K23K06k38j3r1M0j38J80K26j89k01M63k04Q5k42Q7J82l60L1q2J66ML85
7207C52m46P9L81n37k6K13l0r4O0M9L4j86O42l18m32K79L0k02K18q1j86l4N12
7230B77k68k77K18J36k82K82j4l50M91l4m44%L02m5k07L72k9j45K20j96p6O4j05
7253a10o8J37om1p3J07R3j59K9M11j3l39J95P6l55o1L94l30M8L06j74j66K9R5
7277B5k3l5K68l33oM8J84k06k03J91j64J73Q24r65JM99L7n93M68R7m28J50L18
7300C27l71l45O11J01n02M07j42l0k73L76k9m99M47R8l42p4M39q2j96M72l32j74
$$ plain form
7140 -5 28 -133 166 -104 -35 18 -333 -154 -155 362 -2 240 156 -183 -117 36 145 -40 105 -93 -186 41 198
7163 198 -18 -46 289 105 -193 452 136 -23 -317 -129 -178 93 184 75 -134 -7 54 -154 -305 310 -168
7184 -168 55 261 23 10 -81 -41 -179 1 227 38 -163 300 96 181 -61 26 208 -152 -121 -203 -37 -33 352
7207 352 -94 -15 366 -171 -197 16 -14 -108 -48 1 35 -151 491 173 -259 20 50 -152 66 -15 -201 -235 277
7230 277 9 -268 -50 86 -196 86 72 -278 213 179 -265 -265 37 -8 -215 157 128 -17 203 7 -69 -5 -110
7253 -110 -178 -41 -47 -88 -161 -54 39 -120 -91 320 307 -32 163 239 -116 -177 217 -113 -65 241 67 -99 -70 25
7277 25 2 -33 235 -98 -104 -56 128 -78 -281 -90 -254 -81 743 -222 -221 278 315 -278 190 287 -141 9 327
7300 327 -44 -389 222 323 -179 228 86 56 -217 159 130 -369 78 176 -166 -240 199 117 -79 393 61 -113
7322a13K86m9l38N00j48k33J29K39j98o5P0o0k37q1L85l36J13K48J64n16J57J60
7344G7l11Q9L11o8KJ37N0l52J3K93j95j30J68j94j80M26l01r6L22J15k40K75q4
7367A27p1j08J08j08r5L33j03l8Q8J91n95P6M38P0m07R0J95m38j14J63j4K86J48
7390B22M5n49M70Pk23k05M41l27k61M96l6j23J60N1j88j62N34k19m49K80O8l12
7412b80LM38q9j34J80J12j54Q9k19k40M25M59p33J26L61k94l31L4J24J47j22J11
7434A3k8M5N8k69n0M37j38j26K88M11r07J84L81P6o15M45n2K6l05N08n26K65R3
7457B14o4k55K4J92q6l31K62M5o1j21K42k60M32j00l23L28k22J12m73O46m35K49
7479A5J5pl67M3M54o7p2o6J51R5j35L4m36N51O8l28j87M48j6l44K56j08k03O1
$$ plain form
7322 -113 173 124 -214 286 138 -95 34 273 75 10 80 20 -217 -298 87 -249 -136 112 276 -240 -83 77
7344 77 -234 -145 166 98 100 237 287 -65 -52 241 46 -84 84 -110 -290 136 -165 -261 61 176 -64 211 127
7367 127 56 -52 56 -52 -147 186 83 45 133 324 -271 -195 243 313 -94 -4 191 -247 -361 -198 -212 74 222
7390 222 267 -282 188 195 -28 -233 208 -119 -380 116 80 -43 117 168 -20 -182 352 133 -316 -36 32 -280
7412 -280 -277 161 72 -62 118 230 76 165 -54 -294 131 590 -143 -17 344 50 -281 -247 -123 24 -98 13
7434 13 -15 30 88 -181 -231 206 68 -58 230 641 -266 -82 299 375 -240 205 153 179 -126 382 -144 121 214
7457 214 150 -105 -81 111 25 -306 -44 1 -60 -181 61 -199 233 133 -190 138 -84 28 -445 201 -234 15
7479 15 30 23 -344 -301 153 86 14 -52 99 194 59 93 -343 208 276 -52 -239 209 193 -151 105 -3 -206 -145
7503a45M13m14j78M62L71n72N0J59n8l21M40k81m31O46J7o13O48K82n05k05M54
7524B19r0m81L07K10k28l1K16l02L4L54n8k62R6Nm4J18lo0k18J55j44J57J50j85
7548h5M4N3J77j13m42P36l26k92K97K16n22L3M35n8l51L33J14l35L6J70m38J99
7570a19L46m02R9K00M2J12k87K89o36J44J85l85K02J32K93j95j22L39m27K39K18
7591B67j91m65M71j02l09M12K18m41Q0K34o8l42K50L96p60J1L95k88O0L57M8j34
7613I9o2K69m85m5L11l46J76R6K9j0mK55m72nM08m64J46O4Q1l61K50M51k25k14
7637e8J47p5k03L57M1k5k83K53j03M6J21l56k15N33j64n73M85L00l45J84m1k82
7659b56J62K39l67K85m41N19m53K44N51m68l70K67K19n91L04M94o10K17L05m35
$$ plain form
7503 -145 268 -146 -324 138 509 -63 -13 146 88 -233 207 -74 -505 141 158 -455 193 475 -30 -235 219
7524 219 129 -352 -45 165 -63 -94 122 -180 -146 208 150 -112 -16 -11 -55 63 60 0 -218 -63 -207 -50 100 -85
7548 -85 -41 12 189 76 -366 370 44 -248 49 265 -257 -224 211 153 -198 135 249 -86 -50 120 -318 -119
7570 -119 227 -175 -76 124 166 278 -9 280 -356 -212 -27 -412 -210 -78 215 20 -102 237 -190 49 267
7591 267 76 -389 82 -20 -329 83 301 -140 -60 174 106 -236 14 410 -350 -339 56 -232 -172 185 233 99
7613 99 37 306 -179 -224 87 -259 -83 13 42 32 28 283 -189 -194 214 -250 -104 -40 41 -320 -70 381 156 -58
7637 -58 89 14 -189 168 209 184 -99 154 51 97 218 -138 -353 180 16 -557 -72 228 -117 67 26 -256
7659 -256 -94 145 -222 63 -378 141 -312 -68 483 15 -355 -88 131 -460 -156 338 -272 -55 250 -185
7679a85J98J57Nk96l29O98m59R1J10K02n20K78K6k83M24j58l1K3K75k25j38J73
7701C6J35m67J7P8L26J16j54k24k5L28m27J83J13K12k62Q3K40l11k5J34m7j09
7723e0j36L43j34j40K06n5k46M40K1m32kM26n57J12L14K94o24J24K73j23jL66
7745D19o42L03n5L70o72L63M1l20K18J30o0l89M30M6k43K07n48L87j30M41k24
7766G2l98L76j65m9J76L18n72J46J04o6l02L18J06m23L43nK0o7lQ4o7m6J18j60
7790a42J2L17k39k2R5j5l11L40J22m53K73K15l20j82M17n1r3J07J61l06j58L35
7812A02m33J51M18k03l48L15R6q3l08N42n43j47O71j78l64L10K5j62k25J28L37
7833A01l38M29m51K15l1J32j78M3R6l66M75j83L60m14K9J54l88J74K19j31l50
$$ plain form
7679 -185 13 170 175 -121 -450 248 -211 -120 -10 192 -328 -50 -24 -307 117 -41 -72 -49 226 1 -137 36
7701 36 171 -296 -279 -201 125 241 87 -137 -162 166 -261 -78 35 247 -15 68 308 -3 -28 106 59 -50
7723 -50 -186 157 23 -117 89 34 -212 228 249 -183 -185 241 -316 -204 110 404 -220 -96 177 54 53 419
7745 419 -223 80 25 395 -277 86 127 -193 25 155 95 -294 136 182 -61 146 -402 -15 -145 296 72
7766 72 -326 50 -115 -164 12 330 -242 -96 8 -58 -360 -42 64 -359 -16 -21 -1 -68 -71 13 -54 -100 18 -142
7790 -142 -130 187 -52 -74 21 6 -305 35 157 -296 -23 192 -128 -310 107 56 -37 70 231 -75 -233 102
7812 102 -331 -180 238 35 -313 2 98 15 -293 249 -294 -441 230 52 -312 -2 23 -139 -364 -236 101
7833 101 -237 192 -259 -44 -75 57 -121 -78 18 -348 127 -56 304 -110 -81 73 -315 -141 78 -53 -403
7854d03L25K94k06N6rk3J33J99m31n0p9K49r8o5L01j29k05j1L50k11m9L71k68
7877D1j85L7J95k98L1J1k72K91N55q32K41N10o73N31k36K38m01J67Kj65J19J85
7899I2j85pK10j65j87K66k5j13j38N37m15j62L24n4l84L72J39K0j53K52mm14N6
7922a38J73j65J61J3k69J0M75n3l99L38O6k05K53j76j47R1q5J14k40K74k40j05
7944b54M19k84L15l19K66n2j56L00k24r8k40L57O3l47M97l56J02J76N3l02O4J72
7966A52k95j46L09rp3J82Q5l16l14O79M9m55K66k39j55N17j62r9J30J80j85n0
7988E1j36O00m57j74J68r6K50k9l76N2M46k43n43N51j14R2j90J71j02J66k5k51
8010a89k93M16L19o70L39j48J31N7L8K6j40Q5J01l12J69J54j30k79L59K23m63
$$ plain form
7854 -403 -78 216 10 66 57 34 167 366 -65 -115 -194 55 -43 -108 193 64 -141 -152 198 -13 -62 309 41
7877 41 -144 -107 88 -210 -179 -168 -440 -149 406 -426 -185 325 -348 183 -53 185 -216 -49 -47 -212 -93 92
7899 92 -93 -100 110 -55 -242 24 -1 -114 -252 285 -130 -292 32 -22 -406 -34 105 125 -28 224 220 -194 -138
7922 -138 35 -130 31 44 -225 -215 260 207 -192 146 212 7 260 84 -63 28 -57 57 -183 91 -149 -254
7944 -254 165 -119 196 -123 143 91 -65 235 11 -87 -327 30 93 -254 243 -113 -11 165 218 -84 -20 152
7966 152 -143 -289 20 11 -62 120 205 -111 -425 254 303 -152 114 -125 -280 237 75 -24 106 286 101 51
7988 51 -85 515 58 -116 52 -44 206 177 -199 -147 299 56 -487 64 -50 42 -148 23 -79 87 62 -189
8010 -189 -482 -66 253 -417 -78 -226 -95 -38 0 26 -114 -29 72 -240 -71 83 -47 -326 33 256 -207
8031b07J37j15P5k64N26K61l89M9n2j58K21nk02J51J88j0o66M87J78n08P4J17
8053a12J28j65K49Rk22O4M79m63ML04j51M1j53J76m19J13p1p5N5J65j25k9J45
8076e3J5m44N72j86r1J5M15k72Np9J36j14n9M05k44k95M40k87J7j06L50j94Q1
8099B7k5O9l18P67p16p2M77l7j97k34N68k10p2M11n01k18L09J44k95J81J75j65
8121F8J3J75k42k1J67j02r3r4L0K71k24R5j5l00M61k78j60M21Q4o33L41j40O7
8144a09K3m8J70k01K59P1m39j42J99JK47k11J40j71j8P53l96m48O82m96j7K56
8166A05MO1k54J53m21M74N5k11l08M19J47l35J41R4J95l03K4j6K1k2J14k96k64
8189d23L43K38
$$ plain form
8031 -207 -70 -185 -110 -374 152 413 24 73 21 -137 84 79 -123 28 216 206 -460 27 205 -303 -229 -112
8053 -112 16 -149 100 109 -113 -49 430 -33 -29 275 124 165 12 188 -231 -118 -189 -264 -209 -44 -169 -198 -53
8076 -53 -38 -482 90 -96 -187 -172 243 -29 -24 -103 33 -81 -140 265 21 -274 166 -121 -104 -210 140 -54 27
8099 27 2 71 -247 520 -196 -268 209 172 -25 -259 309 99 27 438 -63 -281 28 172 -123 58 233 68
8121 68 81 256 14 -7 160 58 -35 -129 -99 172 -52 43 28 -272 189 -89 -249 172 256 -377 -36 -176 -109
8144 -109 -86 -134 36 -165 94 165 -274 -416 -217 -216 31 -180 -40 -211 -229 524 128 -320 362 -134 -151 105
8166 105 109 170 -84 69 -352 122 177 -34 -342 77 224 -111 30 124 319 16 40 24 45 23 137 -159 -423
8189 -423 -80 158
8191A58
$$ Imaginary data points
##PAGE= N=2
##DATA TABLE= (X++(I..I)), XYDATA
0@%%%%%%%qJ6j6J6j6K4l2M0m8N6o7P5q8J04j23J47j70J94k23K55k90L28l69M15
31B20m70N29n92O61p35Q17r07J008j120J241j373J520j684J864k067K295k553
48a346K850l195L601m084M671n408O361p647R493j2375J7552k9717J07412Q6048
62A74216j90191k1412N0457K8444J4079O964q0942l877R1919R490q0185N115J9139
75B3216k5055J9989L2440n9363j2196P7762j1640q4203K4854M6742l6859o341
87a0654M1061k8898k1944M5768j3856n7754L6543M2440m1501m301L5760l9537
99a6873j8220P2489j017q5989O013N8484m829N631K1272n7257l8390O9456K9430
112D0200n1016J543K0591k9995J9489N0933n1266n4266O2428L1452n8304L683
$$ plain form
0 0 0 0 0 0 0 0 0 -8 8 -8 8 -8 16 -16 24 -24 32 -35 40 -48 56 -67 80 -90 104 -119 136 -154 174 -195 220
31 220 -250 279 -313 348 -387 430 -477 531 -589 652 -721 799 -885 979 -1088 1207 -1346
48 -1346 1504 -1691 1910 -2174 2497 -2911 3450 -4197 5296 -7079 10473 -19244 88168 174216
62 174216 -15975 -37387 13070 41514 55593 62557 -18385 -22262 69657 79147 -1038 4077 23216
75 23216 -1839 18150 50590 -8773 -20969 56793 45153 -39050 -14196 32546 -4313 -10654
87 -10654 30407 1509 -20435 25333 11477 -46277 -9734 32706 -8795 -13096 22664 -16873
99 -16873 -35093 37396 36379 -49610 -43597 14887 10058 15689 36961 -20296 -58686 10770 40200
112 40200 -10816 -9273 11318 -18677 812 51745 479 -53787 8641 40093 -18211 -14528
124a4528M3703k6865j2986L5699k5282l6073M5366J8467m4202J5220L1913m4339
136a3907j1715M9055j9244l8993M8689J7144o2366Q093N6579k4892l0132K8178
148F489j4719k7723N1423K5256n5779n466L4946k7460p175N1136j7325n1349L7926
161A80L3619m6582k230M3064k7847k7806M0501L492l2079K8220J5740m9054N834
174a4948M6577k9739k8023M7560M783m3848K1774K2232m5087K562N4770k1853
186A6760m3559L0626J5498k4999K0442J2943m8913K80N1329j6988k8681L9330
198B4068P40n1875K0500M2044l4239j4040L9184j5871l1695L7172J3187m1477
210a2302J1603K8430l5688p873M6177j1497l4262K9699O150m3918K1084M2523
$$ plain form
124 -14528 29175 2310 -10676 25023 -259 -36332 9034 27501 -16701 -1481 30432 -13907
136 -13907 -25622 23433 4189 -34804 13885 31029 -31337 -23244 33335 8443 -21689 6489
148 6489 -8230 -35953 15470 40726 -15053 -20519 14427 -13033 -20208 30928 13603 -37746 180
161 180 33799 -12783 -15013 28051 204 -27602 12899 16391 -15688 12532 28272 -20782 -14948
174 -14948 31629 1890 -26133 21427 26210 -17638 4136 26368 -18719 -16157 38613 16760
186 16760 -26799 3827 19325 -5674 14768 27711 -21202 -20922 30407 13419 -15262 24068
198 24068 24808 -27067 -6567 35477 1238 -12802 26382 10511 -21184 15988 29175 -12302
210 -12302 -699 27731 -7957 -15830 30347 18850 -15412 14287 20437 -23481 -2397 40126
222D0126m0862k4875M7523J660l9803J5507J3463k5204K0274K4640m9865j8120
234c5536O0486O413m7518Q623J1749k7151K4358L8108m5759l2994M9329J1349
246B1457m0977J1694K0630k4906P363K4906l4400j4162N1358k048n0477J7125
258a2437L0002k7701K440L3747k9729k8800M2573J0565l9337J2569K5583k8064
270h589j660L0859k4271k2649M1688P225m2548J2297K5535k9576J828M0929k6095
283D973m1962L5362K6264k9197K870J4792l0728K196M2287j9631l6287L3780J6907
296B1626l6905O498K6845k6907n002L8938j9586m0076L5460K9060l4706n571K0926
309A0600k0935p64L7679j7859l6308L3434K2287l9547j5L1577k0814j1031L5977
$$ plain form
222 40126 -736 -25611 21912 23572 -16231 -724 12739 -12465 7809 32449 -17416 -35536
234 -35536 24950 31363 -16155 -7532 4217 -22934 1424 39532 -6227 -39221 10108 21457
246 21457 -19520 -7826 12804 -12102 -4739 20167 -14233 -28395 22963 20915 -29562 -12437
258 -12437 17565 -10136 -7696 26051 -3678 -32478 10095 20660 -18677 -6108 19475 -8589
270 -8589 -10249 20610 -3661 -26310 15378 22603 -19945 -7648 17887 -11689 -9861 31068 4973
283 4973 -36989 -1627 24637 -4560 -1690 13102 -17626 -15430 26857 7226 -29061 4719 21626
296 21626 -15279 -8781 18064 -8843 -13845 25093 5507 -34569 891 29951 -4755 -10326 10600
309 10600 -10335 -11099 26580 8721 -27587 5847 28134 -11413 -11428 20149 -665 -11696 24281
322B4281j2834l9411L0709L1055l4129j0239K3059j5978n110L6840j1769l9719
334b3245K5105K4867l4428j158L3184j9804k0127L2565k013l5252K3218K6927
346B9839l5467j1151L1248r405j4535K7253n908l5022K2851K5081l4367n783L6397
359B1031j4528k7107K8259N956l1939J5653K5538l0369j0765L1632r081k0856
371a6576K8048K696l7022J2925K9828k4952p932L0968j6897k8791L3171J5614
383B1080l6368L951K8489k1634j2471K8819p838k1938K6071N690l7902J2912L6092
396B4953k4745k0693K8775m163k3770K5064J1331l6162O694L5690k2982k4532
408b4540K8562N470k0784J5009L826l1510J5402L7037k7933k8400L1273P727k6256
$$ plain form
322 24281 11447 -27964 2745 33800 -329 -10568 12491 -3487 -8597 28243 16474 -23245
334 -23245 1860 26727 -7701 -8859 24325 4521 -15606 16959 14946 -20306 2912 29839
346 29839 -5628 -16779 14469 5064 -9471 17782 11874 -23148 -297 24784 -9583 -15366 21031
359 21031 6503 -20604 7655 13611 -18328 -2675 22863 -7506 -18271 13361 4280 -16576
371 -16576 11472 14168 -22854 -9929 19899 -5053 -12985 17983 1086 -27705 5466 21080
383 21080 -15288 -11337 17152 -4482 -16953 11866 4028 -17910 8161 13851 -24051 -11139 24953
396 24953 208 -20485 8290 4127 -19643 5421 16752 -19410 -12716 22974 -8 -24540
408 -24540 4022 9492 -11292 3717 7543 -23967 -8565 28472 539 -27861 3412 11139 -15117
421a5117J5424J4398k8850K652L0806k1372k1341L2575O929k9756R019J5768k2364
434a1229N952K8608k4588k3585L4165R248l1801J0425K1811k4838n692K9080j2303
447E253k1174K6776O337k9590J1101K0109k6036k164L2550j4981k8373K5907J2519
460A8234k6652R116K0166k8744r158L5573m773k7786J7287R807k3560R595J9072
473A8177k6329o042L5040j0336l2943K1656J9182k5191J520J9727k3262q885L5590
486A7904l941l2701J5007J7273k1771L099J9486k1714q291L3025o914l4316J9894
499c960K3307k4568m446K0246j6697j0284L1665j734l3382J2684K0821k0317j333
512g998K1066j7261j2929K9110k147l2117J6812K4822k5150r541K3556r582j4495
$$ plain form
421 -15117 307 14705 -14145 -11493 19313 -2059 -23400 9175 16104 -13652 -4633 11135 -11229
434 -11229 -5277 23331 -1257 -24842 9323 18571 -13230 -2805 19006 -5832 -11524 17556 5253
447 5253 -15921 10855 17192 -12398 -1297 18812 -7224 -9388 23162 8181 -20192 5715 18234
460 18234 -8418 698 20864 -7880 -17038 18535 13762 -14024 3263 13070 -10490 -895 18177
473 18177 -8152 -14194 20846 10510 -22433 -777 18405 -6786 -5266 14461 -8801 -17686 17904
486 17904 13963 -18738 -3731 13542 -8229 -5130 14356 -7358 -15649 17376 10462 -23854 -3960
499 -3960 19347 -5221 -9667 10579 -6118 -16402 15263 13529 -19853 -7169 13652 -6665 -7998
512 -7998 13068 -4193 -17122 11988 9841 -22276 -5464 19358 -5792 -15333 8223 -1359 -15854
525a5854K5238Q12l0212J1653K2550k0443o111K3597j2485j8247K5342M464k8918
538a8614J1966K3722k4158j0023K6911o724k0549K1590P953k6752O049K1385j7827
551e071n761K4474j2575k2424K5647J2809k9140L358K3037j7370j0392K5880o987
564E485k2520K1147J2794k8696Q58K5325j2421j0872J9489q606j9748K5543J3207
577B0985l3112r55K9690j2262j6638K0288q46j9229J7735J0952k8385J017K9622
590A8862j2189j8286J7347P32j8082J8617J1565k9876o23L0610j1786k1654K0463
603E700O642k0875R123J2761k2032N54K6131j3206k0756K1191N916k1339J0381
616A91J5115k3560m396K6814r348k0729K0590P268k4754O087J9490j8046o755
$$ plain form
525 -15854 9384 10196 -20016 -8363 14187 -6256 -12367 11230 -1255 -19502 5840 10304 -18614
538 -18614 -6648 17074 -7084 -17107 9804 3080 -17469 4121 12074 -14678 -8629 12756 -5071
551 -5071 -10832 13642 1067 -21357 4290 17099 -12041 -8683 14354 -3016 -13408 12472 5485
564 5485 -17035 4112 16906 -11790 -10932 14393 1972 -8900 10589 1983 -17765 7778 20985
577 20985 -12127 -13082 16608 4346 -12292 7996 7150 -12079 5656 16608 -11777 -10760 18862
590 18862 6673 -11613 5734 6466 -11616 7001 18566 -11310 -11933 18677 6891 -14763 5700
603 5700 12342 -8533 590 13351 -8681 -8127 18004 4798 -15958 5233 11149 -10190 191
616 191 15306 -8254 -12650 14164 4816 -15913 4677 11945 -12809 -6722 12768 -5278 -12033
629a2033K2702q152j9086J9122O498k3544R066K0583k2174j1100K6481k166k0698
642a4501J5015P509k1921O495K1665j8758j1809K4037j999k0526J4432R008k1034
655a2387P758K0482k2187j3907K9198K722k4657R205J1982j8187M385K0046j8491
668d038j3120K5022J773k3300J0010J3640j8017K091J8995j7845j4104K7514M199
681A2820k7063P260J6995j5974j167J8233j3563j3281K3272K902k5135R647J8052
694A2998j7454m244J9122j1138j3918K3050M970k6307O700J9669j5554n697J8874
707A1071q738j5098J9897M974k2411Q279J7343j8262o940K2952o680j9356J8547
720E578Q851k2420L758J8456j5175p477K1295n879j9947J5777J1090k0599L576
$$ plain form
629 -12033 10669 2517 -16569 2553 9051 -14493 -5427 15156 -7018 -18118 8363 6197 -14501
642 -14501 514 8023 -13898 -7403 14262 -4496 -16305 7732 5733 -14793 -361 8647 -12387
655 -12387 -4629 15853 -6334 -20241 8957 11679 -12978 -3773 8209 -9978 -5593 14453 -4038
668 -4038 -17158 7864 9637 -13663 -3653 9987 -8030 -5939 13056 -4789 -18893 8621 12820
681 12820 -14243 -6983 10012 -5962 -7129 11104 -2459 -15740 7532 10434 -14701 -5054 12998
694 12998 -4456 -8700 10422 -716 -14634 8416 13386 -12921 -6221 13448 -2106 -7803 11071
707 11071 2333 -12765 7132 12106 -10305 -2026 15317 -2945 -9885 13067 6387 -12969 5578
720 5578 14429 -7991 -4233 14223 -952 -8429 12866 6987 -12960 2817 13907 -6692 -3116
733c116J5871j6066o991K3778n862k3155J6970J3888k1985j652J8488j0546q487
746h865J8881n884k0404J6990J4788k2272l382J8563r290q596J8574m724k1385
759a7006J6631J6034k3007n803K1237n399j2220J4417k127j7517J5300J3911k3024
772h573n010K2149o418j4074J5797J840j9122J1152J4796k0115n420K2540n487
785D055j7186J4026M916j6653Q602J3506j9221m379K1997o806j7432J6951O699
798I075k1164N844J7621j5743p504K0082m702j6891J4916P627j9712M882J7485
811A1816j4714q472J9012l752j5725J5827P065k2377M457K0732j2762j2315J7404
824F196p65j5349J3093P156j9704L505K0609j4092j3203J8768J732j6230J0777
$$ plain form
733 -3116 12755 -3311 -10302 13476 7614 -15541 1429 15317 -6668 -8320 10168 -378 -8865
746 -8865 10016 4132 -16272 718 15506 -6766 -10148 8415 -875 -9471 9103 4379 -17006
759 -17006 -375 15659 -7348 -13151 8086 2687 -9533 4884 2757 -14760 540 14451 -8573
772 -8573 -13583 8566 2148 -11926 3871 5711 -13411 -2259 12537 -7578 -12998 9542 4055
785 4055 -13131 895 5811 -10842 -2240 11266 -7955 -12334 9663 2857 -14575 2376 9075
798 9075 -12089 -6245 11376 -4367 -11871 8211 3509 -13382 1534 9161 -10551 -5669 11816
811 11816 -2898 -11370 7642 3890 -11835 3992 11057 -11320 -6863 13869 1107 -11208 6196
824 6196 5431 -9918 3175 10331 -9373 -5868 14741 649 -12554 6214 7946 -8284 2493
837B493P917j9416K992K1646j2961j5702J8101M585j6336P670Q482j6155K746
850c938J8865j3733j4661J9670N321j8852O306J1208j5506K44J9198j1562j5518
863a2958J8031O907j8854M316J2583j3644j632J6892j0372j3893J8553N744k0898
876i225N110J5480j4386n083J7912o817j5546J5893O706j8941M203J5212j3953
889c435o239J8064n119j5312J4296O313j8680M628J6388j4592q391J9389k057
902E253j7739J1303R381j5972K419J4248j3883o836J9644k173j9014J0900J1553
915I084j6248R42J5059j2374q639J9906r54k0739R595J4261j4124k419J2838r421
929c233o730J8226k003k0176J0852J4850j5834m161J5300p216r451J6472n10j9043
$$ plain form
837 2493 10410 -9006 -6014 15632 2671 -13031 5070 9655 -6681 989 9471 -6684 -3938
850 -3938 14927 1194 -13467 6203 11524 -7328 -1022 10186 -5320 -5076 14122 2560 -12958
863 -12958 5073 11980 -6874 -2558 10025 -3619 -5251 11641 1269 -12624 5929 11673 -9225
876 -9225 -4115 11365 -3021 -8104 9808 2991 -12555 3338 10044 -8897 -4694 10518 -3435
889 -3435 -9674 8390 3271 -12041 2255 8568 -10112 -5484 10904 -3688 -12079 7310 5253
902 5253 -12486 -1183 8198 -7774 -5355 8893 -4990 -11826 7818 5645 -13369 -2469 9084
915 9084 -7164 -6222 8837 -3537 -12176 7730 6776 -13963 -4368 9893 -4231 -6650 6188 -3233
929 -3233 -9963 8263 6260 -13916 -3064 11786 -4048 -8209 7091 -125 -9576 6896 6386 -12657
943a2657R483J6024j5487o209J5425m947r446J3898P18j8326R876J4898j6323
956c073o441J7884l987j2970J2949L570j6813P197J4547j4953o623J7448l839
969D896j3432J2783M928j6631N424J4452j4285o523J8091l800j5479J2892P906
982A1222j7099K084J4564j0987p052J5875l705j4745J3406P856j8002J097J6760
995A1274j0541q502J5120k077j4915J2459R312j8667q05J8116q183j0738J2670
1008D523o79j2901J1718Q059j8545m88J8968p837j2760J2851K168j3810R573Q244
1022I084j6739j332J8927p166j3794J2426M049j3240P220Q461j5688q70J8925
1035A0263q220j4695J3582O439j4962M447J0756j3662k173J6699o417j4292J3290
$$ plain form
943 -12657 -3174 12850 -2637 -8846 6579 1632 -7814 6084 6802 -11524 -1648 13250 -3073
956 -3073 -9514 8370 4383 -8587 4362 7932 -8881 -1684 12863 -2090 -8713 8735 4896
969 4896 -8536 4247 9175 -7456 -2032 12420 -1865 -8388 9703 5903 -9576 3316 11222
982 11222 -5877 -3793 10771 -216 -7268 8607 4902 -9843 3563 11419 -6583 -5486 11274
995 11274 733 -7769 7351 5274 -9641 2818 12130 -6537 -7342 10774 2591 -8147 4523
1008 4523 3844 -9057 2661 10720 -7825 -8313 10655 2818 -9942 2909 5077 -8733 840 9084
1022 9084 -7655 -8987 9940 2774 -11020 1406 5455 -7785 -565 7896 -7792 -8662 10263
1035 10263 2043 -12652 930 7369 -7593 -3146 7610 -6052 -8225 8474 2057 -12235 1055
1048A055O612j5703M255J1741j2837l581J6616o017j4197J3715P028j6844K825
1061e332J4156j1589o165J5511l310j3712J2119O112j6053L749J4947j2128q238
1074i933J6198j404j3982J0186P488j5649K609J5068j1124r475J5954J139j4828
1087g753P801P854j3600K467J4136j1632r544J7341J965j6960O950R875j2261
1100c361J75J3323j0089r291J6428K457j6964N234J1568j1043j698J2696r034
1113D01r509J6609K399j8484N708J3461j1334m355J3341o768r570J3831L058j6962
1127h174N459J3358j2163n443J4007m977j0448J2913L380j6563N048J4425j2602
1140a780o639J4965k869j2425J1538M076j4293M009J2908j1991o555J5578k878
$$ plain form
1048 1055 7667 -8036 -3781 7960 -4877 -8458 8158 2141 -12056 1659 8687 -8157 -5332
1061 -5332 8824 -2765 -8930 6581 3271 -10441 1678 7790 -8263 -4514 10433 -1695 -9933
1074 -9933 6265 4861 -9121 1065 8553 -7096 -4487 10581 -543 -10018 5936 7075 -7753
1087 -7753 48 7902 -5698 -3231 10905 -727 -10271 7070 9035 -7925 -975 8900 -3361
1100 -3361 -3186 10137 48 -9243 7185 9642 -7322 -2088 9480 -1563 -3261 9435 401
1113 401 -9108 7501 9900 -8584 -2876 10585 -749 -5104 8237 1469 -8101 5730 8788 -8174
1127 -8174 -2715 10643 -1520 -6963 7044 2067 -8381 4532 7912 -8651 -3603 10822 -1780
1140 -1780 -8419 6546 3677 -8748 2790 6866 -7427 -3418 9490 -2501 -9056 6522 3644
1153C644j3523J0786O663j4975K369J3137j0595o699J5385k586j4609J0480Q622
1166H099j3949P9J2646q969o581J4565k444j5125J0880J0258j5300j865J4122
1179F416o726p715J2346j110j3978R725J0566j4748k650J4220n582q274J1436
1192C926j9j3622R317J0365j5219l905J6411m028j0957J0296J883j2357P819J0036
1206I946j4636l578J6017m090j1827J0923L178j2603O045J0031j3430l739J6605
1219H842m305j2852J0136N586j3042L976J1082j1943m322J5128l909j2745J1309
1232B941N825j4336K926J2304j0751n135J4117l018j3322J0897O869j4304J540
1245c447J3047r226p199J3271j561j2303J0202O225j5086J888J4208q819r209
$$ plain form
1153 3644 -9879 907 7570 -7405 -5036 8101 -2494 -9193 6192 3606 -11003 -523 8099
1166 8099 -5850 -5771 6875 -2094 -8675 5890 3446 -11679 -799 9459 -5841 -7706 6416
1179 6416 -310 -8025 4321 3211 -10767 -1042 9524 -5224 -7874 6346 764 -7510 3926
1192 3926 3907 -9715 -398 9967 -5252 -9157 7254 3226 -7731 2565 4448 -7909 -90 9946
1206 9946 -4690 -8268 7749 3659 -8168 2755 5933 -6670 -625 9406 -4024 -7763 8842
1219 8842 4537 -8315 1821 7407 -5635 -1659 9423 -2520 -6842 8286 4377 -8368 2941
1232 2941 8766 -5570 -2644 9660 -1091 -6226 7891 4873 -8449 2448 9317 -4987 -3447
1245 -3447 9600 374 -6825 6446 4885 -7418 2784 9009 -6077 -4189 10019 1200 -8009
1258h009J2900O13j2252Q232O519j3704J052J4255q774r667J2443K586j2680O368
1272a18O789j2853J275J4454q733j1305J3577L618j3602M587Q549j1007k51J2765
1286G745p968j0621J3974L790j4166L365R954j0105j749J2875p114j0648J3306
1299B638M469j5153L447J1518r518m322J2346n210r815J2563M087j5250L412J2218
1313G430r733m995J2786l358j1118J0656N185j3978K991J2287r546o914J3413
1326E106j571j1523R422N539j3824K976J2522j0079o525J4141j454j3194Q242
1339b22Q029j2466J147J1288q759o456J3619l79j3755P697Q680j1718p66J1611
1353G550p322o946J3311p64j4020P352J0362j1218k951J1236n560p170J2091p0
$$ plain form
1258 -8009 4891 5504 -6748 1484 8003 -5701 -4649 9606 832 -8835 3608 6194 -6486 -118
1272 -118 6671 -6182 -4907 9547 814 -10491 3086 6704 -6898 -2311 6238 -4769 -5020 7745
1286 7745 -223 -10844 3130 6920 -7246 -3881 6073 -4032 -5781 7094 -20 -10668 2638
1299 2638 7107 -8046 -4599 6919 -2599 -6921 5425 215 -9600 2963 7050 -8200 -4788 7430
1313 7430 -2303 -7298 5488 2130 -8988 1668 6853 -7125 -4134 8153 -1393 -8307 5106
1326 5106 3535 -7988 1434 6973 -6851 -3875 8647 -1432 -7957 6184 4730 -8464 -222
1339 -222 7807 -4659 -3512 7776 -983 -7439 6180 5801 -7954 -257 8423 -3295 -4061 7550
1353 7550 228 -6718 6593 5829 -8191 -839 9523 -1695 -4646 6590 1030 -6140 5951 5881
1367E881j3800P613J0309j2062l485J2673m391q072J0215R30j3181O759J0982
1380A0371j2240m700J3016l251r177R505K555j2522N249J0715j1954m625J4047
1393F989l357j0719Q940L829j1909M428J0602j1308n084J3482k310j1231Q815
1406A167N194j2457L031J0489r679n302J3435k482j2465R258O815j3018J514J1425
1420F925q527o096J2477k058j1535R005P013j3187LJ2509p063o532J0618j294
1434B258j0742Q688P123j3097p85J3317n981q739J0219R65j0155P061O449j2731
1448f150j55J4199o230j0006J0143K361j0315N868O962j1676m84J3287n883j0753
1462h832J0702M266j0827L167P808j0526o47J3511o504j0502J0607M708j2052
$$ plain form
1367 5881 -7919 -306 10003 -2059 -5544 7129 2738 -5334 4881 5811 -7370 -611 10371
1380 10371 -1869 -6569 6447 3196 -5981 3524 6079 -6443 -1194 9521 -2433 -7058 6989
1393 6989 3632 -7087 1853 5682 -6227 -1799 8803 -2505 -7589 5893 3583 -7648 1167
1406 1167 6361 -6096 -3065 7424 -2255 -7557 5878 3396 -9069 189 7004 -6014 -4500 6925
1420 6925 -1602 -7698 4779 2721 -8814 191 7204 -5983 -5980 6529 -534 -7066 3552 2258
1434 2258 -8484 204 7327 -5770 -6555 6762 781 -7958 2261 3226 -6929 132 6581 -6150
1448 -6150 -6305 7894 1664 -8342 1801 4162 -6153 -285 6677 -4999 -5483 7804 1921 -8832
1462 -8832 1870 6136 -4691 -1524 6284 -4242 -4889 8622 2118 -8384 2223 6931 -5121
1475e121L080R213r342k499J1882m978j0249J0959N022j2998K268J0084p746m187
1489d612J0900l487r886R931N214j3283K231J1521q529n788J1332j730r960Q577
1503B431M953j2115J822J1318q003o762J1572n15j0785O842N879j0752J122J1254
1517H261q535p459J2339Q31j1176N213O773r677K50J0075p152p184J1856J046
1531E461j2286N050Q330r186j576J0201o408p419J1787J811j3069M532R249q927
1545b450l187J0557n231o836J0226J672j2649N282R877r675m207J0577l537p589
1559g170R895J979j2500M079J0612r067m541J1140k479q896Q429L262j1636M333
1573b560R664r183n498J1687j390r445P764M136j0914K456R517q090n133J1640
$$ plain form
1475 -5121 -2041 7172 -2170 -4669 7213 2235 -8014 2945 7967 -5031 -2763 7321 -425 -4612
1489 -4612 6288 2801 -7085 2846 8060 -5223 -2992 8529 0 -5788 5544 3814 -6146 2431
1503 2431 7384 -4731 -2909 8409 406 -6356 5216 4701 -6084 758 6637 -4115 -2993 8261
1517 8261 -274 -7733 4606 5437 -5739 -526 6247 -3430 -3180 6895 -257 -7441 4415 5461
1531 5461 -6825 -1775 6555 -2631 -4207 5994 -414 -7833 3954 5765 -7304 -2772 6477 -2450
1545 -2450 -5637 4920 -311 -7147 3079 4751 -7898 -2616 7261 -2414 -6621 3956 419 -7170
1559 -7170 2725 4704 -7796 -3717 6895 -2172 -6713 4427 1948 -6948 1481 4743 -6893 -2560
1573 -2560 7104 -2079 -7577 4110 2720 -6725 1039 5175 -5739 -3283 6234 -1856 -6989 4651
1587D651j087j0711P617N622j0304J362R492p738n581J1837r80j1124P091O809
1601F956j0348l59J0103o276n520J0457j158j0888P013P963j0799j533J0624n303
1615I32o022R130Q6r923O427P450j1176k074J1444l387p818P872J209r461O059
1630G48P382j0906k359J1891l455q885P737K686r170M429O940j0181k232J2204
1644F829l009j0382P732M141r531L432P328r321k438J1661l907r921Q491N291
1658F396j0469J091Q658p757k854J0650l250r949Q203N443j0934J136R628p279
1672a287m604R588j828r162Q355M816j0934M26J0390n911o039R020j15r150O534
1687I9N133j0162M59J0509o449p266R889J119q975N057N234r218l0J0765o148
$$ plain form
1587 4651 3564 -7147 470 6092 -4212 -2850 6642 -1096 -6677 5160 4180 -6944 147 6956
1601 6956 -3392 -3751 6352 76 -5444 5013 3855 -7033 -20 7943 -2856 -4389 6235 932
1615 932 -5090 4040 4126 -5797 630 8080 -3096 -5170 6274 2887 -4931 2941 4150 -5311 748
1630 748 8130 -2776 -5135 6756 3301 -5584 2153 4839 -4331 98 7038 -3143 -5375 6829
1644 6829 3820 -6562 1170 5311 -4220 -788 6540 -2781 -5219 6442 2535 -7386 1105 6396
1658 6396 -4073 -2982 5676 -2081 -4935 5715 2465 -7484 719 6162 -4772 -3636 5992 -1287
1672 -1287 -5891 3697 1869 -7293 1062 5878 -5056 -4630 5760 -151 -6190 2830 2715 -6435 99
1687 99 5232 -4930 -4471 6038 -411 -7677 2212 3331 -5644 -587 4647 -4571 -4601 6164 16
1702A6p634R910J710r616M337O219q130o14R557n642p769J0096K561j0316L047
1717b268P405p581j277R113m534p456R071K799j0587L240Q475p546l196R665m493
1732H30p076R274K867j0799K236Q859o796l412Q618k378q035Q255L687j0743K200
1747b413R689p409m409Q931j615p661P000L715j0030J713R566p338m828R713p17
1762C907q917O145M397r004J690Q273o828n032R596K96r905N504N428q338q5Q763
1778E890o096m977R636k99j0020N139O567p792j248Q053m918n409R233K72j0120
1793f089M589P485q520k231Q662l197n845P577P71r511N022P611q876l216R340
1808C572k377o477O781J901r247M299P364q678l524J0028j841p524O421K221q273
$$ plain form
1702 16 -7618 2292 4002 -5614 -1277 4942 -3188 -3802 5755 113 -7656 2440 5001 -5315 -2268
1717 -2268 5137 -2444 -3721 5392 858 -6598 2473 5272 -5315 -2075 6400 -1146 -4342 5323 830
1732 830 -6246 3028 5895 -4904 -2668 6191 -605 -4017 4601 2223 -5812 2443 6130 -4613 -2413
1747 -2413 7276 -133 -4542 4389 2774 -4887 2113 5828 -4202 -2489 7077 -261 -5089 4624 3907
1762 3907 -5010 1135 5532 -3472 -1782 6491 -337 -5369 4227 4523 -5382 122 5550 -2788 -2873 5890
1778 5890 -206 -5183 4453 4154 -5866 -727 5840 -1952 -3200 4853 -65 -5474 3759 4031 -6089
1793 -6089 -1500 5985 -2535 -4766 3896 699 -5146 2431 3202 -6309 -1287 6324 -2552 -5768 3572
1808 3572 1195 -5282 1499 3400 -5847 -1548 5816 -2862 -6386 3642 1801 -5723 698 2919 -5354
1823e354L747P347q647l358J0110j828p921O132L664q086J903P108p445k622R713
1838D463j618r323O341N019q306P79P678o357l474Q872j486q667O414N316r096
1853c445j51Q653m989m452P908o20q232N805N171q691k84Q886m707n463P628L53
1869C370p304M408N120q711l57R404l987p007P614J666p863L793N544q165p80
1884c255R159m291p020P403K801q012K861N430p138j064Q794l509p774P807L023
1899E215q794K195O349o485j907Q440l584o852P273L537r137J490P047n993k760
1914c966Q289k724p235O980L631r207J265P999n759l891P777j493p240O944L290
1929D660q997Q41Q586n812m227P594n66p421N589L762q144Q55Q103n203n517P798
$$ plain form
1823 -5354 -1607 5740 -2907 -6265 3845 2017 -5904 228 3892 -4194 -2291 4817 -2628 -5250 4463
1838 4463 2845 -6478 -137 4882 -3424 -2645 5033 -1324 -4798 4074 2588 -6079 335 5651 -3445
1853 -3445 -3596 5057 68 -4384 3524 2904 -5328 477 5648 -3043 -3327 5559 852 -4611 3017 3370
1869 3370 -3934 474 5594 -3117 -3474 5930 1943 -5064 2550 4216 -3647 146 5690 -2475 -3255
1884 -3255 5904 1613 -5407 1996 4797 -3215 -354 5076 -2062 -3126 5668 2159 -5615 2192 5215
1899 5215 -3579 -1384 4965 -1520 -3427 5013 1429 -5423 1850 5387 -3750 -2260 4787 -1206 -3966
1914 -3966 4323 1599 -5636 1344 4975 -4232 -2967 5032 -727 -4618 3159 1666 -5574 1370 4660
1929 4660 -4337 -3496 5090 -722 -4949 2645 2079 -5342 247 4009 -4135 -3280 4823 -380 -5897 1901
1945A901N75p294M301M462p630K14P776m631n405Q044P64q045L258N473o639l62
1961c238P435n055n090Q450J224q907L465O100o730j127P343l969m992P723J025
1976C657q779L153P265o264k626O749k555m926P565Q63q824L048P435o660l352
1991d251P872j611n683N574J872q215L454P267p154l400Q097j160o397N411K265
2006C941o950K265O514o525l309Q129p18p476M724L850o784J168O566n766l437
2021c808P892p68p809M787M723p176j48O740m445l695P286q01p706N170M917p101
2037a942q65O779l738m094O784m98o996M583N021p414j126P576l086n367O228
2052A845M32o970M248N103p726j047P933l003n413N584J416o542L269M870p172
$$ plain form
1945 1901 2476 -4818 -517 3945 -3685 -3471 4305 -326 -5731 2313 3077 -4968 -1710 3763 -2876 -3238
1961 -3238 4197 -858 -5948 2502 3726 -5181 -1716 4384 -2346 -3473 3870 -99 -5091 2632 3657
1976 3657 -5122 -1969 5296 -968 -3594 3155 600 -4326 3239 4102 -4722 -1674 5761 -899 -4251
1991 -4251 3621 2010 -3673 1901 3773 -4442 -988 6279 -875 -4275 3822 2662 -3735 1676 3941
2006 3941 -3009 -744 5770 -755 -4064 4065 3347 -4129 595 4445 -2339 -1171 5395 -371 -3808
2021 -3808 4084 3316 -4493 294 5017 -2159 -2307 4433 -12 -3707 3579 2778 -4928 242 5159 -1942
2037 -1942 -2807 3972 234 -3860 2924 2426 -4570 13 5034 -2380 -3506 4070 984 -4383 1845
2052 1845 2277 -4693 -445 4658 -3068 -4115 3818 815 -4598 986 2402 -4140 -871 3999 -3173
2067c173j369Q524k785o347N580K369o769K640N141o213j642P793k752o382O012
2082F27K789p032J817N170n388k024P468k261o782N826L794p393R70O197n086
2097a308k778P523j794o803N954L455p430M90O791m608l122O777j169o385M935
2112E28L736p277N08O919l818m417O219J52o163M080M052p140J47P307l784n182
2128d133O286J170o520L364M159o286p3O861m222m850O231K237p085K002N127
2143D268n769o76O915l914n169O928J791p452K093N464n113j496O010l382m627
2158d129O398K065p730J868O178n093k480O188k129n086O002J506p408J947O545
2173D642n026l228O269j152n286N134J935p045J862O100m945l622O947m60n662
$$ plain form
2067 -3173 -4542 3982 1197 -5150 430 2799 -3970 -1330 3811 -2402 -4044 3749 997 -5385 627
2082 627 3416 -3616 -1799 3371 -2017 -4041 3427 1166 -5616 210 4004 -3389 -2419 3778 -1308
2097 -1308 -4086 3437 1643 -5160 794 4249 -3181 -2691 4100 -508 -3630 3147 1978 -4407 528
2112 528 4264 -3013 -2505 4414 596 -3821 2398 2550 -3613 467 4519 -2621 -2474 4833 1049 -4133
2128 -4133 2153 3323 -3197 167 4326 -1960 -2033 4828 606 -4244 1987 4224 -2861 -859 4268
2143 4268 -1501 -2177 4738 824 -4345 2583 4374 -3078 -985 4479 -634 -2130 3880 498 -4129
2158 -4129 2269 4334 -3396 -1528 4650 -443 -2923 3265 1136 -3950 2052 3558 -3850 -1903 4642
2173 4642 -384 -3612 2657 1505 -3781 1353 3288 -3757 -1895 4205 -740 -4362 2585 2125 -3537
2188c537L530K850o232J411O081n178l690P188Jo659L784L431n863O99N526m340
2204i98l603O835k23o670L480M290n690j76N724l742l324O331j74o794L987M887
2220D140o004j383O195k564m136N546K77o573L652N080o093j509O289k349m389
2235c821N539O46o109L104M781n814j738O806j648n284M743J595n687K241M994
2250D348n809j806P009j599n721M761K137n875J831N213n594k094O984j244n920
2265c379L975K989n403P87N154m810k166O481j527n827M354L601o016K47N063
2280C523l422k759N730o67n985M268L818o486j13N757l296l244N026k6n640M152
2296F36L217o164l69O561l121m080M835R71n989L144L975n898p65O826k792n262
$$ plain form
2188 -3537 -7 2843 -3389 -1978 4103 -1075 -4765 2423 2424 -4235 -451 2980 -2883 -2184 3342 -998
2204 -998 -4601 2234 2011 -4659 -1179 3111 -2579 -2755 2969 -773 -4097 2234 2060 -4734 -747 4140
2220 4140 -1864 -3247 2948 384 -3752 1794 2071 -4502 -850 4230 -1863 -3372 2917 568 -3821
2235 -3821 1718 2364 -3745 -641 4140 -1674 -3412 3394 1746 -3538 1205 2800 -2887 -646 4348
2250 4348 -1461 -3267 3742 2143 -3578 1183 3320 -2555 -724 4489 -1105 -3199 3785 2541 -3379
2265 -3379 596 3585 -1818 -1031 4123 -687 -2853 3628 2101 -3726 628 4229 -1787 -1540 3523
2280 3523 101 -2658 3072 2405 -3580 688 4506 -1980 -2093 3664 368 -2876 2150 2124 -3516 636
2296 636 3853 -2311 -2680 3881 760 -3320 1515 2486 -3503 -359 3616 -2282 -3047 3779 987 -4275
2312d275N413J237n359K203M147n593n14O155k858n082M870K700o074J793M252
2327C015n043o91N963k936n053N340K874o607J180M697m120j294N535k671m614
2342d425N538K023o495R96N729m188k264N151j251m926N065K327o586Q29O129
2357C652m011l075N147l73m764L833K810o213Q33O059l962l744N620J20n178L558
2373C12K609n662R62N954m361l411N838M98n467K476L671m937nN249l518l718
2389c510N700R38n818K607L784n017n88N563l172l591N792L62o251K418N083m833
2405e33j608N130k068l665M833M93n864K783N015n079k114N743j797m129M590
2420A730J247o018K281N082n254k383O096j056m881L936J533n183K320M493n219
$$ plain form
2312 -4275 1138 2375 -2984 -781 3366 -2227 -2741 3414 556 -4526 344 3044 -3030 -1237 3015
2327 3015 -2028 -2719 3244 308 -4745 595 3469 -3138 -1958 2739 -1381 -2675 2860 189 -4425
2342 -4425 1113 3136 -3359 -2363 3366 -822 -3086 2065 814 -4112 953 3280 -3306 -2477 3652
2357 3652 -359 -3434 1713 1340 -3424 409 3219 -2994 -2161 3898 -64 -3808 1812 1932 -3246 312
2373 312 2921 -2741 -1779 4175 -186 -3597 2241 2739 -2728 -252 3419 -1518 -1523 3726 208 -3510
2389 -3510 2190 3128 -2690 -83 3701 -1316 -1904 3659 487 -3104 2688 3050 -3201 -783 4300 -533
2405 -533 -2141 2989 921 -2744 2089 2582 -3282 -499 4516 -563 -2677 3066 1269 -2860 1730
2420 1730 2977 -3041 -760 4322 -932 -3315 2781 1725 -3156 780 2313 -2870 -550 3943 -1276
2435a276k123N867r06n221L891K487n399J146M746l996k879N868k23n717L660
2450g5K695n105N74M563l750k303N640n93n718L537L452n087k66N178l298l012
2466c568N362J29n886L434L920n281j028N465k249l467M605L71n396L214L991
2481C616n659q21N354j723m146M511Q94m977K300M083n565p72O217k109m722M093
2497E74J530m710K193L583m678j088N962k142m833M247K449n388J495L985m208
2512a029j196N627j727n421M443L014n541R29M094l685j803N332j404m885M594
2527A342K614o018M59M678k986k714N276j186m521M114K686n880L04N157k870
2542D55l014M611p3m706L470K690n264M6N532l386l328M485O69m617K609L060
$$ plain form
2435 -1276 -3399 2468 1562 -3659 232 2719 -2680 -1534 3212 -784 -3663 2205 1982 -3735 -75
2450 -75 2620 -2485 -1911 2652 -1098 -3401 2239 1646 -4072 -535 2917 -2170 -2436 2742 -556 -3568
2466 -3568 1794 1923 -3963 -529 3391 -1890 -2918 2547 298 -3169 1436 1807 -3589 -375 3616
2481 3616 -2043 -2864 2490 767 -3379 1132 2026 -2951 -651 3432 -2133 -2905 3312 1203 -3519 574
2497 574 2104 -2606 -413 3170 -1508 -2596 3366 1224 -3609 638 3087 -2301 -806 3179 -1029
2512 -1029 -2225 3402 1675 -3746 697 3711 -1830 -901 3193 -492 -2295 3037 1633 -3252 1342
2527 1342 3956 -2062 -1603 3075 89 -2625 2651 1465 -3056 1058 3744 -2136 -1832 3325 455
2542 455 -2559 2052 1979 -2727 743 3433 -1831 -1785 3747 361 -2967 1518 2187 -2430 179 3239
2558C239n325kN755l167m255N242R54n204K118L594m594n72N399l290l533N284
2574A643J025n690J725M405m679n25N033k866l947N123J434n708J340M761m206
2589a132j408M787k012m073M865J319n915J932M918m215k251N006j117l790L750
2604F64J686n292J193M694l542k659N053o60m253L668J950n262J344M728l673
2619c61l203N541k47m911L251K735m790O50M563l342l037N042N01n284K827L117
2635C052m466K48M117k941k917M992K53n304K862L488m507p53M913k481l333N071
2651B294L76n455K442M113m619j018M644j957l299M660M52n257K555L942m661
2666g88j819N564j802l273L638Q30m892K552L779m806j854N712j143m667L715
$$ plain form
2558 3239 -2086 -2088 3667 500 -3755 1487 2441 -2763 -645 2949 -1645 -2217 3182 -108 -3641 1643
2574 1643 2668 -3022 -1297 3108 -1571 -2096 2937 71 -3876 1247 2681 -3027 -1687 3074 -1132
2589 -1132 -2540 2247 235 -3838 1027 2346 -3569 -1637 3281 -934 -3185 1821 704 -3086 664
2604 664 2350 -2942 -1749 2945 -597 -3256 1797 1137 -3116 552 2502 -2760 -1416 3312 -361
2619 -361 -3564 1977 1730 -3181 70 2805 -1985 -1335 3228 -114 -3151 1891 2392 -2892 -65 3052
2635 3052 -1414 -1166 2951 10 -2907 2085 2338 -2966 -104 3384 -1123 -1876 3037 556 -2777 2294
2651 2294 2670 -2785 -343 3770 -849 -1867 2777 820 -2479 2181 2633 -2624 -69 3873 -788
2666 -788 -2607 2957 1155 -2118 1520 2350 -2542 10 3789 -1017 -2871 2841 1698 -2969 746
2681G46J769m852J688L820m332j572N381j031m900L600K303m570P50M044l737
2696h93j937N300j086n189L733L170n156K84M305l207k001M959j162m610L214
2711b76L322m919o28N049k839k624M667m85m912L408L112n067k46M893k109l523
2727c177M390O2m279K656L250m885o15N591k434m066M776O00m567K185L241m501
2743a773m79N312k198m584M523J595n188K139L251m061j021N308k037m489M580
2758H78K040n251J371L873l646j218M870k128l668L893K146n190R32M041k950
2773gk359M753j438l612L511K253n235P59M793l490k325M689p87l912L394J988
2789B975n093O14M584k771k823M413k9m387K987K325m410P0M890l065l131M451
$$ plain form
2681 746 2515 -2337 -649 3171 -1161 -2733 2648 1617 -3283 317 2620 -1950 -1200 2844 -893
2696 -893 -2830 2470 1384 -3805 -72 3098 -2058 -1774 2531 -676 -2677 2282 1120 -3490 -276
2711 -276 3046 -1873 -2501 2548 -291 -2915 1752 1267 -3645 -237 2875 -2192 -2438 2455 346 -3177
2727 -3177 1213 1275 -3004 -348 2902 -1983 -2598 2993 559 -3507 1269 1869 -2698 -513 2728 -1773
2743 -1773 -2252 3060 862 -3722 801 2396 -2792 -653 2598 -1463 -2484 2824 787 -3702 878
2758 878 2918 -2333 -962 2911 -735 -1953 2917 789 -2879 1014 3160 -2030 -1098 2943 -7
2773 -7 -2366 2387 949 -2663 848 3101 -2134 -1375 3418 -72 -2397 2292 1505 -2407 987 2975
2789 2975 -2118 -1504 3080 309 -2514 1899 1870 -2517 470 2795 -1615 -1545 3345 280 -2851 1600
2805A600M97m338K265K738m459K68M511l139k984M747N66m722J963L207l970k56
2821a506M362k652l313M648Q13n494K095L688l728j125M330j811l203M266Q40
2836B210n354K196M102m276j652M645j520l343L851Q48m676K050M102m063k173
2851c053M682r27l636L477J347m653J717L846l703k431N081o78l832K829J940
2866B006m429J056M177l813k163N093m74m382L143K123l988J87L984k970k507
2881b957N140k77n020L026K991m018m32L930k627k093M382jm665K387L457m320
2897a097m55M171k227k750M296n3m634K655L483m687o61M627j632l441L940Q24
2913B359m820K743K932m329r44M962j638l748L648J344m607K091K791m054r06
$$ plain form
2805 1600 2097 -2241 24 2762 -1697 -1429 3082 -57 -3041 1706 2272 -2450 -487 2720 -1250 -1506
2821 -1506 2856 204 -3109 1539 2352 -3142 -1047 2641 -1087 -2212 2118 307 -2896 1370 2210
2836 2210 -3144 -948 3154 -1122 -2774 1871 351 -2992 859 1707 -2969 -919 3183 -880 -3053
2851 -3053 1629 702 -2934 543 1890 -2763 -1046 2800 -903 -3334 1747 1069 -2763 66 2006
2866 2006 -2423 -1367 2810 -1003 -3166 1927 1453 -2929 214 2337 -1651 -1464 2520 -450 -2957
2881 -2957 2183 1906 -3114 -88 2903 -1115 -1547 2383 -244 -2337 2045 2044 -2621 -234 3223 -1097
2897 -1097 -1552 2619 392 -2358 1938 1885 -2749 -94 3389 -1298 -1959 2668 1036 -2405 1535 2359
2913 2359 -2461 282 3214 -1115 -2059 2903 1265 -2483 1165 2509 -2098 -7 2784 -1270 -2176
2928b176N084j536m213L877J293m225J422L057l588r64M584j425m134L916J602
2943B574m194J73M019l566r16M278j303l956L203K531m899L48M175k618k358M488
2959A979p61m274L516J953m636K39M532k914k220L922l12l737L007K182m557N8
2975b023M401k467k804L977J29l694K405K260m091k61M861k324l453L911Q31l959
2991b301J867K809m093k18M437k421l087M096O76l931J335L324l676q63M344k176
3007A22l221M179R88m355J284L836l654j081L910j420l361L939Q27m253J090M122
3023B952l147j793L769j067k963L381J281m726J596L811l371j764M044n05l836
3038b338K985K018m517Q09M376l245k625M544k31l958K693J926l959N44L992l201
$$ plain form
2928 -2176 2908 1372 -2841 1036 2329 -1896 -474 2583 -1005 -1969 2615 1190 -2944 972 2574
2943 2574 -1620 -1447 2572 -994 -1910 2368 1065 -2891 312 2843 -2056 -1708 2467 -151 -2509 1979
2959 1979 1218 -3056 460 2413 -2223 -1984 2548 -366 -2586 1336 1024 -2713 294 2476 -2081 -2023
2975 -2023 2378 -89 -2893 1084 1213 -2481 -76 2184 -1907 -2168 2693 369 -3084 827 1658 -2301
2991 -2301 -434 2375 -1718 -1936 2501 80 -3007 1089 1765 -2166 -831 2493 -1183 -2046 2298 122
3007 122 -3099 1080 2068 -2287 -1003 2833 -821 -1902 2008 588 -2773 1166 1993 -2260 -1170 2952
3023 2952 -195 -1988 1781 714 -2249 1132 2413 -2313 -717 3094 -277 -2041 2003 1498 -2338
3038 -2338 647 2665 -1852 -1043 3333 88 -2537 2007 1776 -2182 511 2437 -1522 -978 3014 -187
3054a87k324M420L21m246K175K643l894K62L487k816k220M251K7m441K311K957
3070B726l691o33L975k181k941M124M79m408K182L040l642q47L782j531k835L995
3086A594k82l911K115L152l661j173M323j479l035L148O06l976K092L030l995
3101a452j102M468j088l294K758J192l695J563L098l634j366M723j130m022L405
3116D24J318l600R79K914l158j556M237m96l719K679K372l952O57K852k492j600
3132b141L972n90m313L421K153m017K50L293k189j707L531o32l686K752K583l891
3148a211m22M013k280k103L285L8l543K522K314m071k17M285k100k588L128Q38
3164A888l962K063K948l839n13M340k032l239L509J133l806J376K358k995o73
$$ plain form
3054 -187 -2511 1909 2230 -2016 159 2802 -1092 -830 2657 -159 -2379 1872 1899 -2542 -231 2726
3070 2726 -965 -1598 2377 196 -2745 1379 1858 -2550 -368 2672 -970 -1817 1965 434 -2401 1594
3086 1594 1312 -2599 -484 2668 -993 -2166 2157 678 -2357 791 1397 -2579 -487 2543 -1452
3101 -1452 -2554 1914 826 -2468 290 1482 -2213 -650 2448 -1186 -2552 2171 1041 -2981 424
3116 424 1742 -1858 -879 2035 -1123 -2679 1558 1062 -2657 22 2394 -1558 -901 1951 -541 -2141
3132 -2141 1831 1241 -3072 349 2502 -1515 -1265 2028 -161 -1868 1663 1031 -2655 97 2680 -1211
3148 -1211 -1633 2380 100 -2003 1282 1320 -2223 299 2613 -1458 -1675 2610 510 -2078 1050 1888
3164 1888 -2074 -11 2937 -902 -1415 2925 893 -2346 1163 2296 -1510 -134 2224 -771 -1444
3179a444M063j708k942L220R91m003J282K861l160o31L746j602k778L092J701
3194B688m501R55L168k630j364L562j225l164L506J340m220N38L505k502j320
3209a664L214r60l227L203J595m026N17L631k696k139L781k92l082K254K036m086
3225a941O55L986k951k042L116K49l199K215J435l359N53L327k087k807M026L52
3241A528l729J511K521l311m5L832k556k155L827J52l900J678L012l641m42L378
3257A660j682k219L246P65l773J075L078l113p72L480j616k470L332P63l933J527
3273f52K872k931j143L756j097k736K833O18l263J187K846k679j893M037m21l194
3289a860K631P67k956Q02L139k910j446L672n20l277K287J625l120M41L281k725
$$ plain form
3179 -1444 2619 911 -2031 1189 2180 -1823 -541 2320 -840 -1471 2275 673 -2105 987 2688
3194 2688 -1813 -858 2310 -320 -1684 1878 653 -2511 995 2335 -1885 -1347 2158 -344 -1664
3209 -1664 1550 590 -2637 566 2161 -1865 -1348 2283 -413 -2552 1229 937 -2145 109 2145 -1941
3225 -1941 -1286 2700 -251 -2293 823 1072 -2127 88 1523 -1836 -1283 2044 -43 -2850 1176 1528
3241 1528 -2201 -690 1831 -1480 -1525 2307 -249 -2404 1423 1575 -2325 -647 2365 -1276 -1718 1660
3257 1660 -22 -2241 1005 1770 -2003 -928 2150 -963 -1735 1745 129 -2341 991 1754 -2179 -652
3273 -652 2220 -711 -1854 1902 805 -1931 902 1520 -1743 -556 2290 -389 -2282 1755 1334 -1860
3289 -1860 771 1538 -1418 -616 2523 -387 -1833 1839 1319 -1958 329 1954 -1166 -725 2556 -169
3305a69j734L825k66l716K169K174l230k7L019k285j414L117j83l545K095K597
3321B427l399l59L311j875k041L262J05l513K027K404l175o45L399j599k052L031
3337A308m76k780J962K244l241n60L428j316k768K834P34l584J913K475l572l82
3353a781L825j423k995K608J486l475J105K448l005o09L547j267l082K750J464
3368A596l352J042K333k453q36L505j208l180K725J722l606N39K815k364j072
3383a794L108p74l019L070J271l738N60K768j660j493L129n11k825K266J745l567
3399a464m7L497j915k094K941k6k729K098J648l095O1L343j634k545K978L63k953
3416a573J606J706l047K05L313j853k434L293N53l401J339K288k911j59L056j420
$$ plain form
3305 -169 -1903 1922 1656 -2060 109 2283 -947 -974 2045 -240 -1654 1463 1280 -2265 -170 2427
3321 2427 -972 -1331 1980 105 -1936 1326 1431 -2082 -55 2349 -826 -1471 1928 329 -1723 1308
3337 1308 832 -1948 14 2258 -983 -1543 1885 569 -2199 635 1369 -2215 -302 2173 -1399 -1781
3353 -1781 2044 621 -2374 234 1720 -1755 -650 1798 -1207 -1816 1731 464 -2618 132 1596
3368 1596 -1756 -714 1619 -834 -1670 1835 627 -2553 172 1894 -1712 -1173 1642 -722 -1794
3383 -1794 1314 540 -2479 591 1862 -1876 -1316 1452 -208 -1701 1428 917 -1908 358 2103 -1464
3399 -1464 -1511 1986 71 -2023 918 892 -1837 261 1909 -1186 -1125 2218 584 -1961 1017 1380 -1573
3416 -1573 33 1739 -1308 -1103 2210 357 -2077 1216 1769 -1632 -293 1995 -916 -1075 1981 561
3432E61k664L253Q25l311J118J992k190q95L198j410k370K710J376m077J123L097
3448B336k887o58K571p73k604K983P10l340Q03L218k581j536L069p91k426K015
3464A09J439l063P12K781k077k095L637m14k882J908J322k953O90K730k251j637
3480b044L379m64k772J507J704k528M5L093k222k072L513l5l349J970J864k838
3496a249Q0K816k067j433K856J98l323J449K179k479n96K783j351j840K752L77
3512A152l226J703J877k317m98K774j390j889K632O34l082J243K376k679q20L078
3528A568j157k129K391N65k735J022K196k175j368L204p52k373K101J115k518
3543a045O18K419k553q91L078r02k503K197J459k688K13K549k407r59K747k60
$$ plain form
3432 561 -2103 1150 1975 -1336 -218 1774 -416 -1311 1887 477 -1893 817 2193 -1884 -761 2336
3448 2336 -551 -1209 1362 589 -2015 968 1678 -1662 -859 2359 -222 -1758 1311 520 -1906 109
3464 109 1548 -1515 -803 1978 -99 -2194 1443 1029 -1853 55 1377 -1576 -886 1844 -407 -2044
3480 -2044 1335 871 -1901 -394 1310 -1218 -1173 1920 -302 -2374 1139 1104 -2245 -275 1589 -1249
3496 -1249 -1169 1647 -420 -1853 1003 1201 -2122 -673 1506 -973 -1569 1214 -137 -1977 775 1152
3512 1152 -2074 -371 1506 -811 -1309 1465 75 -1814 818 1452 -1630 -387 1989 -690 -1510 1568
3528 1568 411 -1718 673 1238 -1497 -475 1721 -454 -1822 1382 630 -1743 358 1473 -1045
3543 -1045 -427 1992 -561 -1452 1626 724 -1779 418 1877 -811 -598 1951 -456 -1415 1332 1072
3559A072l041K417J648k958L14K214j713j231K697o89k508K187J522k949r0K651
3575A543j334j464K579m30k687K014J846l290l49L399j481j873K243K42k502J637
3591I3J665k935K9K544q00k372K524L51k772J572J737k498m16L096j770k215K765
3608E98O01k686J106J949k535k67K949j682k031K554O55k789O11K143j908o00
3624a332K690j368k085K539J063l079M06K488j803j007K510q33j874J879J241
3639A435k819K80K640j561j447K473o64k164K036J085k771O48K594j893j379K257
3655G50J37k217J731J124k747M59K556j972j810K942K36k706J789J131k357J54
3671h00K475j673j637K852M1k720J310J684k102j18K315j630j357K190O24k809
$$ plain form
3559 1072 -1969 448 2096 -862 -548 1666 -47 -1278 1419 730 -1778 409 1931 -1018 -1108 1543
3575 1543 209 -1255 1324 894 -1793 221 2067 -1223 -1572 1827 346 -1527 716 958 -1544 93
3591 93 1758 -1177 -1148 1396 596 -1776 748 1099 -1673 -101 1636 -862 -1278 1818 48 -2167 598
3608 598 1199 -1487 -381 1568 -967 -1234 1715 33 -1998 556 1211 -1578 -967 1176 -732 -1332
3624 -1332 1358 -10 -2095 444 1507 -1572 -1166 1322 -481 -1488 1022 189 -1685 194 1435
3639 1435 -1384 -1104 1536 -25 -1472 1001 337 -1827 209 1294 -1477 -829 1765 -128 -1507 750
3655 750 887 -1330 401 1525 -1222 -763 1793 -179 -1989 953 1189 -1517 272 1403 -954 -800
3671 -800 1675 2 -1635 1217 1258 -1462 -152 1532 -570 -688 1627 -3 -1360 830 1454 -1355
3687a355J249J981k497j64J918n43j854K062P45l000J181K254k395p02K409n32
3703G57k222K123Q21l030J024K323k046j329K871m47k096J869O78k894J290K284
3719A976k403r83K688l29k507K056N37k149N94K368k029j344K741l90k068R84
3735b58J475k417K81K048j540j087K619p00k507J784J909k362m39K596j833j229
3751a660K538k9k618J332J917k532k00K208q35j589K190J13k646J451K031k593
3767i22k71K422q86j809J903M72k468J479J618k312m88K683j092k030K122R25
3783A346k524Q44J658j980p77K945q04k364J829J218k467O27J852j850m13K430
3799A570q18k331J666J304k113N90J418j491o13K119q63j869J678J692k866R3
$$ plain form
3687 -1355 -106 1875 -622 -786 1132 589 -1265 797 1542 -1458 -277 1977 -418 -1120 1289 757
3703 757 -1465 658 1479 -1551 -527 1796 -250 -1579 1292 845 -1251 618 1296 -1598 -308 1976
3719 1976 -427 -1410 1278 949 -1558 498 1035 -1114 -520 1848 -181 -1525 1216 826 -1242 -258
3735 -258 1217 -1200 -919 1129 -411 -1498 1121 421 -2086 -302 1607 -755 -1194 1402 -431 -1660
3751 -1660 878 849 -1769 -437 1480 -1052 -1252 956 121 -1468 722 835 -1811 -360 1671 -922
3767 -922 -1193 1229 343 -1466 437 909 -1559 -80 1538 -774 -1262 1421 329 -1701 421 1346
3783 1346 -1178 -334 1324 -656 -1433 1512 708 -1656 173 1391 -1076 -449 1403 -447 -860 1570
3799 1570 752 -1579 87 1391 -722 -132 1286 -205 -818 1301 438 -1431 247 1939 -927 -834
3815h34K379j889p39K082m51k017J992J290k777LK687j363j451K204o01j842J627
3832C00J276k604j00L031j526j591J741K56j921J377J175k318K60K472j438j848
3848a458K149M10k625J223J488j967j71K289j094j795K211K69k354J058J403j620
3864e84m82K499j412j413K087M70k379P77J725j651j006K618r88j744J832O41
3880I90k733R06K317j917r41K182j74k409K109O45k701R46K124j998j139K489
3896F96k11j915J531R46k183M41K047j352j458K288j25k020J183J193j930R2K504
3913A727j878j539K297N05k670J234J283j694J6J778r85j575K591O0k354Q72J711
3930A379k055j13K174j336j689K581R6k438J136J769k099l21K089o84j729K160
$$ plain form
3815 -834 1545 -344 -1083 999 548 -1469 523 1813 -964 -961 1726 363 -1088 1116 515 -1327 300
3832 300 1576 -1028 -1128 1903 377 -1214 527 783 -1138 239 1414 -904 -644 1828 390 -1458
3848 -1458 691 1101 -1524 -301 1187 -780 -951 1338 244 -1551 660 929 -1425 -367 1036 -584
3864 -584 -1066 1433 21 -1392 695 1165 -1214 -437 1288 -363 -1369 1249 261 -1483 349 990
3880 990 -1743 -837 1480 -437 -1378 804 630 -1779 330 975 -1726 -780 1344 -654 -1793 696
3896 696 485 -1430 101 1047 -1136 -695 1352 0 -1458 830 705 -1315 -132 1061 -869 -777 1727
3913 1727 -151 -1690 607 1112 -1558 -324 959 -735 -719 1059 74 -1501 1090 1150 -1204 -332 1379
3930 1379 -676 -789 1385 49 -1640 941 1037 -1401 -265 1504 -595 -916 1173 489 -1240 920
3946I20M10k694J258K050k378q00K570p67j619J749O12k282R13J919k478o50K510
3963A243m82k101J646P93k175Q10J380j407r95K339m80j903J433J219k486P43
3979d23J950j859o68J884j75k196J695P77j641J28J187q27r21J971mk416J463
3996g5J388k016l79K282r58j443J975j30j995J574J138k119m05K316j178j403
4012a428K137m8k118J193J682k525j84K258o45j774J732L82j908R44J636k263
4028i29j17K241p31k318K233P21k392P70J630j779k66J893o75j996J872J169k540
4045a214O75J672j366o12J958p35j969K317N81k169K25J872j143j001J973l59
4061G05j904J674Q27k380J80K461j441j417K208k90j926J623J188k440L52K219
$$ plain form
3946 920 1330 -1364 -106 1944 -434 -1234 1336 569 -1050 699 1311 -971 -58 1861 -617 -1267 1243
3963 1243 761 -1340 306 1099 -1076 -266 1114 -293 -1288 1051 571 -1332 101 1320 -1166 -423
3979 -423 1527 -332 -1000 884 709 -1487 208 985 -656 -528 659 -168 -1089 882 878 -1538 -75
3996 -75 1313 -703 -1082 1200 242 -1201 774 644 -1351 223 1361 -758 -1163 1153 -25 -1428
4012 -1428 709 661 -1457 -264 1418 -1107 -1291 967 322 -1452 280 662 -1246 -302 1334 -929
4028 -929 -1046 1195 464 -1854 379 1100 -1292 -522 1108 -671 -937 956 281 -1715 157 1326 -1214
4045 -1214 -539 1133 -233 -845 1113 378 -1591 726 1307 -862 -637 1235 92 -909 1064 705
4061 705 -1199 475 1302 -1078 -898 1563 122 -1295 913 623 -1303 320 1508 -932 -580 1639
4077A639j224j592J655L08j969J313R82j984L30K064j154j646K049L4k067J102
4093a60J219k077J16K132j231j276K205K91k340R03J535j820k62J935j015j537
4109a382J759P81k518Q68J676j454k82J456o66j557K117q3j919O30J691j479o64
4126a026K000p18j494J416O77k163P66J827j731o08J811j01k204J673O26k034
4142a283Q13J730j463j420K385k43j997J426P83j713L51J673j586p90K140Qk007
4159a193J136J286j966j87K152j510j377K619k70k052J278J054j802J88K031j463
4175g6j115J914L8j894J048J374j951j83J943j204j141J793J58j603P12J803k243
4192f27l56K124r13j331J601N57k556J448J334j776n46K221q15j357J792J93k312
$$ plain form
4077 1639 415 -1177 478 786 -1183 130 1112 -872 -542 1522 368 -1278 771 805 -1262 -160
4093 -160 1059 -1018 -902 1230 -1 -1277 928 1219 -1121 -218 1317 -503 -765 1170 155 -1382
4109 -1382 377 1158 -1360 -492 1184 -270 -552 904 238 -1319 798 715 -1204 -574 1117 -362 -1026
4126 -1026 974 256 -1238 178 855 -1308 -542 1285 -446 -1054 757 656 -1548 125 751 -1283
4142 -1283 -470 1260 -203 -1623 762 519 -1478 -52 731 -982 -631 1042 -544 -1334 806 814 -1193
4159 -1193 -57 1229 -737 -924 1228 -282 -1659 960 690 -1362 -84 970 -832 -644 1387 -76
4175 -76 -1191 723 761 -1133 -85 1289 -662 -845 1098 -106 -1247 546 704 -899 -187 1616 -627
4192 -627 -983 1141 228 -1103 498 1055 -1501 -53 1281 -495 -1041 1180 365 -992 800 993 -1319
4209a319J050J786j972n85K333r13j969K107P96k284Q05J543j724o59K112n12
4225E95j832J499Q79k049N28J501j336n66J876l32k144J668R71j959J14J869j211
4242G1j206J727k3j735J508J021j882o12K425j249j380J932O0j617J087J319k287
4259h41k40K390j611q60J729o9j477R96Q39j974L57K002j109j447J529O20k004
4276a170J078J172j799j93K001j352j248K118M71k242O67J471j423m95J849o58
4292B47j509J998Q6j777M08J955j656p12J986j074j341J847O56k354N88K057j670
4309b65p65K005l95j763J753N17k031L66K013j654p43J728l12j399J316P09j773
4326f93L10J554j121j282K064P7k009J190O39j297L19J690j568j125J937m7j550
$$ plain form
4209 -1319 -269 1517 -455 -1040 1293 380 -1589 518 1314 -970 -165 1378 -346 -1005 1107 595
4225 595 -1237 262 1141 -908 -380 1121 -215 -781 1095 763 -1381 287 1258 -701 -587 1282 71
4242 71 -1135 592 569 -1166 342 1363 -519 -1131 1294 45 -1335 597 657 -960 127 1446 -841
4259 -841 -1081 1309 -302 -1162 567 498 -979 17 856 -1118 -761 1241 132 -1315 214 834 -1170
4276 -1170 -92 1080 -719 -912 1089 -263 -1511 607 1078 -1164 -497 974 -449 -944 905 247
4292 247 -1262 736 822 -955 -547 1408 -248 -960 1026 -48 -1389 458 1114 -1240 -652 1405 -265
4309 -265 -1030 975 580 -1183 570 1087 -944 -578 1435 -219 -962 766 454 -945 371 1080 -693
4326 -693 -383 1171 50 -1232 832 909 -1100 90 729 -568 -249 1441 -127 -1252 685 638 -912
4343i12J214P64j448m42J899j044j271K354l86j840R06J195j373k31J856j717
4359d76q80J947M86k006J100J239k062l72K050q56j279J700J55j852Q66J466j901
4376f75l34J957p32j259J309P34k183R34J345j664o06K001m72j671J388R19j799
$$ plain form
4343 -912 302 1066 -382 -824 1075 31 -1240 1114 728 -1112 -206 989 -384 -615 1241 -476
4359 -476 -1356 591 1077 -929 171 1410 -652 -1024 1026 170 -1109 591 746 -1106 -240 1226 -675
4376 -675 -1009 948 216 -1043 266 1000 -1183 -249 1096 -568 -1174 827 355 -1316 72 991 -808
$$ [...]
8191b13
##END NTUPLES=NMR FID
##END=
