##TITLE=1H_EC-3210(2)
 CDCl3, 8 sc, 
 20.11.2019
##JCAMPDX= 6.0         $$ Bruker NMR JCAMP-DX V2.0
##DATA TYPE= NMR FID
##DATA CLASS= NTUPLES
##ORIGIN= UXNMR, Bruker Analytische Messtechnik GmbH
##OWNER= root
$$ XWIN-NMR		Version 3.5
$$ Wed Nov 20 14:31:48 2019 Russian Standard Time (UT+4h)  she@DPX200
##.OBSERVE FREQUENCY= 200.1315
##.OBSERVE NUCLEUS= ^1H
##.DELAY= (6, 6)
##.ACQUISITION MODE= SIMULTANEOUS
##.ACQUISITION SCHEME= undefined
##.AVERAGES= 8
##.DIGITISER RES= 18
##SPECTROMETER/DATA SYSTEM= spect
##.PULSE SEQUENCE= zg30
##.SOLVENT NAME= CDCl3
##.SHIFT REFERENCE= (INTERNAL, CDCl3, 0, 15.7039)
##AUDIT TRAIL= $$ (NUMBER, WHEN, WHO, WHERE, WHAT)
$$ ##TITLE= Audit trail, XWIN-NMR		Version 3.5
$$ ##JCAMPDX= 5.01
$$ ##ORIGIN= Bruker BioSpin GmbH
$$ ##OWNER= she
$$ F:/spectra/data/she/nmr/H-F/1/audita.txt
$$ ##AUDIT TRAIL=  $$ (NUMBER, WHEN, WHO, WHERE, WHAT)
(   1,<2019-11-20 14:30:42.68 +0400>,<she>,<DPX200>,
      <created by zg, POWCHK disabled, PULCHK disabled
       configuration hash MD5:
       00 E9 B6 7A A2 85 ED C7 34 08 36 98 17 FE 4E 26
       data hash MD5: 16K
       3D 31 EC DF 9B 13 18 E8 54 81 B9 14 B6 A8 32 11>)
$$ ##END=
$$ 
$$ hash MD5
$$ A6 50 A3 19 33 D2 B2 D9 4C C8 A2 C6 06 DE 91 29
##$RELAX= 
##$RELAX= 
##$RELAX= 
##$RELAX= 
##$RELAX= 
##$RELAX= 
$$ Bruker specific parameters
$$ --------------------------
##$DU= <F:/spectra>
##$EXPNO= 1
##$NAME= <H-F>
##$PROCNO= 1
##$TYPE= <nmr>
##$USER= <she>
##$AMP= (0..31)
100 100 100 100 100 100 100 100 100 100 100 100 100 100 100 100 100 100 
100 100 100 100 100 100 100 100 100 100 100 100 100 100 
##$AQSEQ= 0
##$AQ_mod= 1
##$AUNM= <au_zg>
##$AUTOPOS= <>
##$BF1= 200.13
##$BF2= 200.13
##$BF3= 200.13
##$BF4= 200.13
##$BF5= 200.13
##$BF6= 200.13
##$BF7= 200.13
##$BF8= 200.13
##$BYTORDA= 1
##$CFDGTYP= 0
##$CFRGTYP= 5
##$CHEMSTR= <none>
##$CNST= (0..31)
1 1 145 1 1 1 1 1 1 1 1 1 1 1 1 1 1 1 1 1 1 1 1 1 1 1 1 1 1 1 1 1 
##$CPDPRG= <>
##$CPDPRG1= <>
##$CPDPRG2= <>
##$CPDPRG3= <>
##$CPDPRG4= <mlev>
##$CPDPRG5= <mlev>
##$CPDPRG6= <mlev>
##$CPDPRG7= <mlev>
##$CPDPRG8= <mlev>
##$CPDPRGB= <>
##$CPDPRGT= <>
##$D= (0..31)
0 1.2 0 0 0 0 0 0 0 0.06 0 0.03 0 0 0 0 0.0002 0 0 0 0 0 0 0 0 0 0 0 0 
0 0 0 
##$DATE= 1574245842
##$DBL= (0..7)
120 120 120 120 120 120 120 120 
##$DBP= (0..7)
150 150 150 150 150 150 150 150 
##$DBP07= 0
##$DBPNAM0= <>
##$DBPNAM1= <>
##$DBPNAM2= <>
##$DBPNAM3= <>
##$DBPNAM4= <>
##$DBPNAM5= <>
##$DBPNAM6= <>
##$DBPNAM7= <>
##$DBPOAL= (0..7)
0.5 0.5 0.5 0.5 0.5 0.5 0.5 0.5 
##$DBPOFFS= (0..7)
0 0 0 0 0 0 0 0 
##$DE= 6
##$DECBNUC= <off>
##$DECIM= 24
##$DECNUC= <off>
##$DECSTAT= 4
##$DIGMOD= 1
##$DIGTYP= 9
##$DL= (0..7)
0 120 120 120 120 120 120 120 
##$DP= (0..7)
150 150 150 150 150 150 150 150 
##$DP07= 0
##$DPNAME0= <>
##$DPNAME1= <>
##$DPNAME2= <>
##$DPNAME3= <>
##$DPNAME4= <>
##$DPNAME5= <>
##$DPNAME6= <>
##$DPNAME7= <>
##$DPOAL= (0..7)
0.5 0.5 0.5 0.5 0.5 0.5 0.5 0.5 
##$DPOFFS= (0..7)
0 0 0 0 0 0 0 0 
##$DQDMODE= 0
##$DR= 18
##$DS= 0
##$DSLIST= <SSSSSSSSSSSSSSS>
$$ [...]
##$SUBNAM2= <"">
##$SUBNAM3= <"">
##$SUBNAM4= <"">
##$SUBNAM5= <"">
##$SUBNAM6= <"">
##$SUBNAM7= <"">
##$SUBNAM8= <"">
##$SUBNAM9= <"">
##$SW= 24.9337058887773
##$SWIBOX= (0..15)
0 0 2 0 0 0 0 0 0 0 0 0 0 0 0 0 
##$SW_h= 4990.01996007984
##$TD= 16384
##$TD0= 1
##$TE= 0
##$TE2= 300
##$TE3= 300
##$TEG= 300
##$TL= (0..7)
0 120 120 120 120 120 120 120 
##$TP= (0..7)
150 150 150 150 150 150 150 150 
##$TP07= 0
##$TPNAME0= <>
##$TPNAME1= <>
##$TPNAME2= <>
##$TPNAME3= <>
##$TPNAME4= <>
##$TPNAME5= <>
##$TPNAME6= <>
##$TPNAME7= <>
##$TPOAL= (0..7)
0.5 0.5 0.5 0.5 0.5 0.5 0.5 0.5 
##$TPOFFS= (0..7)
0 0 0 0 0 0 0 0 
##$TUNHIN= 0
##$TUNHOUT= 0
##$TUNXOUT= 0
##$USERA1= <user>
##$USERA2= <user>
##$USERA3= <user>
##$USERA4= <user>
##$USERA5= <user>
##$V9= 5
##$VALIST= <valist>
##$VCLIST= <CCCCCCCCCCCCCCC>
##$VD= 0
##$VDLIST= <DDDDDDDDDDDDDDD>
##$VPLIST= <PPPPPPPPPPPPPPP>
##$VTLIST= <TTTTTTTTTTTTTTT>
##$WBST= 1024
##$WBSW= 4
##$XGAIN= (0..3)
0 0 0 0 
##$XL= 0
##$YL= 0
##$YMAX_a= 162047
##$YMIN_a= -56051
##$ZGOPTNS= <>
##$ZL1= 120
##$ZL2= 120
##$ZL3= 120
##$ZL4= 120
##$ABSF1= 10
##$ABSF2= 0
##$ABSG= 5
##$ABSL= 3
##$ALPHA= 0
##$AQORDER= 0
##$ASSFAC= 0
##$ASSFACI= 0
##$ASSFACX= 0
##$ASSWID= 0
##$AUNMP= <proc_1d>
##$AZFE= 0.1
##$AZFW= 0.1
##$BCFW= 1
##$BC_mod= 2
##$BYTORDP= 1
##$COROFFS= 0
##$CY= 11.3945322036743
##$DATMOD= 1
##$DC= 2
##$DFILT= <>
##$DTYPP= 0
##$F1P= 16.9975609425685
##$F2P= -3.02152046262296
##$FCOR= 0.5
##$FTSIZE= 0
##$FT_mod= 4
##$GAMMA= 1
##$GB= 0.15
##$INTBC= 1
##$INTSCL= 1
##$ISEN= 128
##$LB= 0.24
##$LEV0= 0
##$LPBIN= 0
##$MAXI= 10000
##$MC2= 0
##$MEAN= 0
##$ME_mod= 0
##$MI= 1.114404
##$NCOEF= 0
##$NC_proc= 0
##$NLEV= 6
##$NOISF1= 3.799351
##$NOISF2= 2.8
##$NSP= 1
##$NTH_PI= 0
##$NZP= 0
##$OFFSET= 15.70392
##$PC= 1
##$PHC0= -9798.07
##$PHC1= 27.60086
##$PH_mod= 1
##$PKNL= yes
##$PPARMOD= 0
##$PSCAL= 0
##$PSIGN= 0
##$REVERSE= no
##$SF= 200.130013532006
##$SI= 16384
##$SIGF1= 3
##$SIGF2= 2
##$SINO= 400
##$SIOLD= 16384
##$SREGLST= <1H.CDCl3>
##$SSB= 0
##$STSI= 0
##$STSR= 0
##$SW_p= 3612.71676300578
##$SYMM= 0
##$S_DEV= 0
##$TDeff= 0
##$TDoff= 0
##$TI= <>
##$TILT= no
##$TM1= 0
##$TM2= 0
##$TOPLEV= 0
##$USERP1= <user>
##$USERP2= <user>
##$USERP3= <user>
##$USERP4= <user>
##$USERP5= <user>
##$WDW= 1
##$XDIM= 8192
##$YMAX_p= 0
##$YMIN_p= 0
$$ End of Bruker specific parameters
$$ ---------------------------------
##NTUPLES= NMR FID
##VAR_NAME=  TIME,          FID/REAL,        FID/IMAG
##SYMBOL=    X,             R,               I
##VAR_TYPE=  INDEPENDENT,   DEPENDENT,       DEPENDENT
##VAR_FORM=  AFFN,          ASDF,            ASDF
##VAR_DIM=   8192,          8192,            8192
##UNITS=     SECONDS,       ARBITRARY UNITS, ARBITRARY UNITS
##FACTOR=    0.0002004,     1,               1
##FIRST=     0,             0,               0
##LAST=      1.6414764,     0,               0
##MIN=       0,             -56051,          0
##MAX=       1.6414764,     162047,          0
$$ Real data points
##PAGE= N=1
##DATA TABLE= (X++(R..R)), XYDATA
0@%%%%%%%%%%qJ6j6J6k4L2l2M0m8N6p0P8q8J04j20J36j58J82k06K35k66K99l34
$$ 0 0 0 0 0 0 0 0 0 0 0 -8 8 -8 8 -16 16 -16 24 -24 32 -38 40 -48 56 -64 72 -86 96 -110 125 -141 158 -176
33a76L74m20M68n22N80o43P15p92Q76r69J074j191J318j462J628j814K027k277
$$ -176 198 -222 246 -276 304 -339 376 -416 460 -509 565 -626 692 -770 858 -956 1071 -1206
51a206K573k927L365l925M662n684P213r785J5238m9367P1958M3295r8285o880
$$ -1206 1367 -1560 1805 -2120 2542 -3142 4071 -5714 9524 -39843 32115 75410 -22875 -29755
65b9755n15N27M6054J3865q6227K348R1951M444n5050J6234L71k7291M0360K8864
$$ -29755 -30270 -29743 16311 30176 -56051 -53703 38248 42692 -12358 3876 4247 -23044 17316 46180
79D6180o6615n662P0640j7036n5300L7540K2046m0088J3436K9013m3325l159N5009
$$ 46180 -20435 -26097 44543 27507 -27793 9747 31793 -8295 5141 34154 -9171 -12330 42679
92D2679k7141n3814M3424K9765l9215P856K2567m5446R80O8586k1992p1096K4711
$$ 42679 15538 -38276 5148 34913 -4302 3554 26121 -19325 -18345 50241 28249 -42847 -18136
105a8136L7960k0262J7794K3300n4026j8835N8535n825m7608K8851K3359l6322
$$ -18136 19824 -438 17356 40656 -13370 -32205 26330 20505 -27103 1748 25107 -11215
117a1215J7155L7692m9606k8109N5886J149m6265K8728K6603m2787K065L9734
$$ -11215 5940 43632 -5974 -34083 21803 22952 -23313 5415 32018 -10769 -8704 31030
129C1030l1150k4415M3260l162l8702L2603K0970n2113J420M8592k6205k7344
$$ 31030 -120 -24535 18725 15563 -23139 9464 30434 -21679 -20259 28333 2128 -25216
141b5216M3450k318m7650K7279L1637m1987l502M1642k8052l0443M5253R715m0627
$$ -25216 18234 15916 -31734 -4455 27182 -14805 -18307 23335 -4717 -35160 10093 19808 -20819
154b0819J7831J8835m3960M780N2808k6522m0287M0821J5402m0077J4889K3921
$$ -20819 -2988 15847 -28113 -23333 29475 2953 -37334 3487 18889 -21188 -6299 17622
166A7622l9672k663M6941j8861l4631L6782J2271m1098J3860K7575l7066m764
$$ 17622 -22050 -24713 22228 3367 -31264 5518 17789 -23309 -9449 18126 -18940 -23704
178b3704M7350j7299l8300L5872J5231m3429J1129L6962k9923j5090L5670j2955
$$ -23704 23646 6347 -31953 3919 19150 -24279 -13150 23812 -6111 -21201 14469 1514
190A514k9125L8928J4562m6371N088L4975k5874r379M1374j6492m1028L4967K4918
$$ 1514 -27611 11317 25879 -20492 -15404 19571 -6303 -15682 25692 9200 -31828 3139 28057
203B8057m0615J430L4355k5423j5169L9215q181l6545K9183K0341m1077K535L8638
$$ 28057 -12558 -11128 23227 -2196 -17365 21850 13669 -22876 6307 26648 -14429 -11894 26744
216B6744k3077j8432L6434p707l8787L0398K5885m2572l068M1608j8087k5335
$$ 26744 3667 -14765 21669 13962 -24825 5573 31458 -11114 -14182 27426 9339 -15996
228a5996K9608j892k9653K9555J9540m7577l745M7068j2378k7329K5919l297l3546
$$ -15996 13612 11720 -17933 11622 31162 -16415 -20160 26908 14530 -12799 13120 9823 -23723
241b3723L0009K8367m3667j1369M1888j0804k7545K6530L790l1780K1270K3559
$$ -23723 6286 34653 -9014 -20383 21505 10701 -16844 9686 13476 -18304 2966 26525
253B6525l8927o487M2823j3644l2021K7055Q334l3039J8516K8147l6889j2822
$$ 26525 -12402 -18889 23934 10290 -21731 5324 13658 -19381 -865 27282 -9607 -22429
265b2429L9493q194l1044K5620J0989l1175J3609K5543l4409j1590M1556o938
$$ -22429 17064 8870 -22174 3446 14435 -16740 -3131 22412 -11997 -23587 17969 11031
277A1031l3121K2875J1517l1453J4913L0425l4300k0353L8932O70k9064K0277
$$ 11031 -22090 785 12302 -19151 -4238 26187 -8113 -28466 10466 11136 -17928 2349
289B349J0605l2886J0592L0878k8778j7886L7979k267l3651K1740J6797l2441
$$ 2349 12954 -19932 -9340 21538 -7240 -25126 12853 10586 -23065 -1325 15472 -16969
301a6969N594L1723k6906k0539L7018K695l2106J7918J6313l2076L109L2946k1789
$$ -16969 -11375 20348 -6558 -27097 9921 12616 -19490 -1572 14741 -17335 -14226 18720 -3069
314c069j9445L3940N15l3819J9014K1176l2680J9L4996j9581k4534L2147O898
$$ -3069 -22514 11426 11941 -21878 -2864 18312 -14368 -14349 20647 1066 -23468 8679 15577
327A5577l0602J4184J7677l1142P80L7280j6157k6874K8040N729k9682J6007K2154
$$ 15577 -15025 -841 16836 -14306 -13526 23754 7597 -19277 8763 14492 -15190 817 22971
340B2971l1141m952L5706j3410k7027K7272J0422l0508R483K1499k5896l712L4062
$$ 22971 -8170 -13122 22584 9174 -17853 9419 19841 -10667 -1184 20315 -5581 -9293 24769
353B4769j3961k8288K5996J1045l0632J0172K4979k6106r615L2417r716k8245
$$ 24769 10808 -17480 8516 19561 -11071 -899 24080 -2026 -11641 20776 11060 -17185
365a7185K5097J3571l0673N047K4711k2520r130L2479r703l0518K2845J5777k8840
$$ -17185 7912 21483 -9190 -4143 20568 -1952 -11082 21397 11694 -18824 4021 19798 -9042
378i042O127K6227k5507j4854L2523k358k9563J9820J5763k9248K293K7217k0203
$$ -9042 -2915 23312 -2195 -17049 15474 13116 -16447 3373 19136 -10112 -7819 19398 -805
391h05j4542L0103n169l0289K1624J9788l0616r28K7861j8172j7335K9361q68
$$ -805 -15347 14756 9587 -20702 922 20710 -9906 -10834 17027 -1145 -18480 10881 10013
404A0013k9903J8823K0356k9643n002K8514j3188j6362K5611k247k9701J9640
$$ 10013 -19890 -1067 19289 -10354 -15356 13158 -30 -16392 9219 6972 -22729 -3089
416c089K2792k9571p079K8433j2339j9430K6602L847k9615J3692K0781k6903o232
$$ -3089 19703 -9868 -16947 11486 -853 -20283 6319 10166 -19449 -5757 15024 -11879 -18111
429a8111L0084j0558k1020K2539M782k6856J4327K1993k8036r084L1323p589k2636
$$ -18111 11973 1415 -19605 2934 7716 -19140 -4813 17180 -10856 -19940 11383 3794 -18842
442a8842K1739P957k7729R887K3356k3945r884K9198n143k2262J9444P085k6960
$$ -18842 2897 10854 -16875 -6988 16368 -7577 -17461 11737 6594 -15668 3776 10861 -16099
455a6099J1200K5538k3924j4727K9552k439k2034J9224R010k8888O775K6971j9286
$$ -16099 -4899 20639 -3285 -18012 11540 9101 -12933 6291 15301 -13587 -6812 20159 873
468H73j4579K7029k638k3480J7665J1455k6553O053K6195k0968j6504K8760J029
$$ 873 -13706 13323 10685 -12795 4870 16325 -10228 -4175 22020 1052 -15452 13308 14337
481A4337k5989J5520J3166k5732K554K7283j7070j7257K5586Q90k5149J4877J4705
$$ 14337 -11652 3868 17034 -8698 -6144 21139 4069 -13188 12398 13288 -11861 3016 17721
494A7721k4850J392K6580j6877j9135K5512M559k4839J1933J5170k4741q87K8114
$$ 17721 -7129 -5737 20843 3966 -15169 10343 14902 -9937 1996 17166 -7575 -8462 19652
507A9652j2432k0545K0290M847k2946J2539J6671k4925l263K7101j1482k1508
$$ 19652 7220 -13325 6965 11812 -11134 1405 18076 -6849 -10112 16989 5507 -16001
519a6001K1965P730k4456Q707J7085k2191m654K6976r687k2431J9074Q834k2074
$$ -16001 5964 13694 -10762 -2055 15030 -7161 -11815 15161 5474 -16957 2117 10951 -11123
532a1123P336J8047k1811o902K6835q211k2955K0195J0781k4560M301J9910j9024
$$ -11123 -3787 14260 -7551 -14453 12382 4171 -18784 1411 12192 -12368 -8067 11843 -7181
545g181q537K6394n887k3489J7040J1694k2293M969J9568j9826j0486K6812k968
$$ -7181 -15718 10676 4789 -18700 -1660 10034 -12259 -7290 12278 -7548 -18034 8778 5810
558E810k3627J6306J2592k3806K727K1824j6809j2029K5431k030k3991J4619J4689
$$ 5810 -17817 -1511 11081 -12725 -9998 11826 -4983 -17012 8419 6389 -17602 -2983 11706
571A1706k1535R13K0784j6868j2175K6187j60k5001J3257J6012k1818j288K2222
$$ 11706 -9829 -8916 11868 -5000 -17175 9012 8852 -16149 -2892 13120 -8698 -9986 12236
584A2236j2744j3878K2960R58k4359J2294J6906j9845k750K0632j2044j3801K3111
$$ 12236 -508 -14386 8574 9532 -14827 -2533 14373 -5472 -8222 12410 366 -13435 9676
597I676K988k5427J0530J7892j9565m836K2540q903j6362J9696M110k2598R374
$$ 9676 12664 -12763 -2233 15659 -3906 -8742 13798 4895 -11467 8229 12339 -10259 -885
610h85J8018j9059o468K2353q139j6602J9490O069k4210P113J9681j7587q089
$$ -885 17133 -1926 -8394 13959 5820 -10782 8708 14777 -9433 -2320 17361 -226 -8315
623h315K2255o030j8938J7479P573k3115O412J9703j7003r604K1132m738j8102
$$ -8315 13940 7910 -11028 6451 14024 -9091 -2679 17024 21 -9583 11549 6811 -11291
636a1291J7297Q194k4379M325K1388j5073j1481K0853k990j9256J5474R590k1785
$$ -11291 6006 14200 -10179 -5854 15534 461 -11020 9833 6843 -12413 3061 12651 -9134
649i134K923K0577j5133j2279K0895j135j9489J4600J0429k2411Q90K2554j2840
$$ -9134 -6211 14366 -767 -13046 7849 6714 -12775 1825 12254 -10157 -9267 13287 447
662D47j4226J9490O44j9649J2469J2226k0320n52K0714j1983j3744J9253J526
$$ 447 -13779 5711 6355 -13294 -825 11401 -8919 -9471 11243 -740 -14484 4769 6295
675F295j9484J1341J2419k0393j993K2637j0301j5838J7737L417j9356J0427J3558
$$ 6295 -13189 -1848 10571 -9822 -11815 10822 521 -15317 2420 5837 -13519 -3092 10466
688A0466j9660l600K1862q695j5733J7212M716j9249P942J4682j9048m082K2667
$$ 10466 -9194 -12794 9068 373 -15360 1852 6568 -12681 -4739 9943 -9105 -13187 9480
701I480o931j7377J5575O256j8193P048J4846j7365n786K1904n668j7025J5076
$$ 9480 2549 -14828 747 7003 -11190 -4142 10704 -6661 -12447 9457 3789 -13236 1840
714A840P492j9072N469J6864j7027p032K1831l664j8626J3949R226j8450L691
$$ 1840 9332 -9740 -4271 12593 -4434 -11466 10365 6701 -11925 2024 11250 -7200 -3509
727c509J6930j5233q290K0525k067j8525J3403R310j9226L330J7566j4147r972
$$ -3509 13421 -1812 -10102 10423 8356 -10169 3234 12544 -6682 -3352 14214 67 -9905
740i905K0828j253j9630J1762J0827j7291J515J6826j3260j0687K0302N04j9573
$$ -9905 10923 9670 -9960 1802 12629 -4662 -3147 13679 419 -10268 10034 10538 -9035
753i035J0066J1181j6959J026J7691j2403j2423J9536J646j9672Q632J2890j5906
$$ -9035 1031 12212 -4747 -3721 13970 1567 -10856 8680 10326 -9346 -714 12176 -3730
766c730j396J7346j0608j2483J8280K564j9456P816J3507j6040k845J8584r237
$$ -3730 -5126 12220 1612 -10871 7409 9973 -9483 -1667 11840 -4200 -7045 11539 2302
779B302j4091J6952M374j9422O438J4651j5135m722J7187p217j3654J6297M801
$$ 2302 -11789 5163 9537 -9885 -3447 11204 -3931 -8653 8534 1317 -12337 3960 8761
792H761j9400N415J4927j4385n328J8045o632j5448J6140O780j9446L884J5495
$$ 8761 -10639 -5224 9703 -4682 -10010 8035 1403 -14045 2095 8875 -10571 -6687 8808
805H808j3123o856J7735n325j5177J4748P601j8922L060J5708j2642p378J8330
$$ 8808 -4315 -11171 6564 1239 -13938 810 8411 -10511 -7451 8257 -4385 -11763 6567
818F567m195j6551J3731R451j8660J857J6286j1519q639J6987j903j5697J1840
$$ 6567 2372 -14179 -448 9003 -9657 -7800 8486 -3033 -11672 5315 3412 -12285 -445
831d45R464j8085Q48J7304j0610r510J6574j121j6302J1313J0611j7223p35J7169
$$ -445 9019 -9066 -8218 9086 -1524 -11034 5540 4419 -11883 -570 10041 -7182 -7917 9252
845I252q832j0718J5538N56j5779J0044J0768j6497j922J7719q078j1395J5507
$$ 9252 420 -10298 5240 5796 -9983 61 10829 -5668 -7590 10129 2051 -9344 6163
858F163J481j6868R354J2182j5733l653J7419o455j2172J4128L123j6415P558
$$ 6163 7644 -9224 130 12312 -3421 -7074 10345 3890 -8282 5846 8969 -7446 112
871A12J2346j5308l759J7571n669j3499J3788M066j6233O265J3432j4686n658
$$ 112 12458 -2850 -6609 10962 5293 -8206 5582 9648 -6585 -320 13112 -1574 -7232
884g232J7450m359j3518J2113N156j6073N132J3737j3927o371J7438l660j4731
$$ -7232 10218 5859 -7659 4454 9610 -6463 -1331 12406 -1521 -7892 9546 5886 -8845
897h845J2111O516j6719M192J4502j3166p799J7007k095j4944J1197O527j5863
$$ -8845 3266 9782 -6937 -2745 11757 -1409 -9208 7799 5704 -9240 1957 8484 -7379
910g379L125J4872j2210q731J6638r25j5652R869Q629j5750J842J5230j1551r490
$$ -7379 -4254 10618 -1592 -10323 6315 5390 -10262 -393 8236 -7514 -5672 9558 -1993 -11483
924a1483J5812O81j5346Q546Q724j4644J055J4948j0154r990J5625Q70j4983P886
$$ -11483 4329 5010 -10336 -1790 6934 -7710 -6655 8293 -1861 -11851 3774 4644 -10339 -2453
938b453R425j4124n70J5681r197j1075J5060K810j5441O371J0648j3633j487J5440
$$ -2453 6972 -7152 -7722 7959 -1238 -12313 2747 5557 -9884 -3513 7135 -6498 -7985 7455
952G455q153j1445J4628L688j5877O040J1354j3236k617J5302o181j2174J3589
$$ 7455 -698 -12143 2485 6173 -9704 -3664 7690 -5546 -8163 7139 958 -11216 2373
965B373M697j5530M687J1752j2251l187J5275n766j2764J3282N806j5903M012
$$ 2373 7070 -8460 -3773 7979 -4272 -7459 7816 2050 -10714 2568 8374 -7529 -3517
978c517J2483j1295m991J5444m177j3845J2614O729j5308K490J3276j1050n543
$$ -3517 8966 -2329 -7320 8124 3947 -9898 2716 9445 -5863 -3373 9903 -1147 -6690
991f690J5278l363j4312J2149P523j5678J856J3721j0423o488J4805j858j4484
$$ -6690 8588 5225 -9087 3062 10585 -5093 -3237 10484 61 -6427 8378 6520 -7964
1004g964J0198Q454j4468R36J2909r250p095J4084j212j4467R669R100j4499k48
$$ -7964 2234 10688 -3780 -2844 10065 815 -6280 7804 6592 -7875 1794 10894 -3605 -3853
1018c853J3896q424q607J3766P4j4569Q340R443j3100k094J3985p143r534J3589
$$ -3853 10043 1619 -6988 6778 6852 -7717 623 10066 -3034 -5128 8857 1714 -7820 5769
1032E769P07j4615P569J0195j3410k441J4366o419j0345J2865J654j4376O357
$$ 5769 6476 -8139 -570 9625 -3785 -6226 8140 1721 -8624 4241 5895 -8481 -2124
1045b124J1307j2977l629J3995n248j0494J2231K916j4866N540J1539j2285m371
$$ -2124 9183 -3794 -7423 6572 1324 -9170 3061 5977 -8889 -3349 8190 -4095 -8466
1058h466J4555m704j1443J1821M184j4562M115J2475j1795n193J4099l806j1321
$$ -8466 6089 1385 -10058 1763 5947 -8615 -4500 7975 -3820 -9013 5086 1280 -10041
1071a0041J0638N046j4572L922J2656j1167o118J4266k484j2356J0324N811j4127
$$ -10041 597 5643 -8929 -5007 7649 -3518 -9636 4630 2146 -10210 114 5925 -8202
1084h202K735J2968r932o915J3432j197j1812R021O497j4054K042J3381r188p581
$$ -8202 -5467 7501 -2431 -9346 4086 2889 -8923 98 6595 -7459 -5417 7964 -1224 -8805
1098h805J3292l20j2094Q218P163j3068M63J3685q292q341J2658J041j2818P481
$$ -8805 4487 4167 -7927 291 7454 -5614 -5151 8534 242 -8099 4559 5600 -7218 263
1112B63Q233j2853l08J3793p368r137J2400J974j3181O625R063j2483j107J3474
$$ 263 8496 -4357 -4665 9128 1760 -7377 5023 6997 -6184 441 9504 -2979 -4086 9388
1126I388o705j0014J2222K454j2801N640R226j1985j789J3863o325j0341J1414
$$ 9388 2683 -7331 4891 7345 -5456 184 9410 -2575 -4364 9499 3174 -7167 4247
1139D247L693j2858M516R909j1491k777J3660n037j1304J1347M198j2953L969
$$ 4247 7940 -4918 -402 9507 -1984 -4761 8899 3862 -7442 3905 8103 -4850 -881
1152h81J0188j1558l188J3759m197j1987J0301N480j3093K835J0647r956m943
$$ -881 9307 -2251 -5439 8320 4123 -7864 2437 7917 -5176 -2341 8306 -1650 -6593
1165f593J3576l055j2232R759N437j2657K216J1147r713n325J3058k252j2296
$$ -6593 6983 3928 -8304 1455 6892 -5765 -3549 7598 -2115 -7440 5618 3366 -8930
1178h930Q952O778j2389J054J1264q575o162J2565j097j2829Q266P500j2059j2
$$ -8930 22 6800 -5589 -4535 6729 -1846 -8008 4557 3460 -9369 -1103 6397 -5662 -5674
1192e674J1833p934p247J2752m93j2580P335Q607j2055p44J1729p003p955J2397
$$ -5674 6159 -1775 -9022 3730 3237 -9343 -2008 6599 -5456 -6200 5529 -1474 -9429 2968
1206B968J223j3109O256R152j1576r46J1714o316q368J2000J847j3609O311R568
$$ 2968 4191 -8918 -2662 6490 -5086 -6032 5682 -634 -9002 2998 4845 -8764 -2453 7115
1220G115j1019k660J2379n493q709J1335K509j2955N013J0227j0697k888J1961
$$ 7115 -3904 -6564 5815 322 -8387 2948 5457 -7498 -2485 7742 -2955 -5843 6118
1233F118m358r741J0946L278j2912M473J0535j0060m081J2235l499r670R965L708
$$ 6118 1760 -7981 2965 6243 -6669 -2196 8339 -1721 -5802 6433 2934 -6736 3229 6937
1247F937j2185L209J0977r570m622J2224k955j0596R789M858j2830K557J1082
$$ 6937 -5248 -2039 8938 -632 -5254 6970 4015 -6581 3208 8066 -4764 -2207 8875
1260H875q408n693J2036k255j0752R019N810j2542J550J1244p835o279J1547j524
$$ 8875 467 -5226 6810 4555 -6197 2822 8632 -3910 -2360 8884 1049 -5230 6317 4793
1274D793j1011Q681N763j2011O55J1745p530p019J1275j82j1459P545O347j1602
$$ 4793 -6218 2463 8226 -3785 -3130 8615 1085 -5934 5341 5159 -6300 1245 7592 -4010
1288d010j08J1542o053q099J0970O55j1443O799P352j2198m84J1980n927q655
$$ -4010 -4118 7424 1371 -6728 4242 4897 -6546 253 7605 -4593 -5077 6903 976 -7679
1302g679J0850J773j1959N664Q217j1194j511J2187n668q786J0163K463j1684
$$ -7679 3171 4944 -7015 -1351 6866 -4328 -5839 6348 680 -8106 2057 4520 -7164
1315g164N531Q315j1106k516J2346m707r212R868L201j1876M128R329j0339k885
$$ -7164 -1633 6682 -4424 -6940 5406 699 -8513 1355 4556 -7320 -3192 6137 -4202 -7087
1329g087J2077l889r996R601L781j1293L392R843r877m182J2243k720j0201Q395
$$ -7087 4990 1101 -8895 706 4487 -6806 -3414 6429 -3448 -7630 4613 1893 -8308 87
1343H7M856j1149K719R764r005m695J1856j642j0737Q205N258j0789J488J0416
$$ 87 4943 -6206 -3487 6277 -2728 -7423 4433 2791 -7946 259 5517 -5272 -3784 6632
1357F632q137n476J1625q98j0707P381N884j0972J182J0369p141o119J1080j67
$$ 6632 -1505 -6981 4644 3746 -6961 420 6304 -4668 -3486 6883 -258 -6377 4703 4536
1371D536j0887O733O809j0553J20J0680o868o749J1295P32j1546N762P695j0266
$$ 4536 -6351 382 7191 -3362 -3242 7438 570 -6179 5116 5848 -5698 64 7759 -2507
1385b507q70J0924n933p560J1214R60j1448N367P718r786j376J0790n592p735
$$ -2507 -3377 7547 1614 -5946 5268 6228 -5220 147 7865 -1921 -3297 7493 1901 -5834
1399e834J0314K021j1338M331Q186r068k468J1059m842q491R901K420j1034L617
$$ -5834 4480 6501 -4837 -506 7680 -1388 -3856 7203 2361 -6130 3771 6191 -4843 -1226
1413a226Q966r411k815J0726l710q839R439K970j1731L285R641q878l842J0892
$$ -1226 7740 -1671 -4486 6240 2530 -6309 3130 6100 -5631 -2346 7295 -1583 -5425 5467
1427E467l242r425R087L898j0952K239Q917p956m136J0526k182r979Q595M443
$$ 5467 2225 -7200 1887 5785 -5167 -2928 5989 -1967 -6103 4423 2241 -7738 857 5300
1441E300j0879J432J0093p731m307R963j996r904P961N514j0612O01R437o559
$$ 5300 -5579 -4147 5946 -1785 -6092 3871 1875 -8029 -68 5446 -5166 -4565 4872 -1687
1455a687n555J0418p09j0288P000N940j0162n1J0281n996o419R975q9r772O213
$$ -1687 -7242 3176 2467 -7821 -821 5119 -5043 -5094 5187 -809 -7228 2747 2658 -7114 -901
1470i01O744j0645n38J0295n300o608R727P68j0373N476P559j0559p70J0575m880
$$ -901 5843 -4802 -5340 4955 -345 -6953 2774 3542 -6831 -1355 6204 -4355 -5125 5450 570
1485E70p031R126J549j0298N274P269r461j840J0492m048p436Q978J550j0352
$$ 570 -6461 2665 4214 -6084 -810 6459 -3002 -4842 5650 1602 -5834 3144 4694 -5658
1499e658M537Q118q772k807J0673l709p934Q128K804r798L271Q711q721l197J0358
$$ -5658 -1121 6997 -1775 -4582 6091 2382 -5552 2576 5380 -4418 -1147 7564 -1157 -4354 6004
1514F004k588q662P930L526j0034K749Q774q137l783R770j989q734P472M129r729
$$ 6004 3416 -5246 2684 6210 -3824 -1075 7699 -438 -4221 5549 3560 -5174 2298 6427 -3302
1529c302K109Q454p442m746J0383j301r063O297M786r671J248R347o775n601R799
$$ -3302 -1193 7261 -181 -4927 5456 4155 -4908 1389 6175 -3496 -2248 7099 324 -5277 4522
1544D522o51r297O116N320r460Q29R116o352n857R781k9r626N624N542r574M10
$$ 4522 3871 -5426 690 6010 -3450 -2621 6495 143 -5714 4067 4038 -5588 36 5578 -3996 -3586
1560c586R496n924o587R517N51r539N410O003r004r55R341n100o623R447J093
$$ -3586 5910 -14 -6601 2916 3467 -6072 -662 5341 -3663 -4618 4723 -377 -7000 2447 3540
1575C540r900M514O602q581j197R813m995p130R013K221r911L544P110p944k105
$$ 3540 -6360 -1846 4756 -3825 -5022 4791 -204 -7334 1679 3900 -6011 -2467 4643 -3301 -5406
1590e406R789l917p430Q315K515r823L157P599p518k637R597l171q051P650L443
$$ -5406 4383 466 -6964 1351 3866 -5957 -2800 4799 -2719 -5356 4241 1070 -6981 669 4112
1605D112r282K426P874p555l219R667j994q374P443L754r744K451Q012o773l575
$$ 4112 -5170 -2744 5130 -2425 -5644 4023 2029 -6345 1098 4852 -4892 -2441 5571 -1202 -4777
1620d777R039j893q232O864M482r115J142Q220o398l840R277j367q563O110M812
$$ -4777 4262 2369 -5863 1001 5483 -3632 -2490 5730 -668 -4508 4769 3402 -5161 949 5761
1635E761r014J113Q199n317n007Q875p67q929O265N548q728p65Q757n136n314
$$ 5761 -3253 -2140 6059 742 -4265 4610 3843 -5086 1179 6727 -2001 -2766 5991 855 -4459
1650d459Q931o4q885M951O456r102o85R053m755n981Q434Q02q887M436O333q252
$$ -4459 4472 4408 -4477 474 6930 -2172 -2857 6196 1441 -4540 3894 4696 -4191 245 6578 -1674
1666a674j965R270l949o409Q065J432r023L771O486p637k417R088l629o631P562
$$ -1674 -3639 5631 1682 -4727 3338 4770 -4253 -482 6004 -1633 -4050 5038 1409 -5222 2340
1681B340J699q863L549P105p648k849Q808k391p594P545K382q770K221P426o646
$$ 2340 4039 -4824 -1275 5830 -1818 -4667 4141 1750 -5844 1701 4083 -4687 -2466 4960 -1686
1696a686l224Q250k072p114O441L056q427J962P505o870l539Q840j291p556N658
$$ -1686 -4910 3340 1268 -5846 595 3651 -4776 -2814 4691 -2179 -5718 3122 1831 -5725 -67
1711f7L506q286J546P807o363l857Q134p19p857N960M368q494N70P572n091m424
$$ -67 3439 -4847 -3301 4506 -1857 -5714 2420 1701 -6156 -196 4172 -4322 -3752 3820 -1271 -5695
1727e695Q263n20p570N256M298q238M93Q460n214n213Q218O9p689M954M742p795
$$ -5695 2568 2048 -5522 -266 4032 -4206 -3713 4747 -467 -5680 2538 2607 -5082 -128 4614 -3181
1743c181o44Q488m684n426P895R54q115M486N267p860k41Q295m396n668P246J743
$$ -3181 -3825 4663 -21 -5447 2448 3402 -4713 -227 5040 -2820 -3061 5234 838 -4830 2416 4159
1759D159q037L491N903p540j455Q592l293o684P498K084q260K824O589o817k051
$$ 4159 -3878 -387 5516 -2024 -3479 5113 1820 -4864 2634 4718 -3542 -718 5871 -946 -2997
1774b997Q344l243o527O843K821q167K296O345o486k438Q170k144o879N995K928
$$ -2997 5347 2104 -4423 2420 5241 -2926 -630 5715 -771 -3209 4961 2817 -4062 1933 4861
1789D861p694J756O878o292l047P741j326o838N574L432p834J155O972n739l536
$$ 4861 -2833 -1077 5801 -491 -3538 4203 2877 -3961 1613 5045 -2789 -1634 5338 -401 -3937
1804c937Q268j247p628N155L834p326P13O972n134m035P472p16p407M933M505
$$ -3937 4331 3084 -4544 611 4445 -2881 -2168 4804 -330 -4365 3107 2391 -5016 -83 4422
1819D422p322j08P280m767m551P843l49p796M705M786p274m44P412m061n148P409
$$ 4422 -2900 -3008 4272 -495 -5046 2797 2448 -5348 -643 4143 -3131 -3575 3837 -224 -5372 2037
1835B037M25p707M255N205p507p86P479m000n143P148J304p823L204N604o377
$$ 2037 2462 -5245 -990 4215 -3292 -4078 3401 -599 -5742 1406 2710 -5113 -1909 3695 -2682
1850b682j607P881l503n396O758J482p683K827N647n828k172P511k572o212O820
$$ -2682 -4289 3592 89 -5307 1451 2933 -4750 -1923 3724 -2104 -4276 3235 663 -5549 1271
1865A271J833p868K939O050n433k687P105k063n963N871K809p661K061N878n091
$$ 1271 3104 -4764 -1825 4225 -1208 -3895 3210 1147 -4816 1055 3864 -3797 -1736 4142 -949
1880i49k799P153j657o069N476K920p274J248O935n148l487O761n47o533N173
$$ -949 -3748 3405 1748 -4321 1155 4075 -3199 -1951 4984 -164 -3651 3110 2563 -3970 1203
1895A203L547p071M72O753m291m006O936n63o752M811L875p090L93O982m293m312
$$ 1203 4750 -2321 -1849 4904 613 -3393 3543 2980 -3772 1039 4914 -2176 -1783 5199 906 -3406
1911c406O799m23o315M320M458p144o87P577m037m654O674L49o807L708M466o871
$$ -3406 3393 2970 -3345 975 5433 -1711 -2398 5179 1142 -3512 3162 3511 -3296 412 4878 -1993
1927a993m07P179l590n115O223J019o556L093M650o303r57O755k649n505N701
$$ -1993 -2400 4779 1189 -3926 2297 3316 -3240 -147 4503 -1800 -2757 3998 1349 -4156 1545
1942A545J535o815K551N294n585j702O462k436n516N675K091o745J867N710n855
$$ 1545 3080 -3735 -1184 4110 -1475 -3177 3285 849 -4667 1008 3099 -3646 -1779 3931 -1924
1957a924k037O979j983n885N031K571o705J864N662n221k872P178j722n840M936
$$ -1924 -3961 3018 1035 -4850 181 2752 -3953 -2089 3573 -1648 -4520 2658 936 -4904 32
1972C2K783o619J633N582n127l051P201o74o731M570L486o636R09O186m607l363
$$ 32 2815 -3804 -2171 3411 -1716 -4767 2434 1760 -4971 -401 3085 -3551 -2642 3544 -1063 -4426
1988d426O656o99o049M161L557o049j17O461m232l524O697m28o175L905L998n953
$$ -4426 2230 1531 -4518 -357 3200 -2849 -2966 3495 -737 -4261 2436 2008 -4167 -262 3736 -2217
2004b217l53O417l495m336O292K77o194L504M189n926p98O897l454m323N914N83
$$ -2217 -2570 3847 352 -3984 2308 2585 -3609 -105 4084 -1842 -2640 4257 803 -3520 2394 2977
2020B977o320L156M484n382j474O675k678n059N868J351o092K394M780n642j237
$$ 2977 -3343 -187 4297 -1085 -2559 4116 1438 -3621 2247 3598 -2494 -100 4680 -962 -2199
2035b199O246k218m820N371J524o567K019N368n098j959O191k398n059N455K304
$$ -2199 4047 1829 -2991 2380 3904 -2663 -644 4724 -374 -2333 3858 1460 -3599 1856 4160
2050D160o307J426N006m741k186N982j230n475M647K297o315J393N568m233k935
$$ 4160 -2147 -721 4285 -456 -2642 3340 2110 -3365 1282 3579 -2736 -1343 4225 -8 -2943
2065b943N793j370m996M477K476o000M87N814m364k629N917r88n811M030L489
$$ -2943 2850 1480 -3516 961 3437 -2563 -2076 3738 -626 -3255 2662 1674 -4137 -107 3382
2080C382o096K37N873m421k985N935n27n401L551L601n871k04N634l110l624N588
$$ 3382 -2714 -2477 3396 -1025 -4010 1925 1398 -4003 -452 3149 -2722 -2926 2708 -402 -4026 1562
2096A562K9o190L598L934n774k91N683k662m136N308R24n671K829L921n702m65
$$ 1562 1591 -4599 -1001 2933 -2841 -3132 2551 -111 -4247 1061 1985 -3686 -857 3064 -2638 -3103
2112c103N741k387m517N164R79n540K537M216n185j093N783k169m521M952J887
$$ -3103 2638 251 -4266 898 1877 -3663 -1126 3090 -2095 -3188 2595 426 -4095 857 2744
2127B744n766J783M698m798j473N527j836m449M664J626n743J815N011m218k498
$$ 2744 -3022 -1239 3459 -1339 -2812 2715 879 -3570 1094 2720 -3023 -1208 3803 -415 -2913
2142b913N766j682m308M175K212n619J298N019m217k343O015j463m557L947K293
$$ -2913 2853 1171 -3137 1038 3250 -2369 -1071 3948 -269 -2612 3403 1940 -2617 1330 3623
2157C623n700J061N322m298k780N930r06n298M153K957n832Q35N054l852l007
$$ 3623 -2077 -1016 4306 8 -2772 3158 2252 -3046 1107 4064 -1768 -933 4121 269 -2738
2172b738N766n12n275L524K833n197K25N235l098l669N300L43n075K704L005m977
$$ -2738 3028 2516 -2759 765 3598 -1599 -1374 3861 763 -2906 2394 2737 -2338 366 3371 -1606
2188a606k57N431k857l797N133L51n373K487L781m814q39N590k979l945N073P67
$$ -1606 -1863 3568 711 -3086 2047 2398 -2975 -488 3293 -1521 -2360 3230 251 -3694 1379 2146
2204B146n188K525L812m897j052N255k416l828M577J604n621J883M275m586j363
$$ 2146 -3042 -517 3295 -1602 -2654 2601 185 -3643 934 2538 -3083 -1200 3075 -1511 -2874
2219b874N021j978m061M332J730n414J265M626m125j990N578j433m649M289J761
$$ -2874 2147 169 -3892 440 2170 -3244 -1979 2647 -1478 -3468 2110 677 -3972 317 2078
2234B078n226R96N005m100k331N128r40m567L978K495n218O97M821l772k350N145
$$ 2078 -3148 -2152 2853 -1247 -3578 1550 610 -3957 21 2516 -2702 -2005 2816 -956 -3306 1839
2250A839q40m705L248K916n135P79M651l534k208N042l14m678L098K789n210N73
$$ 1839 999 -3706 -458 2458 -2677 -1898 2753 -781 -2989 2053 1739 -2939 159 2948 -2262 -1689
2266a689M727l374k401M884j5m932K928L116m821j07M878k827k983M861Q0m685
$$ -1689 3038 -336 -2737 2147 2132 -2800 128 3244 -1577 -1684 3194 367 -2616 2245 2325 -2360
2282b360K770K986m484q81N390k585l243M783N21m878J976L837m617q65M918k237
$$ -2360 410 3396 -1088 -1969 3421 836 -2407 2376 2897 -1981 -5 3832 -785 -1650 3268 1031
2298A031l286L969R47n066K158L562l859j378N097j763m332M535J447n173J755
$$ 1031 -2255 1714 2661 -2405 -247 3315 -544 -1922 3175 1412 -2920 1615 3062 -2111 -356
2313c56L896l903j572M545j122m334M203J708n475J553M197m202j611M952r97
$$ -356 3540 -363 -1935 2610 1488 -2846 1357 3065 -2410 -857 3340 -862 -2473 2479 1482
2328A482m391L803J487n047J296M542l938k248M946r85m291L592K114n009O66
$$ 1482 -2909 894 2381 -2666 -1370 3172 -766 -3014 1932 947 -3344 248 2362 -2647 -1981
2343a981M663l312k650N007p55m272K806K548m556J54M741k914l207M838q2m477
$$ -1981 2682 -630 -3280 1727 972 -3300 -494 2054 -2502 -2348 2393 -521 -3728 1110 1028 -3449
2359c449K857K896m536l7M517k509k963M101L91m498K353L374m523n63M907k376
$$ -3449 -592 2304 -2232 -2269 2248 -261 -3224 877 1268 -3230 -877 2497 -2026 -2589 2318 -58
2375e8l118M061Q60m799K106L344m410m06M938k222l617M398R17m728J990L301
$$ -58 -3176 885 1745 -3054 -948 2396 -2014 -2420 2518 296 -3321 1077 1994 -2734 -744 2557
2391B557l874q48M541j754l416L929J184m335J140L683l785j600N314j737l649
$$ 2557 -1317 -2165 2376 622 -2794 1135 2319 -2016 -876 2807 -978 -2578 2736 999 -2650
2406b650L606J970m611J106L859l723j746M721r65m337L680K035m547J048L933
$$ -2650 956 2926 -1685 -579 3280 -443 -2189 2532 1567 -2770 910 2945 -1602 -554 3379
2421C379l520j794M781j009m144L117K499m824J033L757k964k365M472k89m630
$$ 3379 -141 -1935 2846 1837 -2307 810 3309 -1515 -482 3275 311 -2054 2418 2129 -2501
2436b501L009K626m596K52M596l262k593M375P8m547K748K751m250P1L992k670
$$ -2501 508 3134 -1462 -1210 3386 124 -2469 1906 1984 -2563 185 2936 -1314 -1243 2749 79
2452G9k612M674l79m449K721K784m358k75M405k450k750M021K71m650K304L161
$$ 79 -2533 2141 1762 -2687 34 2818 -1540 -1815 2590 140 -2610 1411 1682 -2968 -664 2497
2468B497l873q11M679k350l175L972P38m835K193L374m004q05M242j755l522M004
$$ 2497 -1376 -2187 2492 142 -3033 939 1677 -3158 -965 2409 -1595 -2400 1842 87 -3435 569
2484E69J068m440J813L238m086j016M654j512l482L532J422m457J403L638l509
$$ 569 1637 -2803 -990 2248 -1838 -2854 1800 288 -3194 338 1760 -2697 -1294 2344 -1165
2499a165j732M689j152l692L402J596m501J080M029l430j692M416j030l729L071
$$ -1165 -2897 1792 640 -3052 350 1946 -2555 -1475 2554 -876 -2568 1848 818 -2911 160
2514A60J999m357P58M049k934k172M659r81m077L311K208m564P71L878k549k707
$$ 160 2159 -2198 -1440 2609 -325 -2497 2162 1181 -2896 415 2623 -1941 -1170 2708 159 -2548
2530b548M321r3l706K457K435m281J96M112k388k549L983J61m450K727K412l806
$$ -2548 1773 1680 -2026 431 2866 -1415 -1219 2893 505 -2044 1939 2100 -2350 377 2789 -1017
2546a017O5L990k506k610M012O33m760K541K974m336l51M393k001l351M175M80
$$ -1017 -952 3038 532 -2078 1934 2567 -2193 348 3322 -1014 -1365 3028 1027 -2324 1851 2331
2562B331m320K159K863l710j077M446j770l153L751P68m148J677L079l725j193
$$ 2331 -1989 170 3033 -677 -1754 2692 922 -2231 1520 2288 -1860 -183 2896 -829 -2022
2577b022M721j838l482L751J269m556J485L619l894j162M014q25l657L180J568
$$ -2022 2699 861 -2621 1130 2399 -2157 -672 2947 -947 -2109 1905 1080 -2577 603 2171
2592B171m343Q87L851l340k087M833j346l503K971J580m202J012L666k717k087
$$ 2171 -2172 -1285 2566 -774 -2861 1972 626 -2877 94 1674 -2528 -1516 2150 -567 -2654
2607b654L999m81l841K763K103m094N87M082l307j989M162m62m183L047K362m084
$$ -2654 1345 864 -2977 -214 1889 -2205 -1618 2464 -843 -2832 1330 868 -3315 -268 2094 -1990
2623a990J02L910k436k816M636l55l534J976K304l505k50L965k283k706M171M72
$$ -1990 -1888 2022 -414 -3230 1406 1051 -2483 -507 1797 -1708 -1958 2007 -276 -2982 1189 1661
2639A661m483K429K749l847m11M284k482k352L723N32m321J834L232l929n84M426
$$ 1661 -2822 -393 2356 -1491 -1902 2382 -100 -2452 1271 1803 -2518 -684 2548 -1381 -1965 2461
2655B461j958k843L352J015m049J594L262l085j359L989j249l578L789J272m762
$$ 2461 503 -2340 1012 2027 -2022 -428 2834 -251 -1610 2379 1130 -2448 1341 2613 -2149
2670b149J848K970k829j552M257j501l311L524J189l793Q69L661l315j480M189
$$ -2149 -301 2669 -160 -1712 2545 1044 -2267 1257 2446 -1347 -478 3183 -132 -1612 2577
2685B577j182l189K799J734m242P36L725l075j708L970q98l331K790J922l949
$$ 2577 1395 -1794 1005 2739 -1503 -767 2958 -117 -1825 2145 1247 -2084 706 2628 -1321
2700a321M85L712k659k289L841l06l596K780J716l728L09L603k529k101M091q03
$$ -1321 -836 2876 217 -2072 1769 1463 -2133 647 2363 -1365 -1056 2547 18 -2083 2008 1205
2716A205l694K409K312l889l1L974k424k320L471K83l833J819K981l649l93L668
$$ 1205 -2489 -80 2232 -1657 -1688 2286 -138 -2458 1013 1296 -2537 -718 2263 -1386 -1779 1889
2732A889k046k556L643L44l658J577K812l205r95M051j896k833L413Q92l813J364
$$ 1889 -157 -2713 930 1274 -2384 -807 2005 -1200 -2195 1856 -40 -2873 540 1432 -2381 -1017
2748a017K938l663l70L811j861k379L142J084m255J646L117l177j071L411r35
$$ -1017 1921 -1742 -2112 1699 -162 -2541 601 1685 -2570 -924 2193 -984 -2055 1356 421
2763D21k972K852J427l903J014L728l443j298M103j208l367K997J613l718R59
$$ 421 -2551 301 1728 -2175 -1161 2567 -876 -2174 1929 721 -2646 351 1964 -1754 -795
2778g95L399l100j738L855n65l661L103J720l763M16L890k610k017L777r7m006
$$ -795 2604 -496 -2234 1621 1056 -2605 498 2218 -1545 -1129 2761 151 -1866 1911 1814 -2192
2794b192K575K325m155N06L349k318k044L870j94l458K350J876l525K03L417k122
$$ -2192 383 2708 -1447 -941 2408 90 -1954 1916 1722 -1736 614 2490 -1035 -832 2585 463
2810D63k279L681P1l802K728J972l836k55L789j876k349L196L18l633J864K766
$$ 463 -1816 1865 1936 -1866 862 2834 -1002 -1257 2532 656 -1693 1503 1821 -1812 52 2818
2826B818l626j99L336j795k741L438P57l772J567K551l037r80L773j893k257L134
$$ 2818 -808 -1007 2329 534 -2207 1231 1988 -1784 -217 2334 -703 -1683 2090 197 -2060 1074
2842A074O03l755J568K980l682n13L532r43l457L053J267m088J401L074l346n92
$$ 1074 1677 -2078 -510 2470 -1212 -1725 1807 864 -2593 460 1727 -2361 -960 2114 -1232 -1824
2858a824L682j221l291L046J174l794J375K653k844j109L784j137l534L385J380
$$ -1824 1858 637 -2654 392 1566 -2228 -853 1800 -1044 -2153 1631 494 -3040 345 1725
2873A725l724O17L125k389j624L208J6l786K802J738l492J60L442k169k119L743
$$ 1725 -1999 -1382 1743 -646 -2270 938 954 -2832 -30 1708 -1784 -1624 1818 -351 -2470 1273
2889A273n18l221K638J787l450j0L794k363k226L517j47l620K579K130l307k43
$$ 1273 755 -2466 172 1959 -1491 -1501 2293 -70 -2296 1221 1074 -2546 33 2163 -1144 -1387
2905a387L207j675k565L615K05l336J771K224l107m11L736j839k714L430N40l422
$$ -1387 1820 145 -2420 1195 1400 -1936 -165 2059 -1048 -1459 2277 438 -2276 1154 1694 -1728
2921a728J671K508l358k70L513j880k460L263P09l455J432K829l375p47L604j284
$$ -1728 -57 2451 -907 -1177 2336 456 -2004 1259 1968 -1487 -55 2774 -601 -1348 2256 972
2937I72l035L300P35l431J314K737k792j010L631j376k956K875J182l673J162
$$ 972 -2063 1237 1972 -1459 -145 2592 -200 -1210 2421 1045 -1911 964 2146 -1527 -365
2952c65K563k964n75L335p60l058K705J207l316N28K988k717j138L444q77l113
$$ -365 2198 -766 -1341 1994 1234 -1824 881 2088 -1228 -700 2288 -429 -1567 1877 1000 -2113
2968b113K458J679l618O04L175k724j631L596l21l252K270J666l447M06L083k179
$$ -2113 345 2024 -1594 -990 2185 -539 -2170 1426 1105 -2147 123 1789 -1658 -1252 1831 -348
2984c48j831L060l1l203K214J874l263q3L330k189j547K773L21l350J852K286
$$ -348 -2179 881 850 -2353 -139 1735 -1528 -1611 1719 -470 -2017 756 1077 -2273 -421 1865
3000A865l106m65L319j921j961K779N76l250J283K599k985m28L231j795k241K945
$$ 1865 -1241 -1706 1613 -308 -2269 510 1086 -2164 -881 1718 -1267 -1695 1536 -259 -2500 445
3016D45Q92l391J232K529k764r61L793j482k473K872P75l474J321K671k956q05
$$ 445 1337 -2054 -822 1707 -1057 -2018 1775 293 -2180 692 1467 -2007 -686 1985 -971 -1776
3032a776L345r57k771K870J002l232P12K823k453j253L402q04k788K631J434l430
$$ -1776 1569 612 -2159 711 1713 -1519 -807 2016 -437 -1690 1712 908 -1880 751 2185 -1245
3048a245O35K869k531j306L314n95k956K595J385l344N04K608j842j588L244m44
$$ -1245 -610 2259 -272 -1578 1736 1141 -1815 780 2165 -1179 -675 1933 91 -1497 1747 1303
3064A303k971K079J779l153K86L002k322j871L536k45l453K204K038l283K8L493
$$ 1303 -1668 411 2190 -963 -677 2325 3 -1868 1668 1423 -2030 174 2212 -1071 -1043 2450
3080B450k237k008L416J37l707K405J901l462K98K857j700k141L176J23l147J673
$$ 2450 213 -1795 1621 1758 -1949 456 2357 -1105 -807 2050 350 -1791 1385 1508 -1639 34
3096C4K173k978n12L124j665k220K854N85l160J474K288l039l32L151j561k283
$$ 34 2207 -771 -1283 1841 176 -2044 810 1395 -1765 -291 1997 -1042 -1374 1777 216 -2067
3112b067K855M06l027J286K311k873o37L055j151k414K780P41l396J407K460k472
$$ -2067 788 1194 -1833 -547 1764 -1109 -1746 1309 158 -2256 524 1265 -2131 -724 1736 -736
3128g36j064L121q97k531J967J413l002M64K907k509r40L083p19k800K344J502
$$ -736 -1800 1321 424 -2107 -140 1273 -1729 -1265 1642 -867 -1807 1276 557 -2243 101 1603
3144A603l267M98K575j908j512L218n35k804K161J686l440M82K940k014j417K908
$$ 1603 -1664 -1166 1409 -499 -2011 1207 672 -2132 29 1715 -1725 -1243 1697 -317 -1734 1174
3160A174k78k756J965J796l135K71K981k167j445K656p4k614J805J902l050J44
$$ 1174 896 -1860 105 1901 -1234 -963 2018 -149 -1594 1062 988 -1626 179 2081 -969 -825
3176h25K842j916j742K807Q9k769J141K623l076j91L209j578k208K643M61l044
$$ -825 2017 101 -1641 1166 1255 -1514 -373 2250 -826 -1017 2192 614 -1594 1049 1510 -1534
3192a534J423J996k530l42L052j752j673K254P40k959J375K163k508p37L143j511
$$ -1534 -111 1885 -645 -987 2065 313 -1360 894 1634 -1325 50 2213 -295 -1032 2111 600
3208F00k209K556N82k715J086J914k462q29L323j054k385K481R58l124Q30K414
$$ 600 -1609 947 1529 -1186 -100 1814 -648 -1477 1846 792 -1593 888 1846 -1278 -448 1966
3224A966k438j214K955n55k629K211J136l014Q20K442k286j165L023n91k755K308
$$ 1966 -472 -1686 1269 714 -1915 296 1432 -1582 -762 1680 -606 -1771 1252 661 -2094 214
3240B14J371l049K72K769j895j595L078m57k810J708K053k982m6K756j548j984
$$ 214 1585 -1464 -1192 1577 -318 -1913 1165 708 -2102 -394 1659 -1323 -1369 1387 -161 -2145
3256b145K685n1k460J715J613k500l90L083j853j644K521J75k765J626J894k672
$$ -2145 540 489 -1971 -256 1357 -1143 -1533 1550 -303 -1947 574 749 -2016 -390 1504 -1168
3272a168l35K798j470j876K757K39k891J799J756k627l31K771j082j962K292L48
$$ -1168 -1503 1295 -175 -2051 706 945 -1946 -147 1609 -1018 -1349 1422 340 -1622 670 1018
3288A018k554J292J748k353o61L105j323j872K107R01k705R49K058k173m31K509
$$ 1018 -1536 -244 1504 -849 -1510 1595 272 -1600 507 1408 -1297 -348 1710 -463 -894 1615
3304A615p76k482K548N86k549O15K355k359q08K915j016k360K392Q19k455P27
$$ 1615 839 -1643 905 1491 -1058 -443 1912 -447 -1255 1660 644 -1716 676 1495 -960 -233
3320b33K346k171j018K858q89k205J975J035k779L49K651j555j336K013L85k752
$$ -233 2113 -58 -1076 1782 893 -1312 663 1698 -1081 -732 1919 364 -972 1041 1426 -1326
3336a326J815J519k906K29K397j723j596K997n88k140J454J409k444L12K220j384
$$ -1326 489 2008 -898 -669 1728 5 -1591 1406 818 -1322 132 1541 -903 -591 1629 245
3352B45k054K940J3k485J634J063k144k09K451j470j728K530kk439J404J633k252
$$ 245 -1809 1131 1144 -1341 293 1356 -788 -997 1454 -16 -1744 786 784 -1655 -251 1382 -870
3369h70l65K533j236j984K700L00k765J132K120k367n67K413j066j745K156L09
$$ -870 -1235 1298 62 -1922 778 1078 -1687 -555 1565 -802 -1369 1044 -22 -1767 389 698
3385F98j814N20J668j860n58K447j094j936J933R45k369P88K394k457j001K797
$$ 698 -1116 -596 1072 -788 -1346 1101 7 -1929 4 949 -1420 -632 1762 -695 -1696 1101
3401A101q12k125K056J027k736P45K104j904r05K603m29k424J991R00k356M21
$$ 1101 289 -1836 220 1247 -1489 -744 1360 -544 -1449 1154 725 -1699 292 1192 -1164 -743
3417g43K159j472j289K634n27k213J667J315k516J95K157j299j713K443r9j973
$$ -743 1416 -56 -1345 1289 762 -1451 216 1531 -985 -790 1367 68 -1645 798 699 -1274
3433a274J701J376k435J12J881r96j857K294L19k353J105J931k424j24K512j436
$$ -1274 427 1803 -632 -520 1361 365 -1492 802 1121 -1232 -127 1804 -620 -744 1768 332
3449C32j733K204N62k369J272J249k309r4K572j225j378K184l29k061J260J568
$$ 332 -1401 803 1365 -1004 268 1517 -792 -886 1686 461 -917 1267 938 -1123 137 1705
3465A705k359r4K237j092j738K257L40k545J203J652k012m17K128r47j683J880
$$ 1705 -654 -748 1489 397 -1341 916 1256 -1289 -86 1566 -446 -863 1265 318 -1365 515
3481E15R54k830R16J881j653j006K394q72j654J741O27k090O50J937j983p71K189
$$ 515 1469 -1361 -445 1436 -217 -1223 1171 299 -1355 386 1013 -1077 -427 1510 -473 -1244 945
3498I45m58k138J739P41k037K91J898j486j161K387j93k246J756J258k124k11
$$ 945 487 -1651 88 829 -1208 -917 981 -505 -1666 721 528 -1718 38 1296 -828 -1039
3514a039K127j295j412K125k34j853J529J001k427O33J656j367j150K613n40k202
$$ -1039 1088 -207 -1619 506 272 -1581 -52 949 -1478 -845 811 -556 -1706 907 367 -1835
3530a835J463J214j971J13K090j084j418K216j73j845J121J401j930o53K517j404
$$ -1835 -372 842 -1129 -1016 1074 -10 -1428 788 615 -1230 -109 1292 -638 -1291 1226 -178
3546a78j393K553m39j752Q95J689k248J24J885q44j484K095k2j673O76J545j753
$$ -178 -1571 982 543 -1209 -314 1375 -873 -749 1136 292 -1192 903 881 -792 -116 1429 -324
3563c24m51J960q85j329J534Q36k391Q17J997j981p92K114m10j967J984M99k216
$$ -324 -775 1185 300 -1029 505 1341 -1050 -233 1764 -217 -1009 1105 695 -1272 712 1211 -1005
3580a005P35J835j931o59K498r82j554J523Q62k101J53K137j512j073K136m07
$$ -1005 -270 1565 -366 -1025 1473 491 -1063 460 1322 -779 -626 1511 -1 -1074 1062 655
3596F55j543J549P14k663O53K163j579q00J869m00j871J380J303k268J19K125
$$ 655 -888 661 1375 -1288 -635 1528 -51 -851 1018 618 -1253 127 1430 -838 -719 1406
3612A406j451q70J719q8j852R75R67j741L61J744j332j295K265k69j997J199J646
$$ 1406 -45 -915 804 716 -1136 -161 806 -935 -574 1170 -162 -1457 808 539 -1458 -259 1387
3629A387k355J16K135j583j099J883r9j736J075J084j818k79J837n68j337J767
$$ 1387 -968 -852 1283 -300 -1399 484 385 -1351 -276 808 -1010 -1289 548 -20 -1357 410
3645D10R1j992J156J391j631q57K350q42j576J839M06j744N98J491j774n54K004
$$ 410 501 -1491 -335 1056 -575 -1432 918 76 -1500 339 745 -999 -401 1090 -684 -1238 766
3662G66o03j964J953P00k013P19J577j741n07J937m94j455J327Q39k072Q00J703
$$ 766 163 -1801 152 852 -1161 -442 1135 -606 -1113 824 330 -1125 202 1041 -1031 -231 1472
3679A472j663p92J763n57j572J665P63k140P90J342j325m60J825l95j900J447
$$ 1472 -191 -983 780 223 -1349 316 1079 -1061 -271 1071 -254 -714 1111 716 -1184 263
3695B63J287k253K11K110j504j153K104l20j705J125J285k164K62K068j432r68
$$ 263 1550 -703 -492 1618 114 -1039 1065 745 -960 165 1450 -714 -452 1616 184 -784
3711g84J665J14k100J123J176j619j63K164j350q25J413J07j693J164J056j866
$$ -784 881 995 -1105 18 1194 -425 -588 1576 226 -599 814 921 -772 392 1448 -418
3727d18j73J826q14j404J802L03k206R72J251j421n73J817o73j320J521L62j860
$$ -418 -591 1235 421 -983 819 1122 -1084 -112 1139 -282 -855 962 289 -1031 490 852 -1008
3744a008Q11J273j498n34J671l85j703J818L54j832O88J066j045p07K033p60j728
$$ -1008 -197 1076 -422 -956 715 330 -1373 445 799 -1033 -345 721 -324 -1031 1002 242 -1486
3761a486J655Q50k112M00J559j184r57K006m04j783J875J79j749K64J623j287
$$ -1486 169 1019 -1093 -693 866 -318 -1275 731 327 -1456 419 598 -1151 -887 736 -551
3777e51n24J638k90j687J003J082j705J94J809j377r66J931m20j439J225J055
$$ -551 -1075 563 273 -1414 -411 671 -1034 -840 969 -408 -1374 557 137 -1302 -77 978
3793I78j902J92J672j459q46J799N6j743J241P88j338j66J978j320j075J833j80
$$ 978 -924 -732 940 -519 -1365 434 490 -1253 -12 776 -562 -728 1250 -70 -1145 688 508
3810E08j515R84J371j608l94J467m91j049J289L79j806Q34J133j294q15K077m55
$$ 508 -1007 -23 1348 -260 -654 813 322 -727 562 941 -865 -31 1102 -192 -1007 1070 615
3827F15j871J860M29j747N10J467j156o42J785q23j246J684qj794Q25J290j088
$$ 615 -1256 604 1033 -714 -204 1263 107 -535 1250 427 -819 865 857 -937 -112 1178 90
3844I0q75J629m51j450J574Q04k279Q55J251j312o57K185q45j444J148P41j304
$$ 90 -785 844 393 -1057 517 1321 -958 -103 1148 -164 -821 1364 519 -925 223 964 -340
3861c40L5J630j550q68J818k3j634R99Q30j685J27J414q16r35J888m95j481J395
$$ -340 -305 1325 -225 -1093 725 702 -932 67 897 -788 -661 753 -63 -998 890 395 -1086 309
3879C09O35j777J20J879j471q62J570l0j514R32J036j429k36J435o89q96J468
$$ 309 944 -833 -713 1166 -305 -1167 403 373 -1141 -209 827 -602 -838 597 -92 -988 480
3896D80J37j746J018J017j461n44J789p30j367J767N9j723J070J119j497k60J385
$$ 480 617 -1129 -111 906 -555 -1099 690 -40 -1407 360 419 -1304 -234 885 -612 -872 513
3913E13n25j254J681J88j839Q58J306j319j73J202n48j127J304L01j433M76J305
$$ 513 -12 -1266 415 603 -1236 -378 928 -391 -564 638 90 -1037 267 568 -865 -389 916
3930I16j338k15J517m84j387J281L68j669P65J237j354k95J630o48j520J877M28
$$ 916 -422 -637 880 396 -991 290 658 -1011 -246 991 -363 -658 972 324 -1196 681 1109
3947A109j534K55J252j104o52J343M9j673R92J195j911N11J104p97q54J409J22
$$ 1109 -425 -170 1082 -22 -674 669 718 -955 37 1232 -679 -168 936 139 -715 694 816
3964H16j459J024P83j514M5J458r04j154J881l65j569J145P81j420J83J484j108
$$ 816 -643 381 1164 -350 -305 1153 249 -905 976 611 -958 187 968 -452 -269 1215 107
3981A07j061J518Q8j433Q10J004j572kJ587p07j343J698j13j462R61J015j517
$$ 107 -954 564 652 -781 29 1033 -539 -541 1046 339 -1004 694 581 -881 80 1095 -422
3998d22j92J359o05j028J427J7j585R73Q15j090n37J738o92q94J179m5j331P39
$$ -422 -614 745 140 -888 539 556 -1029 -56 759 -331 -868 870 178 -716 463 418 -913 -174
4016a74J082j225n48J640o07j109R71N01j408L84J303j329l44J357m81j193J628
$$ -174 908 -317 -865 775 168 -941 30 531 -877 -493 810 -519 -863 494 13 -1180 448
4033D48k7r82K39J125j119n23J607l00j629J225N65j375J67J216j079m00J148
$$ 448 421 -561 -322 803 -316 -839 768 468 -1161 64 629 -746 -579 637 -442 -842 306
4050C06o0j261J070O64j633M12J212n55j092J525M5j419P91Q83j475l3J748j208
$$ 306 246 -1015 55 719 -914 -502 710 155 -937 588 633 -786 5 888 -587 -620 1128 -80
4068h0m93J218L05j872J023R74j601J8J665j090q14J157L20j504Q18Q79j244m8
$$ -80 -573 645 950 -922 101 1075 -526 -508 1157 67 -747 410 730 -774 44 923 -321 -369
4086c69J090n26j003J396L00j469Q34Q98j524q5J180m43j376J349P73j585O15
$$ -369 721 195 -808 588 888 -581 253 1151 -373 -458 722 279 -1097 252 1025 -560 55
4103E5Q45j199j84J421n57j232J369K23j310K55J316j188l10J302j76j513J040
$$ 55 900 -299 -483 938 381 -851 518 741 -569 -314 1002 -186 -496 806 630 -883 157
4120A57O04j477O01J004j206l82J291n87q60J173N11j540K82J070o92m94R07j32
$$ 157 761 -716 -115 889 -317 -699 592 5 -855 318 829 -711 -429 641 -51 -545 362 230
4138B30j281J069O33j438M17J146j062n52J529j98j749J469P33j723L15J332j291
$$ 230 -1051 18 651 -787 -370 776 -286 -838 691 493 -1256 213 946 -777 -462 870 -421
4155d21q04J416qj427J194P06j114k79J482p69n95P53M10j548O36R63j038j76
$$ -421 -1225 191 183 -1244 -50 656 -458 -737 745 -24 -619 134 544 -1004 -368 595 -443 -619
4173f19J024k95j241J479J51j432P49J064j276k29J613r17r82J182J10j174N37
$$ -619 405 110 -1131 348 499 -933 -184 880 -396 -625 988 71 -911 271 381 -793 -256
4190b56J201j521k90J420m62r71J264J81j261M34J029j121k82J243n18r73J247
$$ -256 945 -576 -866 554 92 -879 385 566 -695 -261 768 -353 -635 608 90 -883 364
4207C64K00j504P20J065p66p47J384n69o63P92O83j547K92J397j116l89J077j03
$$ 364 564 -940 -220 845 79 -668 716 147 -516 276 959 -588 -296 1101 -15 -404 673 570
4225E70j564J266Q07j624M50J025r98m21J043l7j137Q37N59j413L17J141q80m72
$$ 570 -994 272 1079 -545 -95 930 -68 -489 554 517 -620 217 776 -637 -320 821 -59 -531
4243e31J032j2j217P81O19j223L22J345j145o80Q00L69j208N91J046j136m21J319
$$ -531 501 489 -728 53 672 -551 -229 1116 -29 -709 91 460 -748 -157 889 -247 -668 651
4261F51k90j182J197qj379Q72Q55j073m16J676j010j197J685J29j416O09R93j258
$$ 651 361 -821 376 368 -1011 -139 716 -357 -773 903 -107 -1304 381 510 -906 -297 696 -562
4279e62K10Q30k79j211J468j61j149N30Q66j124%R65l05j034P64R97j596N86R46
$$ -562 -352 478 199 -1012 456 295 -854 -324 542 -582 -582 383 78 -956 -192 805 -791 -205 741
4298G41q28n68J209j06j266P85L62j108M20Q48m88q59J489o38r47J151N11j711
$$ 741 -87 -655 554 448 -818 -33 329 -779 -359 489 1 -858 631 -7 -954 197 708 -1003
4316a003N37J124p91l95J041j94r86P40M58r65K34J094j110p58J820n48j167J114
$$ -1003 -466 658 -133 -528 513 319 -667 73 531 -434 -200 894 -216 -974 846 298 -869 245
4334B45O44j401R2J007m83o75J194o2j237O99P53p84n46J558o73j120J472j00
$$ 245 889 -512 -420 587 104 -571 623 561 -676 23 776 -8 -554 1004 331 -789 683 583
4352E83j065M08R29j231p4J285n21r57R24M70j518O49R34j087j59J159m20r61
$$ 583 -482 -74 855 -376 -450 835 314 -643 281 751 -767 -118 816 -271 -430 729 309 -652
4370f52J099L05j267N44P85r73j97R59o14p48J238J19j421O34J099j219m82J428
$$ -652 447 752 -515 29 814 -159 -356 603 -11 -759 479 598 -823 -189 910 -309 -791 637
4388F37n32q01R22L36j292K05J131q22n30J304k23j184J014L03j102K08J153r78
$$ 637 105 -696 226 562 -730 -525 606 -216 -746 558 335 -849 165 468 -634 -426 727 -251
4406b51p21J511l82r65O03O47q75N6J019j167j80J220m54q43Q49M75j056n4J219
$$ -251 -972 539 157 -808 -205 442 -433 -377 642 -525 -705 515 61 -782 67 542 -514 -568 651
4425F51n95j068J386l3j050N15R39q28k83J470j176m52Q39k4j121P00Q88j216
$$ 651 56 -1012 374 341 -709 -194 745 -83 -366 1104 -72 -524 315 291 -830 -130 758 -458
4443d58j38J342p57p68J163J61r58M07M48p64j65J349n09j046R52O36j083J42
$$ -458 -596 746 -11 -779 384 545 -413 -6 442 -322 -487 862 353 -693 259 895 -188 -46
4461d6Q48q29o84J462l51r18J036K21j268N55R33j202j67J208l42j146R52M57
$$ -46 802 -27 -711 751 400 -518 518 739 -529 26 959 -243 -410 798 456 -690 262 719
4479G19j270L04P19n55m18J105k61p33P54M13j221O68Q78j010n71J213m65q01
$$ 719 -551 -247 472 -83 -501 604 343 -390 364 777 -444 224 1102 92 -479 734 269 -532
4497e32N52O45q60j16J151p35o43J260m18j011P94O83p65n81J552j080l24Q86
$$ -532 20 665 -195 -311 840 105 -538 722 304 -707 87 770 5 -576 976 -104 -428 458
4515D58j39j305J033N05j115J12J204n92r89J209q4p68L63O39r27k50J093m98
$$ 458 319 -986 47 552 -563 -451 753 161 -828 381 297 -471 -108 531 -396 -646 447 -51
4533e1n38O97M64j228M77Q66j308j26J701r95r68J452n8r69M79Q84j059m16J389
$$ -51 -589 108 572 -656 -179 687 -621 -747 954 -41 -1009 443 385 -584 -105 779 -280 -696 693
4552F93m51r58Q05P28j259k13J299r01j44Q05m25j031J317k1r07J36Q59m44m51
$$ 693 242 -716 89 817 -442 -655 644 -257 -401 404 -21 -1052 265 244 -663 -527 332 -112 -563
4571e63J050M3j429J218N6p18Q2P30n31l73J078k69r71R10L36j085K71Q40q70
$$ -563 487 530 -899 319 375 -343 -261 469 -62 -435 643 374 -597 313 649 -436 -165 675 -195
4590a95l57J456m05j012O87M84r69j44J329q42o04J193k00j150P63O34j069JJ089
$$ -195 -552 904 499 -513 174 658 -311 -455 874 32 -572 621 421 -729 34 668 -401 -400 689
4609F89n35o92Q95J49r54N70M39p49j43R41o58k53Q27m5q74M26N30q97K51Q17
$$ 689 154 -538 357 506 -448 122 561 -188 -331 610 -48 -301 526 481 -393 33 563 -334 -83 734
4629G34o48o02Q00K84j059O90L55p70k25O99N4o00P01J24r92N11O86p22m19R86
$$ 734 86 -516 284 568 -491 199 554 -216 -441 258 312 -288 413 537 -455 56 742 20 -399 587
4649E87n60n27O25L65j286O18N72o29m43J190r9j178J180m3q95K49P77r51k23
$$ 587 27 -500 125 490 -796 -178 394 -235 -678 512 413 -765 415 372 -523 -274 503 -448 -671
4668f71Q36K64j374R76L86q64p5J066o58o16J135k55q85Q18K46p82l79J329p04
$$ -671 165 429 -945 31 417 -447 -522 544 -114 -730 405 150 -735 83 329 -453 -832 497 -207
4687b07n06J120k09q90P58L56p79K4O45o74j42Q77P6r36K17M52o22J04J112p67
$$ -207 -713 407 198 -692 66 422 -357 -333 312 -362 -504 373 449 -487 -270 182 -440 -336 776 9
4707Iq56J164L17j148L69N63r72k53J530o11n52P04L53j017N9J107p75j68O87
$$ 9 -847 317 634 -514 -145 418 -554 -807 723 112 -440 264 617 -400 -341 766 -9 -177 510
4726E10k69o59R42P2r70M22O76q97l0Q06m35o44O43M19q47k81J390p63m45Q56
$$ 510 241 -418 524 596 -374 48 724 -173 -203 603 168 -476 167 586 -261 -542 848 85 -360 496
4746D96k62q54P59P2o81N55O63m60o96J013n13m17N43M66j192M17N79m14p7L99
$$ 496 234 -620 139 211 -470 85 748 288 -408 605 92 -325 218 684 -508 -91 488 74 -3 396
4766C96l0o80K83N66r93j32J087n78m19O61K26q19Q36K36r77J08P68p97m6O49
$$ 396 366 -314 -31 535 -458 -590 497 -81 -500 161 387 -432 404 640 -337 -229 539 -258 -304 345
4786C45J25j047M14P50p90k53R22k89n48M61J39n28Q8M57l03l61N86j79o16N17
$$ 345 470 -577 -163 587 -203 -456 466 177 -371 90 229 -299 -211 246 -57 -418 168 -11 -627 -110
4806a10N44r02L3R12o27k32M96j58p24R04L19r34L86N15o03n22J071r3j035P29
$$ -110 434 -468 -435 477 -150 -382 114 -44 -768 136 455 -479 -93 422 -181 -703 368 275 -760 -31
4826c1M95q84N1Q61o35n03P95M2p38P72J63j010J47J003m43q06J196l41o40N37
$$ -31 464 -420 -369 492 -143 -646 149 191 -547 225 388 -622 -475 528 85 -721 475 134 -506 31
4846C1M05p23Q4Q66n26m43Q82k76m86O5Q55r63P8L55k76k74O51J67j003P01L15
$$ 31 436 -287 -203 663 137 -306 576 300 -186 -121 734 -229 -151 204 -72 -346 305 472 -531 170 485
4867D85o40k4M69k59l39N31K00r31P20M49p70o2P10l51n63O30K00r06K26R46j159
$$ 485 -155 -179 290 31 -308 223 423 -508 212 661 -109 -171 539 188 -375 255 455 -451 -225 721 -438
4888d38M35N42n06k83N20K00m81J70M56p39l43P80q2n64N95k12m28J34N89o04
$$ -438 -3 539 33 -250 270 470 -11 159 615 -124 -467 313 231 -333 262 50 -378 -244 345 -259
4908b59R7M64l34m57O30l3m49K77P80r97k19J022j19r89O07N07r46K2O75n47k95
$$ -259 -162 302 -32 -489 141 108 -341 -64 716 -281 -500 522 403 -586 21 528 -418 -396 279 -268 -563
4929e63R47k72m24N13K60p72L62M20n56k45O62J35r68M36M66q39J55N63n02l64
$$ -563 384 112 -312 201 461 -311 51 471 -85 -330 332 467 -501 -65 401 -438 -283 280 -222 -586
4949e86N22O1o87N52N26p75K16O14o84j59O39J40j068P51O32j005p2Q86n68j56
$$ -586 -64 -3 -690 -138 388 -387 -171 443 -241 -400 239 379 -689 62 694 -311 -383 503 -65 -221
4969b21L95j10n99O59J24o03K04L83j42p50P95J06p05M74L35n99r1Q43j95o90
$$ -221 174 64 -535 124 248 -355 -151 232 90 -660 135 241 -464 10 345 -254 -345 498 303 -387
4989c87J014R9j004M62J81j86l06N66l77l05L29M89q34J32N20l56l08P59m68m17
$$ -387 627 726 -278 184 365 179 -127 439 62 -243 86 575 -259 -127 393 37 -271 488 20 -397
5009c97O25J00o05j34P75m83j88N43r1m89L44N61n07r9O16p20p8M16n6m49K21
$$ -397 228 328 -277 -411 364 -119 -307 236 145 -344 0 561 54 -45 571 -149 -227 189 133 -316 -95
5030i5M30l76l32L10K9m84N85L73q34N51L93r72J70O63m08m23O99K6o67M77J04
$$ -95 335 -41 -373 -63 -34 -518 67 440 -394 157 550 -422 -252 411 3 -420 279 305 -362 115 219
5051B19n88NP47k33k66L00j08m16L65J19n10lP18l43m17O29K02p59J74M53q17
$$ 219 -369 -364 383 150 -116 184 76 -340 25 144 -366 -369 349 6 -411 218 420 -339 -165 288 -529
5072e29LP18l24l64K94M04o63N17L70n12m38P95k49m60N34p0n71P09L03n05k57
$$ -529 -526 192 -132 -496 -202 202 -461 56 426 -86 -524 271 22 -438 96 26 -545 164 467 -38 -295
5093b95P87n95j88N36K08o54J26Q8l4NL06J3p01P14k23n0l06P22n39n0N60l87
$$ -295 492 -103 -291 245 453 -201 -75 13 -21 -16 290 303 -398 316 93 43 -263 459 -80 -130 430 43
5115D3l32L91K44k93m22Q84m65q9O23n36m74P48R3p40K14L99om84L52K67o70L03
$$ 43 -289 102 346 53 -369 515 50 -39 584 48 -426 322 415 -325 -111 288 282 -202 150 417 -253 50
5137E0O75r09k2O22n36k34M65J20n87J28M26l77J24K14L0n22L65K69o16J53M11
$$ 50 725 -184 -206 416 -120 -354 111 231 -356 -228 198 -179 -55 159 189 -333 32 301 -315 -162 249
5158B49l41m49R06q6m21K78J28m72K03M35n71M2J76J13m56L21L44q76M62K63m21
$$ 249 -92 -541 365 279 -142 136 264 -208 -5 430 -141 -99 77 190 -266 55 399 -477 -15 248 -173
5179a73l76Q69n6n92O44l5n76J08N87m31m47P75m23l34M01L77p79Q2N49k57K8
$$ -173 -549 320 264 -328 316 281 -295 -187 400 -31 -478 297 -126 -460 -59 318 -461 -379 170 -87 -59
5200e9O06m68m70R6N45m51k01P51m87O7N17k46o18M39N19r06K55O12o49j70P26
$$ -59 547 79 -391 -295 250 -201 -402 349 -138 -71 446 200 -418 21 540 -366 -111 501 -148 -318 408
5221D08n05j51K44O45p49L0L03k25l05M96J67o43L22Q9k53M5N18n58m21J163k67
$$ 408 -97 -248 -4 641 -108 -78 225 0 -305 191 358 -285 37 126 -127 -82 436 -122 -543 620 353
5242C53m37J5N89o37K20L40j56o43L03J77k36J31K72n04K00L24m09j29M35Q3o13
$$ 353 -84 -69 520 -117 103 443 287 -356 -53 124 -112 19 291 -213 -13 311 -98 -227 208 291 -322
5263c22J76M71j79l46K42R8o19M50M02n63M18k8j39n10P54k08m28N16j21l34J86
$$ -322 -146 325 146 -200 42 140 -479 -29 373 -190 228 200 61 -449 305 97 -331 185 64 -270 -84
5284h4N66m45j00L99l28k99L82L33p91J39Q55p57q5L54k09m53O08J5j79q3J63
$$ -84 482 37 -63 336 8 -291 91 424 -367 -228 627 -130 -215 139 -70 -523 85 100 -79 -162 1
5305Am9n69P95J00o36O07N3m04q4L61j7o71O96L6k99pL01l95k20N08qm23M01K30
$$ 1 -48 -617 178 278 -358 249 302 -102 -186 175 158 -513 183 219 -80 -87 214 -181 -401 107 99 -324 77 307
5329C07p47L24K04n33J35M57j48l55N76J15n56J85M03m97K7M14l56j50M85J00
$$ 307 -440 -116 88 -445 -310 147 -1 -356 220 335 -221 -36 367 -130 -103 311 -45 -195 290 390
5349C90k09m29M73o60J95O98l16n67N93P5k39l17L90l25k09O95K95p16K02L97
$$ 390 181 -248 225 -435 -240 458 142 -425 168 243 4 -313 77 -248 -457 238 533 -183 19 416
5369D16p41J42L84l06O5L12j09m97M76Mm52L05J00J5m3J97j02l75L98K50n04j37
$$ 416 -325 -183 201 -105 -40 272 163 -334 142 146 -306 -1 99 114 71 268 166 -209 189 439 -65 -202
5391b02N68m30R8L54l71m57N72J83n27K28L54j43l38M01M4o54M84K63p08M92L33
$$ -202 366 -64 34 388 17 -440 132 315 -212 16 370 227 -111 290 334 -320 164 427 -281 211 544
5412E44m04n47M20K88n83K18K82l96K77j60R3m51N43Q6k62j08M65m21R9J21l8
$$ 544 140 -407 13 301 -282 -64 218 -178 99 -61 32 -419 124 210 -52 -160 305 -116 -17 104 66
5433F6m13N93K7n03M69k67O6j70N52o00nL73j35k01K2K95j53j64L39j55k62J11
$$ 66 -347 246 273 -230 239 -28 38 -132 420 -180 -185 188 53 -148 -126 169 16 -148 191 36 -226 -115
5455a15N01o59L19J32k34k73O63m09m27L69M83n54k32M47jk15M14l25r7K46M13
$$ -115 386 -273 46 178 -56 -329 334 -75 -502 -133 350 -204 -436 11 10 -205 209 -116 -213 33 446
5476D46p44K48J81R1k29K70j37n58M49J05k51j00N51j80o09P45k1l14j1K91j88
$$ 446 -298 -50 131 222 -7 263 126 -432 17 122 -129 -229 322 142 -467 278 257 -57 -68 223 35
5497C5j93O87n46O2J99K33o40J85L12m57J1M01l64q2N14k52k46k0L66k97p5L88
$$ 35 -158 529 -17 45 244 477 -163 22 334 -123 -112 289 -75 -157 357 105 -141 -161 205 -92 -167 221
5519B21l49K84j80N56p73N9O74o58L26P1j19l82K30L09n00O5K29j10m36P00l5
$$ 221 -128 156 -24 532 -241 -182 492 -166 160 231 112 -270 -40 269 -231 -166 63 -47 -483 217 182
5540A82n73L03M41o94M51K66n14J08R8j48j79L70j94oN7M43n29j43M07J05l99
$$ 182 -391 -88 353 -341 110 376 -138 -30 68 -80 -259 111 -83 -89 -32 411 -118 -261 146 251 -148
5561a48M9M20m79j72P92q08J1L27J02l02K04j7l26J62M30l18j96M58K0p59L58
$$ -148 -99 321 -158 -330 462 -346 -335 -8 94 -208 -4 -21 -347 -185 245 -73 -269 189 209 -550 -192
5582a92L99k90j35J77nJ2K35q5k13P9L17l87j12N28l19l13K14L50l55o4L98m92
$$ -192 207 -83 -218 -41 -46 -34 201 116 -97 -18 299 -88 -200 328 9 -304 -90 260 -95 -159 239 -253
5604b53j75M83q7j24J95R3m85M74L54o49m2L93m26P8L22K39n90J27M40m57k46
$$ -253 -428 55 -32 -156 39 132 -353 121 475 -174 -216 177 -249 -171 151 390 -200 -73 367 -90 -336
5625c36M10K65r35N72K41m46K11Lk96P5N35j73l80K56L65n16K8K34Q0j63K47R5
$$ -336 74 339 -596 -24 217 -229 -18 -15 -311 -236 299 126 -254 2 367 -149 -121 113 193 30 277 372
5647C72o28O31k93O1j32K10l09k16K65j54L0J07K87o04M04L18m59P3r3K46l23
$$ 372 -256 375 82 143 11 221 -88 -304 -39 -193 -163 -56 231 -373 31 349 -110 -37 -130 116 -207
5668b07R2J92M9l14M77l54j44L89Q4m34O7K17m66J43L84m25J29%n6r8K88J3j10
$$ -207 -115 77 126 -188 289 -65 -209 180 264 -170 -103 114 -352 -209 175 -250 -121 -121 -177 -275 13 26 -84
5691h4k35M99j56m48N56R3l94J14L23m94rK09l01K71O3L96n72j85L25J12k02L18
$$ -84 -319 180 24 -424 132 225 -169 -55 268 -226 -235 -26 -327 -56 7 403 -169 -354 -29 83 -119 199
5713A99n3k86L89j96l67L53M41n71K10j26K25m27j3K09m8p2K76l0j75L7J49l66
$$ 199 146 -140 249 53 -314 39 480 -91 119 -7 218 -209 -222 -13 -61 -133 143 113 -62 -25 124 -242
5735b42J81M09p28J54L65m7j29J11J4j16k34L44p5nK48m47P1k8K30m62L59N89
$$ -242 -61 348 -380 -226 139 92 -37 74 88 -28 -262 82 7 2 250 -197 -126 -154 76 -386 -27 562
5757E62r21K04J69p1J30N4j06m06M21J12n63L33J84J64n66K96N60j058M07K94
$$ 562 -359 -155 14 -57 73 127 21 -385 36 148 -415 -82 102 266 -300 -4 556 -502 -95 199
5777A99j61j72L44r1k32M13l37j20L20J8p9m32N91L7n68PK97o2Q8L29k65RK0j46
$$ 199 38 -134 210 119 -113 300 -37 -157 163 181 102 -330 261 298 -270 -263 34 -28 60 389 124 133 153 7
5801Gkk43L60k00k98M85nn47O77j53l95J29J92j78J64K56l85l62N63J35n07M90
$$ 7 5 -238 122 -78 -376 109 104 -443 234 81 -314 -185 7 -171 -7 249 -136 -498 65 200 -307 183
5823A83rj42j94L04q6l20L20mj71J44P9J7k50M72m31K78l20K62O2k38J56m00M34
$$ 183 174 32 -162 142 56 -264 56 52 -119 25 104 121 -129 343 -88 190 -130 132 194 -44 112 -288 146
5846A46O7l00j43J21L50m66J75q1%k10M11j60kr1J41j11K14R5k25K75J02k47m5
$$ 146 213 -87 -230 -109 241 -225 -50 -131 -131 -341 70 -90 -92 -183 -42 -153 61 156 -69 206 308 61 16
5869A6k21K23N5m46M48j61R8J13j20k21K12L33l39Q4K19m49J00R8j16J91K5j30
$$ 16 -205 18 73 -373 75 -86 12 125 5 -216 -4 329 -10 74 293 -156 -56 42 -74 117 142 12
5891A2k81M03J10j53j66L65k16j20q7K44k28Q2K45j44k76N98l01k82K31r3O0p
$$ 12 -269 134 244 91 -75 290 74 -46 -133 111 -117 -35 210 66 -210 388 87 -195 36 -57 3 -4
5913dJ72l14P0J05L42l49J30O9r7j97M49l78j78N28k53m78L20J16k74K36m6l3
$$ -4 168 -146 -76 29 371 22 152 221 124 -73 376 -2 -180 348 95 -383 -63 53 -221 15 -31 -64
5935f4j72L18m1o6j34J03j26K56jK0j13q3K93l43K10l4j36J95kk10r1K15k46J87
$$ -64 -236 82 41 -25 -159 -56 -182 74 73 93 -20 -103 190 -153 57 23 -113 82 80 -130 -221 -6 -252 -65
5959f5k45L49O8m24M66j58j70L63n4n06M46J74l67j7J48k75L60N8k98p3j4L09
$$ -65 -310 39 107 -317 149 -9 -179 184 130 -376 70 244 -123 -140 8 -267 93 151 -147 -220 -234 75
5981G5k20O1J5j90L65lL21n82j23O77m36Q2m1j13K49l74M48J3l45J42j64M1K41
$$ 75 -145 -84 -69 -259 106 103 424 -158 -281 396 -40 42 1 -112 137 -237 211 224 -121 21 -143 -102 139
6004A39k40K6o5K91l76M51r5M9l39K98k45J41J06k11n6K31J0j58k90L48j22J62
$$ 139 -101 -75 -140 151 -225 226 131 180 -159 139 -106 35 141 -70 -126 105 115 -43 -333 15 -107 55
6026E5jL11k11k48M08l40j5J47K25m81J56L73m50j96R51q69n9J6N07m47K61j92
$$ 55 54 365 154 -94 314 -26 -41 106 331 -150 6 379 -71 -267 684 -185 -244 -228 279 -168 93 -99
6048i9Rm9J38J82m64L98J95k14l07L44l22N2L82l12m3R7Q3q6mK7Q7k30M88j26
$$ -99 -90 -139 -1 181 -283 115 310 96 -211 133 -189 -137 245 -67 -110 -13 70 -16 -20 7 94 -136 352 226
6072B26n12K02L15m76L75L3Kr2k8k4PN6L2j48k49L72O2j93J83k4k28R2M3M5k21
$$ 226 -286 -84 231 -245 130 163 165 73 45 21 28 84 116 -32 -281 91 153 -40 143 119 -109 -17 26 71 -150
6097a50Q6j45j80M63j92k83M16M18o59L27K29l85l7J5K68o04L01J00j30j59K88
$$ -150 -64 -209 -389 74 -118 -401 15 433 -226 101 330 -55 -92 -77 191 -413 -112 -12 -142 -301 -13
6118a3j27j40M59K19k99J5J21l95L6J22m5l02L78J83k84N5MP1k17M41m46O7L74
$$ -13 -140 -280 179 398 99 114 235 -160 -124 -2 -47 -349 29 212 -72 -17 -13 58 -159 282 -164 -97 277
6141B77l80n5p3M87k68J66LJl48J78M5j16K35k85N7j8K89k46l11M32n3n0Q1p6
$$ 277 -103 -158 -231 256 -12 154 157 158 -190 -12 33 -83 152 -133 -76 -94 195 -51 -362 70 17 -33 48 -28
6165b8m1k3J88j15k39N2N98p56K94M18j67k54N6K58k73MM11m6p67O20k72l51M80
$$ -28 -69 -92 96 -19 -258 -206 392 -364 -70 348 181 -73 -17 241 -32 -28 383 337 -430 190 -82 -433 47
6188D7K02m74j4K61q1J13J20k77j12L52j83l07L71J59m14J93Q1p3J04p8N3k52
$$ 47 249 -225 -239 22 -59 54 174 -103 -215 137 -46 -353 18 177 -237 -44 37 -36 68 -10 43 -209
6210b09M63k87k12K94L0J05q7k04L74j34k19J16P3Q2p8j94l1K29O9R4k40k84K48
$$ -209 254 -33 -245 49 79 184 97 -107 267 133 -86 30 103 185 107 -87 -118 111 180 274 34 -250 -2
6233bj21K75l69J59j5J07p5Qj89K45k47M76n05KJ78M4m14K08K08K97o06M7K74
$$ -2 -123 152 -217 -58 -73 34 -41 -33 -222 23 -224 252 -253 -251 -73 -29 -443 -235 -27 270 -336 -289 -15
6256a5M4K84l02N3l12N37n08mK78j46j26M16p4j19J38L8m75K17n6K41J23m63L13
$$ -15 29 313 11 64 -248 289 -219 -223 55 -91 -217 199 125 6 144 182 -293 -76 -132 109 232 -231 82
6279H2l54M43l4M6k41j79M74n05K84R8k46k2K1K51r9MK42l23k5J02l6o0L75n19
$$ 82 -272 171 137 183 -58 -237 237 -268 16 114 -132 -154 -133 118 19 23 265 -58 -83 19 -17 -77 298 -221
6303b21J58J56J23j98j10J65j25k9j19L66l79L3L51k01K95R6l64k34M58k10j87
$$ -221 -63 93 216 18 -92 73 -52 -81 -200 166 -213 -180 171 -30 265 361 -3 -237 221 11 -176
6324a76qJ32j78j15K01n1k36N92j91j61J67J1j65l5K42k9j25K46Pj20j28RK71
$$ -176 -184 -52 -230 -345 -144 -195 -431 161 -30 -191 -24 -13 -178 -213 29 0 -125 121 128 8 -120 -111 160
6347A60j67q5K97q0J71n48K89l42K64K2jK00k58M5O6o7qK4Nj71K0K44k16K07j
$$ 160 -7 -92 205 125 296 -252 37 -305 -41 -19 -20 180 -78 -33 33 -34 -42 -18 -13 -184 -164 80 -136 71 70
6372G0j9j75J55q1j7j06K01k17J07J66R6k04QM34m66J83j62N3j33j8N2m7K4J83
$$ 70 51 -124 31 -50 -67 -173 28 -189 -82 84 180 -24 -16 418 -48 135 -27 26 -107 -125 -73 -120 -96 87
6396H7l18K33N6N1J9K27j69l60M42l31L74k87J78j01k56K25J52m12J08M33k76
$$ 87 -231 2 58 109 128 355 186 -174 268 -63 311 24 202 101 -155 70 222 -190 -82 351 75
6417G5k39K02K07m06L31j34q0J49j40jMN6j50J15J7k51K15l31L63R2j52J13j16
$$ 75 -164 38 245 -161 170 36 -44 105 -35 -36 -32 24 -126 -11 6 -245 -30 -361 2 94 -58 55 -61
6440f1j15P3mj1m06O90j80N5o1O0j83j7J16j78J30J71l2j60k7K1L12j50j4J67
$$ -61 -176 -103 -107 -118 -524 166 -14 41 -20 40 -143 -160 -44 -222 -92 79 47 -113 -140 -119 193 43 29 196
6464A96m62K74J08l08K66J51l46O0n2L0J63K4k12J08p0k4l9M17l04j53L28Ll55
$$ 196 -266 8 116 -192 74 225 -121 -61 -113 -83 80 104 -108 0 -70 -94 -133 284 -20 -173 155 158 -197
6487a97j60M14k32J33J7k41M04j79j21J53k04K37K50m73m9L32l96M22K14k92k57
$$ -197 -357 57 -175 -42 -25 -266 138 -41 -162 -9 -213 24 274 -199 -248 84 -312 110 324 32 -225
6508b25K1J78P6J73j29L41n20J12j82K63J64j28m22ML07J25l40K59l65L18Oj41
$$ -225 -204 -26 50 223 94 435 -85 27 -155 108 272 144 -278 -274 33 158 -182 77 -288 30 36 -105
6530a05K57k80J16L4j43O5J01j1j67J48J32j69J82k20J06n8L6q0j1K43j38r5K00
$$ -105 152 -128 -12 22 -121 -56 45 34 -133 15 147 -22 160 -60 46 -12 24 -56 -67 176 38 -57 143
6553A43n1j01J50j16j2k7K01l65J03n4R3N5l4J72l62J06J98j14p6L02l11q0J96
$$ 143 92 -9 141 25 13 -14 187 -178 -75 -129 -36 19 -15 157 -205 -99 99 -15 -91 211 -100 -180 16
6576A6J9J0J05j95j01kl4K15j81K42n2j80K54lr2j30J00%J06l77K26J72k35J13
$$ 16 35 45 150 -45 -146 -148 -182 33 -148 94 42 -138 116 113 21 -109 -9 -9 97 -280 -54 118 -117 -4
6600dJ39l47M25l26L40k12j14j84K61J32o6l1n6J32j94M4K01kj13J48j94J74k26
$$ -4 135 -212 213 -113 227 15 -99 -283 -22 110 44 13 -43 89 -105 -61 140 138 25 173 -21 153 -73
6623g3R2l79O46j2k83j75K27J10j15M44o93%K05L47p00K04J85R7n22M87P3k01
$$ -73 19 -360 286 274 -9 -184 43 153 38 482 -211 -211 -6 341 -359 -155 30 127 -395 92 165 -36
6645c6N0k84K23j76M09l04K35qK0k18J91k88L32p3Q0j7j07j42J9O6J62o9J2n2
$$ -36 14 -270 -47 -223 186 -118 117 109 129 -89 102 -186 146 73 153 136 29 -113 -94 -28 134 65 77 25
6669B5j01L50m44K25N5j94J06k26L84jj38Q0j83Mnj78O8J60O4J32j68K8J76j69
$$ 25 -76 274 -170 55 110 -84 22 -204 180 179 41 121 -62 -58 -63 -241 -173 -13 51 183 15 43 219 50
6693E0j15J16J3J0k18K75l97M41j75j20J55K98l68R1j25K03j84k9KK3K03j90j18
$$ 50 -65 51 64 74 -144 131 -266 175 0 -120 35 333 -35 56 -69 134 -50 -79 -77 -54 149 -41 -159
6716a59kL87m19N2K17l22K43n2R4j19j98O5O8M64k64k67L07K4j59L1p8J0j15p9
$$ -159 -161 226 -193 -141 76 -246 -3 -55 39 -80 -278 -213 -145 319 55 -212 95 119 -40 -9 -87 -77 -192 -271
6740b71K59J02k70N97m63r3J12O6l72J03L84n2j04J16j05M3j25J62J39j11k5K39
$$ -271 -12 90 -180 417 -46 -139 -27 39 -333 -230 154 102 -2 114 9 52 -73 89 228 117 92 331
6762C31l67j21M04j39k00o6M33j58J63j62j72P4J86j40K22k68o8M0K44k17L2K00
$$ 331 -36 -157 247 108 -92 -158 275 117 280 118 -54 20 206 66 288 20 -48 -8 236 19 51 251
6784B51k26K5j9j27L9K30k10J63k2K4j62j13j5K27j37P2M2M51l43k44N9o4L21
$$ 251 25 50 31 -96 -57 173 -37 126 104 128 -34 -147 -162 65 -72 0 42 493 150 -94 -35 -99 222
6807B22j05m0k58J23K58j14k9J00k53K81n2j7j4j96m9O4J12j29r2J07M13m57Q2
$$ 222 117 77 -181 -58 200 86 57 157 -96 185 133 116 102 -94 -143 -79 33 -96 -188 -81 332 -125 -43
6830d3K5%N9M0k11j72Q4L64l43L72l69J76J29m12L34j81K02q9n8l8J80j18J92
$$ -43 -18 -18 41 81 -130 -302 -218 146 -197 175 -194 -18 111 -301 33 -148 54 -35 -93 -131 49 -69 123
6853A23k55L28j55k37M7J50r7K7J39j30k0K81k84P0K58l45k05J14K1J04K5l00
$$ 123 -132 196 41 -196 -149 1 -96 -69 70 -60 -80 201 -83 -13 245 -100 -305 -191 -170 -66 -41 -341
6875c41K30L72l47N5o9J51J60l34J99J77l87J68j75l1qK6J31j9J02J6J91l67J79
$$ -341 -111 261 -86 -31 -100 51 211 -123 76 253 -134 34 -141 -172 -180 -154 -23 -42 60 76 267 -100 79
6898G9n6k25O3mr4L08M7r4K50j83m5j28K96k52j49J36OJ37r2J24k74J16K18Q7
$$ 79 23 -202 -139 -143 -237 71 118 24 274 91 46 -82 214 -38 -187 -51 -45 92 0 124 -150 -34 184 271
6922B71m47l1K69o3K01j37k81J44j9L71k74j15J24k0j46J46m3M5M9L2l8J22q0
$$ 271 -176 -207 62 -1 200 63 -218 -74 -93 278 4 -111 13 -7 -153 -7 -50 -5 44 76 38 160 80
6945H0l13nK68k27K73k71J03k12K96o6n5K2J02N8k74K10K69k43j33L3M11m56R5
$$ 80 -233 -238 30 -197 76 -195 -92 -304 -8 -74 -129 -107 -5 53 -221 -11 258 15 -118 -85 326 -130 -35
6968c5K73k11L5M7l0P7j27p6J70q6j42p0K62Q1l05L60j1rJ60j92k10J52N3j49
$$ -35 238 27 62 109 79 156 29 -47 123 37 -105 -175 87 168 -137 223 212 203 363 171 -39 113 166 17
6992A7M4R4k75O1j2Q0r3Q4J32k39L1n1j03N39j67j19nk24L07l39M09l43m4K8J96
$$ 17 61 155 -120 -59 -71 9 -84 0 132 -107 -76 -127 -230 309 142 23 18 -206 101 -238 171 -172 -216 -188 8
7017HP6m28O9K56K82l12J79M1q7k08K98J2k96J31m5O9j37M5K3Q5m10N01k11J42
$$ 8 84 -344 -275 -19 263 -49 130 171 84 -124 174 186 -110 21 -24 45 -92 -47 -24 61 -349 152 -59 83
7041H3J17k02k8j05K07j52pK50o4l00K87p3Jk22K17P1j03J60k20J27j02k36L82
$$ 83 200 -2 -30 -135 72 -80 -87 163 99 -201 86 13 14 -208 9 80 -23 137 -83 44 -58 -294 88
7064H8J52l84j01M35j39k92M71k2j31R3m6K03k38k35K76m39J52M52k98l16J50
$$ 88 240 -144 -245 190 51 -241 230 208 77 170 124 327 89 -146 130 -309 -157 295 -3 -319 -169
7085a69J07P5J25m33M73l28K14k98L99j49M7n8j27K98k77K13Lj63l92L38J28q2
$$ -169 -62 13 138 -295 178 -150 64 -234 165 16 63 5 -122 176 -101 112 115 -48 -440 -102 26 -56
7107e6K0P8N8l28L09P2o7l24L15l70K78K23l90K42l33J76l7M6K52k3n3k91K38
$$ -56 -36 42 100 -228 81 153 86 -238 77 -293 -15 208 -182 60 -273 -97 -134 -88 164 141 88 -203 35
7130C5o5K7J38J77l92N1N13p56J18J49k84J95j07K82l25K10P4k27KR0L09k46K92
$$ 35 -30 -3 135 312 -80 -29 484 -272 -154 -5 -289 -94 -201 81 -244 -34 40 -187 -185 -95 214 -32 260
7153B60k13k66K00kK8K6q5K15k1j09j7j8j6qk15K86j65J90M8Nk4j38q7L42n3j90
$$ 260 47 -219 -19 -21 7 33 -52 163 142 33 16 -2 -18 -26 -241 45 -120 70 118 123 99 -39 -126 216 163 -27
7179b7L28n06J94n8K13j56No0K17J65l47L34j00j83m9q5K75m18L52l16L02k64
$$ -27 301 -205 -11 -69 144 -12 -7 -67 150 315 -32 302 202 19 -30 -115 160 -258 94 -222 80 -184
7201a84K42j43m1K13j93J21q5L04k77j2J27l8KR0K9K37l29J75j64k0q3J78m8M1
$$ -184 58 -85 -126 87 -106 15 -70 234 -43 -55 72 34 36 126 155 392 63 238 74 54 -29 149 101 142
7225A42r7m1L17k83r6j85J25K23j13J70l12N3r4J87J83n74M16k39K53j82J28K57
$$ 142 45 4 321 38 -58 -243 -118 105 -8 162 -150 -97 -191 -4 179 -395 21 -218 35 -147 -19 238
7247B38m14L88k40J42L7N7P1j81j52o9J43q9j91M92k87K64j06R1k76l11K82p6
$$ 238 -176 212 -28 114 151 208 279 98 -54 -123 20 -69 -260 232 -55 209 103 194 -82 -393 -111 -187
7269a87l3K35j06J57k58OJ45j9M63l64J67k23J71j15j3l7J17k56M32m06N0O7r9
$$ -187 -220 15 -91 66 -192 -186 -41 -60 403 39 206 -17 154 39 26 -11 106 -150 282 -124 -74 -7 -106
7292a06L81k89j02K88K88n39J39J40l89j79O65rk72j44qM69l00r2K2l9L98l98
$$ -106 275 -14 -116 172 460 -79 60 200 -189 -368 297 288 16 -128 -136 333 33 -59 -37 -76 322 -76
7314g6K98m33J35M21l61J43j03j67K80k84o5J98K3j59L30r1k1k81J49J13j60K29
$$ -76 222 -211 -76 345 -16 127 24 -143 137 -147 -212 -14 9 -150 180 89 68 -213 -64 49 -111 118
7336A18k78K05r7Q6l5j31J03J10r5J68j71N5k3l18K38j5L2J82k57k18L17mR9k91
$$ 118 -160 45 -52 34 -1 -132 -29 81 -14 154 -17 38 15 -303 -65 -80 -48 134 -123 -341 -24 -28 71 -220
7360b20M96l43p7O3O1Q7j95J85l03M35m26J27Q6M1j14J07M2j5J41j85P7N4k90
$$ -220 276 -67 -144 -81 -20 67 -128 57 -246 189 -237 -110 -24 17 -97 10 52 37 178 -7 70 124 -166
7383a66L79m97M06j93m6N4K47m61M29j58l3J18J90j16l3j40o4J7R3q0K11n55L11
$$ -166 213 -284 122 -71 -117 -63 184 -277 152 -6 -39 79 269 153 120 -20 -84 -67 26 -54 157 -398 -87
7406h7J33k83K98O2n1r1Q1J91j67j04j36J01K4Nm1K54l9O7m95R7J06KJ24K87k37
$$ -87 46 -237 61 123 72 -19 62 253 86 -18 -154 -53 -29 -24 -65 189 150 217 -278 -181 -75 -73 51 338 101
7431A01k51J79k77l7L27j82R6r1lJ12Nk64N04k05j62J13P0P3l4J21l56L26o1J91
$$ 101 -150 29 -248 -285 42 -140 -44 -135 -138 -26 -21 -285 219 14 -148 -35 35 108 74 195 -161 165 104 295
7455B95m61J57q5o6J85q3j32L03q2j24L8J93k52R9j11J93K8l73N47m03N3j3o9
$$ 295 -166 -9 -94 -160 25 -58 -190 113 31 -93 -55 138 -114 -15 -126 67 95 -278 269 -134 -81 -94 -163
7478a63K25r7K8j56n6J23J92k7K98j24l58M26l73l9J16J90K0o32J95K53Q5k49
$$ -163 62 -35 -7 -163 -219 -96 96 69 367 243 -115 311 -62 -101 15 205 225 -407 -212 41 126 -123
7500a23J90j22Ll5K29k36r0R1r1M09j34k85O3L2J12pj07%j9K49n9k00L63r0o6
$$ -123 67 -55 -52 -87 142 -94 -184 -93 -184 225 91 -194 -131 -99 13 6 -101 -101 -120 129 70 -130 233 143 77
7525G7k68P7L36l07J62k80L37j38J77l48J93l9nj41P6L56l77L7K49k22j9l1O7
$$ 77 -191 -114 222 -85 77 -203 134 -4 173 -175 18 -21 -26 -167 -91 265 -112 -75 174 -48 -67 -98 -31
7548c1K62k79J70j57M7L58j53k55q9J18J86k27K97k79j53k36L99L11n28L39K4
$$ -31 231 -48 122 -35 12 370 217 -38 -127 -9 177 -50 247 -32 -185 -421 -22 289 -239 100 124
7569A24N9m02L41n09L23qR9n4J53l4O6J23m61K96j01J18m69J07R7K75m32J93j35
$$ 124 183 -219 122 -387 -64 -72 27 -27 126 92 158 281 -180 116 15 133 -336 -229 -132 143 -289 -96 -231
7592b31K45K9P3M3j87N9j16N7N3q8M23l55J48j25j92M40l09K44k12J59m85M00
$$ -231 14 43 116 159 -28 31 -85 -28 25 -63 360 5 153 28 -164 276 -33 211 -1 158 -327 73
7614G3j10m8Q7K68j12M2l9L36o17M3k50O0m1K38J7n8j81L08j01j3K92k56n6J13
$$ 73 -37 -85 2 270 158 200 161 497 -120 -77 -327 -267 -308 -70 -53 -111 -292 16 -85 -98 194 -62 -118 -5
7638eL59l86J73j69j52M26o2k47L9J61k27K44j62l85O09j28k44R3J98k19K33k01
$$ -5 354 -32 141 -28 -180 246 184 -63 -24 137 -90 154 -8 -393 216 88 -156 -63 135 -84 149 -52
7660e2Lj27L9J52LNJ38k07j63K95j3P4k81J17r9l3J62R5J10l52K33j73k6L49k04
$$ -52 -49 -176 -137 15 18 23 161 -46 -209 86 73 147 -134 -17 -116 -149 13 108 218 -134 99 -74 -100 249 45
7685D5L55m62k3J10k50J39J54K8j98K20k73J34j3j65K2J41L38l07j96K86k21M1
$$ 45 400 -62 -85 25 -225 -86 68 96 -102 118 -155 -21 -34 -199 -177 -36 302 -5 -201 85 -136 -95
7707i5K59J99m43K74n9n52M71K0Kj58o8R0M4L80n36K25l37L32O5K83j70j43O7
$$ -95 164 363 -80 194 135 -417 54 74 76 -82 -150 -60 -16 364 -172 53 -284 48 113 396 226 83 150
7730A50r7k65L05k02J75o8j16m2R3J38K02m87J37J10l96M60k91L40k32K67j86
$$ 150 53 -212 93 -109 66 -2 -118 -160 -67 71 273 -214 -77 33 -363 97 -194 146 -86 181 -5
7751ek3j05M05j69J2k00P4l8J80k83L17j18K45j32qk68J54p3J46K10j73l8k02
$$ -5 -28 -133 272 103 115 -85 -11 -49 131 -152 165 47 292 160 152 -116 38 -35 111 321 148 110 -92
7774i2J27J18j38n8M22k09j2k39R7j1k87K70K17k75j12J00q5L93k81L6J52j8k09
$$ -92 35 153 15 -43 379 170 158 -81 16 5 -282 -12 205 -70 -182 -82 -167 226 -55 -19 133 115 -94
7797i4q6K07k70RL56j62j7R5L9n5k46J40n6J5L45L6k13j51M87l37Ml06M81m09
$$ -94 -180 27 -243 -234 122 -40 -57 38 77 22 -224 -84 -140 -125 220 256 43 -108 379 42 46 -260 221 -188
7821a88o5M54p1k87R8N2P5p6j27j30L26R4l60K78k34K40j57J45j38L25k35p2k5
$$ -188 -253 201 130 -157 -59 -7 68 -8 -135 -265 61 155 -205 73 -161 79 -78 67 -71 254 19 -53 -78
7844g8J63j31J90j50k59M46j45j21q8J40P0K47l60k0J31q6j06K06J0k23J95j81
$$ -78 85 -46 144 -6 -265 181 36 -85 -173 -33 37 284 -76 -96 35 -51 -157 49 59 -164 31 -150
7866a50L9p5L87k30J53o6K81k86K35k99j09L77j86N9q7k5j63O9j11J88p9L9P2
$$ -150 -111 -186 201 -29 124 58 339 53 288 -11 -120 257 71 130 43 18 -145 -76 -187 1 -78 -39 33
7889C3j71J66J26P9L9p3m50J33K56o6k29J58k10K47Q9k45N7J04Q2j17l9J27k31
$$ 33 -138 28 154 233 272 199 -251 -118 138 72 -157 1 -209 38 127 -118 -61 43 125 8 -31 96 -135
7912a35J04R9j29K07q4k47J10J12j28K19k44j78L15l3J8k60N00k33m7K85m30K50
$$ -135 -31 68 -61 146 62 -185 -75 37 -91 128 -116 -294 21 -12 6 -254 246 13 -34 251 -179 71
7934G1j35J55m8k32K62k43O5J00j74J95l6J50k57LJ61j43K68j62j80Q4p0j74M86
$$ 71 -64 91 43 -189 73 -170 -105 -5 -179 16 -20 130 -127 -124 37 -106 162 0 -180 -96 -166 -340 146
7957A46o4K6j73nQ5L17n91K81k23O9J74k53N8J08K20j08K10J29l85k1J1k00J67
$$ 146 82 108 -65 -70 15 332 -259 22 -201 -132 42 -211 -153 -45 175 67 277 406 21 0 11 -189 -22
7980b2m70M70m9J68k34J41L08m05J29J0k36L94j80k28M33j91Q9j35L46n54K53
$$ -22 -492 -22 -71 97 -137 4 312 -93 36 46 -190 204 24 -204 229 38 127 -8 338 -216 37
8001C7k53L24k67K24p9K2j68J23L49k56j00K59j80k06n9K22P9m8P8j59J64R7k03
$$ 37 -216 108 -159 65 -14 8 -160 -37 312 56 -44 215 35 -171 -230 -8 71 23 101 -58 106 203 0
8024@l40K79J46K30o3l25k01L48j29j20j08L91k39K83m04L28K9k66J53j77R9j
$$ 0 -340 -61 85 315 252 -73 -274 74 -55 -175 -283 108 -131 152 -252 76 105 -161 -8 -185 -86 -87
8046h7j52M63J08op4m86L81K1l63L69r8j19P1k6J06m51M12K2k89L13j77P4j14
$$ -87 -239 224 332 326 252 -234 147 168 -195 174 76 -43 28 2 108 -343 69 91 -198 115 -62 12 -102
8069a02L45m39K67r1J64r3j60L2KN1j35K78j03P7q7L13l23m5n1j22K79J7j7j73
$$ -102 243 -196 71 -20 144 51 -109 -77 -75 -24 -159 119 16 93 6 319 -4 -49 -100 -222 57 74 57 -116
8093a16P7m6J14m7j07J46J85j74k68L15k20j73M32k91L30R8k22J39o4j65J37l23
$$ -116 -39 -85 29 -18 -125 21 206 32 -236 79 -141 -314 118 -173 157 255 33 172 108 -57 80 -243
8115b43J57J07P6k70J45j5k24L12j14K2Q2M3p9J01k08j1j90K80L47l82L93m32
$$ -243 -86 21 97 -173 -28 -43 -267 45 -69 -47 35 78 -1 100 -108 -119 -309 -29 318 -64 329 -103
8137a03K38n2o6n1K34n1j6k87J65J51m66L78R4J44l84M8J49m4j5J6K26n02K94
$$ -103 135 83 17 -34 200 149 133 -154 11 162 -304 74 168 312 -72 -24 125 81 66 82 308 -194 100
8160A00o4k58M38l65l8J27l6K69m14J72L9K5J70JO5j31j76J4K0J42m03N52j59
$$ 100 36 -222 216 -149 -187 -60 -96 173 -241 -69 -30 -5 165 166 231 100 -76 -62 -42 100 -303 249 90
8183I0r0k2n7M91n30j46K40K05
$$ 90 0 -22 -79 412 -118 -264 -24 181
8191A81
$$ Imaginary data points
##PAGE= N=2
##DATA TABLE= (X++(I..I)), XYDATA
0@%%%%%%%jRj6J6j6K4l2L5m3N4o2P2q8J04j20J37j59J84k11K42k75L11l51L96
$$ 0 0 0 0 0 0 0 0 -1 8 -8 8 -8 16 -16 19 -24 30 -32 40 -48 56 -64 73 -86 98 -113 129 -146 165 -186 210
31B10m47N02n61O25o97P76q62R58j063J179j305J443j598J770j961K178k424K705
$$ 210 -237 265 -296 329 -368 408 -454 504 -559 620 -685 758 -840 930 -1031 1147 -1277 1428
49A428l031L414l873M429n126O028p243Q985j1707J6590k8039J02665P7527j63103
$$ 1428 -1603 1811 -2062 2367 -2759 3269 -3974 5011 -6696 9894 -18145 84520 162047 -1056
63a056j0902L2119J2728J7370J5101p4296j313Q9647L492q2283N190K2424k2331
$$ -1056 -11958 20161 32889 50259 65360 -8936 -10249 79398 82890 607 5797 28221 5890
76E890J9062L0347n8952j8079O8376n989o8248K8403L7849m1525n806L6209l2026
$$ 5890 24952 55299 -3653 -21732 46644 40655 -27593 810 38659 -2866 -8672 27537 -4489
89d489j7567M9913j3469n7474L7684M3916m3358j3072L1733k8603j1484N8346
$$ -4489 -22056 27857 14388 -43086 -5402 38514 -4844 -17916 13817 -14786 -26270 32076
101C2076j3378p3405K5941N9308k2145j0562K1147m0463k4193N9314Q256n5096
$$ 32076 18698 -54707 -28766 30542 8397 -2165 18982 -21481 -45674 13640 21896 -33200
113c3200J9506L7568l4165l592L6775l6429l4983N5299J6156n2241J4442L8011
$$ -33200 -13694 23874 -10291 -13883 22892 -13537 -48520 6779 22935 -29306 -14864 23147
125B3147l8208j3400M3282j8360l3534L9380J1540m2371J8410L1031m4825j0259
$$ 23147 -15061 -28461 14821 -3539 -37073 2307 13847 -28524 -10114 20917 -23908 -34167
137c4167N3538j4176l9562L6475J2787m7108J5886M1559l5756j8263M3696j2923
$$ -34167 19371 5195 -34367 2108 14895 -32213 -16327 25232 -10524 -28787 14909 1986
149A986l6795L9574K1521m5059L040L1195l1574o668N1709j6054m8262L5679K8953
$$ 1986 -34809 4765 26286 -18773 -15733 15462 -16112 -22780 28929 12875 -35387 292 29245
162B9245m2011m60L3127k7802j3363M6742p677m3158K9230K4492m1154J232L6227
$$ 29245 -12766 -13226 19901 -7901 -21264 25478 17801 -25357 3873 28365 -12789 -11557 24670
175B4670k5640j6430M4477o683m4692K8011K7938m1497j326M2530k1911k7330
$$ 24670 -970 -17400 27077 20394 -24298 3713 31651 -9846 -11172 31358 9447 -17883
187a7883L5155J023l3720K7372K2915m5427m930M2960j5581k3132L5015m114m3541
$$ -17883 17272 18295 -15425 11947 34862 -10565 -15495 27465 11884 -11248 23767 19653 -23888
200b3888K6771L5087l9623j2433L9097j4362k5990L3931L367m0042J9053L0053
$$ -23888 2883 37970 -1653 -14086 25011 10649 -15341 18590 21957 -18085 968 31021
212C1021l6988r362M1894j3426l0486L0611N096l9480K0146L3787l8418j4787
$$ 31021 -5967 -15329 26565 13139 -17347 13264 18360 -21120 -974 32813 -5605 -20392
224b0392M3266q299l5517K4957J2467l1489J6093K5737m0548j2656M9996n114
$$ -20392 22874 14575 -20942 4015 16482 -15007 1086 26823 -13725 -26381 23615 18501
236A8501l9694J9685J2105l0663J7496L2309l8910k1227M4577L13l6645J9431
$$ 18501 -21193 -1508 10597 -20066 -2570 29739 -9171 -30398 14179 14492 -22153 -2722
248b722J6323l1027R011K9375l1466j5846M2090l796l9212K1724K1013l1296N621
$$ -2722 13601 -17426 -8415 20960 -10506 -26352 15738 11942 -27270 -5546 15467 -15829 -10208
261a0208L1838k9349k1790L9863K591l6375J8428K1679l0018J121K9791k5084
$$ -10208 21630 -7719 -29509 10354 12945 -23430 -5002 16677 -13341 -12220 17571 -7513
273g513j9025L9667K697l8993J5147K3959k8089J744L2215k6516k6576L8791J1984
$$ -7513 -26538 13129 15826 -23167 -8020 15939 -12150 -10406 21809 -4707 -31283 7508 19492
286A9492l5608J0019K0717k8077l18L4073k0469k5419L5215Q198l7562J2946K6548
$$ 19492 -16116 -6097 14620 -13457 -13775 20298 -171 -25590 9625 17823 -19739 -6793 19755
299A9755k8463n869L3747j6882k7324L4161J2653l6373Q184K5145k5824o985L4854
$$ 19755 -8708 -14577 19170 2288 -25036 9125 21778 -14595 -6411 18734 -7090 -14075 20779
312B0779j2534k7891K9558J0727l5967J0362K9053k6904j0975L4812r232l1243
$$ 20779 8245 -19646 9912 20639 -15328 -4966 24087 -2817 -13792 21020 11788 -19455
324a9455K7058J6506l2905L793K5247k3437q574L6326r132l3903K2408J7073k9749
$$ -19455 7603 24109 -8796 -5003 20244 -3193 -11767 24559 15427 -18476 3932 21005 -8744
337h744N255K7633k4995j4222L5077m823l3234K1456J9557l0895j85K7431j8419
$$ -8744 -3489 24144 -851 -15073 20004 15181 -18053 3403 22960 -7935 -8120 19311 892
350H92j3908L1346n796l3333K1045K0514k9901k83K9341j9094j8826L0485k99
$$ 892 -13016 18330 12534 -20799 246 20760 -9141 -9424 19917 823 -18003 12482 12183
363A2183l2028J8399K1947k9618m856K9087j4772j7535K8427n61l3235J6793K4350
$$ 12183 -19845 -1446 20501 -9117 -13973 15114 342 -17193 11234 10673 -22562 -5769 18581
376A8581k6668n077K8368j7081k1687L0825O542l2878J1668K3637k5820o642K8916
$$ 18581 -8087 -13164 15204 -1877 -23564 7261 13803 -19075 -7407 16230 -9590 -16232 12684
389A2684j1655k1920K5884N080l1369J3776K6294k6801j0906K9815r090k3751
$$ 12684 1029 -20891 4993 10073 -21296 -7520 18774 -8027 -18933 10882 1792 -21959
401b1959K5699Q138l0952J0547K6022k5397j3391L0602m097k3216J9957Q072k9169
$$ -21959 3740 11878 -19074 -8527 17495 -7902 -21293 9309 5212 -18004 1953 10025 -19144
414a9144J1818K7199k5706j5408L0293k676k4528K0922J1813k9224M789K6624
$$ -19144 -7326 19873 -5833 -21241 9052 6376 -18152 2770 14583 -14641 -9852 16772
426A6772k0899j3981L0154j533k6967J7013J4257k5606M906K5470k1714j6143
$$ 16772 -4127 -18108 12046 10513 -16454 559 14816 -10790 -5884 19586 -2128 -18271
438a8271L0908J337k7745J5578J5678k6078J300K7120j7850j7180K8174K650k7237
$$ -18271 12637 13974 -13771 1807 17485 -8593 -7293 19827 1977 -15203 12971 15621 -11616
451a1616J2896J5460k4161K321K7795j9121k0798K8178O370k6893J0854J6194
$$ -11616 1280 16740 -7421 -5100 22695 3574 -17224 10954 17324 -9569 1285 17479
463A7479k5327j270K9511j3679k1768K4160N817k6879J0848J8182k3156k864K7543
$$ 17479 -7848 -9118 20393 6714 -15054 9106 14923 -11956 -1108 17074 -6082 -8946 18597
476A8597j4425k2303K6204Q575k8405P161K0255k1371n978K7399j0220k3038K2133
$$ 18597 4172 -18131 8073 16648 -11757 -4596 15659 -5712 -11690 15709 5489 -17549 4584
489D584R203k6808P120K0891k0677o987K6354r640k3905K2276J2414k6814L668
$$ 4584 13787 -13021 -5901 14990 -5687 -12674 13680 4040 -19865 2411 14825 -11989 -8321
502h321K1212j9385q824K7988o155k6102J7575J3112k2861M269K0873k0285j0759
$$ -8321 12891 -6494 -15318 12670 6515 -19587 -2012 11100 -11761 -7492 13381 -6904 -17663
515a7663K7473m120k5706J7706J5104k4176K4K2074j6286j1322K5621k561k5890
$$ -17663 9810 5690 -20016 -2310 12794 -11382 -11358 10716 -5570 -16892 8729 6168 -19722
528a9722J4666J6563k1816k44K1242j5857j2994K5605n43k5806J5018J7517k3253
$$ -19722 -5056 11507 -10309 -10553 10689 -5168 -18162 7443 6900 -18906 -3888 13629 -9624
541i624l138K3320j2437j4692K4056J207k5584J1954J8808k0293l611K2025j3001
$$ -9624 -12762 10558 -1879 -16571 7485 8692 -16892 -4938 13870 -6423 -10034 11991 -1010
554a010j5850K4859M319k6382J0048J9263k0865n107K3904r801j7660K2210N120
$$ -1010 -16860 7999 12318 -14064 -4016 15247 -5618 -10725 13179 3378 -14282 7928 13048
567A3048k5651Q814K0368j8650o789K2053r710j6882K2314O943k7112P042K1758
$$ 13048 -12603 -3789 16579 -2071 -8860 13193 3483 -13399 8915 15858 -11254 -4212 17546
580A7546j8397q743K2553n372j9285J9050P412k4602N927K1772j7096j0451K1674
$$ 17546 -851 -9594 12959 7587 -11698 7352 14764 -9838 -3911 17861 765 -9686 11988
593A1988n066j7972J8415Q841k5707L797K2604j5499j1857K2047k571k0782J5117
$$ 11988 6922 -11050 7365 16206 -9501 -5704 16900 1401 -10456 11591 9020 -11762 3355
606C355J0788k2004K308K1230j5034j3020K1508r69k0311J4247J1591k3037M33
$$ 3355 14143 -7861 -5553 15677 643 -12377 9131 8162 -12149 2098 13689 -9348 -8915
619h915K2839j3324j4176K0443N06k1213J2095J3472k0963q33K2254j2493j5608
$$ -8915 13924 600 -13576 6867 7373 -13840 -1745 11727 -9236 -10069 12185 -308 -15916
632a5916K0256K475k0822J1541J3654k1912k310K4252j0219j7264J8598M810k1376
$$ -15916 4340 6815 -14007 -2466 11188 -10724 -13034 11218 999 -16265 2333 7143 -14233
645a4233R848J5279j9404l427K1870r848j6762J8703O113k1230Q432J5448j9307
$$ -14233 -4385 10894 -8510 -11937 9933 85 -16677 2026 8139 -13091 -4659 10789 -8518
658h518m689K3655p620j9310J7487P710k0740O007J7086j7159o807K1523n867
$$ -8518 -13207 10448 2828 -16482 1005 8715 -12025 -6018 11068 -6091 -12898 8625 2758
671B758j8004J6612P993k0382N131J6814j6459p380K2443l927k0051J4362J0141
$$ 2758 -15246 1366 9359 -11023 -5892 10922 -5537 -12917 9526 5599 -14452 -90 10051
684A0051j9117L555J7455j5424q919K1258k045j9446J3648J0889j9026K126J7582
$$ 10051 -9066 -5511 11944 -3480 -12399 8859 6814 -12632 1016 11905 -7121 -4995 12587
697A2587j4060r746K1822j036k1096J1594J3159j7942O84J7449j2881j0870K0729
$$ 12587 -1473 -11219 10603 9567 -11529 65 13224 -4718 -4034 13415 534 -10336 10393
710A0393N43k0328J0975J2554j8308n09J8922j1706j2769K0261K133k1529Q852
$$ 10393 10936 -9392 1583 14137 -4171 -4680 14242 2536 -10233 10028 12161 -9368 -516
723e16J5146j7256k816J8549j0116j3512J8897L133k0792Q490J4217j7256l326
$$ -516 14630 -2626 -5442 13107 2991 -10521 8376 11509 -9283 -793 13424 -3832 -7158
736g158J9566r666j4488J8382M774k1797O737J6326j5485n140J7703p664j4873
$$ -7158 12408 2742 -11746 6636 11410 -10387 -3650 12676 -2809 -7949 9754 2090 -12783
749a2783J7575N953k1041N004J5765j4281n529J8366o961j5911J6560P407k0750
$$ -12783 4792 10745 -10296 -5292 10473 -3808 -9337 9029 2068 -13843 2717 10124 -10626
762a0626L751J6717j3036p212J6921m729j5643J5138Q237j9995K320J7062j2436
$$ -10626 -6875 9842 -3194 -10406 6515 1786 -13857 1281 9518 -10477 -8157 8905 -3531
775c531q134J7910l570j6861J3507R608j8752J052J7771j1341j0053J6526j048
$$ -3531 -11665 6245 2675 -14186 -679 8929 -9823 -8771 9000 -2341 -12394 4132 3084
788C084j6116J2212R786j8789M69J7950j0266j0491J7180o86j7355J1336J2076
$$ 3084 -13032 -820 8966 -9823 -9354 8596 -1670 -12161 5019 4333 -13022 -1686 10390
801A0390j8031j779J8298r016j1660J6464Q51j7016J0750J2027j7284k504J8331
$$ 10390 -7641 -9420 8878 -138 -11798 4666 5517 -11499 -749 11278 -6006 -8510 9821
814I821q519j1761J6027J531j7691R542J3549j6764m027J8665o907j3531J5576
$$ 9821 1302 -10459 5568 7099 -10592 -1050 12499 -4265 -8292 10373 3466 -10065 5511
827E511L701j7380P559J3336j6123l984J8301o033j3996J4555M597j7399O268
$$ 5511 9212 -8168 -609 12727 -3396 -7380 10921 4888 -9108 5447 10044 -7355 -1087
840a087J4499j4999o172J8215m401j4146J2899N741j6679N156J3765j3895o570
$$ -1087 13412 -1587 -7759 10456 6055 -8091 4808 10549 -6130 -974 12791 -1104 -7674
853g674J7897l129j5417J2017O740j6670L653J5361j2684q758J7121j476j5134
$$ -7674 10223 7094 -8323 3694 10434 -6236 -2583 12778 94 -8664 8457 6981 -8153
866h153J0260Q221j6431K156J5450j1862q860J7255j462j6370J0236Q999j5629
$$ -8153 2107 10328 -6103 -3947 11503 -359 -9219 8036 6574 -9796 440 9439 -6190
879f190R65J6001j1575r967J6655P21j6806R091R723j5219j66J5533r867j0669
$$ -6190 -5225 10776 -799 -10766 5889 6610 -10196 -1105 8618 -6601 -6767 8766 -1101 -11770
893a1770J6476R09j6614Q439J0549j4876j156J6082q893j1780J5692L101j6787
$$ -11770 4706 5615 -10999 -2560 7989 -6887 -8043 8039 -854 -12634 3058 6159 -10628
906a0628O777J1372j4078k114J6331q194j2280J5324L890j6851N623J2745j3508
$$ -10628 -3851 7521 -6557 -8671 7660 -534 -12814 2510 6400 -10451 -4828 7917 -5591
919e591l384J5986o626j2640J4107N596j6651M389J2589j1900l958J5274n615
$$ -5591 -8975 7011 385 -12255 1852 7448 -9203 -4814 7775 -4125 -8083 7191 1576
932A576j3329J3884N911j6096L311J3311j1231n389J5455m520j3565J2456P441
$$ 1576 -11753 2131 8042 -8054 -4743 8568 -2663 -8052 7403 2883 -10682 1774 9215
945I215j5916K157J3463j0135o087J5069l187j4096J1750P764j5388J285J4472
$$ 9215 -6701 -4544 8919 -1216 -7303 7766 4579 -9517 2233 9997 -5391 -4106 10366
958A0366j0120p313J5111j916j4712J0763R167j5707K40J4371q967q087J4605
$$ 10366 246 -7067 8044 6128 -8584 2179 11346 -4361 -4121 10250 1283 -6804 7801
971G801r50j4947J0179R608j5356r24J5151p776r261J4040k58j4941R160J0395
$$ 7801 6851 -8096 2083 11691 -3665 -4589 10562 2786 -6475 7565 7307 -7634 1526 11921
985A1921j4560k530J4707o521r986J3376P79j5030P858J1194j4306l088J5023
$$ 11921 -2639 -5169 9538 3017 -6969 6407 7186 -7844 14 11208 -3098 -6186 8837
998H837o353j0477J3215K243j5238N794J2212j2797m833J4886n027j1307J2510
$$ 8837 2484 -7993 5222 7465 -7773 -1979 10233 -2564 -7397 7489 2462 -8845 3665
1011C665K970j5071N487J2556j3032m882J4715m265j1894J1655M549j5125M232
$$ 3665 6635 -8436 -2949 9607 -3425 -8307 6408 2143 -9751 1904 6453 -8672 -4440
1024d440J2653j1346o171J4437k861j2286J0839N447j4838L264J3315j1001p034
$$ -4440 8213 -3133 -9304 5133 2272 -10014 825 6272 -8566 -5302 8013 -2988 -10022
1037a0022J4212j558j2743J0039O154j4458K315J3951j0039p786J3836j006j2840
$$ -10022 4190 2632 -10111 -72 6082 -8376 -6061 7890 -2149 -9935 3901 2895 -9945
1050i945R589P092j4392J396J3971r265q621J4227j8j3605Q684Q808j4364K70
$$ -9945 -356 6736 -7656 -6260 7711 -1554 -10175 4052 4034 -9571 -887 7921 -6443 -6173
1064f173J3937p916r108J3667Q18j3360P331Q676j3153j58J4166q017r774J3612
$$ -6173 7764 -152 -9260 4407 5225 -8135 -804 7872 -5281 -5439 8727 710 -9064 4548
1078D548K188j4205O706R468j2386j567J4344o942j0399J2775K819j3350N781
$$ 4548 6736 -7469 -763 8705 -3681 -5248 9096 2154 -8245 4530 7349 -6001 -220
1091b20R777j2294k244J4396n694j1552J2288L881j3591N021J0023j1118l590
$$ -220 9557 -2737 -4981 9415 3721 -7831 4457 8338 -5253 -232 9791 -1327 -4917
1104d917J3955m491j1647J0974M704j3412L826J0610j0788m238J4164l854j2168
$$ -4917 9038 4547 -7100 3874 8578 -4834 -1008 9602 -1186 -5424 8740 4886 -7282
1117g282J0230N873j3555K637J1431r998n432J3364k755j2124R777O222j3129
$$ -7282 2948 8821 -4734 -2097 9334 -664 -6096 7268 4513 -7611 2166 8388 -4741
1130d741J277J1618r139n840J3553k405j3391R668P678j3506N17J1955q410o561
$$ -4741 -3464 8154 -985 -6825 6728 4323 -9068 600 8278 -5228 -4711 7244 -1166 -7727
1144g727J2920j214j3102Q497Q164j2889k34J2222p639p459J2795j77j3940P724
$$ -7727 5193 3979 -9123 -626 7538 -5351 -5585 6637 -1002 -8461 4334 4157 -9783 -2059
1158b059R144j2547j063J2603p313p988J2591Q10j3649O786R430j1861j706J2550
$$ -2059 7085 -5462 -6525 6078 -1235 -9223 3368 4178 -9471 -2685 6745 -5116 -6822 5728
1172E728o418q553J2063J662j3561N914J0343j1495l160J2968n094r483J1613
$$ 5728 -690 -9243 2820 4482 -9079 -3165 7178 -4317 -7477 5491 397 -9086 2527
1185B527K875j3700N147J0526j0814l741J2834m442r666J0828L591j3250M249
$$ 2527 5402 -8298 -3151 7375 -3439 -7180 5654 1212 -8454 2374 5965 -7285 -3036
1198c036J1012r660m781J2145k939j0573J0595M203j2963L034J1329r284m991
$$ -3036 7976 -1684 -6465 5680 2741 -7832 2763 6966 -5997 -2963 8366 -918 -5909
1211e909J2220k904j0310R672N130j3227K705J1723q957o234J2221j324j1147
$$ -5909 6311 3407 -6903 2769 7899 -5328 -2623 9100 143 -6091 6130 4806 -6341
1224f341Q886N924j2729J094J2339q189o702J2100r23j1652Q423O409j2409O62
$$ -6341 2545 8469 -4260 -3166 9173 984 -5718 6382 5459 -6193 2230 8639 -3770 -3108
1238c108J2035p501p815J2047J10j1260P098P349j2466m75J2742p075p991J0962
$$ -3108 8927 1426 -6389 5658 5768 -5492 1606 8955 -3511 -3986 8756 1681 -6310 4652
1252D652J305j2355O834Q088j1919j383J2242n457r663J1390K049j2314N759Q601
$$ 4652 5957 -6398 436 8524 -3395 -4778 7464 2007 -7656 3734 5783 -6531 -772 7829
1266G829j1386k255J2344m995r412J0384K367j1789M694R440j0933l138J2624
$$ 7829 -3557 -5812 6532 1537 -7875 2509 4876 -6913 -2219 7221 -3712 -6850 5774
1279E774m303j0063J0114L384j1922L878R678j0506l357J2144l477j0217R398
$$ 5774 1471 -8592 1522 4906 -7016 -3138 6540 -3966 -7323 4821 1344 -8873 525
1292E25M169j1696L154J0242r922m562J2425k229j0828Q792N094j1643K166J0289
$$ 525 4694 -7002 -3848 6394 -3528 -8090 4335 2106 -8722 70 5164 -6479 -4313 5976
1306E976q575n131J2255k252j0798Q237N854j1324J500J0896q477o229J2486r20
$$ 5976 -2599 -7730 4525 2273 -8525 -288 5566 -5758 -4258 6638 -1839 -8068 4418 3498
1320C498j1194P218O647j1156N01J1505p706o301J1734m83j1386O756P232j0527
$$ 3498 -7696 -478 6169 -4987 -4486 7019 -687 -6988 4746 4263 -7123 -367 6865 -3662
1334c662k93J1115o922p135J1689R58j2127O180P931j0888o23J1191o024p281
$$ -3662 -3955 7160 238 -6897 4792 5750 -6377 -197 7734 -3154 -3777 7414 1390 -5891
1348e891J0594J319j1544N367Q127r517k316J1307m974q640J0648K234j1618M402
$$ -5891 4703 6022 -5522 -155 7972 -1545 -3861 7446 2472 -6168 4480 6714 -4904 -502
1362e02Q927r635k688J1028m214q665R831K713j1396L734R111r034l694J1268
$$ -502 8425 -1210 -3898 7130 2916 -5749 4082 6795 -4601 -867 8244 -790 -4484 6784
1376F784l682r333R534L794j1903K687R450q165m048J0716k897r672R022M432
$$ 6784 3102 -6231 3303 7097 -4806 -2119 7331 -834 -4882 5834 2937 -6735 2287 6719
1390F719j1546K108J0071q214n198J1101k332r902Q153N609j2011J536J0016p125
$$ 6719 -4827 -2719 7352 -862 -6060 5041 2709 -7193 960 6569 -5442 -3906 6110 -1015
1404a015n346J0447j710r982P674N474j1029J103J0121p025o285J0605k36j0108
$$ -1015 -6361 4086 2376 -7606 68 5542 -5487 -4384 5737 -1288 -7573 3032 2796 -7312
1418g312O434O604j1337j1J1108o005p041J0046J1j0168O542O896j0725p43J0959
$$ -7312 -878 5726 -5611 -5622 5486 -519 -7560 2486 2497 -7671 -1129 5767 -4958 -5701 5258
1433E258n803o759R474J103j0645N881P463j0310j517J0845m845p119R009J745
$$ 5258 -545 -7304 2170 3273 -7372 -1491 5972 -4338 -5855 4990 145 -6974 2035 3780
1447C780j0713N277Q120r603k536J0754l644q368R421K369j0675M023Q714r254
$$ 3780 -6933 -1656 6464 -3139 -5675 5079 1435 -6933 2488 4857 -5818 -1795 6919 -2335
1461b335l011J0968l018q743Q136L511j0453L732Q521q645l620J0791k734q409
$$ -2335 -5346 5622 2604 -6139 1997 5508 -4945 -1213 7308 -1337 -4957 5834 3100 -5309
1475e309P763L550j0247K695R235q173m242J0641j921r464P369M564r910J941
$$ -5309 2454 6004 -4243 -1548 7687 -486 -4728 5913 3992 -5472 1897 6461 -3449 -1508
1489a508R339p562n328J0603r90r455O797M896j0277J502R479p022n404R807q71
$$ -1508 7831 269 -5059 5544 4554 -4901 1896 6792 -3485 -1983 7496 474 -4930 4877 4006
1504D006r217O427N654r930M75R660o693o094J0180N27j0387N439O251r408n62
$$ 4006 -5211 1216 6870 -3060 -2585 7075 382 -5712 4468 4995 -5392 47 6298 -3110 -3672
1519c672J0201n772o626R041R49r844M743O859q920j303R805n127p103R265J710
$$ -3672 6529 757 -5869 3172 4121 -5723 -980 5879 -3041 -4344 5461 334 -6769 2496 4206
1534D206j0156L963P167q394j929J0037m399p680Q699K635j0112L628P475q498
$$ 4206 -5950 -1987 5180 -3214 -5143 4894 495 -7185 1514 4149 -5963 -2335 5140 -3358
1548c358k222R820l588q144Q421L146j0197L030P827p709k964J0134l115q446
$$ -3358 -5580 4240 652 -7492 929 4075 -6122 -3092 4735 -2974 -5938 4196 1081 -7365
1562g365P870L776r861K215Q174p113l763J0122k761q309P864M073r965J260R173
$$ -7365 505 4281 -5580 -3365 4809 -2304 -6067 4055 1294 -7015 849 4922 -5043 -3783 5390
1577E390o653m324R666j857q966P308N125j0078J442Q540o399m448R443r14r085
$$ 5390 -1263 -5587 4079 2222 -6744 564 5689 -4389 -2947 5593 -806 -5254 4189 3275 -5810
1592e810O436N339r385J38R464n562n678R158k61r174N985N945q877o32Q729m614
$$ -5810 626 5965 -3420 -3282 6182 620 -5058 4100 3839 -5335 650 6595 -2282 -2914 5815 1201
1608A201o070R098J59q716M525O520q680r42R451m828o436Q366J341r025L857
$$ 1201 -4869 4229 4388 -4328 197 6717 -1963 -2905 6546 1718 -4718 3648 4989 -4036 -179
1623a79P241q293j819Q883l926o376Q233J529r851L865P424q098k395R209l257
$$ -179 7062 -1231 -3050 5833 1907 -4469 3764 5293 -4558 -693 6731 -1367 -3762 5447 2190
$$ [...]
8191a30
##END NTUPLES=NMR FID
##END=
