##TITLE=1H_EC-3209
 CDCl3, 40 sc, 
 18.11.2019
##JCAMPDX= 6.0         $$ Bruker NMR JCAMP-DX V2.0
##DATA TYPE= NMR FID
##DATA CLASS= NTUPLES
##ORIGIN= UXNMR, Bruker Analytische Messtechnik GmbH
##OWNER= root
$$ XWIN-NMR		Version 3.5
$$ Mon Nov 18 14:42:47 2019 Russian Standard Time (UT+4h)  she@DPX200
##.OBSERVE FREQUENCY= 200.1315
##.OBSERVE NUCLEUS= ^1H
##.DELAY= (6, 6)
##.ACQUISITION MODE= SIMULTANEOUS
##.ACQUISITION SCHEME= undefined
##.AVERAGES= 40
##.DIGITISER RES= 18
##SPECTROMETER/DATA SYSTEM= spect
##.PULSE SEQUENCE= zg30
##.SOLVENT NAME= CDCl3
##.SHIFT REFERENCE= (INTERNAL, CDCl3, 0, 15.7039)
##AUDIT TRAIL= $$ (NUMBER, WHEN, WHO, WHERE, WHAT)
$$ ##TITLE= Audit trail, XWIN-NMR		Version 3.5
$$ ##JCAMPDX= 5.01
$$ ##ORIGIN= Bruker BioSpin GmbH
$$ ##OWNER= she
$$ F:/spectra/data/she/nmr/H-F/1/audita.txt
$$ ##AUDIT TRAIL=  $$ (NUMBER, WHEN, WHO, WHERE, WHAT)
(   1,<2019-11-18 14:41:47.20 +0400>,<she>,<DPX200>,
      <continue with go, POWCHK disabled, PULCHK disabled
       configuration hash MD5:
       00 E9 B6 7A A2 85 ED C7 34 08 36 98 17 FE 4E 26
       data hash MD5: 16K
       F1 FC D5 2E 36 5E FB 67 09 44 6F 0F 95 E1 65 CD>)
$$ ##END=
$$ 
$$ hash MD5
$$ C7 7E 84 C6 16 B5 FB F2 CD C3 89 A3 CC 55 21 E3
##$RELAX= 
##$RELAX= 
##$RELAX= 
##$RELAX= 
##$RELAX= 
##$RELAX= 
$$ Bruker specific parameters
$$ --------------------------
##$DU= <F:/spectra>
##$EXPNO= 1
##$NAME= <H-F>
##$PROCNO= 1
##$TYPE= <nmr>
##$USER= <she>
##$AMP= (0..31)
100 100 100 100 100 100 100 100 100 100 100 100 100 100 100 100 100 100 
100 100 100 100 100 100 100 100 100 100 100 100 100 100 
##$AQSEQ= 0
##$AQ_mod= 1
##$AUNM= <au_zg>
##$AUTOPOS= <>
##$BF1= 200.13
##$BF2= 200.13
##$BF3= 200.13
##$BF4= 200.13
##$BF5= 200.13
##$BF6= 200.13
##$BF7= 200.13
##$BF8= 200.13
##$BYTORDA= 1
##$CFDGTYP= 0
##$CFRGTYP= 5
##$CHEMSTR= <none>
##$CNST= (0..31)
1 1 145 1 1 1 1 1 1 1 1 1 1 1 1 1 1 1 1 1 1 1 1 1 1 1 1 1 1 1 1 1 
##$CPDPRG= <>
##$CPDPRG1= <>
##$CPDPRG2= <>
##$CPDPRG3= <>
##$CPDPRG4= <mlev>
##$CPDPRG5= <mlev>
##$CPDPRG6= <mlev>
##$CPDPRG7= <mlev>
##$CPDPRG8= <mlev>
##$CPDPRGB= <>
##$CPDPRGT= <>
##$D= (0..31)
0 1.2 0 0 0 0 0 0 0 0.06 0 0.03 0 0 0 0 0.0002 0 0 0 0 0 0 0 0 0 0 0 0 
0 0 0 
##$DATE= 1574073569
##$DBL= (0..7)
120 120 120 120 120 120 120 120 
##$DBP= (0..7)
150 150 150 150 150 150 150 150 
##$DBP07= 0
##$DBPNAM0= <>
##$DBPNAM1= <>
##$DBPNAM2= <>
##$DBPNAM3= <>
##$DBPNAM4= <>
##$DBPNAM5= <>
##$DBPNAM6= <>
##$DBPNAM7= <>
##$DBPOAL= (0..7)
0.5 0.5 0.5 0.5 0.5 0.5 0.5 0.5 
##$DBPOFFS= (0..7)
0 0 0 0 0 0 0 0 
##$DE= 6
##$DECBNUC= <off>
##$DECIM= 24
##$DECNUC= <off>
##$DECSTAT= 4
##$DIGMOD= 1
##$DIGTYP= 9
##$DL= (0..7)
0 120 120 120 120 120 120 120 
##$DP= (0..7)
150 150 150 150 150 150 150 150 
##$DP07= 0
##$DPNAME0= <>
##$DPNAME1= <>
##$DPNAME2= <>
##$DPNAME3= <>
##$DPNAME4= <>
##$DPNAME5= <>
##$DPNAME6= <>
##$DPNAME7= <>
##$DPOAL= (0..7)
0.5 0.5 0.5 0.5 0.5 0.5 0.5 0.5 
##$DPOFFS= (0..7)
0 0 0 0 0 0 0 0 
##$DQDMODE= 0
##$DR= 18
##$DS= 0
##$DSLIST= <SSSSSSSSSSSSSSS>
$$ [...]
##$SUBNAM2= <"">
##$SUBNAM3= <"">
##$SUBNAM4= <"">
##$SUBNAM5= <"">
##$SUBNAM6= <"">
##$SUBNAM7= <"">
##$SUBNAM8= <"">
##$SUBNAM9= <"">
##$SW= 24.0689530833862
##$SWIBOX= (0..15)
0 0 2 0 0 0 0 0 0 0 0 0 0 0 0 0 
##$SW_h= 4816.95568400771
##$TD= 16384
##$TD0= 1
##$TE= 0
##$TE2= 300
##$TE3= 300
##$TEG= 300
##$TL= (0..7)
0 120 120 120 120 120 120 120 
##$TP= (0..7)
150 150 150 150 150 150 150 150 
##$TP07= 0
##$TPNAME0= <>
##$TPNAME1= <>
##$TPNAME2= <>
##$TPNAME3= <>
##$TPNAME4= <>
##$TPNAME5= <>
##$TPNAME6= <>
##$TPNAME7= <>
##$TPOAL= (0..7)
0.5 0.5 0.5 0.5 0.5 0.5 0.5 0.5 
##$TPOFFS= (0..7)
0 0 0 0 0 0 0 0 
##$TUNHIN= 0
##$TUNHOUT= 0
##$TUNXOUT= 0
##$USERA1= <user>
##$USERA2= <user>
##$USERA3= <user>
##$USERA4= <user>
##$USERA5= <user>
##$V9= 5
##$VALIST= <valist>
##$VCLIST= <CCCCCCCCCCCCCCC>
##$VD= 0
##$VDLIST= <DDDDDDDDDDDDDDD>
##$VPLIST= <PPPPPPPPPPPPPPP>
##$VTLIST= <TTTTTTTTTTTTTTT>
##$WBST= 1024
##$WBSW= 4
##$XGAIN= (0..3)
0 0 0 0 
##$XL= 0
##$YL= 0
##$YMAX_a= 252212
##$YMIN_a= -176367
##$ZGOPTNS= <>
##$ZL1= 120
##$ZL2= 120
##$ZL3= 120
##$ZL4= 120
##$ABSF1= 10
##$ABSF2= 0
##$ABSG= 5
##$ABSL= 3
##$ALPHA= 0
##$AQORDER= 0
##$ASSFAC= 0
##$ASSFACI= 0
##$ASSFACX= 0
##$ASSWID= 0
##$AUNMP= <proc_1d>
##$AZFE= 0.1
##$AZFW= 0.1
##$BCFW= 1
##$BC_mod= 2
##$BYTORDP= 1
##$COROFFS= 0
##$CY= 11.3945322036743
##$DATMOD= 1
##$DC= 2
##$DFILT= <>
##$DTYPP= 0
##$F1P= 16.9975609425685
##$F2P= -3.02152046262296
##$FCOR= 0.5
##$FTSIZE= 0
##$FT_mod= 4
##$GAMMA= 1
##$GB= 0.15
##$INTBC= 1
##$INTSCL= 1
##$ISEN= 128
##$LB= 0.24
##$LEV0= 0
##$LPBIN= 0
##$MAXI= 10000
##$MC2= 0
##$MEAN= 0
##$ME_mod= 0
##$MI= 1.114404
##$NCOEF= 0
##$NC_proc= 0
##$NLEV= 6
##$NOISF1= 3.799351
##$NOISF2= 2.8
##$NSP= 1
##$NTH_PI= 0
##$NZP= 0
##$OFFSET= 15.70392
##$PC= 1
##$PHC0= -9437.878
##$PHC1= 27.40087
##$PH_mod= 1
##$PKNL= yes
##$PPARMOD= 0
##$PSCAL= 0
##$PSIGN= 0
##$REVERSE= no
##$SF= 200.130013532006
##$SI= 16384
##$SIGF1= 3
##$SIGF2= 2
##$SINO= 400
##$SIOLD= 16384
##$SREGLST= <1H.CDCl3>
##$SSB= 0
##$STSI= 0
##$STSR= 0
##$SW_p= 3612.71676300578
##$SYMM= 0
##$S_DEV= 0
##$TDeff= 0
##$TDoff= 0
##$TI= <>
##$TILT= no
##$TM1= 0
##$TM2= 0
##$TOPLEV= 0
##$USERP1= <user>
##$USERP2= <user>
##$USERP3= <user>
##$USERP4= <user>
##$USERP5= <user>
##$WDW= 1
##$XDIM= 8192
##$YMAX_p= 0
##$YMIN_p= 0
$$ End of Bruker specific parameters
$$ ---------------------------------
##NTUPLES= NMR FID
##VAR_NAME=  TIME,          FID/REAL,        FID/IMAG
##SYMBOL=    X,             R,               I
##VAR_TYPE=  INDEPENDENT,   DEPENDENT,       DEPENDENT
##VAR_FORM=  AFFN,          ASDF,            ASDF
##VAR_DIM=   8192,          8192,            8192
##UNITS=     SECONDS,       ARBITRARY UNITS, ARBITRARY UNITS
##FACTOR=    0.0002076,     1,               1
##FIRST=     0,             0,               0
##LAST=      1.7004516,     0,               0
##MIN=       0,             -176367,         0
##MAX=       1.7004516,     252212,          0
$$ Real data points
##PAGE= N=1
##DATA TABLE= (X++(R..R)), XYDATA
$$ plain form
0 0 0 0 0 0 0 0 0 0 0 0 0 0 -7 39 -40 40 -40 40 -52 79 -80 89 -119 125 -154 166 -199 220 -247 285 -323 362
32 362 -403 450 -507 565 -629 697 -775 857 -951 1052 -1168 1292 -1432 1584 -1762 1962
48 1962 -2192 2451 -2756 3125 -3568 4122 -4837 5792 -7145 9244 -12973 21752 -107144 26496
62 26496 7238 -145114 31933 -20313 -159340 -26698 21578 -149510 -23249 82401 -123517
73 -123517 -132920 43067 -81348 -124842 80438 33498 -108031 20031 -10820 -176367 -19417
84 -19417 105267 -60820 -14223 121703 -44146 -103470 54444 -19976 -72558 128635 101538
95 101538 -74986 36380 76312 -87571 9344 152332 8512 379 132859 3182 -64910
106 -64910 110859 72247 -33935 123262 129745 -58258 15810 105001 -27850 34153 178897
$$ packed form
0@%%%%%%%%%%%%pM6p9Q0q0Q0r2J31j59J69k08K44k79L20l65M19m67N32o08O85
32C62p65Q53r57J072j194J326j472J632j808K003k220K460k724L016l346L724
48A962m154M643n207N881o693P690q959J0629j2937J6389k2217L4725j28896J33640
62B6496j9258j52352J77047n2246j39027J32642M8276j71088J26261J05650k05918
73a23517r403J75987j24415m3494K05280m6940j41529J28062l0851j65547J56950
84a9417J24684j66087M6597J35926j65849n9324J57914p4420n2582K01193k7097
95A01538j76524J11366L9932j63883R6915J42988j43820q133J32480j29677o8092
106f4910J75769l8612j06182J57197O483j88003P4068Q9191j32851O2003J44744
$$ plain form
117 178897 32772 -29004 111280 22178 -75032 96738 109554 -24479 80235 111842 -72988
128 -72988 -24771 99650 -16450 -3339 145245 22472 -80713 57853 22815 -88064 58337
139 58337 96057 -56888 10346 76407 -88389 -66336 88168 -4804 -45057 90559 2500
150 2500 -119033 16605 32756 -82743 29676 92180 -68326 -43565 55668 -71348 -77897
161 -77897 83876 18115 -62074 55527 6996 -123672 -1360 58656 -61353 6971 86743
172 86743 -62757 -72551 49228 -38759 -73671 79208 35933 -79437 19197 16470 -111427
183 -111427 -13284 77616 -41800 -21186 68940 -57336 -94028 43025 -5803 -69888 62684
194 62684 43757 -92356 -13243 28588 -89249 -20207 90243 -25679 -47088 55173 -39213
$$ packed form
117A78897j46125o1776J40284q9102r7210J71770J2816j34033J04714L1607j84830
128g2988M8217J24421j16100J3111J48584j22773j03185J38566l5038j10879J46401
139E8337L7720j52945O7234O6061j64796K2053J54504r2972m0253J35616q8059
150B500j21533J35638J6151j15499J12419O2504j60506K4761R9233j27016o549
161g7897J61773o5761q0189J17601m8531j30668J22312O0016j20009O8324P9772
172H6743j49500r794J21779q7987l4912J52879m3275j15370R8634k727j27897
183a11427R8143R0900j19416K0614R0126j26276l6692J37053m8828o4085J32572
194F2684j8927j36113P9113M1831j17837O9042J10450j15922k1409J02261r4386
$$ plain form
205 -39213 -96832 45016 32145 -59033 44312 52873 -88538 -29079 51916 -51647 -19070
216 -19070 98293 -5584 -62425 47228 -6293 -80957 52081 67757 -45409 25396 61956
227 61956 -70498 -33069 76577 -9696 -18178 96290 13673 -69625 39349 26966 -59532
238 -59532 48991 88885 -35718 -178 60982 -50842 -38041 84446 17057 -29686 71207
249 71207 16913 -80990 19501 43950 -49950 24991 80818 -43302 -39556 43965 -41112 -53416
261 -53416 70094 21541 -58120 27847 7562 -93362 -5513 48449 -48671 -11248 58253 -53142
273 -53142 -73180 27798 -27234 -64321 50818 23867 -78253 -6566 9787 -86030 -17307
284 -17307 58177 -39224 -35924 45607 -43886 -81871 29543 2216 -57280 40992 34851 -78551
$$ packed form
205c9213n7619J41848j2871r1178J03345Q561j41411N9459Q0995j03563L2577
216a9070J17363j03877n6841J09653n3521p4664J33038J5676j13166P0805L6560
227F1956j32454L7429J09646q6273q482J14468q2617q3298J08974j2383q6498
238e9532J08523L9894j24603L5540O1160j11824J2801J22487o7389m6743J00893
249G1207n4294r7903J00491K4449r3900P4941N5827j24120L746Q3521q5077j2304
261e3416J23510m8553p9661Q5967k0285j00924Q7849N3962r7120L7423O9501j11395
273e3142k0038J00978n5032l7087J15139k6951j02120P1687J6353r5817O8723
284a7307P5484r7401L300Q1531q9493l7985J11414k7327n9496R8272o141j13402
$$ plain form
296 -78551 -21359 29635 -57737 -15635 72550 -17887 -46510 41561 -16848 -70612 37586 37100
308 37100 -42569 31855 47912 -66084 -26075 51913 -22617 -10471 79716 1375 -52870 37216
320 37216 10966 -52802 42453 62473 -30548 16083 54047 -46894 -27273 67393 7440 -11554
332 -11554 70891 13075 -58314 29375 35565 -36262 34368 69856 -27213 -7098 50287 -32070
344 -32070 -31803 68102 23105 -25687 48635 14282 -63943 15582 49003 -28918 14310 63060
356 63060 -31198 -32515 42681 -17754 -38945 58656 28984 -42394 19996 14319 -65357 2638
368 2638 56289 -24387 -9093 48420 -33231 -52938 34155 -3090 -44704 42492 29016 -56314
380 -56314 -4547 17282 -58439 -9181 59187 -20200 -32064 33116 -27062 -61381 29966 15230
$$ packed form
296g8551N7192N0994q7372M2102Q8185r0437k8623Q8071n8409n3764J08198m86
308C7100p9669P4424J6057j13996M0009P7988p4530J2146R0187p8341n4245R0086
320C7216k6250o3768R5255K0020r3021M6631L7964j00941J9621R4666n9953j8994
332a1554Q2445n7816p1389Q7689O190p1827P0630L5488r7069K0115N7385q2357
344c2070K67R9905m4997m8792P4322l4353p8225P9525L3421p7921M3228M8750
356F3060r4258j317P5196o0435k1191R7601k9672p1378O2390n677p9676O7995
368B638N3651q0676J5294N7513q1651j9707Q7093l7245m1614Q7196j3476q5330
380e6314N1767K1829p5721M9258O8368p9387j1864O5180o0178l4319R1347j4736
$$ plain form
392 15230 -44152 25590 31272 -57512 -19731 28012 -38686 -12585 61939 -7598 -43856 26855
404 26855 -7529 -50884 33093 38372 -34008 14908 38798 -44613 -20877 44795 -9896 -10443 61669
417 61669 5841 -46586 22803 15534 -35846 33191 52929 -27646 25 41468 -30322 -23522
429 -23522 51901 7518 -17927 49541 11583 -51873 13400 29919 -28675 20506 52608 -29102
441 -29102 -21344 35554 -21112 -30065 47976 15565 -31339 26981 10845 -56304 1490 37514
453 37514 -24386 1901 43115 -31630 -39990 28574 -9085 -34077 39017 18699 -42702 6906
465 6906 13989 -52239 -6170 44797 -17029 -15183 35012 -24478 -46328 28005 9538 -31767 30556
478 30556 25728 -44039 -4357 25363 -34480 -7633 52255 -5600 -24781 30182 -10059 -42711
$$ packed form
392A5230n9382O9742N682q8784L7781M7743o6698K6101P4524o9537l6258P0711
404B6855l4384m3355Q3977N279p2380M8916K3890q3411K3736O5672n4691n47P2112
417F1669n5828n2427O9389p269n1380O9037J9738q0575K7671M1443p1790O800
429b3522P5423m4383k5445O7468l7958o3456O5273J6519n8594M9181L2102q1710
441b9102P758N6898n6666q953P8041l2411m6904N8320j6136o7149N7794L6024
453C7514o1900K6287M1214p4745q360O8564l7659k4992P3094k0318o1401M9608
465F906P083o6228M6069N0967o1826J846N0195n9490k1850P4333j8467m1305O2323
478C0556m828o9767L9682K9720n9843K6847N9888n7855j9181N4963m0241l2652
$$ plain form
490 -42711 29384 27834 -26372 19140 29941 -39796 -13196 33948 -18254 -10780 48368 -520
502 -520 -36067 18979 122 -41653 21854 34413 -28535 -1056 24892 -38336 -25195 33780
514 33780 -9160 -21968 34749 -1812 -48890 6197 7849 -38981 10354 34582 -32065 -20791
526 -20791 18866 -32409 -31967 33124 1653 -30602 20795 2087 -51182 0 20249 -30063
538 -30063 2833 36682 -27127 -29942 21699 -16145 -28759 35088 14432 -32573 12228 11204
550 11204 -42183 -186 35718 -17034 -3866 36549 -18110 -33071 25725 3714 -24240 32908
562 32908 23955 -32874 3235 20119 -31090 -1260 43289 -7207 -14296 29758 -10763 -34976
574 -34976 24267 15983 -23299 21313 24861 -35087 -9955 22863 -21447 -7703 40315 -4122
$$ packed form
490d2711P2095j550n4206M5512J0801o9737K6600M7144n2202P474N9148m8888
502e20l5547N5046j8857m1775O3507J2559o2948K7479K5948o3228J3141N8975
514C3780m2940j2808N6717l6561m7078N5087J652m6830M9335K4228o6647J1274
526b0791L9657n1275M42O5091l1471l2255N1397j8708n3269N1182K0249n0312
538c0063L2896L3849o3809k815N1641l7844j2614O3847k0656m7005M4801j024
550A1204n3387M1997L5904n2752J3168M0415n4659j4961N8796k2011k7954N7148
562C2908q953n6829L6109J6884n1209K9830M4549n0496p089M4054m0521k4213
574c4976N9243q284l9282M4612L548n9948K5132L2818m4310J3744M8018m4437
$$ plain form
586 -4122 -27670 18431 -4408 -36298 18572 23538 -24016 7315 23394 -33089 -18080 27543
598 27543 -9261 -11830 37034 1377 -32820 13540 8410 -27857 18742 33434 -18213 -793
610 -793 29018 -20458 -15100 37776 8200 -10717 35396 12351 -30634 15033 25439 -15008 17640
623 17640 41774 -12168 -7043 31936 -6535 -14121 40088 18480 -14228 26242 16700 -29806 9232
636 9232 34060 -9622 6703 37157 -13330 -20409 25089 148 -19930 29570 17364 -25742
648 -25742 7033 12364 -33106 -4861 31102 -11991 -12545 21881 -18584 -34636 15349 2367 -27862
661 -27862 13532 12855 -35553 -10536 8903 -32060 -12976 26565 -12175 -26842 11003 -16070
673 -16070 -38887 10399 10254 -27694 3156 13064 -33583 -16502 15656 -20346 -14990 28619 -3939
$$ packed form
586d122k3548M6101k2839l1890N4870M966m7554L1331J6079n6483J5009M5623
598B7543l6804k569M8864l5657l4197M6360n130l6267M6599J4692n1647J7420
610g93K9811m9476N358N2876k9576j8917M6113k3045m2985M5667J0406m0447L2648
623A7640K4134n3942N125L8979l8471p586N4209k1608l2708M0470r542m6506L9038
636I232K4828m3682J6325L0454n0487p079M5498k4941k0078M9500j2206m3106
648b5742L2775N331m5470K8245L5963m3093n54L4426m0465j6052M9985j2982l0229
661b7862M1394o77m8408K5017J9439m0963J9084L9541l8740j4667L7845k7073
673a6070k2817M9286j45l7948L0850R908m6647J7081L2158l6002N356M3609l2558
$$ plain form
686 -3939 -28895 9525 -2478 -30236 14104 23289 -20363 -774 20243 -22961 -14415 25663 -2607
699 -2607 -12893 29105 6286 -27568 8999 12278 -20846 13999 31576 -15448 -7572 21513 -13583
712 -13583 -14641 29701 7731 -15311 21967 10703 -28594 4583 20588 -15145 6438 30280
724 30280 -13871 -18317 19172 -5801 -17265 26247 12295 -21084 11362 11401 -27776 -1430 24615
737 24615 -10561 -2054 25658 -12304 -24212 16614 2568 -17238 20490 15329 -23358 1518
749 1518 14584 -22317 -4530 27431 -5025 -10425 21416 -7344 -26487 15264 12397 -15953 13684
762 13684 17511 -23455 -6018 19491 -14322 -7497 28636 -121 -17588 14555 -1575 -26095
774 -26095 13010 19508 -15901 4230 16694 -23344 -12308 20578 -7362 -12754 23160 555
$$ packed form
686c939k4956L8420j2003k7758M4340R185m3652J9589K1017m3204Q546M0078k8270
699b607j0286M1998k2819l3854L6567L279l3124L4845J7577m7024P876K9085l5096
712a3583j058M4342k1970k3042L7278j1264l9297L3177J6005l5733K1583K3842
724C0280m4151m446L7489k4973j1464M3512j3952l3379L2446L9l9177K6346K6045
737B4615l5176Q507K7712l7962j1908M0826j4046j9806L7728n161l8687K4876
749A518J3066l6901J7787L1961l2456n400L1841k8760j9143M1751k867k8350K9637
762A3684L827m0966J7437K5509l3813O825L6133k8757j7467L2143j6130k4520
774b6095L9105O498l5409K0131J2464m0038J1036L2886k7940n392L5914k2605
$$ plain form
786 555 -25345 7742 3428 -25544 7474 21097 -16203 -7430 13314 -20847 -18907 19897 -1558
799 -1558 -17375 15591 3032 -28673 1134 10117 -21159 2950 22995 -14762 -14972 13090 -12151
812 -12151 -18353 21397 7403 -18425 10208 7711 -25347 -309 18511 -12201 -294 24298
824 24298 -10109 -18262 14678 -1208 -15602 21060 14261 -18181 4933 12769 -19291 -1514 24819
837 24819 -5296 -4363 21923 -4351 -19864 14922 8490 -12717 17107 18506 -18591 -1291 17247
850 17247 -13120 -3162 26448 -284 -11065 17701 -827 -20935 13859 15713 -12265 9722
862 9722 18560 -18420 -7799 18643 -7287 -6672 24685 1775 -18639 10771 4326 -20722 9882
875 9882 19633 -12900 -441 16331 -16425 -13146 18225 -1145 -11462 18882 4221 -22995 4557
$$ packed form
786E55k5900L3087m314k8972L3018J3623l7300Q773K0744l4161J940L8804k1455
799a558j5817L2966j2559l1705K9807Q983l1276K4109K0045l7757k10K8062k5241
812a2151o202L9750j3994k5828K8633k497l3058K5038J8820l0712J1907K4592
824B4298l4407q153L2940j5886j4394L6662o799l2442K3114P836l2060J7777K6333
837B4819l0115R33K6286k6274j5513L4786o432k1207K9824J399l7097J7300J8538
850A7247l0367R958K9610k6732j0781K8766j8528k0108L4794J854k7978K1987
862I722Q838l6980J0621K6442k5930O15L1357k2910k0414K9410o445k5048L0604
875I882R751l2533J2459J6772l2756L279L1371j9370j0317L0344j4661k7216K7552
$$ plain form
888 4557 8069 -17874 5227 20542 -12139 -8518 14133 -12125 -15784 17236 3730 -14398 12362
901 12362 5175 -24354 -1033 12599 -13873 -229 18605 -11408 -16006 11368 -6187 -17135
913 -17135 15290 7494 -17714 4107 7601 -22735 -4735 17134 -9406 -5420 17452 -8630 -19982
926 -19982 10447 1339 -14894 12707 12492 -17733 -850 11025 -17309 -5359 20571 -3794 -9394
939 -9394 15743 -3690 -20505 10481 10718 -12222 9235 14956 -16059 -5527 15022 -9991 -6885
952 -6885 21599 1547 -13268 11598 1032 -20107 9070 15576 -12066 2748 15124 -15458
964 -15458 -9892 16328 -3943 -9992 18120 3932 -17048 6942 5248 -17697 6069 18650 -10064
977 -10064 -4746 12878 -11113 -12661 16768 2255 -11685 14342 6485 -18347 2686 10945 -12245
$$ packed form
888D557L512k5943K3101J5315l2681L621K2651k6258l659L3020j3506j8128K6760
901A2362p187k9529K3321J3632k6472J3644J8834l0013m598K7374j7555j0948
913a7135L2425p796k5208K1821L494l0336J8000K1869k6540L986K2872k6082j1352
926a9982L0429r108j6233K7601k15l0225J6883J1875k8334J1950K5930k4365n600
939i394K5137j9433j6815L0986K37k2940K1457N721l1015J0532K0549k5013L106
952f885K8484k0052j4815K4866j0566k1139K9177O506k7642J4814J2376l0582
964a5458N566K6220k0271o049K8112j4188k0980K3990j694k2945K3766J2581k8714
977a0064N318J7624k3991j548K9429j4513j3940K6027p857k4832K1033Q259k3190
$$ plain form
990 -12245 2817 20225 -7911 -9817 12529 -5878 -12255 17034 8142 -12950 8880 9238 -16686
1003 -16686 827 15393 -7454 -994 20211 -4104 -13245 11392 1571 -12222 14981 12542 -13502
1016 -13502 2833 11225 -13741 -3222 18341 -4013 -5508 16431 -3422 -17832 9017 5189
1028 5189 -12872 9908 12473 -17160 -4669 10085 -12161 -7661 15750 -3339 -13083 10810 -2690
1041 -2690 -22267 3609 8555 -13564 2193 10972 -17802 -11468 10387 -8290 -11432 13472 -1184
1054 -1184 -18003 5264 936 -19601 2241 12885 -11184 -2326 11693 -14210 -13517 12692 -99
1067 -99 -9941 12926 4405 -16813 3580 8518 -13544 2800 17541 -6698 -4957 13333 -6356
1080 -6356 -12234 15265 7232 -9448 11672 9001 -14858 1811 14193 -8657 462 18875 -3430
$$ packed form
990a2245J5062J7408k8136j906K2346j8407o377K9289q892k1092K1830L58k5924
1003a6686J7513J4566k2847O460K1205k4315r141K4637r821j3793K7203k439k6044
1016a3502J6335Q392k4966J0519K1563k2354j495K1939j9853j4410K6849l828
1028E189j8061K2780K565k9633J2491J4754k2246M500K3411j9089r744K3893j3500
1041b690j9577K5876M946k2119J5757Q779k8774O334K1855j8677l142K4904j4656
1054a184j6819K3267m328k0537K1842J0644k4069Q858J4019k5903O93K6209j2791
1067i9r842K2867q521k1218K0393M938k2062J6344J4741k4239J741J8290j9689
1080f356n878K7499q033j6680K1120k671k3859J6669J2382k2850R119J8413k2305
$$ plain form
1093 -3430 -10283 12031 -1426 -11934 14565 11372 -10573 4848 9177 -14206 -1592 15671 -4989
1106 -4989 -5013 15786 -3686 -14278 8886 1971 -12693 9975 11717 -13891 -2762 8987 -12707
1119 -12707 -5286 16632 -2744 -9906 11742 -678 -16766 6061 6288 -11627 6096 12992 -13355
1132 -13355 -6671 11388 -7441 -6508 16560 1274 -12370 9044 2892 -14548 5644 12658 -8430
1145 -8430 2441 13942 -10122 -7932 12548 -1425 -7039 14673 4617 -13537 5997 7299 -12396
1158 -12396 3342 14994 -6648 -3793 11601 -7343 -11692 11879 2600 -9686 10795 4925 -16220
1171 -16220 -421 8497 -11783 -1454 14834 -7937 -10344 8746 -6416 -14968 9746 5605 -12822
1184 -12822 3417 5017 -17920 -5016 10010 -9171 -5172 12290 -6712 -13397 6736 -1091 -13801
$$ packed form
1093c430o853K2314j3457j0508K6499l193k1945J5421M329k3383J2614J7263k0660
1106d989k4K0799j9472j0592K3164o915j4664K2668J742k5608J1129J1749k1694
1119a2707P421K1918j9376p162K1648j2420j6088K2827K27j7915J7723O896k6347
1132a3355O684J8059j8829R33K3068j5286j3644K1414o152j7440K0192P014k1088
1145h430J0871J1501k4064K190K0480j3973n614K1712j0056j8154J9534J302j9695
1158a2396J5738J1652k1642K855J5394j8944m349K3571r279j2286K0481n870k1145
1171a6220J5799Q918k0280J0329J6288k2771k407J9090j5162q552K4714m141j8427
1184a2822J6239J600k2937J2904J5026j9181L999J7462j9002o685K0133p827j2710
$$ plain form
1197 -13801 8003 8666 -12758 -163 7629 -13253 -4897 13212 -3512 -6582 13256 -1410 -14364
1210 -14364 7524 6439 -9404 7830 13177 -10013 -2027 11066 -6573 -4169 15859 2609 -7316
1223 -7316 10803 3344 -12278 6927 11769 -7351 5007 14072 -8542 -5369 12294 -2135 -5622
1236 -5622 14898 4876 -10509 6751 5280 -12063 3788 13339 -6614 -954 11949 -7613 -10255
1249 -10255 10851 323 -8096 10927 5245 -13647 1239 6251 -11652 -229 13777 -6068
1261 -6068 -6741 9634 -5881 -11561 9553 4022 -10333 6279 6149 -14349 -1771 9083 -8125
1274 -8125 -2939 13506 -4340 -10220 7964 -1963 -11826 9130 8200 -10210 2902 7051 -12109
1287 -12109 -3027 12249 -4920 -5118 12224 -1409 -12972 6136 2643 -11081 6489 9930 -10679
$$ packed form
1197a3801K1804O63k1424J2595P792k0882Q356J8109j6724l070J9838j4666j2954
1210a4364K1888j085j5843J7234N347k3190P986J3093j7639K404K0028j3250r925
1223g316J8119p459j5622J9205M842j9120J2358R065k2614L173J7663j4429l487
1236e622K0520j0022j5385J7260j471j7343J5851R551j9953N660J2903j9562k642
1249a0255K1106j0528q419J9023n682j8892J4886N012j7903J1423J4006j9845
1261f068o73J6375j5515n680K1114n531j4355J6612j30k0498J2578J0854j7208
1274h125N186J6445j7846n880J8184r927r863K0956r30j8410J3112M149j9160
1287a2109R082J5276j7169j98J7342j3633j1563J9108l493j3724J7570L441k0609
$$ plain form
1300 -10679 -1736 7920 -9553 -5903 12572 -1480 -8403 8786 -242 -14577 3332 5590 -10452
1313 -10452 2918 10169 -10549 -7091 7356 -5800 -8160 11218 866 -11659 5046 1855 -14304
1326 -14304 1556 8092 -8960 -941 10130 -8967 -10153 8419 -1643 -8124 10098 3039 -11618
1339 -11618 3183 5333 -10531 428 12604 -5402 -3924 10585 -4570 -9960 9389 4085 -7179
1352 -7179 8710 6819 -11665 1095 10124 -6757 612 13618 -2116 -5195 9643 -836 -10077
1365 -10077 9998 8124 -6558 5439 8779 -10298 -1319 11417 -3392 -2368 12599 -779 -9498
1378 -9498 7432 1699 -9399 7509 10309 -7505 506 7798 -9218 -4315 12138 -1369 -6391
1391 -6391 9743 419 -10751 5334 4807 -10127 3784 10551 -8098 -4385 7535 -7243 -5878
$$ packed form
1300a0679Q943R656j7473L650J8475j4052o923J7189r028j4335J7909K258j6042
1313a0452J3370P251k0718L458J4447j3156k360J9378j0352j2525J6705l191j6159
1326a4304J5860O536j7052Q019J1071j9097j186J8572j0062o481J8222p059j4657
1339a1618J4801K150j5864J0959J2176j8006J478J4509j5155n390J9349n304j1264
1352g179J5889j891j8484J2760R029j6881P369J3006j5734l079J4838j0479r241
1365a0077K0075j874j4682J1997L340j9077Q979J2736j4809J024J4967j3378q719
1378i498J6930n733j1098J6908K800j7814Q011P292j7016M903J6453j3507n022
1391f391J6134r324j1170J6085n27j4934J3911O767j8649L713J1920j4778J365
$$ plain form
1404 -5878 11382 691 -8701 6231 1154 -12158 2098 7090 -8547 180 9246 -8072 -7641
1417 -7641 7472 -4039 -7246 9727 2536 -11132 2640 2957 -12288 155 9504 -7277 -3941
1430 -3941 9217 -6826 -10223 7218 -279 -9176 7797 4133 -12183 -311 5435 -9569 -1689
1443 -1689 10343 -4882 -6652 8333 -3251 -10351 7242 3950 -8674 5100 6213 -11139 -1950
1456 -1950 8852 -5408 -1861 11623 -1675 -8179 7426 756 -8888 7701 7637 -6759 2340 7353
1470 7353 -8942 -3391 10502 -2023 -2870 11441 -186 -9129 5663 4787 -7708 5168 9547
1483 9547 -6765 -1155 8060 -6366 -4432 10805 1310 -5471 8761 1405 -10146 3734 7070
1496 7070 -7176 2162 9882 -6502 -3915 8103 -3904 -6707 9725 2750 -7630 5287 3613
$$ packed form
1404e878J7260j0691r392J4932n077j3312J4256M992j5637Q727R066j7318M31
1417g641J5113j1511l207J6973p191j3668J3772L17j5245J2443R349j6781L336
1430c941J3158j6043l397J7441p497q897J6973l664j6316J1872N746j5004P880
1443a689J2032j5225j770J4985j1584p100J7593l292j2624J3774J113j7352R189
1456a950J0802j4260L547J3484j3298o504J5605o670r644J6589o4j4396R099N013
1470G353j6295N551J3893j2525q47J4311j1627q943J4792q76j2495J2876M379
1483I547j6312N610R215j4426J934J5237r495o781J4232p356j1551J3880L336
1496G070j4246R338P720j6384K587J2018j2007k803J6432o975j0380J2917j674
$$ plain form
1509 3613 -9895 1525 8902 -5862 -508 8968 -5368 -7383 7487 -473 -6707 8932 4495
1522 4495 -9496 1641 5370 -9042 244 10358 -3788 -3589 8830 -3398 -9022 6661 2535
1535 2535 -7437 5951 5687 -9349 -1014 6595 -6974 -2016 10521 -2837 -6185 6148 -1648 -8725
1549 -8725 5849 4894 -7886 2164 5996 -10149 -3898 7322 -4272 -4466 8388 -1772 -9752
1562 -9752 3297 210 -9635 3483 6657 -7768 -1818 5910 -7973 -5588 7397 -2229 -6992 6759
1576 6759 398 -10855 1812 3753 -7537 2665 7932 -6643 -3697 6804 -4885 -4983 8964
1589 8964 1817 -6747 5966 2933 -9030 2416 7075 -5434 1382 9695 -5083 -4934 7988 -609
1603 -609 -5640 9367 4415 -7152 4377 5150 -7658 1606 9698 -3777 -501 9401 -3489 -6678
$$ packed form
1509C613j3508J1420P377j4764N354R476j4336k015J4870p960o234J5639m437
1522D495j3991J1137L729j4412R286J0114j4146J99J2419j2228n624J5683m126
1535B535r972J3388k64j5036Q335P609j3569M958J2537j3358l348J2333p796p077
1549h725J4574r55j2780J0050L832j6145O251J1220j1594j94J2854j0160p980
1562i752J3049l087r845J3118L174j4425N950P728j3883K385J2985r626m763J3751
1576F759o361j1253J2667J941j1290J0202N267j4575K946J0501j1689r8J3947
1589H964p147q564J2713l033j1963J1446M659j2509O816Q313j4778J49J2922q597
1603f09n031J5007m952j1567J1529P73j2808R264Q092j3475L276R902j2890l189
$$ plain form
1617 -6678 7160 1978 -5934 6621 5804 -8149 369 5966 -6264 -835 8746 -2685 -5459 6418
1631 6418 -879 -8030 5604 3956 -6387 3634 5420 -8653 -2667 7189 -5175 -3149 8375
1644 8375 -1753 -7745 4648 582 -7570 4228 5445 -6058 190 5808 -7237 -4335 7734
1657 7734 -2121 -4536 6982 393 -7773 4237 3461 -7399 2771 7966 -5670 -1983 6418 -5355
1671 -5355 -5061 7714 1341 -5089 6009 1765 -8109 2339 5964 -5570 1003 8066 -4463 -3760
1685 -3760 6014 -2947 -5966 6870 2379 -6899 3597 2554 -8705 263 6638 -5016 -2177 6584
1699 6584 -4776 -6185 4897 -1213 -7449 5703 3642 -8043 64 3263 -8642 -1378 7267 -4459
1713 -4459 -4522 5791 -2185 -8012 4518 1807 -6099 3510 5276 -7532 -1300 5177 -4822 -1785 8681
$$ packed form
1617f678J3838n182p912J2555q17j3953Q518N597j2230N429R581j1431k774J1877
1631F418p297p151J3634j648j0343J0021J786j4073N986R856j2364K026J1524
1644H375j0128n992J2393m066q152J1798J217j1503O248N618j3045K902J2069
1657G734r855k415J1518o589q166J2010p76j0860J0170N195j3636L687Q401j1773
1671e355K94J2775o373o430J1098m244r874J0448L625j1534O573P063j2529P03
1685c760R774q961l019J2836m491r278J0496j043j1259Q968O375j1654K839Q761
1699F584j1360j409J1082o110o236J3152k061j1685Q107L199j1905P264Q645j1726
1713d459o3J0313p976n827J2530k711p906R609J766j2808O232O477r999L037J0466
$$ plain form
1728 8681 -1266 -5220 5970 491 -6014 4929 5131 -5019 2227 6279 -5298 -1908 7247 -1740
1742 -1740 -1840 9023 1413 -6231 5014 2861 -5404 4536 7442 -4003 265 7392 -4040 -2893
1756 -2893 7033 895 -3705 7182 1958 -8184 2798 4222 -5362 1749 6826 -4563 -3321 5469
1770 5469 -3414 -4871 6052 1478 -4855 4265 2276 -8371 382 5424 -5071 -1666 5969 -4480
1784 -4480 -5447 4880 -1496 -6446 5340 2910 -7615 1633 3057 -7997 -1279 6142 -3635 -3030
1798 -3030 5182 -3299 -6375 4275 1391 -6167 3310 3900 -6410 -160 3911 -5673 -1517 7019 -1929
1813 -1929 -4111 4770 -467 -6892 4080 3610 -5899 1662 5105 -6564 -1278 4888 -3510 -2954 6691
1828 6691 -357 -5845 3775 461 -6550 3151 4662 -5474 262 5115 -5710 -3071 5737 -957
$$ packed form
1728H681r947l954J1190n479o505J0943K02j0150P246M052j1577L390R155q987
1742a740j00J0863p610p644J1245k153q265R940K906j1445M268P127j1432J147
1756b893R926o138m600J0887n224j0142J0982J424r584P111N077j1389J242Q790
1770E469q883j457J0923m574o333R120j989j0647Q753N042j0495L405P635j0449
1784d480r67J0327o376m950J1786k430j0525R248J424j1054O718P421r777O05
1798c030Q212q481l076J0650k884p558R477N90j0310O250M071r584M156Q536q948
1813a929k182Q881n237o425J0972m70r509P561L443j1669N286O166q398N56R645
1828F691p048n488R620l314p011R701J511j0136N736M853j0825K639Q808o694
$$ plain form
1842 -957 -4358 5977 699 -7020 1920 1932 -5959 2145 6049 -4228 -1882 5126 -3725 -4121 6454
1857 6454 1057 -3816 4343 2321 -6812 2089 4805 -4778 889 7715 -2843 -3292 5416 -1124 -4129
1872 -4129 5650 3246 -4455 3894 3937 -5573 1339 6981 -2747 -43 6923 -2046 -4667 4672 1189
1887 1189 -3901 5381 3703 -4717 1085 4245 -4627 -655 7104 -1143 -2435 5254 -920 -5388 3547
1902 3547 2331 -4624 3249 3737 -5416 -1245 3520 -3935 -2394 5945 -1496 -4567 4260 -629 -6473
1917 -6473 2564 3396 -5417 438 3895 -5293 -3167 4524 -2711 -3653 5707 -287 -6089 2390 873
1932 873 -6272 967 4088 -4151 -1626 3493 -4576 -3912 4718 -298 -3757 4123 1075 -5992 811
1947 811 2658 -4722 121 5554 -4050 -2971 4739 -2403 -4830 4822 1763 -4950 2677 1767 -5807
$$ packed form
1842i57l401J0335n278p719Q940J2p891Q104L904j0277K346P008q851l96J0575
1857F454n397m873Q159k022r133Q901K716r583N667O826j0558m49Q708o540l005
1872d129R779k404p701Q349M3r510O912N642r728K704O966q969k621R339l483
1887A189n090R282j678q420N802L160q872L972P759q247j292P689o174m468Q935
1902C547j216o955P873M88r153M171M765p455J541Q339p441l071Q827m889n844
1917f473R037Q32q813N855L457r188K126P691p235r42R360n994n802Q479j517
1932H73p145P239L121q239K525N119q069O64Q630n016l459P880l048p067O803
1947H11J847p380M843N433r604J079P710p142k427R652l059o713P627r10p574
$$ plain form
1962 -5807 -47 4116 -3108 -1174 5395 -2324 -4010 4130 193 -4397 4076 3538 -4464 1183 3665
1977 3665 -4924 -454 5546 -1683 -1689 4244 -1092 -4642 4561 1965 -3744 3516 4293 -4226 108 4219
1993 4219 -3526 -1191 6256 -459 -2450 4440 15 -4709 3711 3266 -3912 2069 4803 -4273 -1587
2008 -1587 4320 -1781 -2046 5986 368 -4200 3068 820 -4911 2576 4151 -3949 37 4686 -3638
2023 -3638 -2599 4394 -1198 -3224 4561 1307 -5243 1363 2214 -4931 868 4841 -3261 -1917 3405
2038 3405 -1830 -3628 4454 474 -3899 3109 1879 -5327 -107 2854 -3548 271 4598 -2669 -3489
2053 -3489 3535 -957 -4520 3254 2109 -4081 2241 1960 -4813 -917 3838 -2459 -2056 4528 -2201
2068 -2201 -4734 3070 855 -3937 2900 2573 -4551 133 3520 -4671 -1925 4542 -1320 -2804 3997
$$ packed form
1962e807N760M163p224J934O569p719j686Q140l937m590Q473n38q002N647K482
1977C665q589M470O000p229oN933n336l550R203k596n709P260P77q519M334M111
1993D219p745K335P447o715j991O890m425m724Q420m45p178N981K734r076K686
2008a587N907o101k65Q032n618m568P268k248n731P487J575q100L986M649q324
2023c638J039O993n592k026P785l254o550O606Q51p145N799L973q102J344N322
2038C405n235j798Q082l980m373P008j230p206N220K961o402L819M327p267q20
2053c489P024m492l563P774j145o190O322k81o773L896M755o297M03O584o729
2068b201k533P804k215m792O837l27p124M684L387q191K746O467n862j484O801
$$ plain form
2083 3997 -326 -5926 2335 1827 -4683 1493 3409 -4396 -1716 3421 -3262 -2425 4779 -32 -3418
2098 -3418 2262 -266 -4709 2219 4018 -3035 814 3698 -3578 -1297 3857 -708 -2247 5255 921
2113 921 -3985 2458 2174 -4136 1783 4606 -1950 -683 4518 -1715 -2621 5094 698 -2479 4043 2547
2129 2547 -3822 1620 3228 -3248 1076 5143 -1367 -1931 4560 -1313 -2834 3822 2143 -3350 3233
2144 3233 2547 -4295 -632 3645 -2542 -1249 4295 -575 -3308 2753 -90 -3516 2810 2292 -4185
2159 -4185 316 2087 -4042 -898 4223 -1558 -2546 3267 -1388 -4756 2255 721 -3525 1769 2493
2174 2493 -4871 -1022 2839 -3382 -1735 3970 -577 -3471 2269 397 -5085 1546 2420 -3288 365
2189 365 3254 -3480 -1745 2998 -2128 -2455 4656 654 -3768 2013 786 -4400 1104 3600 -2834
$$ packed form
2083C997m323n600Q261n08o510O176J916p805K680N137o683Q37P204m811l386
2098c418N680k528m443O928J799p053L849K884p276K281N154m565j539P502m334
2113I21m906O443k84o310N919K823o556J267N201o233r06P715m396l177O522j496
2129B547o369N442J608o476M324M067o510n64O491n873j521O656j679n493O583
2144C233o86o842L663M277o187J293N544m870k733O061k843l426O326n18o477
2159d185M501J771o129L144N121n781r88N813m655l368P011j534m246N294P24
2174B493p364L849L861o221J647N705m547k894N740j872n482O631Q74n708L653
2189C65K889o734J735M743n126l27P111m002m422N781j227n186N504K496o434
$$ plain form
2204 -2834 -260 3376 -2117 -2505 3194 469 -3219 3176 1113 -4363 909 2559 -3558 582 3712
2219 3712 -2866 -1885 2979 -2297 -4130 2880 797 -3256 2602 1337 -4366 255 2718 -2573 -967
2234 -967 3707 -1430 -2690 2819 -606 -3683 3020 2353 -3397 1414 2848 -4106 -387 4084 -1845
2249 -1845 -718 4557 -564 -3496 2405 1013 -2816 3629 3487 -3182 635 4067 -2651 -970 4173
2264 4173 -747 -2311 3457 -6 -3358 2946 2431 -2445 1500 3360 -1890 -330 3530 -2106 -1668
2279 -1668 3858 600 -3397 2274 386 -4286 1743 2949 -2662 -583 3690 -2509 -2750 3021 -957
2294 -957 -2779 3435 382 -3869 583 1140 -3892 255 3259 -2864 -2097 2232 -2687 -3316 3010 -457
2310 -457 -3710 1628 1499 -4459 238 1856 -3629 -334 3629 -1771 -2068 2337 -1413 -3207 2951 800
$$ packed form
2204b834K574L636n493l88N699k725l688O395k063n476N272J650o117M140L130
2219C712o578R81M864n276j833P010k083m053N858j265n703M621K463n291J606
2234i67M674n137j260N509l425l077O703o67n750M811J434o954L719M471n929
2249a845J127N275n121k932N901j392l829O445j42o669L817L432o718J681N143
2264D173m920j564N768l463l352O304n15m876L945J860n250J560L860n636M38
2279a668N526l258l997N671j888m672O029J206n611K079M273o199k41N771l978
2294i57j822O214l053m251M452N57n032M147L004o123P67M329m919o29O326l467
2310d57l253N338j29n958M697J618n485L295L963n400k97M405l750j794O158k151
$$ plain form
2326 800 -3331 1530 2282 -3726 -370 3042 -1631 -1673 3497 -835 -3790 1960 24 -3377 2696 2035
2342 2035 -3103 705 3318 -2784 -1046 3684 -443 -1410 3114 -283 -3990 2631 1879 -3159 2005
2357 2005 2823 -2126 -441 2978 -2401 -1414 3524 -259 -2638 2669 331 -3844 1378 2260 -2548 711
2373 711 3570 -2349 -1122 2564 -427 -2258 3651 1022 -2497 1497 1572 -3028 530 3479 -2692 -398
2389 -398 3293 -1100 -1673 3434 226 -1663 2776 1504 -3259 836 2504 -2852 323 3480 -832
2404 -832 -2077 2833 -1049 -2542 3316 1590 -2699 2694 1964 -3927 -339 2991 -2510 -1219 4019
2419 4019 -951 -2538 2351 -281 -2696 1731 1916 -2907 849 1703 -3635 -1694 2992 -1977 -2116 2980
2435 2980 -793 -4190 1627 645 -3051 743 1675 -3210 -458 2460 -3074 -1845 3353 -1011 -2746
$$ packed form
2326H00m131M861P52o008L356L412m673m2N170m332k955N750j936l401O073o61
2342B035n138L808K613o102J738M730m127r67M524l397l707O621p52n038N164
2357B005Q18m949J685L419n379R87M938l783k379N307k338m175N222Q82m808L259
2373G11K859n919J227L686k991j831N909k629l519L994P5m600L558K949o171K294
2389c98L691m393n73N107l208j889M439j272m763M095J668n356L175L157m312
2404h32j245M910l882j493N858j726m289N393p30n891L588L330n501J291N238
2419D019m970j587M889k632k415M427J85m823L756Q54n338J941M686m969j39N096
2435B980l773l397N817r82l696L794R32m885K752K918n534J229N198m364j735
$$ plain form
2450 -2746 1627 330 -3851 995 1452 -2778 624 2425 -2462 -1343 2390 -1053 -2265 2044 -215
2465 -215 -2812 1824 1008 -3012 501 2430 -1724 368 2634 -1575 -2334 2191 -538 -2149 2707 1307
2481 1307 -3427 1077 1597 -2917 459 2685 -2463 -1387 2922 -798 -2702 2900 1058 -2510 2514
2496 2514 899 -3385 -288 2739 -2013 -192 3442 -1165 -2251 2432 -85 -2604 2118 2012 -2138
2511 -2138 1670 2515 -3306 -184 3651 -1748 -1335 3812 -49 -2820 2235 693 -2383 2109 2603 -2146
2527 -2146 603 2268 -2688 -1443 3299 68 -2238 2351 69 -2804 1037 1667 -2652 1097 2220
2542 2220 -2304 -1168 1909 -1760 -1803 2728 183 -3169 2022 551 -3113 887 2027 -1967 -332
2557 -332 2284 -2199 -1910 2580 -786 -1975 2023 279 -2642 774 986 -3301 741 2378 -1855 -1116
$$ packed form
2450b746M373j297m181M846M57m230L402J801m887J119L733l443j212M309k259
2465b15k597M636q16m020L513J929m154K092K266m209p59M525k729j611M856j400
2481A307m734M504N20m514L376K226n148J076M309l720j904N602j842l568N024
2496B514j615m284L097L027m752J821L634m607j086M683k517k519M722j06m150
2511b138L808Q45n821L122L835n399M13N147l861k771N055j542l076M492M94m749
2527b146K749J665m956J245M742l231k306M589k282k873L841O30m319L749J123
2542B220m524J136L077l669m3M531k545l352N191j471l664M000J140l994J635
2557c32K616m483K89M490l366j189L998j744k921L416K12m287M042J637m233P39
$$ plain form
2573 -1116 2905 -1626 -2289 2479 609 -2966 1817 743 -2757 346 1098 -2903 -204 3243 -1589
2588 -1589 -1403 2145 -586 -2973 2061 1148 -2583 1337 2114 -2356 154 1837 -1619 -781 2802 -979
2604 -979 -2568 854 -199 -2121 1473 1712 -2902 555 2142 -2282 -682 3092 -609 -1266 3042 226
2620 226 -2681 1559 1434 -2293 519 2370 -2444 471 1816 -1307 -946 2884 -454 -889 2410 692
2636 692 -2677 1264 1751 -1814 1083 2531 -1152 -854 2473 -671 -1402 3139 962 -2216 1514 1001
2652 1001 -2191 1286 2697 -1281 -324 2100 -1726 -1751 2496 484 -1555 1999 1081 -2624 434 1415
2668 1415 -2705 336 2547 -825 -858 2020 -682 -2550 2178 265 -2433 1150 960 -2745 306 1750
2684 1750 -1848 -1225 2145 -1015 -2476 1920 -448 -2974 1953 871 -2493 209 1451 -2970 -882
$$ packed form
2573a116M021m531o63M768j870l575M783j074l500L103P52m001K699L447m832
2588a589J86L548k731k387N034r13l731L920P77m470K510J683l456Q38L583l781
2604i79j589L422j053j922L594K39m614L457J587m424J600L774l701o57M308k816
2620B26k907M240j25l727K812J851m814K915J345l123L61L830l338m35L299j718
2636F92l369L941M87l565K897J448l683K98L327l144p31M541k177l178L730n13
2652A001l192L477J411l978R57K424l826k5M247k012k039L554r18l705L058R81
2668A415m120L041K211l372l3K878k702j868M728j913k698L583j90l705L051J444
2684A750l598O23L370l160j461M396k368k526M927j082l364K702J242m421K088
$$ plain form
2699 -882 1981 -1594 -773 1996 -705 -1749 1147 205 -2588 1559 2379 -2092 -767 1809 -1800 -1135
2715 -1135 2361 -831 -2084 2168 234 -2841 969 1406 -2341 292 2931 -2041 -360 2247 -1334
2730 -1334 -1504 2631 544 -2536 1630 1167 -2290 710 1416 -1919 332 2332 -1692 -1305 2101 -263
2746 -263 -1766 1917 453 -1751 906 1350 -1893 299 2739 -2224 -624 2375 -1077 -2387 2313
2761 2313 -243 -2170 1419 2062 -2644 -86 1581 -2031 -337 2463 -924 -1370 2130 253 -2051
2776 -2051 1870 1612 -2338 739 1515 -1808 318 1847 -1393 -877 3038 -67 -1878 2170 -70 -2588
2792 -2588 1866 1233 -1962 -138 2355 -1782 -1494 2312 -823 -1605 2263 372 -1957 848 658 -2452
2808 -2452 424 2119 -2389 -330 2701 -1861 -2004 1709 -277 -2093 1534 506 -2380 607 1134
$$ packed form
2699h82K863l575Q21K769k701j044K896r42k793M147Q20m471J325K576l609O65
2715a135L496l192j253M252j934l075L810M37l747K633K639m972J681K607l581
2730a334j70M135k087l080M166m63l457L000P06l335K251K000m024L87L406k364
2746b63j503L683j464k204K657M44l243K192K440m963J600K999l452j310M700
2761B313k556j927L589O43m706K558J667l612J694K800l387m46L500j877k304
2776b051L921k58l950L077P76l323K126J529l240N16L915l105j811M048k240k518
2792b588M454o33l195J824K493m137K88L806l135p82L868j891k329K805j90l110
2808b452K876J695m508K059L031m562j43L713j986j816L627j028k886K987N27
$$ plain form
2823 1134 -2597 -577 1746 -1770 -1843 1267 -875 -1992 1796 -457 -1597 540 521 -2616 621 1941
2839 1941 -1534 -817 2363 -1561 -1930 2108 293 -1563 1241 1347 -2588 991 2034 -2453 -133 2593
2855 2593 -922 -1324 1737 179 -1850 1688 1629 -1926 1304 1680 -2524 -58 2098 -1470 -219 2091
2871 2091 192 -1748 2095 222 -2422 1534 1666 -1480 672 1704 -1915 -1019 2341 -475 -1206 2425
2887 2425 -93 -1469 1421 533 -1736 945 2174 -1830 -143 2145 -1852 -1183 2830 -484 -2067
2902 -2067 2203 442 -2283 591 742 -2296 246 2614 -1060 -739 2247 -1279 -1233 1825 -242 -1908
2918 -1908 1456 345 -2467 524 1032 -1143 -416 2282 -480 -1100 1268 -264 -1588 1918 509 -2087
2934 -2087 879 983 -2198 -378 1573 -400 -501 2311 -1179 -2065 1647 307 -1892 1094 828 -2233
$$ packed form
2823A134l731K020K323l516p3L110k142j117L788k253j140K137j9l137L237J320
2839A941l475P17L180l924l69M038j815j856K804J06l935L579J043m487K320K726
2855B593l515m02L061j558k029L538n9l555L230L76m204K466K156l568J251K310
2871B091j899j940L843j873k644L956J32l146K152J032l619Q96L360k816p31L631
2887B425k518j376K890q88k269K681J229m004J687K288l997O69M013l314j583
2902b067M270j761k725K874J51l038K542K368l674L21K986l526M6L058k067j666
2918a908L364j111k812K991N08k175P27K698k762o20K368j532j324L506j409k596
2934b087K966J04l181J820J951j973j01K812l490q86L712j340k199K986k66l061
$$ plain form
2950 -2233 -235 1742 -2469 -725 1758 -1035 -1366 1774 -399 -2285 1301 291 -2323 682 1559
2965 1559 -2162 -647 1647 -806 -1090 2334 -530 -1778 1344 277 -2487 1034 1616 -2267 143
2980 143 1586 -1501 -974 2156 -197 -1144 1940 282 -2419 1045 1062 -1737 899 1569 -1578 -400
2996 -400 1509 -622 -1433 2095 797 -816 1272 467 -1587 668 2145 -1906 100 1951 -971 -1156
3012 -1156 1316 -561 -1370 2210 583 -1525 1054 882 -1378 834 2087 -1871 -808 2330 -862
3027 -862 -693 1055 586 -1905 1563 1768 -2135 567 1717 -2451 -228 2035 -1102 -1384 1719 -252
3043 -252 -2023 1036 702 -1636 368 1921 -2502 -35 1659 -1289 -1028 1629 -648 -1332 1457 -141
3059 -141 -2717 797 1233 -1803 30 1194 -1354 -943 858 -1178 -1453 1931 178 -1895 1294 449
$$ packed form
2950b233J998J977m211J744K483k793l31L140k173j886L586j010k614L005Q77
2965A559l721J515K294k453k84L424k864j248L122j067k764L521N82l883K410
2980A43J443l087N27L130k353r47L084j658k701L464J7k799K636O70l147J178
2996d00J909k131q11L528j298j613K088q05k054K255J477m051K006J851k922j85
3012a156K472j877q09L580j627k108K579j72k260K212J253l958J063L138l192
3027h62J69J748m69k491L468K05l903K702J150m168K223K263l137k82L103j971
3043b52j771L059l34k338K004J553m423K467J694k948K61K657k277o84K789j598
3059a41k576L514M36l036J833J164k548M11J801k036k75L384j753k073L189q45
$$ plain form
3075 449 -1731 465 1253 -1922 -25 1947 -1402 -1002 2408 -845 -1577 942 427 -2527 559 1427
3091 1427 -1722 580 1689 -1610 -919 1756 -1203 -1779 2973 292 -1360 909 984 -1777 -378 1775
3107 1775 -1498 -218 2006 -854 -1583 1567 247 -1625 2037 811 -2058 350 1743 -1668 -231
3122 -231 1677 -940 -61 2031 -271 -2165 2219 651 -1336 1642 1088 -2320 606 1945 -1315 -10
3138 -10 1637 -744 -864 1880 91 -2154 1501 1514 -734 625 1692 -1629 -562 2176 -798 -90
3154 -90 2288 -242 -1680 1152 892 -1937 417 1696 -1515 186 1980 -1397 -1047 1058 -566 -1303
3170 -1303 1598 9 -1452 1230 744 -1436 1049 1548 -910 -468 1131 -735 -1136 1556 -68 -1538
3186 -1538 860 671 -2382 -23 1242 -1548 534 1141 -1007 -1072 942 -619 -1851 1381 739 -1654
$$ packed form
3075D49k180K196P88l175J897J972l349M00L410l253p32K519n15k954L086Q68
3091A427l149K302J109l299O91K675k959n76M752k681j652K269P5k761J399K153
3107A775l273J280K224k860p29L150j320j872L662j226k869K408J393l411J437
3122b31J908k617Q79K092k302j894M384j568j987K978n54l408K926J339l260J305
3138a0J647k381j20K744j789k245L655J3k248J359J067l321J067K738k974P08
3154i0K378k530j438K832k60k829K354J279l211J701J794l377L50K105j624p37
3170a303K901j589j461K682m86k180K485M99k458M42J599j866m01K692j624j470
3186a538K398j89l053K359J265k790K082O07k148o5K014j561j232L232o42k393
$$ plain form
3202 -1654 689 787 -2480 201 1561 -1517 -986 1622 -1103 -2008 1108 -282 -2270 748 1033 -2278
3218 -2278 426 891 -1765 -339 1863 -839 -412 1554 -392 -1747 588 654 -977 932 1552 -1704
3234 -1704 -35 1696 -718 -1127 1255 -531 -796 1477 8 -2492 925 893 -924 995 1125 -1352
3250 -1352 -141 1458 102 -760 1972 -97 -1495 470 963 -1029 588 1777 -1103 156 1712
3265 1712 -1126 -884 1667 985 -1720 1613 623 -1126 15 853 -1437 305 1927 -668 -1079 1932
3281 1932 -873 -1634 879 -360 -1543 985 671 -2199 208 1026 -1054 -820 1681 -668 -1368 1579
3297 1579 -383 -1387 1203 990 -1325 599 1447 -1097 -351 1306 -678 -199 827 -720 -1481 1144
3313 1144 490 -1751 1078 499 -2402 123 1340 -1086 -216 986 -436 -1712 990 -197 -2128 554
$$ packed form
3202a654K343R8l267K681J360l078N31K608k725r05L116j390j988L018K85l311
3218b278K704M65k656J426K202k702M27J966j946j355K335O6j631J909O20l256
3234a704J669J731k414m09K382j786k65K273j469k500L417l2j817J919J30k477
3250a352J211J599j356q62K732k069j398J965M93j992J617J189k880J259J556
3265A712k838K42K551o82k705L333r90j749J141Q38k290J742J622k595m11L011
3281A932k805p61K513j239j183K528l14k870K407Q18k080K34K501k349p00K947
3297A579j962j004K590k13k315J924Q48k544P46J657j984M79J026j547p61K625
3313A144o54k241K829n79k901K525J217k426Q70J202j422j276K702j187j931K682
$$ plain form
3329 554 653 -1834 -109 1147 -1288 -543 1873 -739 -1012 1603 -137 -1447 786 737 -1277 1056 836
3346 836 -1847 144 1040 -1019 -625 551 -392 -1395 1354 -25 -2107 176 424 -1749 752 1527
3362 1527 -723 -733 807 -450 -1163 1100 470 -1472 1218 331 -1657 566 915 -579 -343 2362 -713
3379 -713 -734 1277 200 -1498 700 695 -1080 1025 1034 -1293 -46 916 -755 -552 2088 -2 -715 1358
3397 1358 423 -1175 1337 1172 -903 -163 1134 -1307 -385 1303 -439 -426 1757 55 -1602 566
3413 566 1205 -1379 817 1384 -1162 -694 1479 -1139 -865 1074 303 -991 306 269 -1365 1091 522
3430 522 -1260 -47 1491 -784 -560 812 -446 -619 1091 510 -1569 764 1080 -1084 640 1727
3446 1727 -532 -170 1110 -527 -1336 577 596 -744 708 -201 -1744 844 641 -1146 565 1389 -629
$$ packed form
3329E54R9k487J725J256k435P45K416k612k73K615j740j310K233m9k014K333k20
3346H36k683J991Q96k059L94J176r43j003K749j379k082K283K48k173K501P75
3362A527k250j0J540j257p13K263o30j942K690q87j988K223L49j494K36K705l075
3379g13k1K011j077j698K198nj775K105Rk327J247R62j671K03K640k090p13K073
3397A358r35j598K512j65k075P40J297k441R22J688j742J3K183j702j657K168
3413E66O39k584K196N67k546M68K173k618K74J939p71j294J297l7j634K456n69
3430E22j782J213J538k275K24J372j258j73J710n81k079K333L16k164J724J087
3446A727k259L62J280j637q09J913J9j340J452r09j543K588k03j787J711Q24k018
$$ plain form
3463 -629 -837 801 -931 -592 481 565 -1497 69 388 -1202 210 936 -887 -305 1137 -278 -868
3480 -868 602 -83 -1079 764 1260 -444 117 618 -1375 126 1290 -574 -1284 844 -309 -844 711
3497 711 495 -1000 867 400 -1005 640 777 -729 -272 823 -201 -1186 1212 -2 -1196 408
3513 408 258 -1088 884 1343 -1573 -229 1343 -689 -1034 2095 272 -1624 141 1128 -846 984
3529 984 1114 -998 447 2129 -871 -453 566 -127 -600 1115 335 -1483 428 482 -659 401 1355
3546 1355 -864 -249 1505 -369 -1352 1047 630 -1069 790 57 -336 317 948 -1580 -239 1315 -686
3563 -686 -823 822 103 -960 902 518 -1476 398 1173 -1463 162 794 -501 -657 1268 157 -1205
3580 -1205 575 416 -1508 275 884 -1179 -43 58 -1154 -716 1891 -24 -1092 1352 -446 -1331
$$ packed form
3463f29k08J638j732L39J073Q4k062J566L19j590J412P26j823N82J442j415n90
3480h68J470o85r96J843M96j704N61N01j993J501J164j864p10K128j153n35J555
3497G11k16j495J867m67j405J645J37j506M57J095j024r85K398j214j194J604
3513D08j50j346J972M59k916J344J572k032l45L129j823j896J765R87j974J830
3529I84J30k112J445J682l000M18J019o93m73J715p80j818J911N4j141J060R54
3546A355k219O15J754j874r83K399m17j699J859p33l93O53O31k528J341J554k001
3563f86j37J645p19j063J862l84j994J874P75k636J625O32j295j56J925j111j362
3580a205J780j59j924J783O09k063J136J01j212M38K607j915j068K444j798q85
$$ plain form
3596 -1331 886 652 -1605 257 1126 -688 -81 1464 -551 -899 1270 -1091 -1272 638 820 -1227
3612 -1227 891 352 -1371 186 1084 -1490 -58 723 -916 -653 874 80 -1080 243 318 -1008 502
3629 502 1393 -1407 -686 1215 -581 -388 1187 364 -647 1313 865 -1608 297 686 -821 158 1341
3646 1341 -89 -301 1496 741 -464 884 890 -895 640 854 -193 63 396 -859 388 1138 -471
3663 -471 -528 801 136 -424 897 995 -626 344 306 -932 -168 879 -363 -1048 1030 -500 -1191 -103
3681 -103 555 -555 983 909 -747 -319 1563 -774 -272 784 -648 -809 359 217 -880 603 495
3698 495 -1186 -32 911 -538 -335 700 -1926 -961 832 257 -1283 1116 128 -1013 -24 1263 -1047
3715 -1047 297 1036 -800 -882 854 -482 -281 757 900 -955 414 401 -1000 -329 965 -593 -1285
$$ packed form
3596a331K217k34k257J862Q69j814O07J545k015l48K169k361j81J910J82k047
3612a227K118n39j723J557Q98k574J432P81j639K63J527p94j160J323P5j326J510
3629E02Q91k800P21J901j796J93J575q23j011J960m48k473J905L89j507R79J183
3646A341j430k12J797p55j205J348Oj785J535K14j047K56L33j255J247P50j609
3663d71n7J329o65n60J321R8j621R70l8j238P64J047j242o85K078j530o91J088
3681a03O58j110J538p4j656M28J882k337N02J056j432j61J168j42j097J483j08
3698D95j681J154R43j449K03J035k626R65J793n75j540K399r88j141R89J287k310
3715a047J344P39j836q2J736j336K01J038J43j855J369j3j401O71J294j558o92
$$ plain form
3732 -1285 866 -732 -1299 1043 938 -935 67 172 -1199 -360 748 -578 -575 1236 -608 -844 977
3749 977 -678 -1516 449 21 -1131 320 1065 271 -591 969 -565 13 1252 31 -1082 1260 353
3766 353 -886 1327 944 -428 -77 441 -879 -558 1025 -92 -42 1100 743 -731 982 1077 -388
3783 -388 583 1178 -420 -145 1230 -318 -266 1127 -446 -912 869 491 -935 368 508 -464 118 1124
3801 1124 -522 -755 863 -660 -1660 197 895 -954 273 814 -1040 -84 1535 -638 -346 993
3817 993 -407 -830 752 -37 -808 201 189 -959 963 699 -743 -102 911 -343 -1079 653 -1353
3834 -1353 -1166 370 731 -1210 499 468 -788 137 330 -741 -122 1041 -654 -632 553 175 -1660
3851 -1660 589 540 -453 208 484 -785 -98 756 121 -74 831 -38 -807 831 682 -1269 585 676 -16
$$ packed form
3732a285K151j598n67K342j05j873J002J05j371Q39J108j326LJ811j844k36J821
3749I77j655q38J965m28j152J451P45p94q62J560j534N78J239j221j113K342r07
3766C53j239K213l83j372L51N18j320L21J583j117N0J142l57j474J713R5j465
3783c88R71N95j598K75J375j548N2J393j573m66J781l78j426J303J40r72N82J006
3801A124j646k33J618j523j000J857O98j849J227N41j854R56J619k173K92J339
3817I93j400m23J582p89p71J009j2j148J922k64j442O41J013j254p36J732k006
3834a353J87J536L61j941J709l1j256R25J93j071O19J163j695K2J185l78j835
3851a660K249m9r93O61K76j269O87Q54o35j95R05q69p69J638j49j951J854R1o92
$$ plain form
3870 -16 -43 1364 -628 -548 931 128 -1120 369 -116 -1398 875 181 -885 -401 974 -543 -324 412
3888 412 -129 -535 1215 13 -1029 702 604 -649 370 520 -380 920 1529 -714 141 1038 322 -517
3906 -517 846 147 -632 413 984 -1565 584 1058 -857 -451 580 -541 -549 601 341 -533 1005 1082
3924 1082 -1343 329 1039 -964 -126 800 -657 -457 134 195 -959 265 353 -1161 966 806 -735
3941 -735 -188 1289 -503 -476 897 -231 -678 321 245 -869 554 594 -1398 -919 875 -685 -220 1280
3959 1280 -406 -688 909 -200 -526 559 304 -897 367 527 -689 -216 579 -975 -707 530 -41
3976 -41 -510 143 107 -735 -79 718 -867 191 401 -723 328 1086 370 -590 1058 107 -1103 674
3994 674 -49 -761 -234 997 -597 -295 512 -517 -1042 946 -5 -767 316 571 -901 371 874 -971
$$ packed form
3870a6k7J407j992Q0J479q03j248J489m85j282K273o94j066M84J375j517K19P36
3888D12n41m06J750j202j042J731r8j253J019J50r00J300O09k243Q55Q97p16q39
3906e17J363o99p79J045N71k549K149M74j915M06J031j121qJ150k60q74J538P7
3924A082k425J672P10k003Q38R26j457K00N91O1j154J224Q8j514K127j60j541
3941g35N47J477j792K7J373j128m47R99p6j114J423M0j992M79J794j560M65J500
3959A280j686k82J597j109l26J085k55j201J264J60j216M73P95j554K68J237n71
3976d1m69O53l6q42O56P97j585J058K10j124J051P58p16r60J648r51j210J777
3994F74p23p12N27J231j594L02Q07j029n25J988r51p62J083K55j472J272N03j845
$$ plain form
4012 -971 -260 655 -54 -524 1082 301 -1410 416 442 -50 102 -69 -675 743 749 -513 116 945 429
4031 429 -965 947 295 -369 985 975 -1135 521 729 -775 233 763 -112 -394 1209 174 -676
4048 -676 147 320 221 327 798 -744 34 1165 -355 -601 628 -360 -968 951 248 -1051 165 1211
4066 1211 -265 -363 1526 -944 -70 1087 -338 -357 449 -180 -689 715 82 -748 249 914 -895 -665
4084 -665 616 -166 -1227 583 13 -1124 609 503 -581 576 197 -401 -67 1044 -601 -63 832
4101 832 -400 -687 250 -87 -760 360 733 -657 25 709 -873 187 820 -721 -820 1053 -352 -569
4119 -569 342 382 -97 99 179 -640 -314 360 -186 -369 1409 12 -585 541 352 -790 166 513 -908
4138 -908 -56 1088 -39 -373 417 113 75 845 314 -1018 424 208 -292 475 567 -1218 235 1022 -287
$$ packed form
4012i71P11R15p09m70J606p81j711J826K6m92J52j71o06J418Oj262O29Q29n16
4031D29j394J912o52o64J354j0k110J656K08j504J008N30q75k82J603j035q50
4048f76Q23J73r9J06M71j542P78J131j520k46J229r88o08J919p03j299J216J046
4066A211j476r8J889k470Q74J157j425j9Q06o29n09J404o33q30R97O65j809K30
4084f65J281p82j061J810n70j137J733j06j084J157l79n98L34J111j645N38Q95
4101H32j232k87R37l37o73J120L73j390O82O84j582J060O33j541r9J873j405k17
4119e69R11M0m79J96Q0q19L26O74n46j83J778j397n97J126j89j142R56L47j421
4138i08Q52J144j127l34P90l04l8P70n31j332J442k16n00P67R2j785J453P87j309
$$ plain form
4157 -287 -474 1005 300 -600 472 355 -412 652 58 -1307 -22 715 -715 -316 808 -407 -425 741
4175 741 406 -688 818 452 -776 407 532 -400 -59 761 -256 -780 732 -20 -582 421 499 -882
4193 -882 -624 46 -507 -37 1050 -213 113 664 -598 -1251 1014 -59 -402 498 1217 -891 403 526
4211 526 -92 -284 1009 -289 -1352 479 201 -1343 317 517 -1186 5 947 -863 -455 745 -792
4228 -792 -404 158 217 -233 164 254 -247 85 634 -1107 -143 272 -1205 -682 1225 -630 -789 1358 63
4247 63 -1145 241 366 -342 -28 812 -441 42 992 -102 -908 669 19 -715 372 628 -688 14
4265 14 570 -175 -347 616 92 -552 1069 437 -76 1254 462 -1044 278 1344 -222 186 418 252
4283 252 -519 522 -21 -532 1083 97 -662 304 593 -708 230 482 -702 -522 760 -118 -1372 358
$$ packed form
4157b87j87J479p05r00J072j17p67J064n94j365J285P37j430L99J124j215j8J166
4175G41l35j094J506l66j228J183J25r32L41Q20j017n24J512p52n62J003P8j381
4193h82K58O70n53M70J087j263L26N51j262o53K265j073l43R00P19k108J294J23
4211E26o18j92J293j298j063J831k78j544J660K00j703J191R42j810M08J200j537
4228g92L88N62N9m50L97R0n01L32N49j741R64M15j477N23J907j855j59K147j295
4247F3j208J386J25p08L14Q40j253M83R50j094q06J577o50p34J087K56j316P02
4265A4N56p45j72R63n24o44J621o32n13J330p92j506J322J066j566M08K32j66
4283B52p71J041n43n11J615r86p59R66K89j301R38K52j184J80J282q78j254J730
$$ plain form
4301 358 -555 -1261 425 428 -980 -324 -89 -869 201 1208 -358 -326 473 60 -662 184 622 -704 -150
4320 -150 697 -1287 33 1020 -1007 -283 459 -106 -599 109 908 -1042 -261 -290 -680 -400 854 -429
4338 -429 -566 587 55 -692 284 -817 -460 185 172 -698 -222 1181 -353 -218 1134 -158 -988 -4
4356 -4 -81 -937 627 3 -541 487 560 -379 444 1288 -339 40 998 -278 -1108 1211 -174 -1285 457
4375 457 341 -845 -124 504 -418 -260 523 -551 -74 564 179 -1278 603 368 -948 195 -509 -640
4393 -640 -209 233 -421 -941 364 -107 -459 924 44 -410 753 156 -1047 -85 616 -777 -524 1053
4411 1053 379 -303 782 282 -1242 654 185 -1256 200 875 -763 -676 335 4 -971 916 -443
4428 -443 -314 452 680 -475 265 767 -757 100 938 -49 -545 988 293 -939 466 218 -362 380
$$ packed form
4301C58r13p06J686Lj408O56K35p80J070J007j566L2P99m13p22Q46M38j326N54
4320a50Q47j984J320R87k027P24P42n65m93P08P99j950P81k9l90K80J254j283
4338d29j37J153n32p47R76j101L57O45j3q70M76J403j534J35J352j292q30R84
4356dp7q56J564o24n44J028P3r39Q23Q44j627L79R58j276q30K319j385j111J742
4375D57j16j186P21O28r22J58P83j074M77O38l85j457J881k35j316J143p04j31
4393f40M31M42o54n20J305m71l52J383q80m54J163n97j203R62P01j393K53J577
4411A053o74o82J085n00j524J896m69j441J456O75j638Q7J011l31r75J887j359
4428d43J29P66K28j155P40N02j524Q57Q38r87m96J533o95j232J405k48n80P42
$$ plain form
4446 380 156 -668 378 775 -363 246 357 -378 -256 871 -147 -615 619 745 -640 181 693 -707
4464 -707 -89 1063 -705 -412 577 -342 -537 484 478 -1335 398 428 -724 -91 478 -245 -79 951 -486
4483 -486 -645 1043 -443 -954 596 250 -843 -266 468 -837 -542 577 -653 -778 869 -542 -232
4500 -232 629 623 -412 62 376 -1190 -499 702 -448 -363 1078 -71 -438 330 231 196 -41 472 -64 279
4520 279 0 -380 -762 159 -41 -797 342 14 -554 524 -13 -185 126 766 -365 -410 996 808 -412
4539 -412 468 -167 -590 112 -197 -776 683 17 -789 51 591 -95 46 1088 -1009 -977 172 -279 -1009
4558 -1009 373 366 -518 385 1179 -515 -253 911 -365 -334 633 603 71 243 1331 -459 323 574 -678
4577 -678 -168 1149 335 -432 668 166 -907 487 453 -830 1140 592 -710 74 269 -608 -665 559
$$ packed form
4446C80k24q24J046L97j138O09J11p35J22J127j018m68J234J26j385Q21N12j400
4464g07O18J152j768K93R89r19j95J021oj813J733L0j152O33N69p23J66J030j437
4483d86j59J688j486n11J550l46j093N77P34j305K95J119j230j25J647j411L10
4500b32Q61oj035M74L14j566O91J201j150Q5J441j149l67P68r9l5k37N13n36L43
4520B79k79l80l82R21k00p56J139l28n68J078n37j72L11O40j131m5J406j88j220
4539d12Q80o35m23P02l09n79J459o66q06Q40N40o86J41J042k097L2J149m51p30
4558a009J382pq84R03P94j694K62J164j276L1R67l0n32J72J088j790P82K51j252
4577f78N10J317q14p67J100n02j073J394l4j283J970n48j302P84J95q77n7J224
$$ plain form
4595 559 -625 -654 873 68 -440 1091 821 -526 431 342 -598 -407 483 -290 -187 853 -47 -526 303
4614 303 402 -1071 252 218 -758 -163 249 -579 -466 276 -792 -872 766 75 -526 809 962 -511 -212
4633 -212 977 -760 -347 383 -114 -509 1156 -78 -436 563 294 -572 -10 150 -1090 -176 356 245
4651 245 -315 1125 305 -1021 661 -362 492 -104 577 -668 -416 677 -92 54 794 -386 42 566
4669 566 246 -366 172 -16 -474 788 413 -234 -915 125 124 9 -79 -243 -1549 660 188 -812 486
4688 486 845 155 -304 775 -659 -372 632 -90 -741 -136 140 -5 908 685 -749 -101 1031 1
4706 1 -283 414 -852 45 -359 -651 -77 410 916 -1215 304 772 -10 -491 50 -369 -253 -142 -282 -1425
4726 -1425 425 39 -939 -263 569 -471 -354 1205 -292 -234 94 106 -778 673 443 -1087 730 355
$$ packed form
4595E59j184k9J527q05n08J531k70j347R57q9r40J91Q90p73J03J040r00m79Q29
4614C03R9j473J323l4r76N95M12q28J13P42j068q0J638o91o01J335J53j473K99
4633b12J189j737M13P30m97l95J665j234l58R99k69q66N62J60j240R14N32j11
4651B45n60J440q20j326J682j023Q54n96O81j245K52J093p69J46P40j180M28N24
4669E66l20o12N38j88m58J262l75o47o81J040jj15q8j64j306K209m72j000J298
4688D86L59o90m59J079j434K87J004p22o51O05K76j45R13k23j434O48J132j030
4706Ak84O97j266Q97m04k92N74M87N06k131J519M68p82m81N41m19J16J11j40j143
4726a425J850l86r78O76Q32j040J17J559j497N8L28J2q84J451k30j530J817l75
$$ plain form
4744 355 -809 191 -124 -92 -684 821 -924 -636 811 -461 -374 484 578 -375 455 106 -686 -118 558
4763 558 121 -205 772 -296 -795 305 598 -556 345 701 -721 47 845 -435 -330 1109 128 -807
4781 -807 521 -231 -247 355 562 -655 187 668 -396 -354 878 -724 -364 610 384 124 466 473 -531
4800 -531 -169 766 -456 -7 280 -583 -74 992 -177 -855 288 -180 -976 385 325 -306 172 667 26
4819 26 -137 858 -403 -616 646 407 -60 314 335 -287 -501 83 -268 -8 339 -728 -137 621 -458
4838 -458 -649 317 324 -652 753 75 -1066 633 324 -365 -718 107 -187 21 451 36 -791 92 658 -431
4858 -431 42 222 -896 -275 1402 5 13 580 244 -687 155 -278 -415 95 699 -375 155 395 205
4877 205 -359 1323 22 -554 581 614 -803 219 646 -278 260 660 -473 -350 578 -40 -561 435
$$ packed form
4744C55j164J000l15L2n92J505j745K88J447j272Q7Q58R4r53Q30l49p92N68O76
4763E58m37l26R77j068m99J100K93j154R01L56j422P68P98j280J05J439r81r35
4781h07J328p52j6O02K07j217Q42M81j064M2J232j602L60R74k26k60L42Pj004
4800e31L62R35j222M49K87q63N09J066j169o78J143m68p96J361o0o31M78M95o41
4819B6j63R95j261k13J262k39m67L74K1o22k14N84l51K60L47j067N91P58j079
4838d58j91R66Pr76J405o78j141J699l09o89l53Q25k94K08M30m15q27Q83N66j089
4858d31M73J80j118O21J677j397QN67l36r31Q42m33j37N10O04j074N30K40j90
4877B05n64J682j301n76J135L3j417J022M27r24N38M00j133J23R28o18n21R96
$$ plain form
4895 435 48 -552 -380 295 -179 -362 56 -782 69 284 -12 -289 385 -435 -159 828 659 -581 442
4914 442 633 -492 111 190 -342 -939 791 209 750 353 -276 -586 -161 881 -574 6 485 -80 -239
4933 -239 1049 -387 -333 487 -197 -868 394 443 -98 -101 403 -575 181 1058 -909 -537 632 -38 -788 867
4953 867 7 -380 -74 423 -743 52 739 -878 105 -139 62 -199 640 487 568 122 401 -679 -490
4972 -490 524 -924 -745 324 451 -308 498 225 -298 472 -341 -639 158 736 -830 356 696 -378
4990 -378 -764 665 -699 -1117 485 54 -630 -533 -337 -279 -608 1283 -592 -96 673 -96 -319 -154 300
5009 300 -103 391 561 -80 542 573 -581 -167 405 -349 135 311 -314 -266 687 486 -81 191 -231 -176 -283
5030 -283 506 -29 -280 672 703 -399 791 -81 -463 -278 98 -749 151 652 -875 -552 425 -478 -148
$$ packed form
4895D35l87o00J72O75m74j83M18q38Q51K15k96k77O74q20K76R87j69j240J023
4914D42J91j125O03P9n32n97J730n82N41l97o29l10M25J042j455N80M79n65j59
4933b39J288j436N4Q20o84o71J262M9n41lN04r78P56Q77j967L72J169o70p50J655
4953H67q60l87L06M97j166P95O87j617R83k44K01k61Q39j53Q1m46K79j080J89
4972d90J014j448J79J069J27p59Q06k73n23P70q13k98P97N78j566J186L40j074
4990c78l86J429j364m18J602m31o84R7J96N8l29J891j875M96P69p69k23J65M54
5009C00m03M94J70o41O22L1j154M14N72p54M84J76o25M8R53k01n67K72m22N5j07
5030b83P89n35k51R52L1j102J190q72l82J85L76q47R00N01j527L23R77r03L30
$$ plain form
5049 -148 1356 406 -373 562 80 -363 461 96 -61 478 518 -84 -474 -141 187 -689 689 365 -757
5068 -757 190 105 -22 124 617 -460 328 7 9 -514 357 152 -180 380 361 -813 -593 -182 -89 -18 41 -313
5090 -313 -418 -641 95 -299 825 337 -832 201 603 -146 -72 732 -53 -156 1000 -124 -170 150 533
5109 533 -552 348 201 -629 194 338 -41 -62 -19 107 -338 83 75 -1061 -82 165 55 -22 -101 373 269
5130 269 725 -82 -401 478 -593 -574 -45 191 -604 -14 525 -780 297 163 -1016 -144 470 201 -644
5149 -644 -71 382 -351 59 754 -232 -33 343 -718 -227 296 -614 -923 376 -475 -206 294 -194 -186 205
5169 205 753 -361 -135 629 277 -755 385 -281 -946 963 202 -386 100 -586 -542 306 839 -117 421
5188 421 609 -853 -494 -179 -331 -451 1145 862 -33 107 398 -310 -555 792 -207 -326 666 -97 -237
$$ packed form
5049a48J504r50p79R35m82m43Q24l65j57N39M0o02l90L33L28q76J378l24j122
5068g57R47q5j27J46M93j077P88l21Kn23Q71k05l32N60j9j174K20M11R3P1N9l54
5090c13j05k23P36l94J124m88j169J033M02p49P4Q04p85j03J156j124m6L20L83
5109E33j085R00j47q30Q23J44l79k1M3J26m45M21qj136R79K47j10p7p9M74j04
5130B69M56q07l19Q79j071J9N29K36p95N90N39j305J077j34j179Q72O14k69q45
5149f44N73M53p33M10O95r86J99L76j061M91N23r10l09J299q51K69N00m88QL91
5169B05N48j114K26P64l52j032J140o66o65J909p61n88M86o86M4Q48N33r56N38
5188D21J88j462L59L15j52j20J596k83q95J40K91p08k45J347r99j19R92p63j40
$$ plain form
5207 -237 490 -139 -925 2 30 -621 -152 23 -24 315 488 110 -352 -130 28 -773 47 -52 -789 477 196
5228 196 -779 -43 267 -12 243 381 317 -214 -514 -120 -379 494 184 -839 -43 519 -98 -331 602 198
5248 198 -290 -26 82 328 764 300 -1151 -49 567 -150 -483 -148 320 -103 305 371 -298 635 140 -521
5268 -521 -482 309 -177 -651 556 -559 -398 811 188 -595 139 447 -816 354 376 -1018 -208 -73 300
5287 300 107 702 225 -839 423 1279 -416 288 405 -386 -4 323 -26 -84 473 -188 -956 288 -414
5306 -414 -531 641 206 -580 -68 152 -857 184 206 -279 -498 22 195 -393 107 -199 -783 108 768
5325 768 -369 -424 771 -135 -511 -385 -4 -419 143 391 -871 232 268 -332 -267 358 -479 148 14 -277
5345 -277 -233 371 253 -327 106 313 -467 -245 604 -106 -559 409 -64 -319 -97 -411 -499 216 -103 -440 121
$$ packed form
5207b37P27o29p86R27K8o51M69J75m7L39J73l78m62K22J58q01Q20r9p37J266k81
5228A96r75P36L10k79K55J38o4n31l00L94k59Q73l10j023P96N62o17k33R33m04
5248A98m88K64J08K46M36m64j451J102O16p17l33L35M68m23M08O6o69R33m95o61
5268e21L9P91m86m74J207j115J61J209o23p83P34L08j263J170K2j394Q10J35L73
5287C00j93N95m77j064J262Q56j695P04J17p91L82L27l49n8N57o61p68J244p02
5306d14j17J172m35p86N12K20j009J041K2m85k19N20J73n88N00l06n84Q91O60
5325G68j137n5J195r06l76J26L81m15N62K48j262J103L6o00O5O25q37O27j34k91
5345b77M4O04j18n80M33K07p80K22Q49p10m53R68m73k55K22l14q8P15l19l37N61
$$ plain form
5366 121 42 -44 -340 292 -510 254 333 -368 -1009 101 475 -1082 35 -499 -133 69 267 -119 206 212 -444
5387 -444 -88 69 221 -265 160 -123 -331 227 279 -340 133 498 176 335 120 369 -12 212 4 -339
5407 -339 574 758 -231 -23 2 124 -445 950 22 -518 432 -149 185 -82 614 -125 641 598 -508 -192
5427 -192 785 263 -463 267 577 -254 365 415 -433 601 1183 -1245 21 -64 -884 141 630 -543 -419
5446 -419 753 178 -499 223 351 -370 0 -222 -433 -329 -26 365 -911 418 410 -1120 -225 -9 -13 -122
5466 -122 621 114 -89 105 -138 -493 -510 -26 -878 166 343 -207 -190 215 -541 -445 537 200 -85 438 13
5487 13 -205 525 453 4 228 -281 -28 -56 643 -381 391 154 -86 -375 411 363 -639 -554 47 146 94 572
5509 572 -705 -433 324 -255 -971 973 73 0 718 -64 -439 134 614 -44 -480 -29 -667 176 126 75
$$ packed form
5366A21p9q6k96O32q02P64P9p01o41J110L74j557J117n34L66K02J98l86L25Oo56
5387d44L56J57J52m86M25k83k08N58N2o19M73L65l22J59k15K49l81K24k08l43
5407c39R13J84r89K08K5J22n69J395r28n40R50n81L34k67O96p39P66m3j106L16
5427a92R77n22p26P30L10q31O19N0q48J034N82k428J266q5q20J025M89j173J24
5446d19J172n75o77P22J28p21L70k22k11J04L03L91j276J329qj530Q95K16mj09
5466a22P43n07k03J94k43l55j7M84q52J044J77n50J7M05p56R6R82l37k85N23m25
5487A3k18P30p2m49K24n09K53k8O99j024P72k37k40k89P86m8j002Q5O01R9n2M78
5509E72j277K72P57n79p16J944r00p3P18p82l75N73M80o58m36M51o38Q43n0n1
$$ plain form
5529 75 -331 137 426 -461 306 -283 -317 -295 275 41 204 229 -316 -10 149 -119 -363 -93 184 -66 273
5550 273 393 -951 213 328 -573 282 50 96 -441 194 164 100 428 253 -179 -339 -96 290 -302 -111
5570 -111 -532 -296 317 58 -915 -29 -116 -402 -137 165 -20 18 268 -270 280 688 -44 412 311 -73 -98
5591 -98 17 554 -120 -209 296 -435 -782 398 -642 -576 -9 -376 -801 180 242 -1128 -510 307 -215 398
5611 398 544 -535 -698 398 -370 417 587 328 225 172 -184 -355 62 370 350 -708 643 478 -249
5630 -249 976 667 -415 497 111 -801 24 252 -218 -432 385 -179 652 281 291 -429 174 405 -719
5649 -719 -144 402 364 -85 829 375 -248 97 668 -253 -425 125 -210 329 -6 -1030 -41 641 -7 -447
5669 -447 510 364 147 687 30 -81 213 730 -321 342 -32 317 572 38 94 -480 202 -406 -453 245
$$ packed form
5529G5m06M68K89q87P67n89l4K2N70k34J63K5n45L06J59k68k44K70K77k50L39
5550B73J20j344J164J15r01Q55k32M6n37O35l0o4L28j75m32j60K43L86n92J91
5570a11m21K36O13k59r73Q86q7k86K65L02j85L8K50n38N50M08p32M56j01l84k5
5591i8J15N37o74q9N05p31l47J180j040O6N67l67m25R81O2j370O18Q17n22O13
5611C98J46j079j63J096p68P87J70k59j03n3l56j71M17L08k0j058J351j65p27
5630b49J225l09j082R12l86r12Q25K28m70k14Q17n64Q31l71J0p20O03K31j124
5649g19N75N46l8m49R14m54o23L45N71r21j72N50l35N39l35j024R89O82o48m40
5669d47R57j46k17N40o57j11K94N17j051O63l74L49K55n34N6n74O82o08m7O98
$$ plain form
5689 245 557 -697 95 622 -220 -264 418 -270 -599 -208 14 406 269 -227 -410 399 590 -248 -643 443
5709 443 -576 -34 611 80 -762 403 -45 -1194 276 296 -609 187 -259 -373 -363 184 -401 34 680
5728 680 -216 -216 842 152 -759 -339 312 -727 -340 209 -380 -167 55 -225 -1005 213 -244 40 65 568
5748 568 86 -243 345 77 -413 78 -500 -701 322 67 86 -137 520 -365 217 198 -302 40 954 -442
5768 -442 326 714 -128 -693 706 424 -713 40 121 -92 -310 -128 -276 -916 241 -151 -462 -14 -104 107
5788 107 36 -25 202 -298 -42 -228 -771 172 -140 -261 688 183 -95 391 211 -753 -308 367 -273 -25 334
5809 334 474 3 212 360 -524 368 231 -247 -288 907 36 349 563 -258 180 61 348 33 639 -348
5829 -348 142 -54 1079 178 180 420 -155 16 571 18 -702 284 404 326 -298 127 -353 -183 22 -280 -142
$$ packed form
5689B45L12j254P92N27q42m4O82o88l29L91K22L92j37m96j83Q09J91q38l95J086
5709D43j019N42O45n31q42J165m48j149J470K0r05P96m46j14J0N47n85M35O46
5728F80q96%J058o90r11M20O51j039L87N49n89K13K22k80p80J218m57K84K5N03
5748E68m82l29N88k68m90M91n78k01J023k55J9k23O57q85N82j9n00L42R14j396
5768d42P68L88q42n65J399k82j137P53Q1k13k18J82j48o40J157l92l11M48r0K11
5788A07p1o1K27n00K56j86n43R43l12j21R49n05k78M86j80r64M45O75o40K48L59
5809C34J40m71K09J48q84Q92j37m78m1J195q71L13K14q21M38j19K87l15O06r87
5829c48M90j96J133r01KK40n75J71N55n53p20R86J20p8o24M25m80J70K05l02J38
$$ plain form
5850 -142 377 -162 -155 -66 -479 -850 -49 477 120 71 127 127 -474 360 -288 77 -529 -665 357 172 -187 -520
5872 -520 -57 -363 381 381 -138 -766 -603 546 -424 -41 413 417 81 -607 -399 -419 -268 -98 -422 -63 143
5893 143 -69 -189 255 -359 -67 145 -290 -100 491 198 -194 384 344 -607 -14 -54 -222 -33 875 297 -561
5914 -561 453 -111 -414 -48 619 -674 57 216 -559 -229 314 147 -560 648 166 -66 48 -141 -1062
5933 -1062 168 688 -82 132 174 -111 127 628 58 -559 365 652 -365 256 338 -266 699 311 -455 223
5953 223 -26 169 -371 193 -10 -541 212 488 -273 -407 -156 52 -284 533 -228 -67 534 -366 -210 -139
5973 -139 -165 373 -271 1018 -397 92 455 -432 -142 -21 371 -243 1015 -358 -631 451 45 -402 -702
5992 -702 165 17 -298 -77 -269 87 16 348 -503 -236 93 212 -213 233 -403 -295 544 -34 196 344
$$ packed form
5850a42N19n39PQ9m13l71Q01N26l57m9N6%o01Q34o48L65o06j36J022j85l59l33
5872e20M63l06P44%n19o28J63J149r70L83M54Ml36o88K08k0J51J70l24L59K06
5893A43k12j20M44o14K92K12m35J90N91k93l92N78m0r51N93m0j68J89R08n78q58
5914e61J014n64l03L66O67j293P31J59p75L30N43j67p07J208m82k32J14j89r21
5933a062J230N20p70K14M2k85K38N01n70o17R24K87j017O21Q2o04R65l88p66O78
5953B23k49J95n40N64k03n31P53K76p61j34K51K08l36Q17p61J61O01r00J56P1
5973a39k6N38o44J289j415M89L63q87K90J21L92o14J258j373k73J082m06m47l00
5992g02Q67j48l15K21j92L56p1L32q51K67L29J19m25M46o36J08Q39n78K30J48
$$ plain form
6012 344 941 -362 -19 719 99 -116 1066 -105 -408 428 180 -271 833 -240 -251 136 -361 -280 -25
6031 -25 -165 -264 -459 832 565 -562 345 337 43 765 13 -91 -426 1070 -179 -191 471 -103 -326 315
6051 315 3 138 -58 259 -204 194 805 0 -104 175 52 127 735 25 -248 124 12 18 -38 227 -238
6072 -238 -465 -89 -356 -227 337 -73 -283 -11 323 456 87 338 -165 418 -147 -309 -601 -224 -331 483
6092 483 -90 61 155 470 10 -657 -233 4 -84 -397 1004 -523 -225 1014 602 -132 529 272 -624 163
6112 163 -31 -375 338 306 368 -274 -71 74 128 236 -55 -219 53 199 -782 312 456 -254 206 -444 -556
6133 -556 283 583 -113 39 668 -428 -928 -476 -10 -365 343 704 241 151 126 -333 -212 167 -338 -827
6153 -827 -110 -254 -408 470 -156 -181 148 1411 9 -393 149 -211 -318 -334 -179 156 -318 123 -331 142
$$ packed form
6012C44N97j303L43P38o20k15J182j171l03Q36k48m51J104j073j1L87m97Q1K55
6031b5j40r9j95J291k67j127R07qk94P22p52j04l35J496j249j2O62n74k23O41
6051C15l12J35j96L17m63L98O11q05j04K79j23P5O08p10k73L72j12On6K65m65
6072b38k27L76k67J29N64m10k10K72L34J33l69K51n03N83n65j62k92L77j07Q14
6092D83n73J51R4L15m60o67M24K37q8l13J401j527K98J239m12p34O61k57q96P87
6112A63j94l44P13l2O2o42K03J45N4J08k91j64K72J46r81J094J44p10M60o50j12
6133e56Q39L00o96J52O29j096n00M52M66l55P08L61m63r0k5m59J21L79n05m89
6153h27P17j44j54Q78o26k5L29J263j402m02N42l60j07j6J55L35m74M41m54M73
$$ plain form
6173 142 245 162 -264 825 526 209 502 528 -110 354 317 67 197 694 -629 -707 284 163 -672 646
6193 646 218 -524 -283 748 -361 -626 87 -433 -312 224 -245 165 -237 125 287 141 -147 -276 267
6212 267 -172 270 298 -307 168 529 -42 -52 -418 521 -54 132 140 97 -278 256 730 -508 -436 47 139 223
6234 223 410 14 -185 -79 -290 97 -200 311 -319 324 87 -436 -460 497 -425 -519 67 -217 -597 1183
6254 1183 453 -175 -347 436 -795 -236 284 -281 -310 -209 -213 -293 378 -89 -493 104 514 -26 478 -63 -158
6275 -158 -522 324 -468 -582 299 182 -161 535 -257 -615 29 107 18 659 -175 -448 -36 210 300 -135 242
6296 242 -14 -73 -33 -2 58 -219 81 152 -18 464 -121 -309 507 286 -60 884 756 100 23 -237 -386 -301
6318 -301 -130 -384 -306 503 -839 -519 25 42 -637 78 -153 -408 219 321 583 -16 1094 -61 -281 431
$$ packed form
6173A42J03q3m26J089k99l17K93K6o38M64l7k50J30M97j323p8R91j21q35J318
6193F46m28p42K41J031j109k65P13n20J21N36m69M10m02L62J62j46k88j29N43
6212B67m39M42K8o05M75L61n71j0l66R39n75J86Qm3l75N34M74j238P2M83R2Q4
6234B23J87l96j99J06k11L87k97N11o30O43k37n23k4R57r22r4N86k84l80J780
6254A183p30o28j72P83j231N59N20n65k9J01mq0O71m67m04N97M10n40N04n41r5
6275a58l64Q46p92j14Q81j17l43O96p92l58O44P8q9O41q34k73M12K46R0m35L77
6296B42k56n9M0L1O0k77L00P1j70M82n85j88Q16k21l46R44j28o56p7k60j49Q5
6318c01J71k54P8Q09j342L20N44J7o79P15k31k55O27J02K62n99J110j155k20P12
$$ plain form
6338 431 495 -7 328 121 272 487 494 -418 -489 162 -87 -307 63 329 -550 -132 30 -54 -240 43 -117 -358
6360 -358 509 346 40 -196 93 -318 96 218 301 107 -390 -45 -293 297 -264 -705 362 92 -371 513
6380 513 138 -295 152 287 52 195 310 262 -185 315 -498 158 444 112 -318 643 -29 -355 -422 212 234
6401 234 368 -139 186 -498 453 356 -118 518 -336 134 44 -75 -216 374 21 -407 183 656 -448 21
6421 21 156 654 64 -511 204 -505 -570 123 -683 29 351 -100 -70 557 -291 -460 274 2 81 53 255 -54
6443 -54 -212 94 -14 271 -112 -453 1 -81 772 -647 171 -381 -276 442 -227 28 213 182 -214 -295 409
6464 409 163 -15 454 221 -135 -154 315 -549 -605 736 -492 -1425 179 575 -285 -309 591 -455 359 687
6484 687 -776 -105 414 -508 39 94 432 -311 -336 116 -462 310 836 -75 385 389 -205 -473 -325 -491 -230
$$ packed form
6338D31O4n02L35k07J51K15Pr12p1O51k49k20L70K66q79M18J62q4j86K83j60k41
6360c58Q67j63l06k36K89m11M14J22Q3j94m97L45k48N90n61m41J067k70m63Q84
6380E13l75m33M47J35k35J43J15m8m47N00q13O56K86l32m30R61o72l26o7O34K2
6401B34J34n07L25o84R51r7m74O36q54M70r0j19j41N90l53m28N90M73j104M69
6421B1J35M98n90n75P15p09o5O93q06P12L22m51L0O27q48j69P34k72P9k8K02l09
6443e4j58L06j08K85l83l41M54q2Q53j419Q18n52J05P18o69K55J85l1l96q1P04
6464D09k46j78M69k33l56j9M69q64n6J341j228r33J604L96q60k4R00j046Q14L28
6484F87j463O71N19r22N47N5L38p43k5M52n78P72N26r11M60Mn94k68J48j66K61
$$ plain form
6505 -230 -225 47 458 25 553 -158 -285 -65 212 -225 -384 125 -19 -463 -662 82 -378 275 -491 -215 380
6526 380 445 -369 -154 -246 -519 355 -188 -473 684 120 333 -237 -23 -80 -469 572 -73 526 416 -3
6546 -3 -436 655 -172 -35 272 273 315 -64 498 -258 135 334 -938 -420 -140 124 -168 291 -190 -1013 157
6567 157 735 -574 -640 231 383 39 717 388 51 563 -278 -217 734 -143 -128 -277 482 -587 572 255
6587 255 163 52 -301 -72 -381 243 119 162 -365 -278 -97 314 238 -465 -193 312 54 31 705 -405 -71
6608 -71 200 159 88 -619 -143 -632 119 46 539 381 410 765 -383 -71 -334 -384 156 667 -1 -204 553 132
6630 132 120 410 -383 -173 -126 34 -400 218 209 -220 455 248 245 -112 1123 588 -179 648 62 -504 -174 262
6652 262 234 73 140 304 -196 502 -148 33 654 143 -681 165 248 29 -617 899 -37 259 969 -554
$$ packed form
6505b30NK72M11m33N28p11j27K20K77m37j59N09j44m44j99P44m60O53p66K76N95
6526C80O5q14K15r2k73Q74n43k85J157n64K13n70K14n7l89J041o45N99j10m19
6546cm33J091q27J37L07JM2l79N62p56L93J99j272N18K80K64k92M59m81q23J170
6567A57N78j309o6Q71J52l44O78l29l37N12q41O1R51q77J5j49P59j069J159l17
6587B55r2j11l53K29l09O24j24M3n27Q7J81M11p6p03K72N05k58k3O74j110L34
6608g1K71m1p1p07M76m89P51p3M93j58K9L55j148L12k63n0N40N11o68k03P57m21
6630A32j2K90p93K10M7J60m34O18rm29O75k07ll57J235n35p67Q27n86n66L30M36
6652B62k8j61O7J64n00O98o50J81O21n11q24Q46Q3k19o46J516r36K96P10j523
$$ plain form
6672 -554 -608 163 253 -383 -296 248 -129 -146 103 -270 -141 399 251 -481 -112 681 111 -446 612 -272 -348
6693 -348 322 -215 24 481 289 217 -35 -358 102 311 -203 27 -339 435 52 -31 96 -214 -433 -202 363
6714 363 128 610 -242 -541 -138 -79 -249 -564 482 479 158 417 256 483 -507 -443 -214 -150 102 -94 88
6735 88 -92 -18 -7 -205 656 -830 17 337 -730 829 212 345 200 119 324 18 268 -553 -15 900
6755 900 63 291 51 365 -570 41 459 -396 38 98 -841 -264 614 -350 -390 -371 252 -440 298 -264 -371
6776 -371 405 134 -6 -275 413 -339 190 95 -565 -266 554 47 576 388 361 54 383 -426 205 -766 -395
6797 -395 185 257 470 536 -35 22 367 -493 -196 -310 -357 12 -135 -409 54 305 170 -47 -33 54 -331 332
6819 332 53 -409 -171 301 45 -218 319 450 284 -372 75 -264 67 197 78 504 428 -308 -185 470
$$ packed form
6672e54n4P71R0o36Q7N44l77j7K49l73J29N40j48p32L69P93n70n57J058q84p6
6693c48O70n37K39M57j92p2k52l23M60K09n14K30l66P74l83q3J27l10k19K31N65
6714C63k35M82q52k99M03N9j70l15J046ll21K59j61K27r90O4K29O4K52j96J82
6735H8j80P4J1j98Q61j486Q47L20j067J559o17J33j45q1K05l06K50q21N38R15
6755I00q37K28k40L14r35O11M18q55M34O0r39N77Q78r64m0J9O23o92P38n62j07
6776c71P76k71j40k69O88p52N29r5o60K99Q20n07N29j88k7l07L29q09O31r71L71
6797c95N80P2K13O6n71N7L45q60K97j14m7L69j47k74M63K51j35k17J4Q7l85O63
6819C32k79m62K38M72k56k63N37J31j66o56M47l39L31J30j19M26p6p36J23O55
$$ plain form
6839 470 138 -343 -45 -155 221 -12 97 -495 486 276 207 -231 424 -546 -371 -134 -402 -206 933 223
6859 223 -628 159 -577 -20 573 419 298 -231 211 103 -699 938 60 86 640 21 -352 402 410 384 -202
6880 -202 -68 -139 -424 407 -821 279 -445 -201 -471 -495 -253 -162 -147 -539 -24 -20 420 -151 73 399 -285
6901 -285 168 376 224 240 364 117 -57 -358 351 -299 -329 666 309 337 -547 115 -700 -146 -403 50 -57
6922 -57 -330 -541 107 132 434 -577 132 423 -135 -261 102 193 86 528 -125 -116 635 -687 678 174 217
6943 217 124 732 -5 -247 238 612 -344 -202 610 173 160 -395 -264 -115 658 -428 -119 -279 99 -956
6963 -956 337 -66 -658 -207 636 130 -813 153 -474 -461 162 -379 320 -420 -238 -361 -29 -141 10 -233
6983 -233 -196 476 -150 -22 -193 93 -928 71 -106 75 -109 175 -441 702 -85 -481 475 -492 -705 -220
$$ packed form
6839D70l32m81K98j10L76k33J09n92R81k10o9m38O55r70J75K37k68J96J139p10
6859B23q51P87p36N57N93j54j21n29M42j08q02J637q78K6N54o19l73P54Qk6n86
6880b02J34p1k85Q31j228J100p24K44k70k4K42R1J5l92N15MM40n71K24L26o84
6901b85M53K08j52J6J24k47j74l01P09o50l0R95l57K8q84O62q15N54k57M53j07
6922e7k73k11O48K5L02j011P09K91n58j26L63R1j07M42o53RP51j322J365n04M3
6943B17r3O08p37k42M85L74r56J42Q12m37j3n55J31J49P73j086L09j60L78j055
6963i56J293m03n92M51Q43n06r43R66o27J3O23n41O99p40J82j23L32j12J51k43
6983b33L7O72o26J28j71K86j021R99j77J81j84K84o16J143p87l96R56r67k13M85
$$ plain form
7003 -220 361 -402 34 -139 181 744 701 131 -170 -261 -263 83 -505 613 248 -269 485 -368 -200 650 -567
7024 -567 104 299 -441 186 166 12 -30 154 141 -454 181 -248 -296 -196 480 -309 531 302 -804 64 39
7045 39 -82 -180 -130 -86 -111 39 671 -50 -75 204 87 -316 -182 258 -356 182 -90 331 -303 -118 -225 -725
7067 -725 -713 280 69 392 295 -6 631 -27 217 212 889 -200 -442 299 -1092 -490 -256 140 -336 120 476
7088 476 -247 -41 36 63 -191 73 -275 -826 95 -472 -62 130 -183 -83 -466 261 -236 422 -14 -446 -254
7109 -254 377 -27 131 336 -440 -662 421 144 12 5 -242 218 -320 670 -81 -505 366 68 -371 -54
7129 -54 49 -381 191 190 -9 193 17 375 -247 -191 968 113 -46 289 -359 241 169 333 227 -27 -206
7150 -206 -228 632 388 -825 534 -50 184 125 119 197 437 -363 -60 509 439 107 -249 675 -365 47 828
$$ packed form
7003b20N81p63M36j73L20N63m3n70l01r1kL46n88J118l65n17P54q53J68Q50j217
7024e67O71J95p40O27k0j54m2J84j3n95O35m29m8J00O76p89Q40k29j106Q68k5
7045C9j21r8N0M4k5J50O32p21k5K79j17m03J34M40o14N38k72M21o34J85j07n00
7067g25J2R93k11L23r7l01O37o58K44nO77j089k42P41j391O02K34L96m76M56L56
7088D76p23K06P7K7k54K64l48n51R21n67M10J92l13J00l83P27m97O58m36m32J92
7109b54O31m04J58K05p76k22J083k77j32pk47M60n38R90p51m24Q71k98m39L17
7129e4J03m30N72jj99K02j76L58o22N6J159q55j59L35o48O00p2J64j06k54j79
7150b06k2Q60k44j213J359n84K34n9oP8K40q00L03N69p0l32l56R24j040M12P81
$$ plain form
7171 828 408 -609 -202 607 -347 7 431 72 100 297 213 -367 -198 -180 336 -144 404 -61 -114 -570 -402
7192 -402 288 -424 -517 142 470 119 430 11 -63 -50 371 157 -531 62 720 62 -193 -73 -390 -448 562
7213 562 143 -435 639 134 -28 -343 605 242 142 -129 -178 -1027 -89 -4 -93 176 1016 -187 -499 214
7233 214 390 -24 -22 -72 -395 510 433 177 -190 -459 -245 398 463 -348 239 279 38 -54 -173 -248 367 520 241
7256 241 38 63 647 64 290 -21 -415 -566 107 85 -312 215 -273 432 -81 -93 -123 -228 -52 -401 -284
7277 -284 545 -117 218 -318 -115 -577 -526 364 -827 438 379 83 160 -118 -387 82 415 -6 -167 530
7297 530 205 -307 -256 537 -33 852 -204 -249 73 -19 -102 -550 316 -517 -560 147 -119 -177 248 827 61 -9
7319 -9 156 -4 650 491 438 -636 -222 -384 -30 198 -180 -508 -62 106 -299 -579 -342 -30 -578 29 -409
$$ packed form
7171H28m20j017M07Q09r54L54M24l59K8J97q4n80J69J8N16m80N48m65n3m56J68
7192d02O90p12r3O59L28l51L11m19p4J3M21k14o88N93O58o58k55J20l17n8J010
7213E62m19n78J074n05j62l15R48l63j00k71m9q49R38Q5q9K69Q40j203l12P13
7233B14J76m14Kn0l23R05p7k56l67k69K14O43O5q11N87M0k41r2j19p5O15J53k79
7256B41k03K5N84n83K26l11l94j51O73k2l97N27m88P05n13j2l0j05J76l49J17
7277b84Q29o62L35n36K03m62N1Q90j191J265n9k96P7k78k69M69L33m21j61O97
7297E30l25n12N1P93n70Q85j056m5L22r2q3m48Q66q33m3P07k66n8M25N79p66p0
7319iJ65j60O54j59n3j074M14j62L54K28l78l28M46J68m05k80K37L12n48O07m38
$$ plain form
7340 -409 -71 161 388 -40 81 -20 -224 -344 196 51 -611 704 224 -469 -93 55 -298 -124 8 -270
7360 -270 600 403 141 -209 -314 391 -81 -5 -168 -83 -26 181 -294 -213 283 -412 -540 178 -100 -303 913
7381 913 -86 -165 142 538 -426 -71 -219 116 136 -60 286 -766 -20 193 -261 234 -255 -332 341 245 -560
7402 -560 163 -14 332 -85 947 -148 -240 -90 154 7 341 -89 64 218 424 -115 54 503 -33 -1051
7422 -1051 -601 369 -570 -345 18 -286 295 63 -413 -101 419 -192 -192 422 -288 394 145 -665 99 496
7442 496 211 -882 -97 -100 -475 -155 286 28 294 -391 -998 -21 -49 242 -807 -69 258 -197 301 -626
7462 -626 -492 13 167 -48 -253 343 -22 225 -219 -39 -711 15 237 668 -43 241 -597 463 647 432
7482 432 -184 44 12 -465 269 358 594 -680 -100 -664 143 216 -176 -242 631 144 -220 -50 196 123 663
$$ packed form
7340d09L38K32K27m28J21j01k04j20N40j45o62J315m80o93L76J48l53J74J32k78
7360b70Q70j97k62l50j05P05m72P6j63Q5N7K07m75Q1M96o95j28P18k78k03J216
7381I13r99p9L07L96r64L55j48L35K0j96L46j052P46K13m54M95m89p7O73r6q05
7402e60P23j77L46m17J032j095r2J50K44j47L34m30J53J54K06n39J69M49n36j018
7422a051M50R70r39K25L63l04N81k32m76L12N20o11%O14p10O82k49q10P64L97
7442D96k85j093P85ll75L20M41k58K66o85o07R77k8K91j049P38L27m55M98r27
7462f26J34N05J54k15k05N96l65K47m44J80o72P26K22M31p11K84q38J060J84k15
7482D32o16K28l2m77P34Q9K36j274N80n64Q07P3l92o6Q73m87l64J70K46p3N40
$$ plain form
7503 663 -285 -473 -47 -30 310 -242 471 -605 174 -580 -529 -325 37 90 -520 707 -310 -181 -168 -143 123
7524 123 -331 561 -227 -59 123 707 -439 168 467 -248 -93 140 -102 268 -647 273 -257 66 -302 -480
7544 -480 -245 14 175 -155 441 56 -885 125 99 142 -498 -355 -369 -334 276 227 237 29 -39 -356 -16 457
7566 457 6 -108 463 -307 -383 -161 -963 217 554 -607 9 212 -246 -587 121 233 210 542 414 -363
7586 -363 -32 368 -29 -48 560 -415 368 5 -26 -393 622 383 -114 -6 -110 278 104 175 -69 -614 580
7607 580 -225 158 132 -45 -99 -651 236 -902 -277 -125 -230 336 -7 173 409 395 554 237 -259 -403 -190
7628 -190 -40 -50 -565 -307 235 -66 -82 -61 -286 -471 212 146 -229 -647 -326 -203 -821 242 -31 535 -275
7649 -275 -36 72 -480 130 -336 -45 -762 -288 -97 -318 -662 -166 831 -754 -411 -155 -427 -609 -122 252
$$ packed form
7503F63r48j88M26J7L40n52P13j076P79p54N1K04L62N3o10J227j017J29J3K5K66
7524A23m54Q92p88J68J82N84j146O07K99p15J55K33k42L70r15R20n30L23l68j78
7544d80K35K59J61l30N96l85r41J010k6M3o40J43j4L5O10m9J0k08o8l17L40M73
7566D57m51j14N71p70p6K22q02J180L37j161O16K03m58l41P08J12k3L32j28p77
7586c63L31M00l97j9O08r75P83l63l1l67J015k39m97J08j04L88j74P1k44n45J194
7607E80q05L83k6j77n4n52Q87j138O25J52j05N66l43J80K36j4J59l17m96j44K13
7628a90J50j0n15K58N42l01j6K1k25j85O83o6l75m18L21J23o18J063k73N66q10
7649b75K39J08n52O10m66K91p17M74J91k21l44M96R97j585L43K56k72j82M87L74
$$ plain form
7669 252 -435 -371 -63 -144 87 10 188 -210 146 65 47 -35 -212 54 171 382 -176 -219 84 -19 74 27 304
7692 304 33 -173 535 -155 330 657 80 173 776 53 411 -190 -144 -17 -52 -49 145 -204 327 -433 -61 295
7714 295 174 -69 488 121 -1188 -288 312 -79 362 -178 -355 157 252 -106 -237 -314 482 -270 260 -575
7734 -575 -297 -450 73 -40 -229 -165 520 612 563 -280 -104 609 -674 -119 670 172 30 -257 116 -375 284
7755 284 618 180 -243 275 61 -419 838 625 19 -98 -268 -195 -513 910 136 41 209 -713 -603 337
7775 337 21 -501 -281 135 -260 636 -265 -400 -273 572 -102 -51 -337 237 25 214 -191 115 132 126 -287
7796 -287 -736 435 293 2 -851 142 -330 201 -3 -139 -192 -743 354 374 96 -163 158 190 249 -141 163
7817 163 66 183 140 222 -53 715 619 -279 156 -211 258 -764 120 -17 -339 -167 -248 -627 -463 68 146 -325
$$ packed form
7669B52o87O4L08q1K31p7J78l98L56q1j8q2j77K66J17K11n58m3L03j03R3m7K77
7692C04k71k06P08o90M85L27n77R3O03p23L58o01M6J27l5LJ94l49N31p60L72L56
7714B95j21k43N57l67j309R00O00l91M41n40j77N12R5l58j31p7P96p52N30q35
7734e75K78j53N23j13j89O4O85R2m9q43J76P13j283N55P89m98j42k87L73m91O59
7755B84L34m38m23N18k14m80J257k13o06j17j70P3l18J423p74r5J68r22J10R40
7775C37l16n22K20M16l95Q96r01j35J27Q45o74N1k86N74k12J89m05L06J7om13
7796b87m49J171j42k91q53R93m72N31k04j36n3n51J097K0k78k59L21L2N9l90L04
7817A63r7J17m3Q2k75P68r6q98M35l67M69j022Q84j37l22J72q1l79J64N31P8m71
$$ plain form
7839 -325 448 340 -489 543 322 -74 223 -447 395 -137 696 -531 -412 180 159 -457 8 -91 73 400
7859 400 324 -80 -329 302 -607 828 327 -380 135 -278 584 41 72 718 -921 -81 323 -121 95 310
7879 310 435 -140 -148 227 235 238 58 -143 206 326 33 -87 -676 413 -329 -15 -459 -41 116 0 -280 337
7901 337 -3 2 -426 -79 -189 -207 139 -316 157 386 -345 -59 106 -176 -758 299 -122 -537 271 456 114
7922 114 59 -929 -87 -818 253 -439 -431 129 258 142 313 -141 177 379 175 -123 241 427 -1029 -623
7942 -623 281 83 63 -117 37 -1021 206 169 284 -255 -59 -416 -377 -257 -94 -375 170 40 -355 -59
7962 -59 162 -3 -301 14 -640 167 -154 480 232 -34 -755 103 837 -249 -144 71 -263 -298 296 358 -4
7983 -4 -191 -20 61 -207 -58 -98 545 808 -117 -299 62 126 16 -47 427 -25 394 134 -59 215 191 339
$$ packed form
7839c25P73j08q29J032k21l96K97o70Q42n32Q33j227J19N92k1o16M65r9J64L27
7859D00p6m04k49O31r09J435n01p07N15m13Q62n43L1O46j639Q40M04m44K16K15
7879C10J25n75qL75QLj80k01L49J20k93j20n89J089p42L14m44M18J57j16k80O17
7901C37l40Nm28L47j10j8L46m55M73K29p31K86J65k82n82J057m21m15Q08J85l42
7922A14n5r88Q42p31J071o92QN60J29j16J71m54L18K02k04k98L64J86j456M06
7942f23R04j98k0j80J54j058J227l7J15n39J96l57L9J20J63k81N45j30l95K96
7962e9K21j65k98L15o54Q07l21O34k48k66p21Q58P34j086J05K15l34l5N94O2l62
7983dj87J71Q1k68J49m0O43K63r25j82L61O4j10o3M74m52M19k60j93K74k4J48
$$ plain form
8005 339 -220 132 -149 -68 -38 461 -91 -710 -242 -120 -487 -305 409 -354 -108 -361 -298 605 152 -212 -133
8026 -133 109 107 472 158 221 -126 427 33 79 407 -156 524 -130 451 -422 220 -45 -68 -67 338 316 -473 15
8049 15 -324 -3 -327 246 -104 -464 520 -7 10 55 -23 -629 -40 47 -355 264 11 -691 -29 -279 -117 -645
8071 -645 -327 6 -43 -69 128 -380 41 268 -63 -775 -29 -368 18 327 -82 -223 130 -219 70 60 376
8092 376 280 -6 379 49 103 370 -116 337 -523 308 -274 91 -19 421 142 157 162 -143 -7 162 -144 -229
8114 -229 419 -82 337 150 0 167 -297 392 -414 -34 48 34 221 232 -7 276 -325 -492 -27 -90 -347
8135 -347 73 42 -362 -887 80 -618 153 278 -420 -150 189 -122 -424 -798 141 -84 217 72 -252 334
8155 334 -396 -159 244 33 188 60 -128 -217 -424 254 508 -753 -757 130 -85 -188 -125 430 -80 936 47
$$ packed form
8005C39n59L52k81Q1L0M99n52o19M68J22l67J82P14p63K46k53O3R03m53l64P9
8026a33K42kL65l14O3l47N53l94M6L28n63O80o54N81q73O42k65k3JM05k2p89M88
8049A5l39L21l24N73l50l60R84n27J7M5p8o06N89Q7m02O19k53p02O62k50J62n28
8071f45L18L33m9k6J97n08M21K27l31p12P46l39L86L09m09j41L53l49K89j0L16
8092C76r6k86L85l30N4K67m86M53q60Q31n82L65j10M40k79J5Nl05J36J69l06q5
8114b29O48n01M19j87j50J67m64O89q06L80Q2j4J87J1k39K83o01j67M65o3k57
8135c47M20l1m04n25R67o98P71J25o98K70L39l11l02l74R39k25L01j45l24N86
8155C34p30K37M03k11J55j28j88q9k07O78K54j261mQ87k15j03O3N55n10J016q89
$$ plain form
8176 47 -120 158 723 -615 -253 -182 50 -403 87 -348 -707 484 -507 -262 257
$$ packed form
8176D7j67K78N65j338L62P1K32m53M90m35l59J191r91K45N19
8191B57
$$ Imaginary data points
##PAGE= N=2
##DATA TABLE= (X++(I..I)), XYDATA
$$ plain form
0 0 0 0 0 0 0 0 0 0 0 0 2 -40 40 -40 40 -41 70 -80 81 -110 121 -135 161 -190 206 -242 280 -319 360 -405 456
31 456 -515 575 -642 719 -803 890 -987 1093 -1214 1344 -1487 1645 -1826 2019 -2243 2490
47 2490 -2776 3104 -3484 3934 -4477 5143 -5984 7085 -8604 10831 -14423 21184 -38334 173668
61 173668 252212 -57465 74343 83402 -61038 39830 178052 12252 61574 183258 -11693
72 -11693 -104156 93497 28771 -70693 115780 123755 -69835 16779 59600 -107789 -15878 142265
84 142265 -30440 -67272 94206 -18556 -124185 50932 37526 -79918 61268 70407 -136094
95 -136094 -58161 64384 -73569 -38024 126392 -11982 -102760 39469 -26271 -127791 48405
106 48405 74060 -73560 27875 79869 -113239 -79840 74033 -29023 -36068 117942 5031
$$ packed form
0@%%%%%%%%%%Km2Q0q0Q0q1J11j50J61j91K31k56K96l51L96m48N22n99O79p65Q61
31D56r71J090j217J361j522J693j877K080k307K558k831L132l471L845m262M733
47B490n266N880o588P418q411R620j1127J3069j5689J9435k5254L5607n9518K12002
61A73668P8544l09677J31808R059j44440J00868J38222j65800M9322J21684j94951
72a1693r2463J97653o4726r9464J86473P975j93590Q6614M2821j67389R1911J58143
84A42265j72705l6832J61478j12762j05629J75117j3406j17444J41186R139k06501
95a36094P7933J22545j37953L5545J64416j38374r0778J42229o5740j01520J76196
106D8405K5655j47620J01435N1994j93108L3399J53873j03056p045J54010j12911
$$ plain form
117 5031 -109891 39188 23945 -100953 44086 107047 -57183 -8564 77039 -79147 -67750
128 -67750 103051 15833 -43994 94574 15941 -121940 21055 60963 -67694 30536 108191
139 108191 -58819 -49496 64220 -59139 -78581 97794 37416 -69564 46680 14133 -127675
150 -127675 -5555 72485 -59190 -6165 87378 -64369 -89441 49200 -29035 -82196 76354
161 76354 43062 -90426 5241 20355 -111837 -15941 90629 -37957 -34426 69326 -50052
172 -50052 -99198 49260 12836 -67336 63035 56919 -92453 -18933 42370 -75134 -15792
183 -15792 105039 -12349 -53544 55348 -26515 -93583 52128 49965 -56830 39563 59680
194 59680 -88591 -37813 59537 -41605 -24562 98092 -3431 -78922 35088 -4369 -88091
$$ packed form
117E031j14922J49079j5243j24898J45039O2961j64230M8619Q5603j56186J1397
128f7750J70801q7218n9827J38568p8633j37881J42995L9908j28657R8230P7655
139A08191j67010R323J13716j23359j9442J76375o0378j06980J16244l2547j41808
150a27675J22120P8040j31675N3025R3543j51747k5072J38641p8235n3161J58550
161G6354l3292j33488R5667J5114j32192R5896J06570j28586L531J03752j19378
172e0052m9146J48458l6424q0172J30371o116j49372P3520O1303j17504N9342
183a5792J20831j17388m1195J08892q1863o7068J45711k163j06795R6393K0117
194E9680j48271N0778R7350j01142J7043J22654j01523p5491J14010l9457q3722
$$ plain form
205 -88091 42483 68714 -57876 1956 50942 -83008 -54570 68451 -15998 -40936 76672
216 76672 -607 -98056 14700 18885 -76168 27430 76728 -57748 -31513 45566 -62996
227 -62996 -60092 74946 11110 -52002 53066 9722 -97413 7304 48732 -52108 15286
238 15286 82135 -45003 -49444 49697 -26576 -48879 81577 39220 -53844 33944 28053 -77556
250 -77556 8400 78466 -23514 4185 81802 -28916 -57949 54606 10148 -37546 76593
261 76593 55530 -58188 11032 41655 -57765 2919 89584 -10217 -21093 63638 -19810 -68111
273 -68111 47896 31126 -41343 48414 49768 -70940 -19044 44311 -43508 -13541 79937 -11076
285 -11076 -53816 39385 -11963 -75313 34716 43845 -47950 16813 42500 -73535 -39880 50557
$$ packed form
205h8091J30574K6231j26590N9832M8986j33950K8438J23021q4449k4938J17608
216G6672p7279r7449J12756M185r5053J03598M9298j34476K6235P7079j08562
227f2996K904J35038o3836o3112J05068m3344j07135J04717M1428j00840O7394
238A5286O6849j27138m441R9141p6273k2303J30456m2357r3064Q7788n891j05609
250g7556Q5956P0066j01980K7699P7617j10718k9033J12555m4458m7694J14139
261G6593k1063j13718O9220L0623r9420O0684Q6665r9801j0876Q4731q3448m8301
273f8111J16007j6770p2469Q9757J354j20708N1896O3355q7819K9967R3478r1013
285a1076m2740R3201n1348o3350J10029R129r1795O4763K5687j16035L3655R0437
$$ plain form
297 50557 -23851 -26012 67599 -7185 -72211 23198 7051 -66016 26940 56834 -45158 -8210
309 -8210 41323 -58984 -45186 60778 2237 -31933 54375 2733 -75555 15206 33492 -46316
321 -46316 21349 66203 -36197 -24232 44701 -33085 -39117 68938 27496 -34887 39803 16689
333 16689 -66404 14284 59037 -24218 11596 68072 -25420 -34974 47394 -4328 -33104 67104
345 67104 42697 -39717 21675 28607 -53911 10512 73010 -11401 -6845 57904 -18742 -46550
357 -46550 45624 16119 -33082 51588 44151 -49161 -1156 33395 -42613 -153 72576 -8041
369 -8041 -31604 40317 -13230 -54435 37729 29290 -38637 26981 37992 -57463 -23268 34829
381 34829 -31519 -15844 61994 -9768 -55640 19440 -6508 -59124 24229 34785 -46485 -3467
$$ packed form
297E0557p4408k161R3611p4784o5026R5409j6147p3067R2956K9894j01992L6948
309h210M9533j00307J3798J05964n8541l4170Q6308n1642p8288R0761J8286p9808
321d6316O7665M4854j02400J1965O8933p7786o032J08055m1442o2383P4690k3114
333A6689q3093Q0688M4753q3255L5814N6476r3492r554Q2368n1722k8776J00208
345F7104k4407q2414O1392O932q2518O4423O2498q4411M556O4749p6646k7808
357d6550R2174k9505m9201Q4670p437r3312M8005L4551p6008M2460P2729q0617
369h041k3563P1921n3547m1205R2164q439o7927O5618J1011r5455L4195N8097
381C4829o6348J5675P7838p1762m5872P5080k5948n2616Q3353J0556q1270M3018
$$ plain form
393 -3467 28768 -58718 -40198 34715 -19118 -29717 43903 -10228 -71590 3953 5664 -53131
405 -53131 13135 38967 -45756 -24060 26657 -44363 -43475 40850 144 -34429 32637 986
417 986 -66467 1807 30128 -33020 10223 48794 -33400 -30570 35245 -15626 -31924 50182 23350
430 23350 -31352 26246 18322 -50933 7454 51656 -12847 4584 51535 -19964 -33708 41751
442 41751 8409 -24828 48755 35077 -33825 13013 28717 -38703 3798 61157 -4146 -11231
454 -11231 41854 -14130 -41299 36626 22398 -27605 31361 32395 -43787 -8224 29759 -32196
466 -32196 -9912 53585 -6285 -35798 23074 -11890 -49961 23863 27156 -35487 5757 23193
478 23193 -49915 -26116 28933 -22633 -22906 41202 -6425 -50259 9254 -2000 -47264 15469
$$ packed form
393c467L2235q7486J8520P4913n3833j0599P3620n4131o1362P5543J711n8795
405e3131O6266K5832q4723K1696N0717p1020Q88Q4325m0706l4573O7066l1651
417I86o7453O8274K8321o3148M3243L8571q2194K830O5815n0871j6298Q2106k6832
430B3350n4702N7598p924o9255N8387M4202o4503J7431M6951p1499j3744P5459
442D1751l3342l3237P3583j3678o8902M6838J5704o7420M2501N7359o5303p085
454a1231N3085n5984k7169P7925j4228n0003N8966J034p6182L5563L7983o1955
466c2196K2284O3497n9870k9513N8872l4964l8071P3824L293o2643M1244J7436
478B3193p3108K3799N5049n1566k73O4108m7627m3834N9513j1254m5264O2733
$$ plain form
490 15469 32416 -34921 -11709 22407 -40740 -30279 34637 -5904 -26958 32688 1061 -51132
502 -51132 5193 15291 -34737 11857 39965 -29500 -22357 24319 -23548 -28047 38629 9700
514 9700 -28757 22128 8229 -47922 1688 30084 -23170 2635 39198 -24475 -32274 24984
526 24984 -8202 -27136 35880 18703 -35225 8525 13710 -41911 -1432 39337 -15174 -8690
538 -8690 35138 -18026 -37463 25216 8397 -24555 30543 25009 -35531 -943 23174 -27852
550 -27852 -1795 47503 -3709 -15879 32251 -5135 -33432 30103 26782 -17586 25138 33000
562 33000 -28896 -4366 35986 -8741 371 51239 8307 -21112 28745 10647 -25087 30571
574 30571 39437 -12883 14148 35123 -21860 -10030 41244 4034 -6016 43826 10125 -30235
$$ packed form
490A5469J6947o7337K3212L4116o3147J0461O4916m0541k1054N9646l1627n2193
502e1132N6325J0098n0028M6594K8108o9465P143M6676m7867m499O6676k8929
514I700l8457N0885j3899n6151M9610K8396n3254K5805L6563o3673p799N7258
526B4984l3186j8934O3016j7177n3928M3750N185n5621M0479M0769n4511O484
538h690M3828n3164j9437O2679j6819l2952N5098n534o0540L4588K4117n1026
550b7852K6057M9298n1212j2170M8130l7386k8297O3535l321m4368M2724P862
562C3000o1896K4530M0352m4727R112N0868m2932k9419M9857j8098l5734N5658
574C0571Q866n2320K7031K0975n6983J1830N1274l7210j0050M9842l3701m0360
$$ plain form
586 -30235 17381 18383 -23501 19531 37875 -18736 -7387 25729 -22039 -22102 33966 5227 -20801
599 -20801 22821 3076 -43566 919 17619 -27095 515 28176 -26848 -27033 16011 -20403
611 -20403 -31660 23495 5586 -33317 6243 2103 -46031 -8198 22966 -22924 -10631 23095
623 23095 -24378 -35054 15563 -5619 -29312 21129 14052 -33448 -1229 11149 -34801 -5568
635 -5568 34192 -10088 -14433 23558 -12894 -32708 21582 12502 -21436 19178 22179 -29227 -4967
648 -4967 20943 -19670 -4850 38432 393 -20427 19431 -2581 -28604 20303 23234 -19033
660 -19033 8803 22384 -26315 -12453 24191 -10711 -11076 32951 1269 -30190 9173 2839 -28008
673 -28008 12752 25516 -22116 -6268 18707 -24410 -20794 22647 -3243 -18348 22752 2103
$$ packed form
586c0235M7616J002m1884M3032J8344n6611J1349L3116m7768o3N6068k8739k6028
599b0801M3622j9745m6642M4485J6700m4714K7610K7661n5024j85M3044l6414
611b0403j1257N5155j7909l8903L9560m140m8134L7833L1164m5890J2293L3726
623B3095m7473j0676N0617k1182k3693N0441p077m7500L2219J2378m5950K9233
635e568L9760m4280m345L7991l6452j9814N4290r080l3938M0614L001n1406K4260
648d967K5910m0613J4820M3282l8039k0820L9858k2012k6023M8907K931m2267
660a9033K7836J3581m8699J3862L6644l4902l65M4027l1682l1459L9363o334l0847
673b8008M0760J2764m7632J5848K4975m3117L616M3441k5890j5105M1100k0649
$$ plain form
685 2103 -35075 2583 9907 -24086 6995 27285 -21232 -17137 17648 -15024 -20197 25618 6232
698 6232 -20703 17427 9116 -31874 1102 21843 -13064 4299 31257 -13983 -19479 21483 -877
711 -877 -16243 27757 17140 -20723 11010 16553 -24907 590 30697 -5207 -2524 27392 -8931
724 -8931 -23739 20877 9296 -15174 21523 19172 -23327 599 18422 -20203 -5145 30579
736 30579 -2725 -13471 19004 -6355 -27951 15262 14674 -17872 9354 16480 -25851 -9503 18353
749 18353 -14321 -11993 26476 -1892 -23006 10270 -1999 -28110 10028 20089 -17790 -1489
761 -1489 14680 -23754 -16028 20553 -5851 -14844 21283 1656 -26630 5659 6363 -24115 7822
774 7822 25211 -15692 -8909 16448 -16357 -16325 24279 4341 -15487 17547 7651 -26507 3649
$$ packed form
685B103l7178L7658P324l3993L1081K0290m8517M095L4785l2672n173M5815j9386
698F232k6935L8130q311m0990L2976K0741l4907J7363K6958m5240n496M0962k2360
711h77j5366M4000j0617l7863L1733N543m1460K5497L0107l5904K683K9916l6323
724h931j4808M4616j1581k4470L6697k351m2499K3926J7823l8625J5058L5724
736C0579l3304j0746L2475k5359k1596M3213n88l2546K7226P126m2331J6348K7856
749A8353l2674K328L8469k8368k1114L3276j2269k6111L8138J0061l7879J6301
761a489J6169l8434P726L6581k6404q993L6127j9627k8286L2289P04l0478L1937
774G822J7389m0903O783K5357l2805L2M0604j9938j9828L3034r896l4158L0156
$$ plain form
787 3649 15349 -16355 4548 27338 -12055 -15755 16282 -7405 -16012 23774 11578 -18008 9979
800 9979 10905 -24315 -373 21657 -10261 -2161 24722 -9657 -21084 14755 917 -16140 19518
813 19518 15142 -20934 1438 13514 -19143 -3292 24694 -5141 -8833 20482 -4955 -22850
825 -22850 13655 9689 -14336 13011 17613 -20655 -4994 16398 -12381 -5662 25921 106 -15092
838 -15092 14826 -400 -21401 11959 17734 -12768 7043 18002 -18519 -10274 19359 -4106
850 -4106 -8482 23692 3698 -19917 9121 5934 -20452 8665 21495 -12740 -2853 16476 -15029
863 -15029 -14174 19904 1477 -12612 18021 4512 -23877 3714 10201 -16746 3567 21904 -12790
876 -12790 -11769 12901 -10959 -17671 17209 5707 -17421 9227 6173 -24804 -1732 15383 -13366
$$ packed form
787C649J1700l1704K0903K2790l9393l700L2037k3687q607L9786j2196k9586K7987
800I979R26l5220K3942K2030l1918Q100K6883l4379j1427L5839j3838j7057L5658
813A9518m376l6076K2372J2076l2657J5851K7986k9835l692K9315k5437j7895
825b2850L6505l966k4025K7347M602l8268J5661K1392k8779O719L1583k5815j5198
838a5092K9918j5226k1001L3360N775l0502J9811J0959l6521Q245K9633k3465
850d106m376L2174j9994k3615K9038l187k6386K9117J2830l4235R887J9329l1505
863a5029Q55L4078j8427j4089L0633j3509k8389K7591O487k6947K0313J8337l4694
876a2790J021K4670k3860o712L4880j1502k3128K6648l054l0977K3072J7115k8749
$$ plain form
889 -13366 -2635 20296 -11658 -18299 10609 -4584 -18175 15268 9408 -19433 2243 8379 -22133
902 -22133 -5082 18447 -7762 -7904 15745 -8528 -21590 10554 3745 -16319 10839 13064 -18800
915 -18800 -4070 11507 -16005 -7163 20618 -2739 -13255 13543 -3511 -21380 9660 11435
927 11435 -12806 6908 14629 -17360 -7939 14632 -8248 -7793 21342 2970 -15631 10669 3559
940 3559 -18089 9208 18880 -9739 1591 16571 -12760 -9776 19094 195 -9210 20702 7622
953 7622 -16785 7351 10027 -14414 7526 22460 -7151 -3794 16339 -7821 -11011 19336 6013
966 6013 -10312 14857 9455 -18123 2093 13822 -10242 2810 20271 -7460 -12271 12169 -3318
979 -3318 -13925 16275 8997 -14251 5826 8164 -19121 -3598 14392 -8644 -4777 16610 -8161
$$ packed form
889a3366J0731K2931l1954o641K8908j5193j3591L3443n860k8841K1676O136l0512
902b2133J7051K3529k6209j42K3649k4273j3062L2144o809k0064K7158K225l1864
915a8800J4730J5577k7512Q842K7781k3357j0516K6798j7054j7869L1040J775
927A1435k4241J9714P721l1989R421K2571k2880M55K9135j8372j8601K6300p110
940C559k1648K7297R672k8619J1330J4980k9331K984K8870j8899r405K9912j3080
953G622k4407K4136K676k4441K1940J4934k9611L357K0133k4160l190L0347j3323
966F013j6325K5169n402k7578K0216J1729k4064J3052J7461k7731m811K4440j5487
979c318j0607L0200p278k3248K0077K338k7285J5523J7990k3036L867K1387k4771
$$ plain form
992 -8161 -18812 7707 -1030 -15175 10401 9069 -18323 -2757 8807 -17517 -7844 15404 -5896
1005 -5896 -11267 12425 -5426 -20958 6323 5290 -13905 6640 11346 -17423 -6831 11505 -11080
1018 -11080 -8811 17513 -876 -13216 10528 820 -19169 6730 13644 -10143 3371 14169
1030 14169 -14098 -8861 15753 -3484 -8535 17139 3797 -15080 7596 6387 -15808 5196
1042 5196 17503 -8642 -2850 13331 -11197 -12075 14966 2061 -10731 12972 5175 -17186 1970
1055 1970 9270 -13707 317 17450 -7064 -8998 10112 -7283 -13774 13311 6795 -12614 6448
1068 6448 6596 -17501 -1086 13217 -8811 -2523 17609 -5195 -12489 10224 -289 -11864 13155
1081 13155 11435 -11905 2924 10399 -12913 -1927 17459 -2903 -4563 16651 -145 -14117
$$ packed form
992h161j0651K6519q737j4145K5576j332k7392J5566J1564k6324R673K3248k1300
1005e896n371K3692j7851j5532K7281j033j9195K0545M706k8769J0592J8336k2585
1018a1080K269K6324j8389j2340K3744r708j9989K5899O914k3787J3514J0798
1030A4169k8267N237K4614j9237n051K5674j3342j8877K2676j209k2195K1004
1042E196J2307k6145N792J6181k4528q78K7041j2905j2792K3703p797k2361J9156
1055A970P300k2977J4024J7133k4514j934J9110j7395o491K7085o516j9409J9062
1068F448J48k4097J6415J4303k2028O288K0132k2804p294K2713j0513j1575K5019
1081A3155j720k3340J4829P475k3312J0986J9386k0362j660K1214j6796j3972
$$ plain form
1093 -14117 10324 7057 -9534 11579 15702 -11421 -638 12520 -8543 -3378 19026 1088
1105 1088 -8479 13594 2734 -14426 7868 11069 -9019 5849 13561 -11968 -7513 12503 -5872
1118 -5872 -8036 15715 1305 -15133 6200 2155 -16620 2125 11045 -11065 -2862 10469 -13399
1131 -13399 -13536 9426 -3404 -11650 10107 1121 -18897 163 4725 -15813 -1132 12369 -10127
1144 -10127 -8370 8900 -10510 -14410 10472 2272 -11664 7187 5123 -17326 -1508 10066 -9892
1157 -9892 -1277 14945 -5431 -10113 10569 -2431 -12278 11285 8937 -9468 5526 8826 -12676
1170 -12676 -1704 14447 -4037 -2512 15853 -1152 -11717 9532 4268 -10264 10639 12386
1182 12386 -9678 797 10610 -10146 -3505 16447 -424 -6350 11654 -251 -14039 6724
$$ packed form
1093a4117K4441l267j6591K1113M123k7123J0783J3158k1063N165K2404j7938
1105A088r567K2073j0860j7160K2294L201k0088J4868P712k5529M455K0016j8375
1118e872k164K3751j4410j6438K1333m045j8775J8745Q920k2110Q203J3331k3868
1131a3399j37K2962j2830q246K1757q986k0018J9060M562k0538J4681J3501k2496
1144a0127J757J7270j9410l900K4882q200j3936J8851k064k2449J5818J1574j9958
1157i892Q615J6222k0376m682K0682j3000r847K3563k348j8405J4994L300k1502
1170a2676J0972J6151j8484J525J8365j7005j0565K1249n264j4532K0903J747
1182A2386k2064J0475R813k0756O641J9952j6871n926J8004j1905j3788K0763
$$ plain form
1194 6724 6424 -10977 5665 12121 -11594 -5171 10295 -8186 -6757 14304 1050 -10963 8243
1207 8243 1537 -15017 4478 11284 -8761 1579 11614 -10137 -9174 11184 -3288 -7954 13716
1220 13716 4448 -12812 5083 5691 -13034 3006 14332 -6684 -2991 12294 -6585 -9565 12486
1233 12486 2903 -8062 10825 6996 -12960 1587 8778 -9349 558 14635 -4367 -7513 10157
1246 10157 -4231 -11475 10730 6468 -9843 4666 7117 -13710 -2445 9614 -7245 -4670 13025
$$ packed form
1194F724l00j7401J6642O456k3715O423J5466j8481J429K1061j3254j2013J9206
1207H243o706j6554J9495O806k0045J0340J0035k1751R63K0358j4472m666K1670
1220A3716r268j7260J7895O08j8725J6040J1326k1016L693J5285j8879k980K2051
1233A2486r583j0965J8887l829j9956J4547P191j8127R907J4077j9002l146J7670
1246A0157j4388p244K2205m262j6311J4509K451k0827J1265J2059j6859K575J7695
$$ [...]
8191B60
##END NTUPLES=NMR FID
##END=
