##TITLE=1H_EC-3208(II-38)
 CDCl3, 8 sc, 
 19.11.2019
##JCAMPDX= 6.0         $$ Bruker NMR JCAMP-DX V2.0
##DATA TYPE= NMR FID
##DATA CLASS= NTUPLES
##ORIGIN= UXNMR, Bruker Analytische Messtechnik GmbH
##OWNER= root
$$ XWIN-NMR		Version 3.5
$$ Tue Nov 19 14:03:59 2019 Russian Standard Time (UT+4h)  she@DPX200
##.OBSERVE FREQUENCY= 200.1315
##.OBSERVE NUCLEUS= ^1H
##.DELAY= (6, 6)
##.ACQUISITION MODE= SIMULTANEOUS
##.ACQUISITION SCHEME= undefined
##.AVERAGES= 8
##.DIGITISER RES= 18
##SPECTROMETER/DATA SYSTEM= spect
##.PULSE SEQUENCE= zg30
##.SOLVENT NAME= D2O
##.SHIFT REFERENCE= (INTERNAL, D2O, 0, 15.7039)
##AUDIT TRAIL= $$ (NUMBER, WHEN, WHO, WHERE, WHAT)
$$ ##TITLE= Audit trail, XWIN-NMR		Version 3.5
$$ ##JCAMPDX= 5.01
$$ ##ORIGIN= Bruker BioSpin GmbH
$$ ##OWNER= she
$$ F:/spectra/data/she/nmr/H-F/1/audita.txt
$$ ##AUDIT TRAIL=  $$ (NUMBER, WHEN, WHO, WHERE, WHAT)
(   1,<2019-11-19 14:02:52.45 +0400>,<she>,<DPX200>,
      <created by zg, POWCHK disabled, PULCHK disabled
       configuration hash MD5:
       00 E9 B6 7A A2 85 ED C7 34 08 36 98 17 FE 4E 26
       data hash MD5: 16K
       AF 9D 28 7B D6 D9 21 B0 37 1D F1 33 2F 38 79 BE>)
$$ ##END=
$$ 
$$ hash MD5
$$ 1C 48 73 00 F8 FD 25 C3 D9 DC EB 00 F7 FF 02 F6
##$RELAX= 
##$RELAX= 
##$RELAX= 
##$RELAX= 
##$RELAX= 
##$RELAX= 
$$ Bruker specific parameters
$$ --------------------------
##$DU= <F:/spectra>
##$EXPNO= 1
##$NAME= <H-F>
##$PROCNO= 1
##$TYPE= <nmr>
##$USER= <she>
##$AMP= (0..31)
100 100 100 100 100 100 100 100 100 100 100 100 100 100 100 100 100 100 
100 100 100 100 100 100 100 100 100 100 100 100 100 100 
##$AQSEQ= 0
##$AQ_mod= 1
##$AUNM= <au_zg>
##$AUTOPOS= <>
##$BF1= 200.13
##$BF2= 200.13
##$BF3= 200.13
##$BF4= 200.13
##$BF5= 200.13
##$BF6= 200.13
##$BF7= 200.13
##$BF8= 200.13
##$BYTORDA= 1
##$CFDGTYP= 0
##$CFRGTYP= 5
##$CHEMSTR= <none>
##$CNST= (0..31)
1 1 145 1 1 1 1 1 1 1 1 1 1 1 1 1 1 1 1 1 1 1 1 1 1 1 1 1 1 1 1 1 
##$CPDPRG= <>
##$CPDPRG1= <>
##$CPDPRG2= <>
##$CPDPRG3= <>
##$CPDPRG4= <mlev>
##$CPDPRG5= <mlev>
##$CPDPRG6= <mlev>
##$CPDPRG7= <mlev>
##$CPDPRG8= <mlev>
##$CPDPRGB= <>
##$CPDPRGT= <>
##$D= (0..31)
0 1.2 0 0 0 0 0 0 0 0.06 0 0.03 0 0 0 0 0.0002 0 0 0 0 0 0 0 0 0 0 0 0 
0 0 0 
##$DATE= 1574157771
##$DBL= (0..7)
120 120 120 120 120 120 120 120 
##$DBP= (0..7)
150 150 150 150 150 150 150 150 
##$DBP07= 0
##$DBPNAM0= <>
##$DBPNAM1= <>
##$DBPNAM2= <>
##$DBPNAM3= <>
##$DBPNAM4= <>
##$DBPNAM5= <>
##$DBPNAM6= <>
##$DBPNAM7= <>
##$DBPOAL= (0..7)
0.5 0.5 0.5 0.5 0.5 0.5 0.5 0.5 
##$DBPOFFS= (0..7)
0 0 0 0 0 0 0 0 
##$DE= 6
##$DECBNUC= <off>
##$DECIM= 24
##$DECNUC= <off>
##$DECSTAT= 4
##$DIGMOD= 1
##$DIGTYP= 9
##$DL= (0..7)
0 120 120 120 120 120 120 120 
##$DP= (0..7)
150 150 150 150 150 150 150 150 
##$DP07= 0
##$DPNAME0= <>
##$DPNAME1= <>
##$DPNAME2= <>
##$DPNAME3= <>
##$DPNAME4= <>
##$DPNAME5= <>
##$DPNAME6= <>
##$DPNAME7= <>
##$DPOAL= (0..7)
0.5 0.5 0.5 0.5 0.5 0.5 0.5 0.5 
##$DPOFFS= (0..7)
0 0 0 0 0 0 0 0 
##$DQDMODE= 0
##$DR= 18
##$DS= 0
##$DSLIST= <SSSSSSSSSSSSSSS>
$$ [...]
##$SUBNAM2= <"">
##$SUBNAM3= <"">
##$SUBNAM4= <"">
##$SUBNAM5= <"">
##$SUBNAM6= <"">
##$SUBNAM7= <"">
##$SUBNAM8= <"">
##$SUBNAM9= <"">
##$SW= 24.9337058887773
##$SWIBOX= (0..15)
0 0 2 0 0 0 0 0 0 0 0 0 0 0 0 0 
##$SW_h= 4990.01996007984
##$TD= 16384
##$TD0= 1
##$TE= 0
##$TE2= 300
##$TE3= 300
##$TEG= 300
##$TL= (0..7)
0 120 120 120 120 120 120 120 
##$TP= (0..7)
150 150 150 150 150 150 150 150 
##$TP07= 0
##$TPNAME0= <>
##$TPNAME1= <>
##$TPNAME2= <>
##$TPNAME3= <>
##$TPNAME4= <>
##$TPNAME5= <>
##$TPNAME6= <>
##$TPNAME7= <>
##$TPOAL= (0..7)
0.5 0.5 0.5 0.5 0.5 0.5 0.5 0.5 
##$TPOFFS= (0..7)
0 0 0 0 0 0 0 0 
##$TUNHIN= 0
##$TUNHOUT= 0
##$TUNXOUT= 0
##$USERA1= <user>
##$USERA2= <user>
##$USERA3= <user>
##$USERA4= <user>
##$USERA5= <user>
##$V9= 5
##$VALIST= <valist>
##$VCLIST= <CCCCCCCCCCCCCCC>
##$VD= 0
##$VDLIST= <DDDDDDDDDDDDDDD>
##$VPLIST= <PPPPPPPPPPPPPPP>
##$VTLIST= <TTTTTTTTTTTTTTT>
##$WBST= 1024
##$WBSW= 4
##$XGAIN= (0..3)
0 0 0 0 
##$XL= 0
##$YL= 0
##$YMAX_a= 87945
##$YMIN_a= -161311
##$ZGOPTNS= <>
##$ZL1= 120
##$ZL2= 120
##$ZL3= 120
##$ZL4= 120
##$ABSF1= 10
##$ABSF2= 0
##$ABSG= 5
##$ABSL= 3
##$ALPHA= 0
##$AQORDER= 0
##$ASSFAC= 0
##$ASSFACI= 0
##$ASSFACX= 0
##$ASSWID= 0
##$AUNMP= <proc_1d>
##$AZFE= 0.1
##$AZFW= 0.1
##$BCFW= 1
##$BC_mod= 2
##$BYTORDP= 1
##$COROFFS= 0
##$CY= 11.3945322036743
##$DATMOD= 1
##$DC= 2
##$DFILT= <>
##$DTYPP= 0
##$F1P= 16.9975609425685
##$F2P= -3.02152046262296
##$FCOR= 0.5
##$FTSIZE= 0
##$FT_mod= 4
##$GAMMA= 1
##$GB= 0.15
##$INTBC= 1
##$INTSCL= 1
##$ISEN= 128
##$LB= 0.24
##$LEV0= 0
##$LPBIN= 0
##$MAXI= 10000
##$MC2= 0
##$MEAN= 0
##$ME_mod= 0
##$MI= 1.114404
##$NCOEF= 0
##$NC_proc= 0
##$NLEV= 6
##$NOISF1= 3.799351
##$NOISF2= 2.8
##$NSP= 1
##$NTH_PI= 0
##$NZP= 0
##$OFFSET= 15.70392
##$PC= 1
##$PHC0= -9956.38
##$PHC1= 32.60087
##$PH_mod= 1
##$PKNL= yes
##$PPARMOD= 0
##$PSCAL= 0
##$PSIGN= 0
##$REVERSE= no
##$SF= 200.130013532006
##$SI= 16384
##$SIGF1= 3
##$SIGF2= 2
##$SINO= 400
##$SIOLD= 16384
##$SREGLST= <1H.CDCl3>
##$SSB= 0
##$STSI= 0
##$STSR= 0
##$SW_p= 3612.71676300578
##$SYMM= 0
##$S_DEV= 0
##$TDeff= 0
##$TDoff= 0
##$TI= <>
##$TILT= no
##$TM1= 0
##$TM2= 0
##$TOPLEV= 0
##$USERP1= <user>
##$USERP2= <user>
##$USERP3= <user>
##$USERP4= <user>
##$USERP5= <user>
##$WDW= 1
##$XDIM= 8192
##$YMAX_p= 0
##$YMIN_p= 0
$$ End of Bruker specific parameters
$$ ---------------------------------
##NTUPLES= NMR FID
##VAR_NAME=  TIME,          FID/REAL,        FID/IMAG
##SYMBOL=    X,             R,               I
##VAR_TYPE=  INDEPENDENT,   DEPENDENT,       DEPENDENT
##VAR_FORM=  AFFN,          ASDF,            ASDF
##VAR_DIM=   8192,          8192,            8192
##UNITS=     SECONDS,       ARBITRARY UNITS, ARBITRARY UNITS
##FACTOR=    0.0002004,     1,               1
##FIRST=     0,             0,               0
##LAST=      1.6414764,     0,               0
##MIN=       0,             -161311,         0
##MAX=       1.6414764,     87945,           0
$$ Real data points
##PAGE= N=1
##DATA TABLE= (X++(R..R)), XYDATA
$$ [...]
2601B102j944j577J671q10q12K968N06k993J78K192j311q40J787j182j575K786
2617A146J688k834n71J622j201l75J929q30j932K583J874l117j154J643p09J56
2633h2K288j250k658K253K373k579j559J497p65P9K607q66k941J680K050k476
2649c49j250J831k17k23K248p70l277J279K511j777j435J723k43o74K326k64l454
2666b015Q11K659j717j247J957j89q74K115l70l477N33L032r09j344J539p33j184
2683a413K484L99l675r2L004l19j121J308q48j587K538O78l483m48L316K00j195
2700b54N88j155j651K768J714l509j069K854N05j008Q80j373j862K445K110k985
2716a002j183K871M36j298N44r02k014K595K490k790j706K433O03j388J043n95
$$ y = [2102, 158, -1419, 252, -558, -1370, 1598, 2104, -889, -711, 1481, 170, -670, 1117, -65, -1640, 1146, 2834, 0, -571, 1051, -150, -525, 1404, 574, -1358, 1225, 3099, -18, -1172, 471, -238, -82, 2206, 956, -1702, 551, 2924, 345, -1214, 283, -482, -403, 2204, 1338, -1603, 77, 2127, -349, -1599, 232, 15, -208, 2040, 1270, -2007, -728, 1783, 6, -1429, 294, 51, -623, 1703, 1439, -2015, -1204, 1455, -262, -1509, 448, 259, -615, 1500, 1130, -2347, -1814, 1218, 309, -1035, 504, -229, -1413, 1071, 1470, -2205, -2297, 707, 388, -733, 575, -273, -1860, 678, 1356, -2127, -2575, 741, 941, -254, 334, -821, -2472, 296, 2010, -1499, -2568, 286, 791, -217, 663, -710, -2572, -127, 1983, -1002, -2185, 686, 1122, -176, 368, -534, -2548, 47, 2537, -253, -1959, 474, 1077, -311, 732, 137]
2732A37k407K088K692k239j627K262J71j540R13k86j925J890K968k388k054J835
2748D90M58j313J449j59k261J051L041j691k157J731R9j349J384O42k650J019
2764b16L105j582k545J304L69q77J741O65k940k9L214q82k345R34L66j293J918
2781I07J137k859m97K941o22k400J026N14r45J793J245l302j096L053J7j947R63
2798g2L08j441J478J646k854j266K760k4j862J041N46j422J098J643k663j568
2814b652K679O49j576Q77M73k155J012K226j947j949K180O38j586J077P56k250
2830a548M08K396j566j991K112R30j482J054L32k639L40K971r63k091J398P89
2846D50j312J064R84k687k07L085o07k284J366J001j237P93P66k660k73L498j78
$$ y = [137, -2270, -182, 2510, 271, -1356, 906, 1077, -463, 450, 164, -1761, 129, 3097, 709, -1345, 490, 948, -365, 1084, 925, -1336, -285, 2756, 1065, -1092, 639, 738, -611, 773, 1415, -1235, -216, 2889, 1307, -1238, 66, 435, -442, 1299, 1964, -976, -1005, 2209, 1327, -1018, -84, 282, -1011, 907, 2044, -815, -1312, 1629, 1007, -1393, -367, 147, -798, 995, 2240, -1062, -2158, 895, 912, -1035, -72, 236, -1205, 273, 1919, -935, -2201, 559, 535, -1327, -286, 260, -1162, -64, 1579, -1084, -2652, 27, 676, -900, -23, 450, -1705, -693, 1533, -414, -2363, -183, 455, -1131, -54, 702, -1548, -1140, 1256, -310, -2301, -189, 741, -741, 313, 645, -1994, -1654, 1317, 354, -1737, -339, 450, -862, 202, 1186, -1501, -1708, 1377, 770, -1514, -148, 853, -384, 409, 1175, -1485, -1758, 1740, 1562]
2863A562k471R14P46j179J093J064k491q50L302O2k335O53J012j333R38J122k483
2880f74q50L312O06k547J42O06j181J080K046k474j703K660Q88j995J52O92j524
2897g64P61K164k049j845K588J239k313M9N14j440R33K559j823k461J900J273
2913A285j607J67P71j736L65K648j355k550K008J335j896K5Q53j425L89K710j369
2930F18k841J585J559j353P2Q85j812N1K616o55k977J381J839j347j98P51j428
2947a254n1K907o44l431R68K040q07q2R55k045o27L080J19k976M70J781q75J89
2965b83J044j900r19K992N22k872J38J667q09L23J489j983j676K743J088k273
2981g09M4J376j058j11J885j296j746K205J203k258j24J598j077j2J876j406k051
$$ y = [1562, -909, 5, 751, -428, 665, 1729, -762, -1612, 1690, 1752, -583, 70, 1082, -251, 687, 1809, -674, -1524, 1788, 2394, -153, -11, 595, -586, 494, 2540, 66, -1637, 1023, 1911, -84, 68, 760, -764, -3, 2161, 112, -1733, 855, 2094, -219, -170, 344, -1096, -163, 2396, 573, -1888, 12, 1285, -322, -155, 616, -1120, -755, 1893, 538, -2012, -4, 1331, -565, -540, 313, -1112, -723, 1987, 618, -2223, -638, 921, -432, -360, 525, -1287, -1236, 1380, 725, -2252, -871, 968, -379, -577, 174, -1254, -1305, 1602, 958, -2473, -1505, 535, -272, -354, 601, -1444, -2071, 1009, 1128, -1848, -1378, 403, -472, -283, 761, -1139, -2058, 934, 1456, -1416, -1278, 389, -420, -97, 1392, -591, -2267, 476, 1564, -709, -665, 711, -347, -458, 1427, 131, -1615, 590, 1793, -465, -589, 1009, -68, -80, 1796, 390, -1661]
2998a661K074J597j989k73J392j259k82K106q11k150J537J866k312l61J610p95
3014B89m50J802q43k462J689K129j696q56J159j058k64K326m13k906J091K082
3030A619j354o77J223j111n95K442k95k754N91K516j101p53R70j300q45K702M95
3047A773l065J47K077r31m30J515j343j344K117R80k702j4J849p21o25J468j005
3064b54j823K278J436k685l02J513o09m01J722r20j980J736J487k065m94J799
3080D38o65q70J497n29k106J903J824k238q72J659l32n61J686p00k249J499K085
3097A469j836j004J668m33n71J520l83k411J526K319j570j441J259j53n67K025
3113A417l90k755R85K544j267j136J071m27r05K077L05k654L12K407q60j232R31
$$ y = [-1661, 413, 2010, 21, -252, 1140, -119, -401, 1705, 894, -1256, 281, 2147, -165, -526, 1084, 289, -161, 1641, 798, -1664, 25, 2154, 458, -398, 761, -297, -561, 1765, 1352, -1554, -463, 1619, 265, -412, 811, -300, -895, 1547, 1252, -1502, -911, 1605, 504, -249, 721, -579, -1424, 1278, 1773, -1292, -1145, 932, 1, -429, 1086, -257, -1601, 516, 1496, -1206, -1220, 629, -92, -717, 751, -254, -2077, 201, 1637, -1048, -1350, 163, -446, -847, 875, -45, -2025, -289, 1198, -867, -1361, 438, -227, -1097, 400, -129, -2235, -332, 1492, -746, -1618, 41, -291, -852, 834, 134, -2115, -616, 1469, -367, -1371, 297, -136, -707, 813, 430, -1981, -455, 1864, 294, -1147, 112, -41, -608, 1417, 1027, -1728, -743, 1801, 534, -602, 469, 42, -863, 1214, 1519, -1135, -823, 1584, 724, -508, 423]
3130D23m10r17K147P91k954j05K226m66r01R85n62j568K128J243k514m12J994
3147A128n31j060J235k70j476J613J412k491p65K119j46j055J331n73j626J554
3163C99J527k236q98J995k20j136J133P9j643J286J530k315j240K137K81j038
3179c59J065l04k029J265J927j757j461J630L71j035J264M8k275R05K219j613
3195a39j648J785L29j000J174pk373M28K640q32j818J201J38j084J680M79k594
3212a641n9K602o54j289J085N6j123J162Q11k482k15K635j99j576Q49J18j418
3229a338J456J216k279p53K435m5j451R14K09j430J019J167j750o72K367J86j989
3246g38Q55J81j393J241J572j954j153K231L04j627P08L59j390Q83J617j648j246
$$ y = [423, 13, -904, 1243, 2034, -920, -1025, 1201, 735, -166, 819, 257, -1311, 817, 2060, -454, -866, 1128, 597, -463, 772, 502, -974, 639, 2051, -440, -1205, 914, 768, -287, 1044, 471, -1155, 399, 1926, -310, -1208, 787, 567, -569, 564, 643, -1000, 286, 1816, -499, -1739, 398, 679, -359, 706, 402, -1627, -362, 1565, -192, -1653, -23, 348, -687, 577, 625, -1650, -745, 1474, -139, -1787, -2, 327, -673, 501, 494, -1879, -1451, 1189, 357, -1461, -260, -122, -1206, 474, 953, -1641, -1700, 902, 248, -1041, 44, 100, -1023, 139, 950, -1532, -1747, 888, 689, -887, -38, 80, -1338, 118, 1334, -945, -1698, 737, 692, -759, 155, 364, -1066, -47, 1120, -630, -1302, 1065, 1251, -738, 117, 298, -1095, 146, 1718, -236, -1389, 842, 1146, -481, 227, 586, -804, 79, 1696, 48, -1198]
3263a198K204L21j740N09M79j577J152K126j672j782J426Q47j399Q70K38j734
3279i30N74K318r02k047J240N59j080P31N11j910M82K397p96k175R16N58r30J132
3297F48P48k210k25K514m19k001O91P00j086Q80J031j873n90K251l76k010P04
3314f23R45q61P02J038k081p27K250l8j944P40J003j102M54J327j704j123K083
3331C39K95j881N02J113q65K92J184j750j243K032P31j600L22R45j174K33J541
3348A016j378j659J897R14j408K56P37j217L35J705j375j910J673J480j160J68
3364G4L87j609J98K215p57k010J210J300j014K21M91j546k07K355m56k232J193
3381a87J362q51r4M59j596k26K480o2k192R17J107j061L9P28j332l40K081Q4j985
$$ y = [-1198, 1006, 1327, -413, 96, 575, -1002, 150, 2276, 604, -1178, 248, 1095, -304, 566, 804, -930, -356, 1962, 1060, -987, 253, 812, -268, 463, 974, -936, -454, 1943, 1147, -1028, -112, 446, -484, 648, 1396, -814, -1039, 1475, 1056, -945, -254, 446, -640, 240, 1271, -602, -1192, 1059, 683, -1327, -623, 322, -539, 163, 1201, -880, -1607, 643, 605, -1339, -599, 404, -698, -244, 1083, -621, -1744, 339, 634, -1247, -745, 368, -497, -205, 979, -771, -2014, 18, 749, -851, -529, 416, -758, -525, 1016, -362, -2021, -124, 790, -618, -362, 375, -842, -507, 1198, -177, -2087, -414, 1066, -94, 74, 461, -1148, -950, 1265, 508, -1502, -292, 1008, -6, 215, 706, -840, -1047, 1308, 852, -1380, -187, 1175, 324, 230, 689, -907, -1133, 1347, 1285, -907, 10, 1117, 56, 95, 823, -509, -849, 1232, 1316, -669]
3400f69O55J290j111j96Q53j229n53K249L59k028P5J268j098j09J400j188p45
3417g77J914L64j860j61J422r84j81J329j032j041J734Q75j979l24R68q22K08
3434c47J741j118j714J651R88j756k60R55p33K03J715r46j968J321J350j559o33
3451a110J044o70J03J920p02k327R61J520j236m05J090p44q2J542m94k124Q09
3468i05J755j226n95J023m94l00J537l81k142O46J640p98l98J195o38r77J557
3485D99J6j909O54J591r91l14J208p29j004J473J30j780L23J632o08l53J123p62
3503A99j656J551R62j651M8J486o20l97J000p08j568J523J192j766j25J416m21
3520D65m56R05q55j553J668J613j565o06J123k72n32J214q19j756J668J649j469
$$ y = [-669, -14, 1276, 165, -31, 822, -407, -960, 1289, 1648, -380, -305, 963, -135, -244, 1156, -32, -777, 1137, 1501, -359, -520, 902, -82, -263, 1066, 34, -1007, 727, 1602, -377, -701, 267, -555, -347, 1394, 276, -1438, 213, 1201, -555, -815, 140, -593, -390, 1325, 379, -1589, -268, 1082, -477, -1110, -66, -736, -633, 1287, 585, -1742, -781, 739, -497, -902, 188, -556, -638, 904, 410, -1714, -905, 850, -376, -971, 52, -442, -742, 795, 414, -1728, -1082, 558, -240, -638, 557, -81, -1058, 499, 515, -1394, -740, 851, -140, -454, 754, 25, -979, 494, 624, -1156, -833, 799, 191, -162, 961, 199, -1457, 94, 1056, -595, -547, 939, 319, -78, 922, 214, -1354, 169, 1361, -405, -530, 886, 465, 9, 914, 59, -1494, 174, 1787, 222, -384, 739, 467, -65, 1149, 330, -1426, 242, 1891, 422]
3537D22p84J043l11n54J167o10j554J245J824j313j102R76l60o71J309o7j517
3554h57P62J552j375o90Q74l40p41J164M53j610N12J500j181r17R97m23p44J412
3572C48P33j694r5J275q18o79J092n14q60J458R42j844l99J481m59q32R42m71
3590c94r29J724R50k010q34J566k48o16Q70j83j051J314J217k030r99J583K29
3607A59n98O45l00j068J350J245k185q73J412M45o10Q80p7j376O30J506j602j008
3625a425J659K39p13P80N3j539O77J281j173j058J594K13p97R80K55j885K45J454
3643H40o93p62J298Jj049J018L74j668j78J752m47q44J115j07r19Q77N62j866
3661f96l03K038K4j206P57q3r80R70M54j738j57J988J47j228K88l9p34Q96O41
$$ y = [422, -362, 681, 370, -184, 983, 373, -1181, 64, 1888, 575, -527, 449, 89, -582, 727, 660, -857, -95, 1457, 82, -608, 266, -74, -815, 349, 802, -808, -296, 1204, 23, -894, 103, -320, -1064, 348, 1081, -613, -708, 567, -251, -930, 162, -352, -1212, 246, 1188, -656, -1055, 426, -33, -865, 77, -394, -1323, 401, 1351, -659, -1493, 73, -175, -791, 79, -104, -1155, 159, 1376, -654, -1653, -70, 159, -439, 206, -94, -1162, 188, 1433, -752, -1625, -213, 232, -378, 502, 425, -951, -321, 1185, -417, -1425, 234, 473, -240, 540, 593, -946, -269, 1012, -161, -1219, 375, 588, -209, 771, 1026, -859, -614, 840, 147, -615, 683, 684, -365, 653, 1027, -641, -819, 933, 486, -358, 757, 650, -269, 608, 1170, -696, -999, 1039, 1063, -143, 614, 531, -449, 521, 975, -763, -920, 1068, 1215, -13, 275, 236, -498, 398, 1039]
3680A039j801l93K234J54j416J72J2q31Q84J024j567o03J952J12j530K35K71r54
3698a006R38J025j279p28J704Oj450M12L68j100O33J403q32r55J150oj313N60
3716d70O95j034K74J476p69j106Q58J48j089P72O80j286M7J757n16j428N22L05
3734a64q46R08Q24j455L4J548n29j524P04M78n27O97P32j552k53J916l33j877
3752a219N04Q63m45O24O04j316n83J804j84j691O55R01m85L12P77j556o12J880
3770H33j3j674O44R36o59L99Q18j285j116J595L67j220N28P86q32k5J003j024
3788F1j096J380N42j066O50O16j287J2J289p73j350J002Q18p47L91N56j452k86
3806g40J677n06j414R37J026p59K07L12j625R2J800n20j528Q43J060n77k74L71
$$ y = [1039, -762, -1155, 1079, 1233, -183, -11, 1, -830, 54, 1078, -489, -1092, 860, 972, -558, -323, -52, -1006, -68, 957, -322, -1050, 654, 660, -790, -378, -10, -1110, -477, 926, 94, -861, 289, 283, -1030, -470, 225, -809, -535, 941, 172, -934, -76, 72, -1017, -245, 435, -851, -804, 953, 437, -991, -469, -164, -1010, -102, 722, -733, -699, 849, 320, -1204, -500, -22, -549, 148, 880, -672, -925, 991, 658, -1219, -715, 148, -297, 327, 931, -385, -968, 836, 652, -1039, -384, 517, 32, 344, 1121, -435, -1047, 833, 820, -854, -210, 726, 67, 466, 1284, -1, -1117, 478, 845, -375, 153, 939, 107, 82, 1085, 61, -1035, 345, 887, -179, 471, 1087, -200, -188, 1101, 328, -1022, -20, 798, 51, 442, 998, -454, -740, 937, 431, -983, -46, 980, 221, 428, 740, -885, -793, 1007, 487, -1041, -198, 862, 285, 11, 382]
3824C82j493P4J897k52j639Q13J187r43l64K05q40n1J903j19j741N41J209r68
3842a99k36M16r83L3J806J9j901O06Q91q26k89P71o00l72J559O5j641K01Q71p65
3862e74j85J158n03r72J314O12j423j6O51q18J44J403n11j362J285N82j220k50
3880f85O87n98J74J562o42j512Q87R98r96m44O52m92J75J496n49j574O65J122
3898I26j073k26Q56n25J34J133o17j826J046J182j057m48J109l73j79J038n35
3915E65j621P20J414r55l17R22k26n61R81l75j641P51J353p00n53J112n35q25
3933d91J043Q2j503N19J344q34l77J122o53j225J036O49j178N8J178n87l48Q68
3951G03o50j385J187J036j111k46Q70m58j88J038p99j566J143J426j073m22R37
$$ y = [382, -1111, -1037, 860, 608, -1031, -218, 969, 26, -338, -133, -973, -1024, 879, 760, -981, -440, 769, -199, -435, -19, -1002, -969, 837, 856, -1045, -439, 452, -374, -663, 108, -492, -864, 695, 760, -881, -680, 191, -574, -759, 399, -104, -1076, 238, 850, -573, -589, 62, -756, -612, 791, 280, -1082, 203, 785, -435, -685, 2, -596, -422, 1140, 498, -1014, -127, 871, -125, -569, 83, -409, -234, 1262, 713, -861, -196, 926, -147, -373, 483, -42, 92, 1225, 608, -1218, -172, 1010, -47, -495, 614, 241, 62, 1100, 565, -1056, -336, 1078, 123, -194, 728, 502, -59, 922, 547, -1094, -343, 1010, 310, -243, 869, 334, -491, 552, 634, -869, -350, 994, 160, -217, 905, 252, -973, 63, 712, -466, -408, 770, 183, -165, 703, 53, -1332, -145, 891, -220, -466, 404, -54, -242, 796, -3, -1569, -426, 1000, -73, -495, 442]
3968D42n52l26Q62o81j274J184J369j077o75Q48l28m12Q81l97j339J130J355j058
3986d8p11Q41k59p16Q54n4r14Q06J409j330q96Q98j49n75R71J83r99M20J272j030
4006b7q12R70l61n62R63O44j224Q1J107o52p11O41k13o25J351P93j654j89J008
4025E28k42n96P20m10q02J460J030j746o66J192k04l70O34k24r30J345J009j859
4043a31p02J158J05m07P08l11j044J226R03j559j043J331K74n06O87k68r42P88
4061B67Q75j432q18J475L24p19M98%j011O28P67j298n10J494J41r41N60K28j226
4080f98K40J107j020n24J195J61q33N46M61j441q3J266m34n94R73q6r61P85M46
4099E06j607j77J660j29o81N24j16q14Q56M68j574j98J784N3q93K12n6q02R06
$$ y = [442, -110, -436, 426, -255, -1529, -345, 1024, -53, -728, 120, -208, -620, 261, -136, -1475, -345, 1010, -48, -759, 82, -177, -893, -39, -93, -1007, -201, 1208, -122, -1018, -120, -269, -844, 127, 310, -689, -269, 1003, -27, -839, 131, -230, -792, 171, 815, -409, -328, 779, 127, -584, 57, -156, -781, 570, 1363, -291, -480, 528, 286, -310, 410, 0, -802, 658, 1688, -58, -724, 468, 264, -106, 528, 304, -626, 719, 1728, -131, -833, 325, 430, 23, 731, 420, -624, 602, 1505, -54, -1097, 234, 508, 2, 689, 421, -521, 267, 1142, -290, -1108, 367, 691, -28, 470, 470, -541, 87, 854, -444, -954, 540, 681, -260, 300, 528, -698, -458, 649, -371, -895, 300, 461, -372, 174, 635, -806, -889, 377, -57, -651, 322, 236, -725, 60, 506, -1101, -1278, 382, 253, -428, 96, -20, -834, 22, 490, -1084, -1282, 502, 555, -338, -126, -182, -984, -78]
4118g8P60j523l46J616J82j123L21J37q91Q41P86j337l26J641K2j287L56K95q05
4137g59O13R57j004m45J344j13j316N61L78o93L80J117r28m12J109l10j255P34
4155d2N09r21L35J134o29q53R65j52q35N75P28j045n0J475o33r99P52J2q46R28
4175D08N51j235j24J626m27j496N89K44m55Q14N46j389j28J493k71j435L49N56
4193B16l42N72O44j561l25J640k30j460M76P10m72N96M87j358n46J506K0j350
4211g77N25N70n33J70O48r97p19J391J6j132O13P91p81j7P74r46p34J157L41r80
4231f20N01O66j051q5R30n50j011R76O14q63L75O21j137j64J255m56j271R71Q62
4250E63p51L64K48j213j43J626m68j332P91R44o03j3K52j141J99J462l30j327
$$ y = [-78, 682, -841, -1187, 429, 611, -512, -191, -54, -945, -104, 682, -655, -981, 660, 682, -605, -249, 46, -759, -146, 811, -193, -638, 706, 593, -723, -162, 216, -477, -97, 1020, 92, -320, 789, 479, -776, -42, 467, -454, -119, 1015, 386, -467, 498, 346, -489, 86, 814, -231, -281, 1194, 561, -438, 314, 326, -520, 408, 959, -276, -400, 1226, 799, -697, -108, 136, -319, 495, 1041, -348, -476, 1017, 746, -689, -340, 216, -126, 446, 1090, -471, -796, 844, 614, -846, -370, 340, -132, 464, 951, -407, -953, 553, 573, -777, -252, 318, -215, -45, 603, -394, -1113, 278, 294, -838, -225, 566, -215, -232, 542, -404, -1138, 19, 360, -620, -119, 547, -504, -589, 341, -209, -1220, -244, 370, -493, -118, 503, -634, -798, 457, 1, -1270, -299, 563, -188, 176, 424, -789, -932, 694, 226, -1106, -315, 629, 26, 13, 265, -876, -677, 785, 455, -872]
4268h72P16J041p83n3J27q45o5J580k1j458N21R39o89l88O99q89k82J688j48j406
4288e88N89P88q94k19Q41m53m79J271J38j418M82O18r54j8J029n38n75J087J66
4307H73j244J30P72q83j8J269n46q75J106J61j062O3O22o14rJ181l32j249Q72
4326B17N79j055n1O25n97QJ278n32j454R00P88r95k26P62o75K28J161p48j393
4345a180Q03J035j064k46Q44l03k85J064m08j533P27J189r47k50R52o77k76J026
4363D71k58j322M68J252q32k19R28m59q35R11J61j279N03R16n90k55R98n30j004
4382i75R21L97j118L88J064q13r4Q21o46r12Q64P62r68j67R82o57j72R40n09j215
4402a107J105Q47r79j80P76m23l30Q51n65j013R62J196j107l19O62m37j42P06
$$ y = [-872, -156, 885, 102, 49, 176, -669, -734, 846, 825, -633, -112, 827, 138, -250, 449, -440, -722, 966, 818, -588, 1, 789, -105, -324, 517, 64, -415, 856, 994, -424, 58, 676, -278, -296, 733, 195, -380, 707, 873, -371, -241, 531, -352, -370, 899, 353, -522, 584, 745, -317, -254, 368, -246, -255, 926, 594, -655, 217, 796, -259, -310, 315, -282, -274, 1004, 472, -982, -82, 706, -289, -515, 247, -428, -200, 961, 213, -1180, -377, 658, -406, -652, 192, -111, -396, 668, 260, -1273, -546, 643, -304, -554, 398, -279, -555, 471, 213, -1109, -641, 611, -221, -440, 488, 29, -806, 105, 266, -1013, -510, 406, -184, -439, 559, 29, -975, -54, 343, -775, -387, 677, -136, -230, 591, -55, -967, -103, 659, -309, -476, 506, -151, -323, 617, 108, -1107, -2, 845, -134, -314, 462, 39, -291, 560, -5, -1018, -56, 1140, 33, -286, 376, -61, -203, 503]
4420E03l28j208J010J352j183m47O86k69k15N76j14j091Q45J175j047o57Q60l64
4438H4o08J036P9j073M13J104r25n80Q11l28n72J074K80j185K90R90q30o36R64
4457C88l43o65J020L48j044j6Q66o73l66P38k76n79Q97O65j326k78Q16k25m41
4476d94O84j97p47R66P19j458l61R94k56l38N30j6r16J008P13j376o49J418j10
4495A14o14O34j24q02P43O55j208n76J301Q9o99N46K41j184Q05N07q49m84J052
4514A47J45o09N16O4r72K80R97o27o71Q86N7o12M98L66j187J95J118o26m13Q44
4534C96l8p65O59L74j272J42J063k80n35O08K9r06Q09M91j279K3J159r1p82M42
4554B47J18r37P39O96j277j36J338j53r31N04J85p38M88P66j144k94J170N1q98
$$ y = [503, 175, -1033, -23, 1329, 146, -301, 385, 116, -99, 477, 363, -728, 117, 1292, 245, -412, 448, 84, -524, 512, 591, -482, -69, 1035, 110, -470, 341, 13, -559, 515, 795, -390, -100, 890, 60, -576, 388, 45, -620, 400, 748, -296, -312, 554, -119, -485, 253, -23, -602, 295, 960, -366, -644, 172, -53, -494, 190, -7, -754, 212, 931, -527, -888, 106, -150, -488, 42, 26, -890, 118, 831, -545, -1194, 224, 114, -500, 134, 10, -792, -49, 606, -602, -1178, 123, 212, -487, 59, 300, -884, -79, 428, -421, -905, 147, 292, -317, 199, 263, -709, -429, 568, -59, -730, 156, 213, -399, 99, 465, -722, -527, 591, -35, -448, 396, 358, -407, 252, 626, -646, -504, 559, 279, -256, 352, 381, -525, 284, 775, -504, -481, 678, 587, -195, 247, 365, -572, 167, 863, -414, -550, 788, 635, -296, 208, 393, -345, 143, 909, -235, -529, 641, 692, -206]
4573b06M03J16p45M71R90j164l37J107L8j082M35L17q42N17Q73q63p06J181o7
4592D36r64O01K38q26M29R63p47p97Q77J4q00N13L76q84J55J240o48q33P02J38
4612A83p72N60L56q93l5J181m15r23N09L08n94M95N57j076j59J285l72q99M60
4631b44K93m49K48P06j149k33J342j88j139N32M49n58L39N38r24l15J118n4j120
4650h08O34N77p55L51M49q38l02J158j22q24M42O31p31K23N98p80o00J088Q0r02
4670d31N70L70o03Q9P96p89o56R42M78r04L17L61o67j3R30m89r38Q38M95o27K34
4691C03L26q69QJ017l38j005P39M20n64N7N42p60l42J189k30j031N04P76p89R1
4711D4K82p40j29J203k47j053O20O19q60K51L09o16j72R45J9j162N23O29p64r
$$ y = [-206, 197, 313, -432, 39, 1029, -135, -472, 635, 673, -409, 26, 343, -499, 18, 891, 28, -678, 503, 436, -528, 73, 311, -515, -86, 877, 130, -667, 210, 224, -576, -63, 313, -571, -416, 824, 176, -657, 45, 183, -589, -29, 327, -566, -601, 580, 165, -758, -249, 59, -535, -40, 517, -559, -718, 567, 195, -704, -244, 49, -400, -152, 554, -595, -828, 514, 326, -813, -281, 168, -390, -51, 487, -437, -752, 366, 312, -808, -174, 403, -352, -1, 448, -390, -692, 466, 344, -480, -38, 593, -138, 85, 683, -97, -697, 391, 471, -431, 139, 509, -94, -5, 791, 2, -654, 288, 766, -138, 179, 540, -127, -140, 790, 301, -637, 201, 696, 69, 303, 629, -240, -232, 785, 447, -558, 181, 601, 37, 94, 636, -124, -466, 723, 493, -538, -34, 742, -47, 44, 326, -414, -543, 660, 413, -640, -20, 599, -261, -10, 299, -317, -489, 456, 475, -687, -164, 465, -299, -308]
4731c08O47n34n00J058P5j168M11P34p03k14P80o25k24P39L09j198K25O06n95
4750d85R3O27k33p36P94M38j122R1N93m67j13R26n13p60R63L93r49J38N09n70
4770c83o6R31m91q91P94N82p58j58P17n33m9Q82k09j080M71P43o39j70N79l96
4790a24j35P61j53r46M80Q09p20k52Q17n50k56Q45J2j063L47Q18o55j03O39m25
4810A46m56R01l1q89J74Q65n55j92P11n21n68Q79L42j078j5R72n34l18P16m78
4830G1n78R30K92r58Q8N95k94k62O22n48n27P70M77r68r7P92l29l64O97k56r10
4851g57P33P06r20k00Q14m75j37N73k81q98P95O63p73l94N81k10l10P17j29p90
4871f92N54O41o51m21O98k08n19P30M2r84N25O58l96o28P52k49m62P72J49r34
$$ y = [-308, 339, -195, -695, 363, 438, -730, -319, 415, -288, -502, 278, -347, -571, 168, 477, -721, -496, 110, -485, -392, 235, 2, -734, 60, 498, -624, -533, 60, -407, -520, 406, -107, -867, 96, 489, -460, -322, 187, -383, -449, 482, -9, -900, -106, 476, -282, -440, 277, -256, -305, 577, 368, -712, -241, 502, -137, -307, 272, -124, -259, 502, 349, -597, -117, 692, -28, -280, 537, -13, -269, 576, 588, -475, -128, 690, 35, -68, 571, 146, -310, 591, 560, -329, -155, 710, 155, -37, 674, 153, -415, 464, 806, -272, -287, 685, 151, -167, 549, 71, -507, 423, 715, -243, -155, 440, 146, -116, 506, -42, -569, 201, 678, -290, -387, 405, 76, -288, 409, 153, -757, -24, 682, -238, -438, 376, -99, -236, 337, 56, -842, -47, 616, -157, -551, 30, -180, -490, 227, 98, -692, -138, 503, -148, -569, 129, -79, -598, 132, 174, -810, -285, 373, -23, -651, 101, -148, -610, 162, 311, -623]
4891f23L66O15n42m22P20j40n21N79J90p02R3Q13l89n23O48j51n24P14K32q23
4911c90l7R43m08k68L69j17o40Q30K72r04m2Q18k69l35M63j13n10N78N76r25l33
4932d42Q96j9o52O37j00p14N85P08q87m10P73p8l96M38J87r76M88P64q54m18R17
4953D47k9m88N20L3q91L36Q72p48m74P17n3m45O01lq81M34P26m69o02O58n5n16
4975c10M75J73q46J67Q69n24m49N16Rn13N02L68q92L2Q12k67o90O05J10o13O47
4996A81K81j033j3R48k70n81L83J1m19M96L98q15l17J065j77p25N35J10n75L04
5016b13N35p30l98J012P5o91L72J39n65K44O61o77m01Q37k3n86K98M26o97J63
5036b19Q39n21n42N93J11o94M85K88p72L12O32m98m36N83O1l31L15Q1n62M0R14
$$ y = [-623, -257, 358, -184, -606, 114, -26, -547, 32, 222, -480, -387, 426, 37, -486, 162, 11, -513, 201, 433, -390, -427, 516, 108, -160, 209, 92, -548, 282, 554, -350, -392, 426, 157, -178, 285, 172, -338, 240, 816, -109, -442, 454, 435, -217, 420, 320, -394, 191, 899, 12, -398, 375, 297, -99, 339, 526, -450, 38, 802, -52, -470, 447, 418, -70, 450, 483, -408, -72, 800, 52, -422, 295, 242, -203, 398, 395, -486, -52, 674, 205, -397, 261, 206, -310, 165, 338, -508, -341, 528, 4, -445, 71, 80, -433, 69, 437, -455, -423, 389, 122, -568, 37, 147, -466, 181, 462, -571, -584, 364, 94, -487, -104, -93, -512, -16, 382, -433, -750, 315, 138, -587, -52, 58, -517, -213, 322, -408, -806, 206, 281, -410, -38, 101, -464, -220, 441, -236, -637, 200, 177, -409, -111, 315, -382, -219, 620, 99, -443, 150, 261, -433, 52, 340, -432, -120, 512, 14, -422, 161, 222, -109, 206, 287, -275, -235, 679]
5057F79m15p27N89L72o38L57L24p62q8R46l12p10O02K12n43L75K02o53m0R38k45
5078D63p83M17K50l19J34L76n82m51J137r3q59K02N14n16J49O90p99l54Q64J2
5098D52p11K76J82l06MN79n77k98P02R5o59J69K33l89N0O76l94p34P47K35p04
5119c72K22L11n48J55O71m08o53O39K22p65L68L18n66M8O83m77o11P42J56m80
5139c45J02L29n54P3Q26k94q18L64M48m38J97L66o48k7R88m75o59L57M95m20K1
5160a12L53n77r6Q35j67q36L25N67l82j1N08n64k20P83j5q11L16N19m59M5M75
5181D76o32k36P13J43q15J13O77m06k1N24m76n19P53K75p28M8N90n43l5O40m07
5202A34n30O73K99p61O1N37l33j71O93n81l86M93M47o09j00M10k45j32N90l17
$$ y = [679, 264, -463, 126, 498, -140, 217, 541, -221, -309, 637, 325, -385, 217, 429, -114, 261, 463, -190, -230, 708, 463, -320, 97, 347, 28, 162, 538, -44, -495, 642, 549, -310, -108, 406, -110, 39, 729, -70, -424, 440, 452, -259, 17, 199, -107, -103, 476, -101, -399, 303, 398, -261, -92, 141, -248, -198, 478, 84, -650, 97, 332, -372, -150, 161, -387, -232, 439, 31, -622, 17, 239, -526, -158, 160, -406, -358, 325, -152, -763, -21, 135, -345, -243, 86, -468, -395, 431, 137, -681, -317, 131, -307, -110, 256, -392, -419, 569, 94, -565, -208, 287, -133, -112, 241, -336, -432, 403, 236, -600, -275, 292, -90, -101, 407, -157, -377, 406, 391, -420, -104, 415, -44, 1, 476, -156, -392, 321, 464, -351, -238, 439, 33, 12, 536, 60, -459, 294, 569, -159, -111, 479, -64, -99, 541, 134, -396, 277, 576, -185, -124, 413, 80, -91, 602, 21, -365, 128, 575, -34, -134, 276, 31, -101, 489, 172]
5222A72o77O10M67m88k80N52l27l14O24q3q09O16M23m98l20N23l37j96O63j9p25
5243d23L80N18o05k37M76l09k05N54pn88R8P64o47o8M30k94k13N77J8o28Q9N21
5265B01k95l31N98l53l30O75J87p60M5N36m29j37M98j40m83O17K42o40j18O13
5285A96k87k10N82l81n26P45L50q26K4N09j94j12M79k47o21N30M67o73j43N49
5305B11k49k63O43k2q44M64O22o88j76M92j57k23O18j18q39N30O51o04k89N14
5325B73j37l25O19k4o98L14N06l23l00M23j64l60N49K4n97J00O70m39k88M70j81
5346A12l41O14J10p22j0O56j27l80M27k12l01L16L86p89n1N51l1k64J77p4m63
5367d16N19M42p58j20N97j15l54L17j57m34N63L36o22l39O83pm57K50P1n45M62
$$ y = [172, -505, 105, 572, 84, -196, 356, 29, -285, 339, 256, -553, 63, 486, -12, -332, 191, -146, -342, 321, 302, -423, -43, 475, -130, -367, 109, -200, -405, 149, 142, -446, -348, 416, -231, -299, 131, -163, -376, 201, 219, -409, -320, 201, -94, -425, 173, -180, -510, 165, 352, -408, -363, 173, -256, -393, 105, -35, -518, 99, 341, -299, -417, 196, -91, -301, 281, -100, -626, 119, 469, -357, -333, 176, -18, -130, 349, 102, -519, 11, 478, -195, -338, 211, -38, -301, 342, 320, -524, -60, 562, -126, -302, 190, 33, -190, 428, 310, -529, 1, 652, 48, -241, 273, 136, -189, 430, 406, -292, 22, 528, 205, -95, 328, 164, -196, 353, 377, -220, -120, 550, 111, -177, 293, 112, -229, 385, 495, -227, -237, 419, 292, -88, 339, 127, -174, 142, 528, -261, -312, 239, 208, -56, 121, 47, -416, 103, 545, -213, -333, 264, 149, -205, 112, -45, -479, 84, 420, -202, -541, 142, 135, -322, -72, -1, -546, -84]
5388h4N64p02k08N97Pn77M68o3n23M22N75n68l23N62k49j45K08J74m76J50N48
5409C57m77m07O35q7m19L74K08n93J51O22l75m53M90l7m31N21Q2n50J15Q09m53
5430H2m79M03J03n37O26K88q60oP40j85m73L81jl21M08K37n77k26P99j00n81K33
5452d6K79k42J64L77n09l65P21n8n18L76J70l96K25L54o19j73O55Nn23L46K57
5473D80n18R4L91m99k96O62J01o26M53l8l90M6M64l73l05N93km94L79L31o29q2
5495b58N21j93m18N46J18m73J36K11n96qQ01k67n26M32Q4l78K24K32o82J46N54
5516B06O8p26K78J83l81K50L21o07j53Q04l7o35J97L68n52L21K90n19k53Q54m3
5537B34o85L29J97l69K7M50m82k99P05J78o77K48L21m50Q9M84l55k12M97l7n83
$$ y = [-84, 480, -222, -430, 167, 174, -403, 65, 2, -521, -99, 476, -92, -415, 147, -102, -247, -39, 135, -341, -191, 357, -120, -527, 108, 21, -398, -24, 184, -409, -258, 364, -11, -464, 26, -11, -442, 79, 161, -389, -274, 535, 82, -397, 6, 109, -428, 198, 486, -374, -380, 360, 175, -298, 83, 82, -239, 169, 406, -171, -397, 402, 302, -279, -46, 233, -9, 155, 532, 23, -342, 379, 321, -197, 179, 349, -47, 178, 532, -87, -260, 395, 400, -123, 223, 480, -38, 56, 447, -52, -348, 314, 415, -211, 242, 204, -186, -140, 324, -49, -354, 239, 237, -257, 122, 453, -176, -258, 263, 70, -348, 198, 316, -157, -21, 190, -406, -414, 387, 120, -406, 26, 110, -268, -44, 188, -494, -348, 206, 274, -452, -174, 9, -372, -122, 199, -408, -561, 243, 206, -429, -232, 136, -416, -95, 195, -324, -577, 277, 234, -451, -122, 75, -294, -267, 183, -299, -598, 107, 285, -392, -144, 177, -273, -184, 300, -55, -267, 230, 193, -390]
5558c90K42L69m16O0O64m96l11N34P5n88K24K14k61QP48l89p02N37K69n19J28
5579@L45m51k8O81k70n93N11L38m18p6L70m63L1N54k33n55K02M86m87J70L32n41
5601i5j33P65j93p27K98M15l01J5K65m56j27O78j35p70L56N38m53m5L36l96r7
5622b62L81P4o41L68L94k95k80M32k04m15N55J7m24K05M16m86p2N57m50l25M82
5643B7P9l92J83L06l81o3M31k47n19M53K87l73N1M59m64k40M82j07n30M60N05
5664D07n40n4J90j76j56M79q2n65M96L36m37j39L28k40k27O03N9p11L53M91m73
5685e8j61K57j28j29M67l2m72J97N38m47k61K90l8k00N77m9m74J81M51n58k8M28
5707C51j10m53N37J37n41J2L04l39m3O69j97n50N14K50o40L2K90k83j38N68k29
$$ y = [-390, -148, 221, -195, -135, 529, 33, -278, 256, 331, -257, -33, 181, -80, -72, 676, 287, -415, 122, 391, -128, 0, 345, -106, -134, 547, 277, -316, 195, 533, 115, 39, 409, -54, -23, 531, 298, -257, -55, 431, -56, 114, 446, -95, -228, 537, 344, -383, -85, 330, 29, 44, 309, -147, -274, 404, 269, -501, -145, 393, -60, -105, 231, -165, -262, 119, 193, -448, -80, 314, 19, -261, 171, -33, -448, 107, 124, -300, -95, 321, -165, -237, 320, -130, -455, 27, 106, -286, -103, 203, -178, -241, 190, -57, -576, -123, 164, -209, -158, 301, -163, -403, 79, -28, -558, -98, 407, -133, -187, 3, -173, -329, 150, 68, -497, -1, 335, -102, -241, 87, -153, -380, 223, 282, -429, -76, 415, -58, -219, 38, -90, -219, 248, 216, -256, -59, 479, 32, -229, 61, 23, -177, 400, 351, -123, 58, 509, -49, -77, 351, 241, -212, 325, 462, -79, -67, 237, -102, -145, 524, 327, -223, 291, 541, -99, -67, 223, -60, -198, 370, 141]
5728A41m78N36K75n35j15K53q4rM22l06n82M08N41n75k07L55Q9k00K90n1o31N31
5750F8L01m35l28N88M8m04M65j84n45M33L18m42k81N79j74k09M31j36n95L52N51
5771D01m61k47L31J04l90K48J57n50J12O06l73j49L46n0n24L29K02n10J19N97
5791B98m08j33M19k01m16M44K63n09j42O46k39j64K10j81l31M55M46n31j44M71
5811B53j15l35L12r0l35L69L40o47j20N12L2m15K14m6k83N13L51n64j67N52j19
5832B12l30K7K31m91M88L91o57j79M98L9m65K13J30k16K13L81m27l45N67M9m51
5853a22K40K61m69M1N51m63l46N39k3m92K93L71n01O4L94k13l23L42j7l31L24
5874A20K66m09k41M63r3l37L90l0m34L99M29p10j64O43l7m79K76P9l27L24L12
$$ y = [141, -337, 199, 474, -61, -176, 77, -7, -16, 406, 100, -482, -74, 467, -108, -315, 40, 129, -71, 219, 168, -463, 68, 369, -66, -394, 194, 242, -162, 303, 119, -426, 7, 325, -117, -398, 181, 7, -202, 229, 93, -502, -150, 401, -60, -307, 24, 128, -262, -14, 143, -407, -295, 311, -62, -211, 135, 85, -439, -110, 92, -418, -299, 298, -110, -243, 176, -25, -441, 3, 266, -243, -385, 261, 22, -142, 68, -113, -444, 11, 457, -74, -218, 253, 138, -197, 115, 25, -310, 59, 399, -248, -368, 144, 176, -239, -25, -71, -354, 159, 510, -54, -221, 331, 212, -118, -91, 140, -351, 137, 528, -129, -308, 190, 229, -236, -23, 107, -109, 104, 485, 58, -287, 280, 329, -122, 118, 379, -90, -49, 502, 39, -307, 232, 209, -283, 10, 381, -120, -56, 338, 125, -198, 144, 127, -204, 120, 386, -23, -264, 199, 106, -231, 159, 129, -305, 94, 523, -187, -351, 292, 255, -224, 52, 131, -196, 128, 440]
5895D40o96q7N22Lm24J13K63l81R0L38m13k43N60j4m51M13J25m46J49L46l33m18
5917e44O11pl35K41L30m92NL43m20j71N09Kl68K65L07o90J25M26k65k51M74M8
5939A43k60J75J50m43j10N74l8l84L28l5j92J37J95o70Q1P16j84l30K70Q7m18
5960b08L79N0k98k16O59N1o38L29jk46K86J10l61j39O73o0p00L79K69l35L2M02
5982D17m05j33N59k3o21J70L56l13m5M23l41j41M94n2o32K78L29m19P6M01k15
6003A63l84L49J25n18K47K43l40q5N69j82n37L00K65m95J19L42l11j10N48k62
6023D6m34L36J18l24K42Q1l49RM74j68o00M48L18l74o2L91l75j60O15k82m33K41
6045b42M90l19k34M17l61N5L43Pn97L06L91m69P9L62m06q1L87o7m95M11L85l59
$$ y = [440, -256, -343, 179, 182, -242, -129, 134, -247, -157, 181, -232, -475, 85, 71, -380, 33, 158, -288, -139, 207, -126, -544, 67, 60, -275, -34, 296, -196, -191, 152, -268, -439, 70, 72, -296, -31, 276, -414, -289, 137, -128, -379, 95, 143, -117, 58, 208, -235, -345, 229, 191, -193, 135, 100, -92, 45, 240, -430, -349, 367, 183, -147, 123, 210, -208, 171, 221, -77, -293, 366, 417, -221, 108, 107, -139, 147, 257, -104, -243, 430, 370, -330, 49, 318, -17, 15, 417, 12, -121, 438, 415, -206, -36, 320, 7, -38, 385, 44, -97, 397, 345, -287, -9, 320, -99, -23, 378, 163, -221, 128, 253, -265, -18, 225, -115, -200, 369, 187, -350, -50, 215, -280, -161, 181, -130, -240, 308, 46, -388, -52, 66, -258, -16, 65, -284, -275, 199, 31, -569, -121, 197, -177, -239, 152, -223, -383, 232, -50, -483, -242, 248, -71, -305, 112, -249, -194, 149, 156, -441, -135, 256, -213, -134, 228, -178, -259, 128, 61, -434, -23, 362, 3]
6067Ck73M36q4k61L79j13k22J45L13m04j49M08n3m03L74J71m56K23L09l71j49
6088a77M39j67m23L78L75n20J97J75l77m0L75M3m16Q3M08k79m4L41m04r2M78p4
6110B79n86M65K71l60j59L18l12j07N45oo57L62L08m07KK27j52k55N36n5m08L17
6132A66J92l70j63L13j58j61L85N6n02N4M66m67q7M13n6l16L23J16m05oL95l38
6154a50j78M30j05l68M36J07m80R3K11k51J57K93j34m80M65J71m40j07L00j21
6174a51r2M85k38l77K63K71k62j82L22j15j21M72l15l32K67N08n49n8L45p5j60
6195i4L34j38l75L32L10n78o8M78j04o2J48L1n63L64K82l69j58M45o7k91K78N5
6217A90m60L11M19m58j80M37o3l69L05K15n57J26M87k93k01K97Ql56K45K66m67
$$ y = [3, -270, 166, 82, -179, 200, 87, -135, 10, 323, -81, -230, 178, 125, -278, 96, 267, -189, 34, 343, -28, -177, 262, 95, -328, 50, 425, -95, 102, 277, -100, -140, 235, 278, -138, -55, 353, 74, 30, 371, -33, -125, 353, 279, -307, 158, 429, 69, -90, 228, -84, -191, 354, 348, -309, 53, 361, -46, -44, 183, 31, -224, 312, 257, -151, 166, 358, -12, -175, 138, -20, -181, 204, 260, -242, -188, 278, -189, -276, 137, 81, -235, 88, 204, -201, -207, 188, -150, -328, 102, -3, -371, 65, 172, -308, -215, -4, -255, -98, 195, 61, -419, 46, 217, -223, -330, -30, -151, -243, 242, 4, -373, -110, 161, -101, -283, 39, -76, -197, 275, -40, -372, -105, 403, -146, -204, 141, 66, -94, 240, 102, -273, 59, 369, -209, -277, 201, 97, 35, 183, 214, -349, 15, 297, -72, -230, 215, 148, -143, 135, 190, -270, 41, 460, 2, -178, 259, 196, -173, 132, 347, -210, -84, 403, 110, -91, 206, 214, -142, 103, 369, -98]
6238i8lL42j32o1l0Q0m33M87J40l85r8M43n2l48K75P1n00L52L52m87j85N38p9
6261A89k94J13o4k00J78L88m07p5L36l4k53Q4J33l46L29K16l31k47N40k43l66
6282c54K10K39l39K02L08n50n1M72p3m44L02K75l82L3L30l05k47N26j76l15L52
6303A3K63m81j9L75k60k11M41j39l25K74L31l44j05M14j52l08L86p6l53M28J79
6324C31m52j20K89R9m21J51K69m25M04J83m82o9M50r2l46L54p5k10K95K30m43
6345h0j26L60J08n09K53J46k73J73M47n63j92M89J6m40J59L21m23P4L65l52p4
6366a21L98j1k14P8K44n27R0K57j14k72L18K16m46J40L06m41j7N00k70k71K23
6387F6K33l88J95N7l49J8M69j88k55J86J33l38J33L34m86p3N56j76n52L89K15
$$ y = [-98, -101, 241, 109, 48, 18, 98, -335, 152, 292, -93, -191, 252, 200, -148, 127, 198, -302, 50, 402, -85, -270, 268, 189, -105, 8, -56, -256, -78, 310, -97, -172, 164, 130, -123, -39, 94, -252, 77, 293, -38, -285, 255, 12, -354, -144, 95, -244, -42, 266, -284, -335, 137, 64, -380, -78, 197, -185, -152, 178, -127, -374, 152, -24, -339, 13, 276, -205, -224, 151, -109, -320, 121, -18, -343, -69, 262, -82, -187, 227, 75, -233, 153, 77, -276, 152, 331, -121, -241, 48, 147, -274, -123, 146, -279, 125, 308, -174, -243, 207, 115, -231, 123, 48, -162, 133, 363, -80, -206, 154, 262, -247, 6, 152, -121, 52, 499, -64, -256, 233, 249, -191, -32, 289, -134, -60, 305, -47, -121, 277, 266, 52, 130, 374, -153, -63, 194, 80, -192, 126, 342, -104, 36, 342, -99, -116, 384, 114, -157, 66, 299, -89, 106, 163, -186, -168, 301, 113, -142, 44, 177, -161, -28, 306, -180, -253, 303, 127, -425, -36, 179]
6408A79l18N7J67k22r3N40j67m85J86L08k81M3K21l64j35N77l7n48R8M19k69o4
6430a88L66k93j20K16N2m31J94K58l13K4K87p8k14K20R3l54J40L10k98j46N47
6451B72k38k97L19J03l98J24L52m87J24L56k26k89K50K5j67K18J26k19l2M35j33
6472B18l91K47K39l21N4K14l06N2L31j33l36O0M89m21lK21j57p1L68p9n13L56
6494A18P1j97p2K75j9k22J35L9k35R8L40l58o9M22j98l44M72p9l88J53K58k11
6516a1j32M05j43l85K34K86k97K3K64k55j81L97k20l82K90L13l54J05J23k49p3
6537b42L74j72k97J87L01j75j60L01r0l63N02j08m03K81K81l33jJ24j57r7L95
6558A48o1m76L80J35j09k35K87j80j80L34J17n35M25K20l50j31J87j45m9L38J34
$$ y = [179, -139, -82, 85, -137, -230, 310, 143, -342, -156, 152, -129, -86, 135, -229, -364, 213, 176, -372, -274, 145, -124, -188, 178, -115, -235, -19, 33, -398, -204, 54, -259, -235, 52, -26, -240, -20, 73, -281, -141, 169, -129, -275, 272, 34, -263, 56, 159, -239, -115, 237, -250, -126, 230, 4, -285, -35, -10, -177, 41, 167, -52, -84, 351, 218, -173, 74, 313, -8, 46, 260, -46, 6, 337, 204, -132, -72, 417, -4, -7, 214, 57, -14, 354, 275, -238, 118, 189, -8, -80, 195, 176, -46, 89, 128, -107, -9, 331, -27, -96, 326, 128, -216, 256, 177, -211, -58, 200, -11, -143, 262, 119, -266, -32, 254, -43, -20, 244, -11, -192, 205, -15, -397, -107, 206, -148, -43, 80, -169, -242, 132, -40, -337, -150, 151, -24, -184, 117, 27, -336, 166, 58, -345, -64, 217, -116, -117, 7, -150, -247, 148, 87, -389, -9, 126, 17, -218, 69, -111, -291, 43, 160, -375, 50, 270, -80, -211, -24, -169, -218, 120, 254]
6579B54o20K16M06l31o8J40o8j27K46R8k66j27M51l15r7L26j38j76K87K00l42
6600e1k6K37k16p0K48m3k38L98J66n57n6M43k18K3J70r0l01L26K21m00j72K95
6622H9N8m3J36r7l56K25L37l64j61L81q9k22L16k22j54K08K55l94n7L56lk58K50
6645A91j32m14M03K33l88q8L19lj73J12N5l40J66K11j90k41L39l2k22L52K4m40
6667b58K08K58j54k98L95j17k68L11Ll70J5N12k07j89J82L9m64M49J85l77q8M36
6689B03k35p4K51j3l57J86K74l74l1L61j27l29J29K40k47K7K99k66j44K38l7j34
6711a60K96q2l00J73M05m44n5L80k00q7J09J17k86J1L98j74k37K11P4k20K66M6
6733B41n09L01J62j31k01J97l6n9J93R7m24qL81j11k35K51J31l43J76K02m19q
$$ y = [254, -366, -150, 256, -75, -143, -3, -71, -198, 48, 146, -120, -247, 204, -111, -208, 118, -20, -196, 91, 291, -51, -77, 160, -56, -126, 122, 79, -159, 239, 405, -152, -208, 235, 17, 40, 210, 120, -181, 145, 366, -34, -206, 89, 147, 104, 240, 143, -213, 12, 349, -15, -176, 205, 116, -106, 210, -12, -166, 42, 297, -97, -154, 202, 199, -59, 191, 59, -355, 48, 281, -107, -195, 124, 121, -52, 60, 115, -225, -59, 152, -38, -279, 60, 28, -194, 158, 182, -258, -50, 208, 54, -244, 151, 34, -234, 77, 80, -290, -275, 237, 30, -159, 23, 62, -402, 47, 232, -145, -233, 203, -32, -106, 145, 132, -225, -39, 235, -139, -170, 191, 64, -265, -136, 104, -143, -116, 183, -83, -227, 11, -26, -160, 136, 54, -246, -73, 332, -112, -167, 213, 13, -74, 35, 152, -134, -123, 275, 101, -136, 75, 149, -71, 195, 241, -268, 33, 195, 64, -137, 60, 24, -35, 158, 255, -169, -177, 204, 93, -142, 109, 240, -103, 73, 275, -144, -152]
6755a52M00ol42K32j02j78J68K51k95j50L44O5k63k3P9q2R0K80l33q9J74J56l71
6778a47J54J32l02J90K48m05j35M13Nk37K90n8k11J15J66l75j87L67J09k45J14
6799AJ10l57P9L64k49j50L04K8l21J60R0k18N3J70j77k32L19R7k70M9J52k64J44
6822a18K38k56j02K14Q0j77J5K14l04p5M10k35k19K72J86k44K10J04l07j32M14
6843A88q4l34K22K14l80K96J36m49J74K85j59k19K00Kj57L5J92j81p7K53J03m63
6865b03K46J92l10J14J80k77j42K67J71l80J59K99l65%J65o0j69K62N9l11J37
6886C4J72k19n8K80j55k39K62P3k58J29O4j34N3N4J62k84K36Qk92O3K88l04r6
6909a61M71j40m06K47K52l18M9J35l58N1K85n1k68R4K85k41J0R8k01o2L58jl73
$$ y = [-152, 248, 242, -100, 132, 30, -148, 20, 271, -24, -174, 170, 235, -28, -51, 28, -54, 36, 316, -17, -106, 68, 224, -147, 7, 139, -163, 27, 275, -130, -265, 148, 153, -84, 206, 148, -63, 52, 218, -157, -344, 23, 132, -113, 1, 111, -246, -167, 197, -52, -202, 102, 130, -191, -31, 59, -159, -106, 64, -113, -345, -26, 71, -199, -150, 2, -262, -118, 120, -136, -238, -24, 56, -121, -106, 108, -196, -271, 139, -96, -315, -43, 143, -101, 109, 213, -94, -226, 188, 104, -230, -8, 206, -174, 122, 258, -191, -17, 268, 109, -110, 90, 92, -65, -30, 162, -19, -96, 157, 260, -203, 43, 235, -75, 39, 219, -58, -200, 67, 238, -142, 17, 316, -49, -49, 116, 56, -113, 149, 208, -103, 34, 206, -13, -71, 209, 54, -185, 77, 150, -108, 21, 85, -49, 4, 58, 220, -64, 172, 180, -112, -49, 239, -65, -161, 310, 170, -236, 11, 263, -55, -6, 129, -229, -178, 107, 56, -212, -118, 167, -74, -64, 34, -167, -229, 129, 128, -245]
6932b45K06J70k33j35L38l48kL54J11m55L5L19l20J41J72p9j75J59J47l06LJ56
6954A3q8m9K31k08j52K73R3l11P5K10k24n6L47j23l05K39K45l18J53J17j91j48
6976a77L85j85k57J89K91k60qK77l84k8L35m5l42L23J66k66o1J54q1k15M39n6
6998A94l96K92K32l52o1J17L5o7K46k2l62L20Q0k17k1J02n1j12K16Jl45J68L09
7021C06k48k3O8l2k42L26J01m06N4K47L6k68J63N3l54K16J51l26J36J51q0j56
7043a27K81j00k45K64J09l13n7K88j19j86J86J29k96J06K23k91o8J76n0j14K58
7064E4j41p6N6J84k38n4K72o0o0R9j26m8M4L50k16l14K85j54p2J99N1j57Q6J73
7088A37j33k04K03j6o2J43P0k68J02J62p3k75K48M2k98K32J47l52J24L11k71j79
$$ y = [-245, -39, 131, -102, -237, 101, -247, -249, 105, 216, -239, -204, 115, -205, -64, 108, 29, -146, 13, 160, -146, -143, 13, -75, -124, 107, -101, -253, 20, 113, -198, -123, 87, -137, -193, 154, 31, -274, -35, 210, -108, 45, 162, -29, -177, 208, 23, -234, -45, 246, -14, -22, 255, -129, -157, 178, 133, -209, 114, 280, 14, -47, 107, 26, -189, 250, 194, -202, 90, 322, -30, -91, 26, 61, -6, 240, 218, -144, 176, 256, 39, 18, 120, 69, -43, 173, 174, -171, -3, 306, 58, 35, 103, 71, -171, 155, 256, -150, -96, 151, 187, -81, 82, 135, -219, -3, 148, -178, -42, 109, 29, -127, 154, 54, -191, 73, 182, -131, -188, 100, -19, -205, -19, 110, -186, -80, 143, -148, -216, -40, -90, -204, 54, -87, -163, -107, 77, -161, -215, 57, -3, -63, 36, -90, -138, -94, 256, 40, -274, 11, -143, -215, -16, 35, -122, -36, 137, 4, -200, 3, -13, -75, 68, 138, -130, -28, 134, 61, -214, 34, 76, -222, 10, 157, -195, -71, 240, -31, -210]
7110b10K79L0l13L25M5k76P1J34n1j30K23J2k40K12J21l29P9L74k79k57L53l7
7132A36k60K69Q3k99m4L03n4k25K50l6l20L63K30m18j16K51j7k51L07n4k93J60
7154c5J71j35k42L07J35l14L18n2l28J96L57m21j08K52j2j58O3J57m01K27L34
7175C11l36j79J78K2j98J67J93l51P5K44j66j76L28q6j74J08K30k52m3J45Q2l69
7197b47K21M4k69J71J96k28j12M12j91j91J00J84k57K50J31l68J27n9J51k45R5
7218h5J21j19J06J98l81LK42Pm30L14O9j89J78K12l34j53L86J0l16J68K16l18
7240i5J47J35j12k70L47r3j80N9K35k84Q5L25l43j02K32J23k51R7J49k59J7K24
7262A86j9k55J59N4l09J89J50k35N8J16kk26J26J24j84K9K83j51k28K97j78k54
$$ y = [-210, 69, 99, -214, 111, 156, -120, -49, 85, 34, -96, 127, 139, -101, 111, 232, -97, -18, 356, 77, -180, 173, 136, -124, 145, 228, -71, -115, 188, 134, -91, 159, 123, -197, 166, 396, -22, -138, 113, 96, -155, 152, 98, -195, -35, 136, 1, -241, 66, 201, -113, 205, 153, -175, 21, 378, -43, -151, 101, 89, -69, -6, 151, -250, -23, 311, -25, -204, -26, -4, -202, -35, 158, -193, -118, 126, -40, -216, 112, 26, -148, -40, 190, -62, -105, 40, 122, -247, -26, 18, -251, -80, 116, -112, -224, 188, -3, -194, -94, 90, -167, 83, 214, -154, -27, -86, 65, -180, -85, 36, -83, 23, 221, -160, -157, 85, 92, -338, -24, 45, -144, 34, 246, -88, -241, 145, 155, -161, 7, 223, -95, 52, 187, 75, -195, 152, 59, -121, -62, 173, -111, -26, 299, -44, -146, 86, 209, -42, 55, 204, -55, -38, 186, 167, -88, 71, 125, -184, 5, 155, -80, -22, 94, 92, -134, -8, 116, -68, -39, 244, 93, -135, 162, -16, -270]
7284b70M12J3j87P7K07k82j06K72n7k40Q2K31k59j1K85j82j82M07j38j64J42P0
7306A20k63P8K48l34k06M24N5l98K19J80l36P6K24k83j29K83L8k17J59K46k96
7327a12j80L27r6k28L88j7k31J01J94k10j14K61l4l38L77O6k09N5J22j42j08L70
7349B42k39j81K11Q6j87nK33l23J00K67q0k88J30K62l28O8L42m26q7K71J15k53
7371g0l9K49j39M1J46k53QL78j38k65M2K62k03r6J91jk73M31mm23J93J06j68J2
7395a3R0Q9l36K26K16l95J20L14l18O4J23q7k14K34J93m28J35J30k96Q0L08k01
7417C4k29J74J17k08Q2J60j76K9kQ9k62K34J24l07l5K37nk67L28q4j98M0K99j25
7441D9j97J97Mj83J98O2l03J06K11k24j7J37J7j84J38L6k66J10K91l33n2L32j32
$$ y = [-270, 142, 155, -32, 45, 252, -30, -136, 136, 79, -161, -79, 152, -107, -118, 167, -15, -197, 210, 72, -92, 50, 120, -143, -65, 183, -151, -357, 67, 122, -276, -57, 123, -213, -137, 87, -196, -325, -42, -4, -221, -62, 184, -112, -292, 35, -61, -289, 99, 82, -149, -48, 146, -64, -178, 83, 49, -289, 88, 154, -55, 0, 122, -20, -128, 242, 3, -178, 33, 119, -68, -73, 160, -163, -63, 204, 124, -164, -34, 228, -100, -32, 310, -116, -203, 68, 183, -70, -109, 140, 1, 42, 188, -65, -57, 321, 183, -82, -40, 222, 19, -77, 114, 113, -160, 271, 267, -156, 37, 143, -25, -13, 77, 166, -170, 56, 272, -123, -3, 311, -7, 57, 180, 93, -121, 113, 306, -122, 13, 143, -153, -73, 235, 34, -195, -21, 96, -112, -30, 130, -46, -17, -19, 70, -192, 42, 166, -141, -176, 61, 56, -211, 117, 33, -165, -125, 174, 49, -148, 49, 53, -130, 68, 130, -173, -67, 144, -80, -97, 40, 57, -127, 11, 47, -219, -109, 182, -151, -203, 129, -3]
7464cj56J53n9j59Q2L22j74j35J95j74mL2J20k17J51K94l13j73L75j20l01K02
7486f2L27l46N5J86j73o2J77l1k51K81Q6j78q3J67j45q2K19l2k38K66N5j56n6
7509g6J23p3O0O9k3q6J35N3j45j07J66o6k6M3j2j24K21jn9j70K21p5k51K54J50
7534B01l20J77J22q4k08K14k1k48J63K79l09j18L94l49n4K40r6o9J76M2k18j02
7556a88L47k67J4J32L7j00L4J51k23qJ25j14m8J17J11l07K22J45k36j97L94k43
7578a02j01K57P5l68J87J66j46j39K21j08JJ33n4j69J1K85k39n5K11O3l18K55
7600F6m9k34J25J74j78n7J70M0k05K36Mk98J90J40j94j84L30J10j78k2J11k49
7622a52M9L83k70j78K08R7k03J90J25l83J30K06k24l1K65M0l61J74M9j82qJ84
$$ y = [-3, -159, -6, -65, -224, -142, 180, 6, -129, 66, -108, -112, -80, 40, -177, -26, 268, -45, -218, 157, 37, -264, -62, 265, -81, -26, 160, -13, -75, 102, 71, -180, 101, 187, 9, -74, 93, -52, -134, 85, 53, -185, 81, 136, -20, -76, 47, -26, 34, 103, 80, -6, 129, 182, 37, -70, 96, 30, 4, 47, 35, -89, 132, 131, 72, -98, 123, 48, -203, 51, 201, -119, 58, 180, 96, -112, 102, 81, -167, -4, 275, -34, -152, 242, -107, -161, 79, -17, -86, 90, 132, -86, -188, 159, -108, -94, 38, 75, -25, 9, 160, -63, -71, 54, -60, -108, 9, 120, -187, 35, 180, -56, -253, 141, -102, -203, 54, 129, -239, -52, 114, -32, -171, 50, -58, -57, 76, 22, -147, -136, 149, -90, -145, 66, 129, -189, 66, 17, -217, -92, 82, -96, -153, 17, 57, -148, 88, 92, -206, -16, 124, -70, -254, 76, 186, 8, -14, 97, -152, -103, 280, 10, -168, 40, 137, -66, 124, 249, -134, -4, 202, -22, -53, 212, 252, -109, 65, 114, -68, -76, 108]
7644A08p7j54J95O9k25K05P2j33j87L53j12k86J36J58j35R7R3k90j00L16q4j06
7666h7J3K00k83J39J50l13mM41j50j24Q5K6j20JM3m1j79L39m5k47J23P3j72J2
7690a20K80k64j06K35l6j39J23J03j51r5K87k38O3J85p6k08J20J92l70J01J35
7711B1p1l5L6J14l33K17J49k96KK79o9k38J23J68l36K15L00m19PJ61P3k70K56
7734E4qj91J59J57l51l3L06L3k14j7J19q2Q4mL4j55K87j60j37jJ66r3qN3km7J19
7761F8O5j26M1J30j98n1K57k10m3K11O9l19L4K85j69j74K81j59j66K00K71m01
7783a04J32J21q6j20K63j40j43j4K86l04P1J29j52O2J04J8j99J4K47j81JJ89l57
7806a63J04J68Q5l48J04J04l7o2J46j76q2K78r3l21L37Q6j76j20K14Kk10L24j37
$$ y = [108, 31, -123, 72, 141, -84, 121, 193, 60, -127, 226, 114, -172, -36, 122, -13, 84, 177, -113, -213, 103, 19, -87, -74, 126, -157, -18, 132, -181, -185, 256, 106, -18, 67, 93, -27, -26, 17, -24, -203, 136, 91, -156, -33, 40, -132, -120, 160, -104, -210, 25, -11, -150, -27, 76, -75, -170, 117, -121, -58, 127, 51, -157, -37, 155, -215, -114, 21, -50, -85, -49, 65, -268, -51, 98, -198, -196, 83, 14, -224, -101, 67, -269, -54, 246, -173, -166, -5, 68, -202, 54, 46, -145, 14, 171, -180, -213, 93, 126, -88, -105, 14, -68, 16, 12, 46, -109, 178, 18, -119, -120, 46, -47, -55, -2, -4, -51, 68, 133, 7, 48, 178, -20, -71, 186, -24, -67, 144, 213, -106, -72, 213, 44, -130, 151, -8, -174, 26, 297, -104, 28, 149, 63, -57, 206, 66, -77, -91, 195, -109, -38, 91, -61, 1, 105, 123, -76, -62, 185, 4, 5, 194, -163, -59, 109, 194, -154, -50, 54, 17, -45, 101, -75, -157, 121, 28, -293, 44, 130, -46, -166, 48, 50, -160, 164, 27]
7829B7j59k8J62J3k18K41j17p8J66P8l04Q1K14j31j73L22k74P2K04K8k99Q0J46
7852E3l9j52J47J62l82K20N4j93O4J63j54p1J52K6j14l3K30j76o2J63o1j23L92
7875B66k47j98K19J20j15r5J57Lj92L09j30j90J42K20l63q2L95k74k9R4J03k98
7897a85J56K34k28NK50j57j03J86o6j24J2K23p1k76K47L4k58R3J64q8J1K58l91
7920g4k1J91m0j25J19L7o6R0M7j25j92J02J09k22L27n4j50O9R8j08n1O3j6k44
7944b36J98K19k09N0J5K7m1Q0j35j97K1L98k99q5K31L8j70J57k1r4n6J60j16q0
7968a45K11k9j14K1R8j79J64M1j95k9K52q5k10J21J66j61pJ56k23j9K65p4j41
7991a16J32qq1l1J83q6j40K50l1k07Q2J35j82m8K87j11j00K76j03k66J81J14k98
$$ y = [27, -132, -160, 2, 15, -203, 38, -79, -157, 9, 87, -217, -136, 78, -53, -226, 96, -178, -106, 98, 126, -173, -93, 53, 14, -138, 9, 171, -211, 9, 63, -130, -66, 97, -57, -128, 24, 50, -64, -97, 133, -43, -105, 58, -3, -126, 266, 19, -179, 40, 160, 45, -50, 107, 110, -82, 227, 97, -93, 49, 269, -94, -176, 219, -55, -84, 10, 113, -185, -29, 205, -23, -18, 232, 75, -28, 158, 92, -32, -20, 203, 132, -144, 103, 137, -121, -28, 136, 48, 59, 317, -74, -95, 96, 56, -69, 50, 87, 21, 111, 158, 33, -159, -57, 52, -170, 157, 103, -47, 22, 120, 12, -39, 24, 8, -236, -38, 181, -28, 22, 37, 64, 23, 103, -32, -229, -208, 190, -109, -194, 37, 75, -95, 62, 41, -53, -109, 51, -65, -145, 66, 37, -77, -56, 42, -137, 27, 68, -127, -156, 96, 11, -199, -78, 88, -73, -80, 76, -147, -166, 99, 25, -116, 16, 8, -73, -104, 79, -7, -147, 103, 72, -135, -53, 82, -100, -148, 139, 28, -72, 204, 101, -165, 16, 130, -168]
8014a68p6K76j3j58L29l1l62K34L49m14k7J37L4j61J90j10j50J52O2r7j0J19O7
8037A72j86KQ1k16K74O4k17r6K32M4k51J28MPj1J13j86l1J95J23l80J79O5j65
8061e6jJ46o9j05J39K6j04k0J41j50J5M1l0o7R9j2k08K58r7k8oJ38q8j15J66R6
8087A09j97pJ64j53L1J45j74J1J35L9l25J15J77j17q9J58L1p9j5Q0j62m1K70k79
8111a73M5K10n5k10J12J84k42Q9K39j01k57J43P4k55J39J60k03n1J66m2j02N0
8133h0J10j43Q2J77j88K0J33j37k19M08j33r8J03M2l9q7J37J9j69J75M0j85J7
8156a5J45j94O2K30p8j45L6P2k32J43J50j81KR2K8k42R8R0n7j1P9j46j06K50o
8181F4l1m8Q9l7o0J65nk92J83n
$$ y = [-168, -244, 32, 19, -139, 190, 159, -203, 31, 380, -34, -61, 76, 110, -51, 139, 29, -121, 31, 93, -4, -14, 105, 172, -14, -12, 69, -147, 127, 191, -26, -122, 110, 154, -97, 31, 35, 42, 31, 144, -42, -73, 122, 245, -135, 44, 109, -56, -57, 89, 20, -85, 54, 80, -24, -44, 97, -53, -38, 3, -27, -94, 5, -7, -215, 43, -54, -82, -88, 50, -38, -153, 13, 109, -88, -95, 69, -84, -53, 92, -82, -71, 64, 103, -222, -107, 70, -47, -136, 22, 53, -26, -41, 39, -123, -164, 106, -173, -128, 82, 27, -183, -71, 113, -129, -40, 199, 98, -159, -16, 58, -197, -58, 102, -101, -152, 14, -28, -130, -80, 30, -113, -31, 146, -42, -22, 111, -26, -245, 163, 30, -68, 35, 77, 38, -49, 88, 107, -62, 113, 153, -32, -15, 130, -64, -2, 228, 150, 5, 41, 113, -119, 24, 174, -7, -5, 87, 115, -127, -29, 61, 4, -7, 72, -74, -180, 70, 64, 33, -15, 74, 37, -23, 142, 137, -155, 28, 23]
8191B3
$$ Imaginary data points
##PAGE= N=2
##DATA TABLE= (X++(I..I)), XYDATA
0@%%%%%%%%%%qJ6j6J6j6K1k9L2m0M8n6O4p2Q7r9J10j25J43j63J85k07K32k61K93
34A55l27L64m05M50m99N53o13O78p50Q31r21J021j134J263j412J585j787K029
52A081k328K705l194L863m838O387r252J6273o3122j08886J15003J01229j790
65E3131p7561n6121J5754Q8043K1684q6309n9884N4472O0470k33l1848k9674K348
78d5728N2959J6170o3281l8898M7798M5976K160r414k2842k6594J6867K5660j5058
91a4225m056L2818N61l0605K372J8132j023K054o427l2278N634N8552J8298m0370
105I437k4989m59K329K2772J4767k9502j2169M2635J6776l8372k6127K567J1949
118h386L3931J8088m5662l8397L8740M6584r776l3404l1288j2311M4528N7518
$$ y = [0, 0, 0, 0, 0, 0, 0, 0, 0, 0, 0, -8, 8, -8, 8, -8, 13, -16, 16, -24, 24, -32, 32, -40, 47, -52, 58, -67, 76, -87, 98, -109, 123, -138, 155, -172, 192, -213, 237, -262, 291, -322, 356, -394, 437, -484, 537, -597, 666, -746, 839, -948, 1081, -1247, 1458, -1736, 2127, -2711, 3676, -5576, 10697, -52425, -161311, -46308, 54921, 53131, -24430, -80551, -64797, 23246, 44930, -41379, -101263, -46791, 13679, 13446, -18402, -48076, -45728, 7231, 23401, -39880, -78778, -30980, 14996, 17156, 7742, -15100, -41694, -24827, 833, -14225, -18281, 14537, 15098, -15507, -13135, 4997, 3974, 6028, -399, -32677, -27043, 31509, 49807, 9437, -15552, -16011, -13682, 9090, 23857, -5645, -17814, 24821, 41597, 3225, -22902, -20335, -8386, 25545, 43633, -2029, -40426, -1686, 44898, 35122, 1718, -29570, -41881, 2647, 60165]
130F0165j6649n3841o570J9339O481P309n882k4068J3512M1718q274l9181n04
143f445J5116j535Q452L657k3614k84L5209M959k5548p020p266j6666K0613L7605
157C7233n415k3446o656j2893l608L1851J0594l7291j4191K7156J2230m496k941
170H127k1667j7133K5283J8025k5444r000K6837P976j4086j0601k0023r424L5309
183e821K7696k3442k0275J0487n83n687J2975r06j7654O896J2064r886Q621K5233
197A9718j6700l8103K334K3219J2431J2965m834l1118K5L5101k523l4781j315
210b3581K3639J3917Q437j2972l5542M906M8400M986m5406j9460J9136K8003K8108
223D2571p122n5209k5342M1251L1950j3589j4915m427N9K0629J1203l4034k3596
$$ y = [60165, 43516, -10325, -16895, 2444, 8925, 16234, 10352, -13716, -204, 41514, 33240, -5941, -6445, 8671, 7136, 15588, 19245, -4369, -4653, 30556, 35515, 9967, 2947, -4319, -20985, -372, 37233, 31818, 8372, 1716, -11177, -14785, 17066, 27660, -9631, -23822, 3334, 15564, 11068, 8127, -13540, -30673, -5390, 12635, -12809, -21809, 5028, 13004, -1082, -11683, -31706, -41130, -5821, 21875, -1567, -21842, -11355, -11938, -17625, -4650, -5556, -23210, -16314, -4250, -14136, -5515, 19718, 3018, -35085, -32751, -9532, 2899, 15864, 11030, -20088, -20063, 15038, 12515, -22266, -23581, 58, 13975, 22412, 9440, -26102, -21196, 27204, 32190, -13216, -32676, -13540, 14463, 42571, 35449, -19760, -45102, -3851, 28099, 14510, -405, -4832, -4773, 15856, 27059, -6975, -30571]
236c0571K8825K3195j2720r948j851k195J9606J5248l3220l3019K1884L1291K129
249A8654k790q902k0099M894K0468j1801j6136K1083J6115j6462r389M660j072
262g77R463P804k7598k0597L4166L4424j4374k5301j0247k192J7421J7613k2358
275b553k2216L0936L1233k2422l3323o331J2474K8414J5851l6174l7437L0151
287a1397M8259o901l6717k3640j935L0833L5744j6516l9983Q144K9090o747j9917
300a1683m930P83J7771K5509j4856l6222P020K8682k401j4530m201o527Q232K8295
314B0942N73k7546m043J0208r743j571J7989L338n449O646p523k0563R222K0922
328A3402r657j1949Q703K299o62J3535m068k5180L80J7896m348n307J3459K282
$$ y = [-30571, -1746, 21449, 8729, -1219, -3070, -5265, 14341, 29589, -3631, -36650, -14766, 16525, 18654, 15864, 6962, -13137, -8243, 12225, 424, -15712, 5371, 21486, 5024, -4365, 295, -777, 8686, 16490, -11108, -31705, 2461, 36885, 22511, -2790, -13037, -15229, 2192, 19805, -2553, -24769, 6167, 37400, 14978, -18345, -24676, -12202, 16212, 32063, -4111, -41548, -11397, 36862, 29961, -6756, -30396, -32331, -1498, 34246, 17730, -22253, -14109, 14981, 8234, -11683, -16613, -15830, 1941, 27450, 12594, -23628, -16608, 12074, 9673, -4857, -9058, -15585, -7353, 20942, 21515, -6031, -10074, 134, -9609, -11180, 6809, 10147, 4698, 11344, 3821, -16742, -7520, 13402, 3745, -8204, 499, 2798, 2136, 15671, 11603, -13577, -13197, 4699, 351, -4956, 8503, 10785]
342A0785p556M378p891k3601P767L0426K452j4373l892p089j793K0400M680k8044
356a3351r381K0236R154K20N150j2080j8698R433J1823j1839n40J7326o07r027
370b181L746p061j4578J1645J6644q711n659P719o170m398J6770J385k3696n579
384b0124J3317O365J1113J0081k1464k3697J4044J7287p273l217N376l202N505
397D111J1516j6163j9940J6869J9281j1535j0344M570K674J0699J1729k0787k7462
410b4782J3809K5292j908n483K116o926j549Q724r981j3000J9313J8175j7202
423F598j4453R476P253K798O91j9262j6251K4514K7394j3648k0403K580M337J797
437C421L355j3215j1078K5491K4232k1828k9233L228J5574J2581M444k2220k3667
$$ y = [10785, 3229, 7607, -284, -23885, -16118, 14308, 16760, 2387, -1505, -8594, -10387, 10013, 14693, -13351, -22732, -2496, 6658, 6878, 12028, -52, -18750, -9317, 2506, -9333, -9873, 7453, 6846, -2181, 1565, -5496, -20074, -8429, 8215, -496, -6155, 1564, -4606, -9004, 7766, 9151, -14545, -20124, -6807, -442, 10671, 20752, -712, -24409, -10365, 6922, -351, -3568, 1808, -1394, 4111, 15627, -536, -20476, -3607, 15674, 4139, -6205, -1635, 1039, 11738, 23467, 2680, -24782, -10973, 14319, 12411, 6928, 9044, 2118, 569, 9293, -688, -13688, 5625, 23800, 6598, -7855, 1621, 8874, 11672, 12363, -6899, -23150, 1364, 28758, 15110, -5293, -2713, 1624, 3421, 6776, -6439, -17517, 7974, 32206, 10378, -18855, -15627, -53, 12528, 16972, -5248, -28915]
450b8915K2131L6010q209k9313r598L537J2615J7937q202k4396Q901K5818p797
463A0519k3953l707P009J2467J6635j0224k9656L743K9106J484j9303q018j946
476a5844P513K1730J530k5635m810J7978k731j4498L347P633M905J0090p558k6320
490b2670J790K7901J997j9619m818N057Q052J4998m007k7593l143K5238L594j7325
504a0548o09R860P159P945j0488k9060J930L5586J0761k0820j2086K256Q136J6499
518A6521m35k7738q162K6051J2472j1744m466J196j572P542J273j9341l268K5697
532A4026R984j4980p212j483l763R620J0368j3360r905J3394N664q518K774K684
546I293j1925k285Q931l382o18J3930j292j7273m52O648n864J879J1064n169p728
$$ y = [-28915, -6784, 29226, 21017, -8296, -17894, -14357, -1742, 16195, 7993, -16403, -7502, 18316, 10519, -13434, -17141, -10132, 2335, 18970, 8746, -20910, -17167, 11939, 13423, -5880, -13898, -15844, -8331, 13399, 14929, -10706, -15516, 2462, -269, -14767, -11420, -3787, 1118, 11208, 3650, -22670, -20880, 7021, 9018, -10601, -15419, -10362, -2310, 12688, 8681, -18912, -22055, 3183, 6777, -10548, -11157, -1297, 5862, 13807, 3319, -25741, -23811, 11775, 22536, 1716, -10370, -8114, 22, 16521, 16086, -11652, -19814, 6237, 18709, 6965, 2499, 3695, 2123, 9665, 10938, -8403, -11671, 14026, 24010, 9030, 1818, 335, -3428, 6192, 16560, 3200, -6705, 6689, 12353, 3835, 6609, 9293, -2632, -4917, 4014, 632, 14, 13944, 12652, -4621, -5073, 1575, -4289, -2410, 8654, 3485, -4243]
561d243Q572N34j1877M121Q493r381l980J0183m97l675R510j178j6116k89R685
576a38k950J992J2287n107j3524L875L579o368N570Q263j0723n996J2819L037
590F616q269J771j679j0976N739J3892n539p302Q395K60j0283M99J033n710R694
605a859J4586j1452j6565N839Q441n51K506n550j4561Q046K3069k972j8300j282
619a0605M192M8O478mj2204O216K0102n819k1460j072J0482O628P393m983j8747
634a3355L657K4352P89k0128m716O650M266Q801P47j5154O53J8598l420k1226
648i486n32J4053P200L796o862j8704J503K4070J537k1467n169J0389O259N581
662A2168k768j7335j688K0104R67k0633k298J5023P505J321q062j9919j035K5939
$$ y = [-4243, 4329, 4863, -7014, -2893, 5600, -3781, -7761, 2422, 1925, -1750, 7760, 6582, -9534, -9823, -138, -3088, -1096, 11191, 6084, -7440, -3565, 14, -6354, -784, 7479, -3244, -9240, 3579, 6616, -1653, 118, -1561, -12537, -6798, 7094, 1555, -5747, 2648, 2908, -7375, -6876, -5843, -11553, -1859, 12727, 1275, -15290, -9451, -1010, -1561, 945, -4605, -19166, -11120, 11949, 8977, -9323, -10605, -6413, -6365, 113, 109, -12095, -5879, 14223, 8404, -13056, -14128, -3646, 2982, 10375, 5392, -13355, -9698, 14654, 15443, -4685, -9401, -2751, 1515, 10316, 11063, -4091, -3438, 15160, 11740, -9486, -10018, 4035, 11235, 15031, 8169, -10535, -9032, 15038, 16575, -4892, -10061, 328, 6587, 12168, 9400, -7935, -9623, 10481, 11448, -9185, -11483, 3540, 11045, 12366, 4304, -15615, -16650, 9289]
676I289Q469j9662r324Q224O693N818j066j7657o065K0405Q850j5403n990Q901
690A482M179K182k145j6742n378K3209J3566j4935j2103K808K836O290N088j3212
704b875j0470J5266J2184j0800p463L976n59J811L828j0552p739J7169J2571j3904
718B443j2366K327J820N336Q373r122j2562J0826J1622j0109q146M589M85J060
732c424N957o669q761J2651J1201j2856j1729M305L856M940Q659o787j3672O502
746e827J1751p310o392N999L64j252O941k334r560O179R197q893o968P057K055
761A007p48P625j787j2695J080Q806l706j476Q591k930q662N627M653o875P37
776g53M946o981k146J0830M15q829L287L906p668p31N948l331M42J0386l199j3609
$$ y = [9289, 17758, -1904, -11228, -3004, 3689, 9507, 8441, -9216, -15281, 5124, 13974, -1429, -7419, 1482, 5661, 7843, 5698, -11044, -16422, 6787, 20353, 5418, -6685, -3877, -1041, 5249, 10337, -2875, -13345, 1921, 14105, 3305, -4158, -182, -741, 1070, 4898, -5654, -13393, 3776, 16347, 2443, -9923, -7596, -5776, -440, 7933, -1189, -13751, -2925, 8697, -1412, -9558, -4969, -4484, -3424, 2533, -4136, -12897, -246, 10955, -1901, -13630, -9325, -5469, -529, 8130, 1343, -12329, -5827, 5924, -1386, -7778, -1779, -1415, -2667, 4274, 1940, -7620, -1441, 7756, -1137, -8105, -1048, 1007, 259, 7884, 6097, -6598, -5518, 3288, -418, -1894, 6697, 3767, -4895, 732, 5385, -1490, -753, 4193, -2788, -4934, 5896, 6311, -2518, 769, 4675, -2993, -3724, 2224, -1107, -665, 9721, 6522, -7087]
792g087K358Q619k223J93L051p322k160J2349J233j2078P41O819l831p57N326
807E231l871j831J0168j625j4715Q85J1635M44j536J201p816l192J3096K754j4155
822c327k068R347L62j438K254o387l177J1760J605j6282k936J2852N045k161k827
837B622j0923l761J6259P953j5619q224Q785N304O54l89j0112n881J4759Q358
851I785j4889q703J0449P473n2k835j2095o364J7126J3252j3257j2401N882O315
865c14K293J152r214p832J3190J1642j2217j0425Q136O718l41j441q838o294J5131
880A346J3820j2578j4354N497P555J766J313p416q169J1709J2633j1230j2652
893a0760O821Q304J51p01p738p504J3011J5122j1016j6384L468R003L685L072
$$ y = [-7087, -4729, 3890, 1667, 1860, 4911, -2411, -4571, 7778, 9011, -3067, -2326, 4493, 662, -95, 5231, 1360, -471, 9697, 8072, -6643, -5758, 5877, 6321, 4785, 5986, -1830, -5022, 8074, 10828, -3327, -5395, 3952, 4314, 2876, 5130, -1257, -4434, 7326, 8931, -7351, -10287, 2565, 7610, 5449, 2622, -8301, -12062, 4197, 12150, -3469, -11693, -2908, 2396, 3050, 2661, -7451, -13332, 1427, 9785, -5104, -13807, -3358, 4115, 4063, 1228, -10867, -17231, -105, 13147, -110, -12511, -6629, -314, 1979, 3131, -6083, -13915, -725, 10917, -1300, -11725, -3589, 3129, 2788, 1347, -7491, -13785, 1346, 15166, 2588, -11766, -6269, 1286, 3052, 4365, -3051, -11220, 489, 13122, 1892, -10760, -3939, 4365, 4516, 3815, -3923, -11427, 1584, 16706, 5690, -10694, -7226, 1777, 5462, 8534]
907H534o679j1466P683J5050o736j3545L444P020J283K617m556j0557O438J5147
921A3677n397j4058J265O269K278N123k396j2802J345J3243j679r730K767L939
935C844k321K997K65r151J366J1834l257j0782K929N637j361K521Q7r781m94J1329
951E662r34q920L215M501m321O83J985o813K66J0655k030j0680K594N808k495
966h24J305K047q375k448J0432J527p686K038K876n852R16O170m420l503O837
981A040J12o824L459M080o550nP510l349n587M968J291m095N050K788j0215k276
997h603J0509J969m915J019k028m628P509O624r497n359Q387K487m047J789j600
1012c84m606O870O667r938o638R030M833l621N7l202n703P340R385p861q265O591
$$ y = [8534, 1855, -9611, -1928, 13122, 6386, -7159, -3715, 3305, 4588, 7205, 2649, -7908, -1470, 13677, 8280, -5778, -4513, 1756, 4034, 9157, 6761, -6041, -4696, 8547, 6868, -2862, -95, 3844, 1523, 4520, 4785, -4366, -3000, 8834, 5577, -5205, -2276, 3361, 2000, 4521, 4608, -5173, -5667, 5662, 4728, -4192, -977, 3524, -797, -114, 1871, -4942, -4676, 5979, 3949, -6731, -4137, 1671, -824, 481, 2528, -5847, -8295, 2137, 3664, -4022, -1984, 892, -4960, -4044, 2126, -2294, -5797, 1040, 1152, -5672, -2213, 1867, -4683, -4688, 2822, -527, -6114, -1146, 145, -3950, 1100, 3888, -6327, -8603, 1906, 3875, -1040, -21, -2049, -6677, 832, 7456, -2041, -7400, 987, 3474, -573, 1216, -384, -4990, 1880, 8547, -1391, -8029, 1001, 5834, 2213, 2270, -932, -6635, 705, 10090, 2229, -6036, 555]
1028E55L754l434R58o83n153N354P501q694p869Q746N892m378j956j898m314P234
1044A615R180r013j0362P139P455l318j783j965m350O812R404r507j1847P683
1058b857J0241k047m141m669m929Q641J2776q041j5081L905J0575Q43j643m382
1072h09p548N993J3298n372j4536L230J0078P96k027m269p688M944J4482l351
1086G221j4771L22Q941J581J01k186q395J726J2733j552j2464J152Q273l90j692
1101F00j160o242K294J2532j887j3379J68R112N20j275q99o441P75J1728k25j2644
1117f423J04R231L11k519p95n392R87J2282K00j3842k167R138K478n17l80p386
1133d690j989J1719L225j1492l012P078R77l56J936o036l812R738M198j0208l306
$$ y = [555, 4309, 875, 1833, 1150, -4003, 1351, 8852, 158, -7711, 1035, 6927, 2549, 593, -1305, -5619, 1615, 10795, 1782, -8580, -1441, 6014, 2696, 913, -1052, -5402, 1410, 10814, 1307, -10540, -2857, 7384, 5337, 1196, -3473, -8402, 239, 13015, 4974, -10107, -6202, 4373, 5216, 3573, -809, -8357, -2364, 10934, 5562, -8974, -5744, 4334, 5130, 3103, -1166, -8854, -3910, 10572, 7221, -7550, -7228, 1713, 3294, 3395, 1209, -7186, -5460, 7273, 5721, -6743, -5591, 2682, 2292, 600, -560, -6802, -4508, 8024, 6137, -7242, -7074, 2038, 2558, 1283, 384, -6057, -5282, 6446, 6221, -6423, -6319, 2912, 3223, 704, -91, -5483, -4496, 7786, 7986, -5856, -8023, 1115, 3593, 3076, 2696, -4690, -6679, 5040, 8265, -3227, -6239, 839, 1816, 1460, 3396, -2640, -6452, 3286, 7484, -2724, -6030]
1148f030O053P46J25L439n311o497P184N605o895j974M877k300j554N400j970
1163H98o192M741L777o296m09O229k387l298M926q37n933L752M353n262j76O386
1179D272l303n115M887J620m646K909L259n991j92P158k061n484L818J346n073
1194b596K702M836m496j493N469k975n539N242L546n364J05M149l532o65N494
1209D883l456o459N592N086n652j796L866j982P4M992n015p711O593Q611m808
1224B818m458R09k001K231P511m789j0444M970R732k581m592m48k769K154Q544
1239F787l562j1514L788J0675j177n294j719l857K295J0392j257j2195O39R590
1253C591k50l832p13m040N30R732r0j1081K60R062o89m504n55k697N80R600N78
$$ y = [-6030, 23, 769, 894, 4333, -978, -7475, -291, 5314, -1581, -3555, 1322, -978, -2532, 2868, 898, -5294, -553, 3224, -3072, -3481, 2748, 361, -2937, 1989, 1152, -4781, -1029, 3324, -1938, -2114, 4272, 969, -4146, 741, 2361, -2285, 624, 3883, -2108, -2300, 4858, 2797, -2687, 1131, 2477, -2596, 106, 4942, 446, -1047, 4422, 1447, -4092, 1150, 4696, -668, -563, 3586, 54, -611, 4883, 1427, -5032, 560, 5646, -6, -1802, 2064, 82, 156, 5148, 133, -7578, -985, 7626, 2818, -1640, -731, -2732, -501, 7010, 2221, -8223, -3253, 6479, 3898, -694, -1142, -3911, -1757, 6787, 3225, -8289, -4501, 6174, 4997, -297, -2016, -5873, -3578, 6814, 5557, -6638, -5999, 3591, 3341, -491, -1204, -5244, -4714, 5018, 4928, -6153, -5893, 3169, 2480, -2024, -2579, -5276, -4696, 4904, 5482]
1270E482j1744p40R036l8m462L6j970K51Q583O00j1565q37R742R21n384q67j504
1287d460J094R695Q74j3392l155J0573L451l787j525k997j56R750K559j2704m844
1302i024J0118M718l050j636l871j408R881M652j2303o779Q683N722j238m80m723
1317g38m299P873O320r141o227P008M113j841O18k894n234N761O427p476n663
1332e393O866L477k788Q54j908n602M243O427n906m485O616K215m665N77k1m265
1348c758L671N739n909m923O688L024m662l11j14m244L485O903m643n700N195
1363D41K470m692N29J010m548K442P509l567o456L476K285l723J880J988n873
1378d829M32P948j130o069J772L82l593L581M584n444k363O028m3m459K086M7
$$ y = [5482, -6262, -7002, 2034, 1996, -2466, -2430, -4400, -4149, 4434, 5034, -6531, -7368, 2374, 3295, -2089, -2956, -4460, -3366, 6329, 7203, -6189, -9344, 1229, 4680, 893, -632, -3629, -3785, 5965, 8524, -4180, -9024, 1094, 5812, 2762, 1126, -2745, -4153, 5728, 10380, -1923, -8702, -19, 5703, 4465, 3985, -738, -5037, 2836, 9156, 15, -6212, 796, 4909, 3068, 3686, 792, -4442, 1319, 7746, 270, -5393, 1473, 4950, 2162, 3016, 1108, -4494, -251, 6176, 270, -4215, 2401, 4616, -49, 528, 507, -3758, -87, 5652, -257, -5180, 1508, 4532, -130, -441, -555, -4799, -1314, 5589, 946, -4754, 441, 2911, -1781, -1252, -242, -4790, -2348, 5161, 1594, -4862, -1386, 899, -2824, -944, 1044, -4829, -4397, 3551, 2421, -3648, -1876, -1494, -5087, -1506, 3078, -2366, -4729, 1299, 1256, -3203, -1117, -1070]
1394a070m836L728O439m555m184M590L65l279L127j52o075L041Q171k884n216
1409b790K292n84k495N152J801o986Q23P406j683m670J958o86k760N377K733o944
1425b056k40P349j173n268J399k08k172N493L157p165j580P172p81n685J261J189
1441F92j333M827K098p903j773Q417o9p017l5K031L99N285J373r685l275R411
1457C443K355o829j537J876R69N396J132j0682m180J0268M362o527k565Q73N77
1472a069N842K400j0806o130R382O177m755k327j96j121M762L689r184o279Q479
1487a136O310m019k191l14k544L654M947p072o539P351N961l473j783j44l640
1502d632K408N762n142n823O690N431m282k225K01k954K224O098m297o291N987
$$ y = [-1070, -5906, -2178, 4261, -294, -4478, 112, 477, -2802, 325, 173, -5902, -2861, 5310, 2426, -2790, -498, -1082, -3577, 1575, 3376, -3610, -2787, 4619, 2936, -1734, 224, -462, -3222, 2155, 4888, -2056, -2296, 5053, 3880, -1388, 11, -197, -2369, 3124, 6281, -884, -2464, 4708, 3927, -1758, -497, 692, -641, 4186, 6284, -1619, -3392, 5025, 4956, -2061, -2096, -65, 334, 5619, 6992, -2693, -5968, 3443, 5798, -1031, -2568, -692, 277, 5673, 6805, -3877, -8057, 2211, 6573, 46, -2519, -1646, -1069, 4773, 7173, -3633, -9763, -381, 5796, 1041, -1286, -1482, -2603, 2159, 5848, -3336, -9615, -1136, 5174, 1155, -1036, -1350, -3894, -240, 4707, -2365, -8904, -1553, 4408, 935, -848, -992, -4632, -2224, 3538, -1604, -7427, -737, 4694, 412, -1813, -1612, -4566, -2342, 3756, -541, -6832, -845]
1517h45N888l931k916j25k931K752P131l680p305M945O236l794l414k76k183L233
1533a215Q069l347q965L262O751k518l067l78k827K868Q590j896r266J264O062
1548C387j849j971R61k704R73P793q25q929M39N292j870q95K636k598j023O011
1564D828P6p267L23M301k789m90M824j466l262L751K44n788J102M224l148r54
1580a491N425q65m462K203Q93m559J713M138l478j561N700o75n494J703J598l880
1596c092J490M554k763j850M788j317o127K125L593l032R2L652k637j507M963
1611B932j266p204J802N104j518l99K651l356j904N322n20p267J250N818n15m16
1627E14J488m135k741O188J496o801m22N204M7M91K013n387m461N976M146n107
$$ y = [-845, 5043, 1112, -1804, -1929, -4860, -2108, 5023, 1343, -5962, -1017, 5219, 1425, -1989, -2265, -4448, -1215, 6854, 3507, -5458, -2196, 4555, 2037, -1030, -1408, -4235, -1367, 7223, 5327, -3939, -2675, 3387, 1538, -433, 528, -2176, -1203, 6590, 5765, -3164, -2725, 2567, 697, -198, 2438, -160, -1183, 4828, 4904, -2363, -2040, 2261, -528, -1018, 3806, 2340, -922, 2829, 3073, -2715, -1613, 2611, -537, -1491, 3934, 3069, -1393, 810, 1703, -2856, -1143, 2995, -483, -2044, 3656, 2981, -2513, -810, 788, -3092, -1602, 2952, 189, -1661, 3127, 1810, -4317, -2192, 1401, -1631, -1539, 2113, -524, -2031, 2932, 1666, -5538, -3736, 1368, -150, -549, 2102, -1254, -3158, 2164, 1644, -5623, -4373, 1445, 930, 514, 2002, -2133, -4874, 1314, 2810, -3991, -4413, 791, 838, 1329, 3342, -2045, -6506, -530, 3616, -1491]
1643a491j277L408l86P55K889n340n994O273N883l632k391J788j344J185M019
1658D345m670o899N330P105k735k659R00j918O16M352l640o449N451P213l411
1673B931l998R39r46P04M027l192o136N609P637m262n655Q82L13J120L946l314
1689F05n933N619Q078m933p046O16J440K222M224l080p045M149Q209l623o931
1704c429J70J237K103N156j904p696K099P361k497n801O47P09J229N689m87q122
1720c536m23O493j052l826J228k23o05N568J266p448j934N008l10k315K449l81
1736d1k057M298J868p027k405N487M17j996K434l66k860L634J839o570k101N852
1752D06J167k513J823j06k653K955J804o645j995O942K271l106L64p10k757L275
$$ y = [-1491, -2768, 640, 254, 1009, 3898, -1442, -7436, -1163, 4720, 1088, -1303, 485, -859, 326, 4345, -325, -7224, -1894, 5211, 2476, -183, 717, -1201, -585, 3767, 127, -6322, -871, 6342, 2931, -1067, -128, -1074, -370, 3657, 465, -5671, -62, 7575, 3313, -2342, -1460, -1147, -27, 3919, 605, -5328, 291, 8369, 3436, -3610, -2994, -1554, 668, 4892, 1812, -5233, -1084, 7125, 3502, -3429, -3259, -2022, 81, 5237, 3333, -4363, -2264, 5097, 2600, -3201, -2554, -1845, -616, 5073, 4586, -3536, -3959, 2534, 1482, -2344, -1116, -1339, -1944, 3624, 4890, -2558, -4492, 516, 206, -2109, 340, -41, -2098, 2200, 4068, -2959, -5364, 123, 540, -1456, 978, 612, -2248, 1386, 3225, -3345, -5446, 406, 1573, -940, 883, 777, -1876, 1079, 2883, -3762, -5757, 1185, 3456, 350, 714, 4, -2753, 522]
1768E22K627n909k500O883K513l500J5p77l128K618L711m601k502N965J918l495
1784C60J13k71l911J664M998k502k494L995L95l826J724J369m598%M928l08j775
1801a39K824j507m571K724L347m376j428M776J024j558J505k506n014L891N015
1816D007l934k709L967J195j552J327k521m645L604N576l435k861L919O84k756
1831a34R26j388l633L747N539l773l519L648P54l208P56l31l012L508N214l818
1847A276m054L564Q42l392Q53M55k433L180N213l836n279K399J742j820J536O03
1863H49l823K313O041k899o201J180J742j53K619O63n166R03O510j312o509m39
1879c682K110J092M047M49o810j222P196L07n953q81J701J282M151R69p480k228
$$ y = [522, 3149, -2760, -5260, 1623, 4136, 636, 651, -126, -3254, -636, 3075, -1526, -4028, 1937, 3855, 360, 473, 202, -3709, -2045, 2953, 451, -2043, 1952, 2347, -1479, 245, 1614, -2984, -2984, 1944, 1636, -139, 2685, 1178, -3393, -669, 2678, -1698, -3126, 1650, 2674, 1116, 2621, 115, -4899, -1008, 4007, 73, -2636, 1331, 2526, 974, 2301, -220, -4865, -1261, 4315, 880, -1981, 1938, 2622, -134, 792, -596, -4229, -482, 5057, 1284, -2235, 1413, 2167, -1041, -285, -616, -3628, -120, 5094, 1276, -2778, 786, 1628, -1764, -911, -456, -2889, 291, 5504, 1668, -3611, -1212, 530, -1290, 246, 849, -2974, -661, 5380, 2481, -3720, -2540, -798, -951, 1668, 2331, -2835, -1932, 4578, 3266, -3243, -3682, -1572, -480, 3567, 4016, -2794, -4016, 3180, 3487, -2466, -3347, -1646, -364, 3787, 4756, -2724, -4952]
1895d952O761J303n609n79K149R60L671L17p293k616O757J958m879k27K452J72
1911C45K118L82o351j982O551J811m900P0L219k25O76p9n589j481P171K341n111
1928a034n61L053o56n9P69m495j759O705K815m844r13K296j388K00J858l716k599
1945d328N926L614l809j639O62k472Q97M069k093l882L656L586k593j358ol166
1961b936O11N628q79m456K021L107k151r82J68l266L85O225J99m875P78K256k128
1978b95n28J525k636k26N360L28m620P41K183k858q66K483j295l70M351k45m691
1995a659N10K635k732r41L219m92j263L402o37m765J023K999k609r98L518m00
2011H10j745K672p1m703L29K875j745J76M038j247l892J910J479l041M6K001j849
$$ y = [-4952, 1809, 3112, -2497, -3076, -927, 33, 3704, 4021, -3272, -5888, 869, 2827, -2052, -2279, 173, 345, 2463, 2845, -3506, -5488, 1063, 2874, -2026, -1956, 1263, 1038, 1714, 1635, -3954, -5435, 1736, 4077, -1034, -1595, 1458, 802, 743, 1512, -2983, -4742, 1963, 4778, -66, -979, 1317, -71, 129, 1987, -1729, -4328, 1598, 5212, 1403, -236, 426, -2046, -1149, 2920, 827, -3055, 601, 4187, 1594, 236, 230, -2936, -2325, 3303, 2424, -2032, -11, 3096, 945, -37, 131, -3135, -2750, 3475, 3674, -1201, -423, 1833, -295, -823, 702, -1934, -2160, 3200, 3528, -1092, -351, 1832, -1026, -1892, 591, -704, -1074, 3277, 3032, -1659, -1149, 1486, -1246, -2187, 1032, 540, -723, 2679, 2042, -2723, -1700, 1299, -1310, -2308, 1210, 810, -935, 1737, 1666, -3037, -2708, 167, -1578, -1402, 2636, 1389, -2503, -593, 886, -2155, -2109, -108, -1957]
2028a957O29M843j669n359J033K996j419n92J147j935J142N404j731p012K56M258
2044C4K58J95N11k990K29N675r13o962k68M554P24K16O78l069o82M892m12o179
2062c509J27M532O62l0R15l274j811M140O16m868M10M342l01r05J264k459k374
2079b523L743R24m309N86M437n24j230Q10k802k528M179K496l889m27L461l74
2095B030j124Q54k897k886M743L667l704k128K673J26n22J059l407l405N205N274
2111E558l392l748J038K30L85K061k877m033M517N695l154m497P86L34O05K414
2127A922k360m142M054N547l122m721M28N00N42L023j044m070K555M644l229m138
2143c611J355J047m5K356l67l534K035L852l478l782K137J325l26K355K75l655
$$ y = [-1957, -1328, 3515, 1846, -3513, -2480, 516, -903, -1495, -348, -2283, -1141, 4263, 2532, -4480, -4224, 34, 292, 487, 998, -1992, -1763, 3912, 2999, -3963, -4231, 323, 1047, 1263, 1941, -1128, -1810, 3082, 2670, -3509, -3382, 1150, 1812, 1782, 2697, -577, -2388, 1752, 2368, -2500, -2090, 2252, 1951, 1046, 2310, -149, -2523, 1220, 2144, -2165, -1579, 2858, 2334, 1104, 1914, -888, -3416, 763, 3259, -630, -1057, 2404, 2030, 906, 1760, -1137, -4023, 720, 4387, 683, -1445, 1228, 1354, 832, 1891, -1516, -4921, 284, 5558, 2166, -1582, -544, -314, 71, 2132, -745, -4778, -261, 5434, 2280, -2217, -1431, -1097, -492, 1922, -438, -4580, -526, 5021, 1899, -2822, -2394, -1894, -1352, 1671, 627, -3443, -888, 3756, 527, -3611, -2256, -1209, -1254, 1102, 735, -2799, -764, 3088, -390, -4172, -2035, -710, -1036, 1319, 1594, -2061]
2159b061P36L255k824k827K841J288j031K036N84m066P5L332j636k359K494R14
2175G51j437K470J058m433j454L258l2r94K316j18k477K273J952m182k190L612
2191C73Q85r60J977o22k974K024K705m041k490L517J528l81J426j082l744J462
2207c97L189k834k070L317J143j291J111m37l738J016L283k168j795L100Q73j937
2223C65J140n4l671L20L633j191j189K684l18k866J174J246l169k36L462k50j528
2240d48J952n92k886J668J684l526o93M045P40j676Q18j536k972K598K776l339
2256a387j717M020J052j989J3j405k156K917L197l610k348M078J674k252q81j459
2272b253j803L595L856l677l051L469J643k360o43q16j321L428L588l742l448
$$ y = [-2061, -1325, 1930, -894, -3721, -880, 408, -623, 1413, 1997, -2069, -1994, 1338, -298, -2657, -163, 751, -686, 1784, 2842, -1591, -3045, 213, 181, -813, 1503, 1385, -1092, 1181, 3133, -1049, -3239, 373, 1258, 298, 2275, 1653, -1321, 703, 3408, -633, -3123, 394, 1922, 1541, 2967, 1885, -1859, -397, 2792, -42, -2112, 1205, 2348, 1057, 2168, 1731, -2007, -991, 2292, 124, -1671, 1429, 2302, 365, 1505, 1451, -2220, -1900, 1733, 542, -647, 2037, 1719, -1147, 27, 1273, -1896, -2132, 1330, 1080, -448, 1504, 912, -1974, -306, 1378, -2148, -2841, 1204, 1944, 268, 1086, -450, -3422, -824, 1952, -1387, -3104, 916, 1968, -21, -8, -1413, -3569, -652, 2545, -1065, -3413, 665, 2339, 87, -794, -2253, -4056, -461, 3395, -282, -3333, 136, 1779, -581, -1224, -2040, -3361, 67, 3655, -87, -3535]
2287c535L267J905k256o02j96j458L078L956l013m090K151J573j655M19O77j799
2303a578J782L779k758l861J906J542j426J138Q51k247Q63L635j678m024R97J604
2319E25p62J721J387l275k89L546r66m092J095K035n00J631P72l636q53M127l38
2336B128m139M31K213R2J599O86m236j562M404M28l751N04K375j22Q02K66m058
2353a940j213M566J064l914J60K375j75M43O08l878j744M335J766l240J63K104
2369A480j249k14J064k783j532M032J658l090M4J670j589m90J848j953j842L220
2385B74J728k284M1J192k546q91K892o00k047K320J507k352K0J193k619n35L483
2402G76N1k821J430J799j891R7Q51k743n39M138P20k962N67J515j669l25J270
$$ y = [-3535, -268, 1637, -619, -1221, -1417, -2875, 203, 4159, 1146, -2944, -793, 780, -875, -456, 221, -1578, 204, 3983, 1225, -2636, -730, 812, -614, 524, 1375, -872, -9, 3626, 1948, -2076, -1079, 525, -237, 1484, 2871, -404, -693, 2853, 1887, -2205, -1110, 925, 425, 2056, 2828, -808, -1661, 2466, 2128, -2011, -1580, 633, 725, 2324, 3010, -1226, -2788, 1616, 2044, -1707, -1203, 1172, 1050, 1852, 2118, -1940, -3153, 1413, 2477, -1437, -1277, 1098, 923, 1366, 1974, -1904, -3648, 687, 2453, -787, -624, 1480, 231, 17, 1081, -1702, -3234, 798, 2456, -634, -590, 1080, -509, -999, 849, -1104, -2946, 274, 2002, -282, -241, 951, -1595, -2486, 406, -194, -2241, 79, 1586, -766, -746, 447, -2172, -2707, 776, 827, -1994, -564, 1235, -656, -559, 292, -2451, -2990, 1148, 1868, -1094, -527, 988, -681, -1006, 264]
2419B64k203k45M108N98l651J34J966j229k09J230k021n42M089Q76l841m54J714
2436E84j252M8K050j452j130L284P70l784m89J928r36J39K457j627k084K825J347
2453B678l225p48J471j243P29L217j280l069J614J665k403m01J323r38M45L308
2469C143j319l852J265K430j512p43J085j331P08L614j223m570O02K816p29m93
2485a09J091j473L82L082j155m721Q56L687o81r08O55j362k07L415q35m841O39
2502b485L867l12r47O24j338r18L002n72m142Q94L918l29j612N44j418q96L097
2519I77L18m135K92L705j92j156P46j717j635K941J247l137mL154n41j403P97
2536B57j494j663L175J970k872r39K250n4q84J092j578k375K930K790k292j486
$$ y = [264, -1939, -2184, 1924, 2522, -1129, -995, 971, -258, -467, 763, -1258, -1800, 2289, 3165, -676, -1130, 584, -668, -620, 1430, -22, -1152, 2132, 2902, -882, -1371, 557, -379, -240, 2217, 590, -1494, 1331, 2678, -547, -1295, 176, -1067, -338, 2879, 1599, -1470, 144, 1809, -594, -995, 328, -610, -165, 3143, 1824, -2028, -763, 1667, 155, -588, 497, -834, -126, 3488, 2265, -2305, -1703, 1113, 384, -109, 982, -491, -109, 2973, 1818, -2903, -2047, 1640, 959, 51, 706, -656, -863, 2552, 1717, -3124, -2485, 1382, 1070, 123, 747, -591, -1509, 1493, 921, -3221, -2327, 1591, 1262, -350, 194, -1224, -2120, 977, 1295, -2840, -2548, 1157, 965, -191, 555, -1162, -2797, 144, 1391, -1746, -1750, 1404, 863, -540, 257, -1237, -2900, 275, 2245, -627, -1566, 684, 630, -254, 838, -740, -3115, -185, 2605, 313, -1173]
2552a173J858m66j014J565j135k335K786L097k649k072J529j32n67J773q19k829
2568b583K333L335k101k365J277j59p65J882m8k351J699K895k620k383J731L89
2584A66p61J925J2k850J278K941j947k289J613L32j029K157O14k944N23K478j771
2601D48k016J867N44j218K144O74l340j86K611r78j477J614j3j693K286J562l294
2618d65j213K332m35j059K037l21k004J660J865l025j666K369M06q23J573p14
2634E17k678K031K330k549k052K071M31m94J624l62k970J089K579k260j566K290
2650C1N85j103J423m04l096J150K974j692j893K048M69j159J314J11l151O46K972
2667A225j154j822J975N27j483Q91K97k855N88L498p68k258J060M85j374J624
$$ y = [-1173, 685, 219, -795, 770, -365, -2700, 86, 3183, 534, -1538, -9, -141, -708, 1065, 246, -2583, -250, 3085, 984, -1381, -104, -263, -1028, 854, 806, -1545, 154, 3049, 429, -1954, -223, 166, -595, 1330, 1342, -1508, -230, 2711, 764, -1525, 88, 420, -609, 1548, 2162, -782, -259, 2219, 448, -1568, 299, 843, -375, 1769, 2443, -897, -1083, 1528, 550, -927, 687, 674, -1019, 1267, 2829, -465, -1678, 654, 219, -840, 1197, 876, -1128, 532, 2397, -628, -2294, 75, 481, -342, 1231, 517, -2161, -130, 2200, -349, -2401, -330, 101, -393, 1231, 869, -2101, -1012, 1567, -693, -2259, 31, 616, -487, 936, 532, -2564, -1414, 1560, -132, -2025, 23, 492, -667, 647, 758, -2393, -1747, 1225, 71, -1751, 224, 751, -732, 159, 456, -2399, -1811, 1687, 919, -1339, -279, 206, -1168, 456]
2683D56O17l007k93L724k57k076J075j91j486J574J188l011l60L675L31k297N4
2700b84o9j281K289J672l033j606L466Q85k021K28m04j466K018K300k776j565
2716a647L045P60k234k7J90j276J853K469k678k325K778J041j957J55K71j518
2732a100J322K715k241k283K336R95k237M18P75j445J150K460k249k692K088J259
2748A271j515L98P28j888O79K741j633k662J633J203j525O58R65k065K07K840
2764B035j300l205J429J715r48N78Q05k511m68L289n21k973J023J429j225R25
2780G7J137k384r33L115k66k868J056J512j018O76J133k728j267L196N59k393
2796a396M61J243j223O86J565k328j587K815Q94k421N84J318j215J07J731k030
$$ y = [456, 1073, -1934, -2227, 1497, 1240, -836, 239, 48, -1438, 136, 1324, -1687, -2047, 1628, 1959, -338, -284, -353, -1634, 655, 2327, -706, -2312, 1154, 2039, 18, 246, -158, -1624, 394, 2694, -82, -1647, 1398, 2158, -76, -103, 87, -1189, 664, 3133, 455, -1870, 908, 1949, -8, 147, 418, -1100, 222, 2937, 696, -1587, 749, 1744, -493, -75, 700, -745, 405, 2865, 616, -2076, 12, 1271, -244, 154, 882, -1006, -327, 2414, 781, -1881, -248, 955, -570, 88, 1053, -1012, -805, 2035, 735, -2470, -1041, 674, -274, 304, 1109, -1402, -1870, 1419, 898, -2075, -1052, 377, -848, 77, 1214, -1170, -2103, 1012, 746, -2122, -1066, 446, -572, 104, 1237, -1491, -2758, 438, 997, -1396, -935, 308, -915, -229, 1336, -992, -2579, 236, 1130, -1291, -707, 611, -604, -497, 1234, -796]
2812g96j766K855J377k227n9J164j639N32K048j553k034K171J431j909J99J169
2828I63j697o1K356j199k153K062J467j692pR06j883oK968o61k715J433J513j445
2846A49Q0J082j929m61L015k99k598J070J637j380k29J044j814l48L191L4l142
2863h98M71J734j149L9J312j933r03K982M79k991L13J588j039j5J214j642j049
2880a487K965P98l232l85J503m39J20J772j876j996K825J163k422l63J278r50
2896g26J24J993j552k056K165J682k518n69J512q68K64K208j539k633J800J967
2912A254j868m86J340j103k15K204p29k684J545J978j912n95J445p80k30K260
2928A424j063k909J456K306j391p15J146j055l61K362n58k811J137K463j432j049
$$ y = [-796, -2562, 293, 1670, -557, -616, 548, -1091, -559, 1489, -64, -2098, 73, 1504, -405, -206, 963, -734, -795, 1561, 362, -1791, 271, 1738, 46, 39, 945, -938, -944, 2024, 1363, -1352, 81, 1594, 149, 229, 1311, -618, -1079, 1936, 1637, -961, 109, 1746, 366, 137, 1181, -633, -981, 2210, 2244, -898, -427, 1307, 158, 197, 1509, -424, -1327, 1655, 2134, -857, -544, 1044, 5, -10, 1204, -438, -1487, 1478, 2276, -956, -1341, 162, -277, -157, 1615, -261, -2257, 568, 1731, -691, -1054, 224, -726, -602, 1391, -161, -2217, -52, 1630, -888, -1457, 55, -813, -549, 1659, 120, -2513, -713, 1254, -614, -1100, 240, -863, -1078, 1126, 397, -2287, -742, 1236, -676, -1271, 174, -606, -836, 1424, 361, -2548, -1092, 1214, -177, -892, 254, -801, -1162, 1200, 642, -2169, -1032, 1431, -1, -1050]
2944a050J241o73m14K256k38l390Q70K889p02j174R13j129p16K731M38l204J05
2961a247K719o84r71R90q79j119K546Q41l020k61K422l93p77J215j285j621K431
2978I07J640k676p51K060n79p60J613p13k048J930J529k331o22J946m76r78J484
2995A175o18k138J844J989k157j004J644m68j042J733q3k409J304K024j980j006
3011a192J863l92r88J480l57k356J380K469j764j526J338j13p61J730K7k650P49
3028a063K571j359j532J356k01q66J810O6k658L79K863r31j609R84l39r18K104
3045F57O70k939k48K424k82j156J089m04j658J839J317k482n43K321m20j067J122
3062B40l32j664J754J610k365j032K199k99q87J313j98j883J263J815j963r24
$$ y = [-1050, 191, -482, -896, 1360, 1122, -2268, -1398, 1491, 789, -385, 528, -601, -1317, 1414, 1852, -1352, -1247, 1472, 788, -183, 807, -72, -1191, 1355, 2196, -824, -1085, 1337, 944, 167, 1382, 97, -1524, 907, 2547, -129, -880, 1180, 601, -159, 1454, 741, -1307, 623, 2152, -179, -801, 1145, 669, -309, 1175, 557, -1581, 263, 2252, 95, -909, 735, 267, -775, 958, 875, -1534, -230, 1794, -186, -1192, 671, 279, -709, 771, 414, -1942, -562, 1907, 143, -1383, -45, -158, -919, 811, 838, -1812, -1063, 1508, 149, -1383, -27, -228, -1094, 716, 782, -1876, -1497, 1366, 435, -1174, -190, -529, -1447, 657, 1327, -1612, -1860, 564, 282, -874, 215, -189, -1847, -8, 1309, -1173, -1716, 605, 185, -882, 240, -92, -1756, -2, 1608, -757, -1789, 410, 111, -776, 537, 339, -1544, -281, 1534, -429, -1353]
3078a353K070j43j379J290Oj802J253K024j959j503K018L04j117J200j28k091
3094a310J236K255j835j657J853M42j260J019R1j910J099K360j755j924J495N73
3110G72q00J100P8k383N80K769r95k144J163M36j065J534N20k518r2K657n33j985
3128i06R83L13j035J520P45k596m97K695j67j681P33J98j297J451J356k338r34
3145a457K169J17j818R75M69j301J066J324k288j158K488K50j727Q51K54j380
3161a166Q79J756j957j490K162N50j786P30O65j536P29J635j928j456K374Q51
3177A012j630K91L17j546R85J824j546j784J849Q84j290L92N52j732M11K284j230
3194D3k023J846J202j319K56M06j867K89K812p62k231J015Q98q34O02O00j988
$$ y = [-1353, 717, 574, -805, 485, 491, -1311, -58, 1966, 7, -1496, 522, 826, -291, 909, 781, -1310, -74, 2181, 346, -1311, 542, 984, -276, 743, 834, -1076, 23, 2383, 628, -1296, 199, 772, -28, 1072, 1150, -1233, -653, 2116, 1121, -1023, 140, 576, -489, 1045, 1565, -953, -1045, 1612, 1079, -906, 77, 390, -645, 875, 1620, -976, -1473, 1222, 1055, -626, 107, 305, -992, 459, 1815, -523, -1457, 712, 829, -989, -14, 455, -846, 220, 1544, -744, -1902, 586, 836, -891, -40, 214, -1166, -287, 1469, -488, -1978, 184, 734, -1052, -322, 343, -1193, -464, 1171, -757, -2213, 161, 1012, -618, -327, -10, -1556, -571, 1253, -293, -2077, -228, 656, -634, -242, 310, -1422, -1011, 1273, 43, -1980, -134, 1068, -251, 5, 411, -1456, -1167, 1645, 883, -1348, -333, 565, -269, 333, 933, -1055]
3211a055l10K725k21k036P06J013j276O34R54j750o13K602K46k228M71Q37j243
3228e44Q86J252j944q43K387K34j841M88O57j243N50J504j663r09K199M37k265
3245f58L59J013j098O51J566j740j429K113Q32k155K91R81r42K47J555j318j674
3262a406K112P47j952k75J214r13M63J806j395k233J671J347j570M8Q24j231m3
3279g86K364r15k393J214J409j327P3R73j363j56K360p10k705Q63J633q30J67
3296a29R29j771o01K390J52k580N47J519r31J17J106j377q66K072Lk220O70J404
3314D34o50k0R60j516j050K259M41k099L04J705r99r5J043j081j149J972N94k119
3332a066K84J519n93n43J191j156j266J994J283k154q8J382r31k82J533j002j649
$$ y = [-1055, -1365, 1360, 1139, -897, -191, 822, -454, 180, 1134, -616, -1229, 1373, 1619, -609, -138, 699, -544, 342, 1594, -350, -1193, 1194, 1428, -413, 75, 732, -511, 39, 1543, -120, -1029, 1170, 1607, -658, -299, 714, -384, 267, 1833, 93, -1336, 777, 1609, -546, -255, 726, -216, 31, 1586, 268, -1406, 706, 1453, -499, -774, 440, -473, -10, 1796, 401, -1832, -161, 1186, -384, -336, 488, -743, -786, 1578, 663, -1730, -516, 893, -434, -361, 612, -751, -907, 1453, 743, -1962, -1099, 534, -296, -129, 800, -971, -1572, 818, 970, -1610, -1063, 456, -475, -358, 748, -629, -1495, 577, 580, -1640, -970, 434, -216, -236, 724, -792, -1842, 417, 858, -1241, -937, 768, -231, -326, 717, -364, -1513, 459, 1053, -1066, -782, 737, 144, -399, 792, -364, -1630, 364, 1647, -507, -595, 787, -144, -426, 1107, 105, -1544]
3349a544J910J315j676m98J346r07l59J660p18j975J591J747j478n49P39j032
3365d28M7J844m06k277J069J837j269m89Q18r65l81K164k74k286Q52J783j126
3382E13q25Q04p90m84K198J11k379L85J574q97n83R59p69o38J802N32k515M31
3400e71J528q97q11J115n97n90J870L81k493r3J696o67o92J267n10j016J593P11
3418A224k166l16J747p44n53J225l53j453J622R17k264m53J599l04m31J628q55
3435G0j813J319J483j803p14J482k19l56J296n35k027J173J810j506j009J228
3451a21J02l01J319o79k201J042K026j256q51J162j17n69J192k86k070R50J995
3468A337j139j007J233l8o83J038k6k077O38K149p99j026J161l63j106J181N00
$$ y = [-1544, 366, 1681, 5, -493, 853, -54, -413, 1247, 529, -1446, 145, 1892, 414, -135, 604, -428, -381, 1463, 1057, -1220, -151, 1686, 417, -72, 746, -219, -600, 1564, 1290, -996, -144, 1639, 513, -312, 492, -298, -782, 1416, 1527, -852, -467, 1107, 210, -373, 586, -183, -821, 981, 1513, -1002, -571, 957, 60, -751, 364, -233, -823, 1047, 1428, -1065, -1158, 538, -129, -821, 446, -64, -1080, 513, 1224, -942, -1258, 489, -255, -808, 417, 64, -1389, 233, 1150, -1114, -1567, 32, -272, -703, 925, 70, -1743, -424, 1059, -744, -1458, 24, -195, -551, 745, 210, -1817, -644, 1166, -340, -1349, -121, -19, -320, 999, 320, -1881, -839, 1187, -69, -920, 242, 125, -444, 748, 462, -1608, -658, 1337, 198, -809, 424, 386, -297, 741, 715, -1362, -724, 1425, 626, -400, 761, 398, -708, 473, 973]
3485I73j844L14K047r29j012J074k8j356J271N18j710K05J846l52j298R14l28
3502C05j310J336J089j525l51J579m08j016Q49j46j431J312J431j726o66J577
3518H99j13j049O40l55j180J280J831j748j190J384K1q21O96k20j280J177J669
3535A641j505j332J237L20r61P72k2j369R19J850j427j551J142K00p94J017N58
3552F95j658J86J850j255j382J221K55r04J040O30j507q8J553p05j349J103L23
3569Hj021J279Q75j898m09J585n79r48J087L65j206R84J023j874o15J591J6j137
3587h74R61J58q80J033J000j956j034J849M23j040O01K51j090P90J146j941r96
3604a599K122M87j097M39K03j231J023J037j785j048J879Q05r80J67J59j271M05
$$ y = [973, -871, -557, 1490, 561, -451, 623, 595, -761, 510, 1028, -682, -477, 1369, 1017, -281, 633, 305, -1005, 331, 1420, -105, -456, 1123, 715, -301, 548, 402, -1029, 283, 1714, -12, -678, 899, 786, -263, 377, 22, -1158, 122, 1953, 205, -985, 399, 420, -401, 295, 75, -1205, -28, 1641, 136, -1196, 41, 361, -600, 172, 150, -1219, -300, 1550, 123, -1428, -286, -86, -880, 137, 695, -963, -777, 1073, -182, -1564, -343, -88, -992, 48, 678, -829, -917, 636, -69, -1418, -315, 8, -1013, 266, 1141, -757, -1166, 419, -160, -1108, -21, 344, -862, 122, 1145, -729, -1344, 247, 263, -874, 87, 245, -635, 398, 1398, -558, -1592, 257, 680, -360, 241, 492, -598, 192, 1338, -603, -1599, 523, 1010, -87, 352, 555, -676, 347, 1384, -401, -1449, 430, 1235, 255, 422, 581, -690, -285]
3621b85J682j257j304J869N48j217J86M34j338L76J579r15j229J416P60j435N60
3638D30M67j626j8J844l38j172J032K49j184M04P14j476k30J834K1j491P00N12
3656F72j198M17P87j491l15K319j6j684K07M17p70M27P89j373l69K177J12j857
3674g49R3O67o68L62J018j486m88K104K19j922n2P23n41M51J174j227q56J733
3692E55K32j710j58R60m56K96J197j155j157J611N61j686J15P94n59K18J389o92
3710C55j489J092L80j245L52J208r52k01J518p50j454R08O33r33M24R89j130k22
3728e17J479l78j668O06Q78p08M44R28j155m60J592l09j747N63J235n97K25O91
3746A102j330n87J881Jk079M94J444l23l9N17j327n63J663K05j839M10J473m83
$$ y = [-285, 1397, 140, -1164, 705, 1253, 36, 222, 656, -682, -306, 1273, 358, -871, 545, 1305, -130, 430, 897, -729, -747, 1097, 759, -413, 619, 868, -316, 88, 802, -674, -904, 930, 951, -540, 160, 672, -526, -109, 678, -813, -1128, 1191, 1175, -509, -302, 115, -655, -228, 561, -812, -1181, 996, 1108, -749, -656, 11, -657, -295, 723, -763, -1251, 853, 1072, -850, -902, -179, -720, -269, 905, -322, -1178, 555, 787, -923, -1081, -121, -577, -281, 916, -239, -1396, 215, 776, -910, -795, -1, -560, -342, 1047, 355, -1134, -42, 338, -907, -555, 653, -299, -500, 1018, 268, -1186, -278, 355, -578, -154, 835, -295, -517, 962, 584, -1084, -478, 400, -308, 136, 1064, -91, -551, 1041, 732, -1015, -452, 783, 186, 411, 1102, -228, -815, 1066, 1067, -1012, -518, 926, 603, 564, 1081, -246, -809, 854, 1059, -780, -370, 1103, 620]
3764F20l17N08j136n93J653M83j781K56J321n78k80N26q66j070J655O50j407J81
3782a75J135q28n81J139p44j075J307Q91j227oQ38j168j35J213l66j558J036J267
3800I63q88l14N66j003l41J550j34j532P89J239j017l59L90p65k61J770j73j684
3818a204O44J419r21o03M49p32m8J739k2j820M80J365q04q56N48l75J01J513r
3837H64k051L77J579p97r12P87k34p8J329J35j932J71J338n94p06R11j84m79J264
3856G88K19j641k89J446m62n01J077j76j106J053P41j590l25J074l44j22J350
3873A192l80j451O86J015j221l87J010k71k09J314n34j621P64J224j010o63Q80
3890C38Q2l06J126n76j691N94J547r60o11R72j05k82O86m55j623Q63J652r83r06
$$ y = [620, 303, 811, -325, -918, 735, 1218, -563, -307, 1014, 436, 156, 682, -184, -1254, 401, 1051, -356, -175, 960, 132, -449, 690, -54, -1129, 178, 1069, -158, -164, 674, -494, -629, 584, 218, -1340, -304, 963, 75, -239, 327, -676, -1017, 533, 399, -1133, -344, 895, -122, -481, -91, -856, -1117, 653, 480, -1204, -560, 859, -62, -665, -216, -948, -996, 743, 721, -1099, -619, 746, -58, -914, -366, -741, -640, 873, 864, -1187, -810, 769, -28, -940, -153, -387, -465, 864, 999, -933, -762, 576, -18, -724, 187, 3, -476, 788, 1007, -634, -923, 523, 61, -440, 637, 461, -645, 408, 1149, -441, -766, 308, -36, -158, 1192, 812, -639, 47, 1062, -159, -546, 464, 193, -16, 1298, 764, -857, -93, 1131, 121, -542, 338, 420, 114, 1240, 664, -1027, -433, 1114, 154, -457, 515, 410, 128, 814, 359, -1264, -401, 1251, 268, -638]
3909f38J166k0o13O22j79j435N58J760q91r33Q94K32r35N74Qj292N10J608p45
3928B51r29R72j29r48O83M66j262J43J533o95p85R95l94j111P98J078j230j16
3946f80J250o02m93N52l35j071R91J286j086o76R95j37n82O93l11j292J206J606
3964A314j297q59R23n0o69P41j19j048J084J470j230j292R95J54q25Q85l0j013
3982h66P56J499j306j093J142J68p67O22L46r82N92J138j184j103J060M84q58
3999c52P51M63j141K34J092r06j018J151K14p69P61P63j296l54J158m41r58Q88
4017B40K90p57Q26P38j510p07J387k6p68P08m7p08J049P29j699j060J571M31r10
4036b23M64J79q53Q18R05j670j041J580O51q68L14n5q63P79Q14j373q49J353O61
$$ y = [-638, 528, 508, -105, 517, 338, -1097, -539, 1221, 330, -603, 291, 523, -412, 162, 170, -1122, -612, 996, 251, -678, 294, 165, -783, -100, 366, -896, -753, 780, 85, -700, 295, -99, -1210, -412, 666, -564, -680, 570, -32, -525, 27, -308, -1379, -388, 898, -188, -864, 131, -6, -588, 105, -206, -1498, -292, 1314, 17, -842, 81, 31, -638, 103, -16, -1064, 20, 1490, 260, -1032, -37, 117, -708, 177, 147, -866, -110, 1389, 83, -1010, 132, 300, -467, 155, 501, -481, 111, 1249, 65, -1038, 22, 506, -352, 399, 862, -279, -45, 1047, 141, -877, 274, 488, -281, 480, 1243, -53, -407, 751, 310, -648, 240, 530, -227, 599, 1337, -173, -880, 507, 481, -287, 421, 374, -334, 715, 1444, -255, -1315, 256, 687, -223, 241, 420, -433, 385, 1290, -380, -1421, 159, 810, -58, 256, 201, -662, 117, 931, -442, -1291, 62, 723]
4055G23r16J22L90r64M49R58j282q91J646N43j155R6M65r94K34J033q10q17J405
4074B35M38j264K96M68j058J34J240n57r11J213L03j133K28N80j057n9J381k24
4092B53j000P38M47j056L80O00j093k15J588J19j236L98L53q41M70O88j197l23
4110i27J829J04j427J65M04o62O46O49j136m45J739L18j664Q1M37l85L16Q50r85
4129i3n75J476J53j437J23O66m28K15R10q12q28J321J68j384K19R77p42J53J004
4148A086o11j092J124J84j232M86R47q09k88J167l76j202P73K81q11L71R35r81
4166d8m36J414l45j428O00N85p75N29O17r96m30J490l02j418N06P95o05L90M95
4185F38j143l67J353k9j461L15R91l18M3N29j178m54J495O9j564L74J092k99q0
$$ y = [723, -193, -71, 319, -645, -196, 762, -520, -1411, 235, 778, -377, -281, 184, -810, -576, 457, -353, -1170, 235, 673, -591, -295, 173, -885, -751, 489, -68, -979, 234, 537, -596, -368, 212, -845, -904, 477, 253, -747, -9, 438, -618, -238, 362, -731, -946, 642, 761, -475, -77, 276, -565, -95, 593, -604, -927, 902, 1006, -421, -256, 148, -514, 132, 781, -355, -800, 939, 1257, -407, -326, 111, -274, 42, 892, -93, -668, 808, 961, -476, -353, 313, -115, 100, 1010, 198, -630, 691, 859, -525, -306, 671, -71, 82, 1086, 475, -617, 507, 691, -541, -55, 892, 83, -205, 962, 586, -616, 157, 438, -373, -2, 933, -48, -484, 930, 585, -843, -243, 342, -433, 96, 713, -283, -713, 777, 475, -943, -437, 358, -247, 143, 638, -505, -872, 481, 452, -1009, -694, 297, -21, 22, 551, -627, -1081, 414, 483, -1081, -707, 385, 86, 6]
4204FL31j017n63J474L12j367J10J261o01k04M49o01q72J450M67j212K52J056
4222G31r35l01R23o37r44J184O04r29J30P11q83l94J100l00r32R15Q62j062J05
4241e2N36q00l52J180r3j249R98Q41r35j02M23p83r0J345k46j291N99J197q86
4260B40m46M59o31J21J237q8j596O73J169q43n24M91m99k01J650l27j475M69J109
4279I88p65n82N29k57j78J187R2j565K65J143p12o73R93l04n48J141m0j346J17
4298e15J046n89n56R58Mr39R17K52j230L4J024o67l44J064k4j115O90O15j211
4317e86k47J096l66k73R02k31j194N65R18j105l05R63k59k36Q71l14j361O24J158
4336F20r67n39J013j04k44O71l36j408P02J356q74m99Q18r1l53N30m8j310N69
$$ y = [6, 337, -680, -1243, 231, 543, -824, -714, 547, -54, -258, 191, -410, -1282, 168, 635, -577, -325, 731, -204, -505, 418, -219, -1163, 21, 625, -304, -174, 537, -346, -740, 360, 60, -872, 43, 905, -157, -52, 484, -316, -668, 512, 419, -830, 168, 1009, 74, -28, 395, -388, -478, 867, 621, -670, -71, 1126, 240, -206, 253, -378, -257, 980, 892, -704, -31, 1138, 295, -229, 262, -237, -438, 1212, 885, -590, -121, 988, 223, -359, 170, -87, -265, 922, 1014, -551, -286, 857, 145, -528, 465, 161, -387, 754, 714, -632, -515, 531, -58, -614, 344, 348, -591, 326, 578, -652, -618, 406, -261, -605, 459, 435, -680, 10, 625, -586, -833, 263, -103, -376, 526, 295, -899, -334, 584, -521, -826, 137, -122, -358, 513, 199, -1162, -538, 620, -347, -886, 127, 23, -221, 450, 114, -1294, -592, 764, -110, -609, 209, 118, -235, 295, 247, -1063, -494]
4355d94J301p10p57Q62ko77O85O6j143L56J365n69n89O79k18q00P59L89j133K48
4375c82J259o69n67Q25j28j015P93N98q34k16J099k88o97O88j55j253J062R35
4393A055r55m33J069l67o76P71k13r48P92J007j058n31R11Po71N54l8j049J004
4412B31J181j216r02J032l9n20O11o9r40P61J040j095q83J046O8n49N82O1r22
4431e22N43R66r81q80Q91O8n36O32J86r32K38J089o49j106Q58M21q81O60M69j071
4451e37j04J124m90q08P86J17p25P27M87j057l74J141l36o68P37J12p73P12O17
4470F88j148n89J256K7q27N06K48p71O41P63j399n48J101N39q76K85K84p59M87
4489i2P93j176m53J229K97r82L92K11o79L44P97q88p70J286M74r61K00K74o92
$$ y = [-494, 807, 97, -660, 202, 200, -477, 208, 274, -869, -513, 852, 283, -306, 373, 155, -645, 114, 503, -630, -382, 877, 208, -359, 466, 338, -677, 116, 714, -120, -336, 763, 475, -222, 466, 311, -942, 120, 1055, 100, -333, 736, 369, -307, 464, 251, -697, 95, 1102, 44, -487, 424, 431, -240, 314, 276, -773, 231, 1412, 196, -706, 326, 287, -233, 378, 309, -631, 130, 1170, 75, -808, 238, 306, -243, 339, 400, -522, 21, 987, 6, -874, 17, 85, -451, 181, 367, -565, -327, 762, 113, -993, -135, 286, -595, 65, 534, -537, -641, 483, -7, -815, -29, 88, -637, 90, 577, -480, -854, 287, -49, -717, 20, 132, -641, 71, 688, -460, -1049, 207, 234, -593, -87, 161, -610, 31, 794, -605, -1153, -52, 487, -389, -104, 180, -579, -92, 701, -475, -928, 301, 598, -384, 8, 219, -460, -116, 681, -207, -977, 309, 783, -178, 22, 296, -396]
4508c96K28Q69p12p71J178N56j040Q5M43q09Q9J100n76q93R68L76q28J47N77r19
4528c28QJ124m18p59P50L02r88L60M73q79o6J163j46r48N48J43p17M29P48j064
4548b65k95J414k08r46K96L14p47L32P77r20l53J238rj249M66M20p07K43Q39q28
4568a88o38J348P1j297K89O67p39L16Q48q37p04J224J38j154K43N11n08P4Q23
4587D87o20q23R76L79j129L42O81p36J22Q96o35q69P37M54q51L07O79p90k8R17
4607D96l27j084O71O15q27J78O94p39l27J259j96j240M49O75l77J02M96q41l48
4626f71J200j7j284M35Q55o37K34N03q50m60J225J51j199L15Q70n93pO78r38m43
4646f33J233l8r74J50J043n31k99O42n86o06J216J35j139K36Q07m25l63P35n94
$$ y = [-396, -168, 701, -11, -782, 396, 952, -88, -3, 440, -369, -280, 820, 244, -649, 319, 695, -133, 14, 591, -328, -320, 804, 386, -373, 377, 679, -309, 51, 524, -355, -421, 742, 596, -352, 196, 339, -378, 51, 799, -265, -560, 854, 646, -300, -4, 310, -437, -105, 672, -248, -601, 637, 628, -621, -155, 265, -442, -199, 640, -188, -826, 522, 593, -704, -415, 252, -487, -171, 677, -160, -864, 360, 498, -656, -413, 98, -410, -336, 487, -133, -956, 20, 399, -730, -388, 293, -443, -321, 575, -60, -929, -192, 262, -589, -282, 397, -393, -421, 496, 169, -915, -244, 371, -456, -278, 416, -323, -650, 609, 413, -827, -378, 297, -80, 22, 518, -323, -671, 529, 512, -772, -337, 518, -119, 115, 618, -232, -692, 533, 684, -515, -200, 670, 77, 70, 748, -190, -633, 600, 562, -412, -262, 781, 250, -49, 593, 7, -599, 617, 752, -387, -151, 656, 231, -132, 603, 9]
4665In76J024M72j150J95P22n32l85P29j87r93Q57P11j035J5O83n92l28Q98k56
4685B81r50O52Q32p83l23O11o13j64J023k68r87M17Q89q25j94N75n25k76R42O8
4705C82j208N60Q54p51k48M83m53l56J200j6j132K40Q59o57k62O09l90l74R35
4724B75K6j074K71P88o18k07N76k09m35P49L62j173J09R01n45l83Q73l06n81P31
4744A30L77j099L9J025m92l13P31l11o72P65N15r54k15Q14k80k92Q15k48q34N88
4764H9N91q28k31Q84l86l02Q23j72j025N47P71o35m50P13r4l69O85k26q42L52
4784a05Q51o09l93P62k93l86O65j1r37L66Q64n35n59P93k93n25P69j7j010M19
4804a84R91n57n42O73k58m83N70K25r27J67J015n54o77Q43j56p19O84L87r90m1
$$ y = [9, -567, 457, 929, -221, -26, 696, 164, -221, 508, 321, -672, 185, 896, -139, -124, 559, -33, -361, 537, 281, -669, -17, 815, 32, -291, 320, -293, -457, 566, 298, -689, -272, 617, -208, -402, 173, -352, -628, 314, 382, -826, -266, 588, -163, -411, 72, -381, -737, 463, 447, -685, -445, 414, -243, -505, 104, -286, -660, 275, 301, -773, -502, 286, -332, -539, 37, -172, -607, 142, 504, -669, -560, 341, -204, -587, 286, -20, -601, 130, 507, -592, -553, 472, -20, -333, 398, 87, -585, 180, 695, -259, -474, 340, 60, -232, 583, 335, -499, 89, 680, -148, -379, 505, 119, -183, 640, 468, -557, -10, 761, 126, -324, 389, 295, -74, 611, 385, -457, -105, 746, 137, -256, 506, 213, -173, 492, 481, -456, -90, 774, 239, -320, 473, 180, -345, 424, 407, -603, -184, 807, 250, -292, 381, 123, -360, 210, 435, -492, -325, 690, 136, -541, 302, 146, -573, 111, 498, -492, -533]
4824e33J179n44m45L93P4q71O70N90q64j63Q48l26n00N92j25p87P61N97r46k81
4844f81P56o8m02M78j74o39M76R73j015l96P12k1m46N49j11o48M55P60o23o96
4864g61P55N7n21N64Q8q50M07Q64o79o52P30l4l60N40J31q25M17Q58o45o36O74
4885A22J00n58N81K33p41lQ68m25n38M87J98o13M08N71r76l5Q98k41p41O41J72
4906D08n76L15M72p94k62J072j09q11M73J40n84N32M23r08m26J153q8o03L07K62
$$ y = [-533, 646, 102, -343, 50, 124, -747, -77, 513, -351, -514, 334, 8, -492, 100, -25, -812, -51, 546, -400, -681, 75, 7, -395, 83, -91, -730, -254, 719, -296, -692, 20, -1, -447, 102, -9, -657, -202, 558, -65, -761, -6, 51, -470, 94, 182, -668, -261, 603, -76, -728, 2, -32, -392, 148, 279, -546, -129, 729, 84, -552, 122, 222, -336, 245, 478, -263, -266, 602, 177, -361, 126, 324, -289, 119, 690, -286, -321, 577, 336, -405, 236, 408, -168, 147, 619, -175, -437, 635, 526, -285, 188, 328, -256, 276, 699, -209, -635, 518, 430, -173, 134, 396]
$$ [...]
8191a52
##END NTUPLES=NMR FID
##END=
