##TITLE=1H_EC-3208(II-37)
 CDCl3, 8 sc, 
 18.11.2019
##JCAMPDX= 6.0         $$ Bruker NMR JCAMP-DX V2.0
##DATA TYPE= NMR FID
##DATA CLASS= NTUPLES
##ORIGIN= UXNMR, Bruker Analytische Messtechnik GmbH
##OWNER= root
$$ XWIN-NMR		Version 3.5
$$ Mon Nov 18 14:34:39 2019 Russian Standard Time (UT+4h)  she@DPX200
##.OBSERVE FREQUENCY= 200.1315
##.OBSERVE NUCLEUS= ^1H
##.DELAY= (6, 6)
##.ACQUISITION MODE= SIMULTANEOUS
##.ACQUISITION SCHEME= undefined
##.AVERAGES= 8
##.DIGITISER RES= 18
##SPECTROMETER/DATA SYSTEM= spect
##.PULSE SEQUENCE= zg30
##.SOLVENT NAME= CDCl3
##.SHIFT REFERENCE= (INTERNAL, CDCl3, 0, 15.7039)
##AUDIT TRAIL= $$ (NUMBER, WHEN, WHO, WHERE, WHAT)
$$ ##TITLE= Audit trail, XWIN-NMR		Version 3.5
$$ ##JCAMPDX= 5.01
$$ ##ORIGIN= Bruker BioSpin GmbH
$$ ##OWNER= she
$$ F:/spectra/data/she/nmr/H-F/1/audita.txt
$$ ##AUDIT TRAIL=  $$ (NUMBER, WHEN, WHO, WHERE, WHAT)
(   1,<2019-11-18 14:33:36.71 +0400>,<she>,<DPX200>,
      <created by zg, POWCHK disabled, PULCHK disabled
       configuration hash MD5:
       00 E9 B6 7A A2 85 ED C7 34 08 36 98 17 FE 4E 26
       data hash MD5: 16K
       BC 84 9C AE 7B 22 86 BF 42 16 7A 0B EF 7D 0D CB>)
$$ ##END=
$$ 
$$ hash MD5
$$ 1B A7 BD 28 6F FC E5 E6 F2 D0 9E 68 49 56 8A D5
##$RELAX= 
##$RELAX= 
##$RELAX= 
##$RELAX= 
##$RELAX= 
##$RELAX= 
$$ Bruker specific parameters
$$ --------------------------
##$DU= <F:/spectra>
##$EXPNO= 1
##$NAME= <H-F>
##$PROCNO= 1
##$TYPE= <nmr>
##$USER= <she>
##$AMP= (0..31)
100 100 100 100 100 100 100 100 100 100 100 100 100 100 100 100 100 100 
100 100 100 100 100 100 100 100 100 100 100 100 100 100 
##$AQSEQ= 0
##$AQ_mod= 1
##$AUNM= <au_zg>
##$AUTOPOS= <>
##$BF1= 200.13
##$BF2= 200.13
##$BF3= 200.13
##$BF4= 200.13
##$BF5= 200.13
##$BF6= 200.13
##$BF7= 200.13
##$BF8= 200.13
##$BYTORDA= 1
##$CFDGTYP= 0
##$CFRGTYP= 5
##$CHEMSTR= <none>
##$CNST= (0..31)
1 1 145 1 1 1 1 1 1 1 1 1 1 1 1 1 1 1 1 1 1 1 1 1 1 1 1 1 1 1 1 1 
##$CPDPRG= <>
##$CPDPRG1= <>
##$CPDPRG2= <>
##$CPDPRG3= <>
##$CPDPRG4= <mlev>
##$CPDPRG5= <mlev>
##$CPDPRG6= <mlev>
##$CPDPRG7= <mlev>
##$CPDPRG8= <mlev>
##$CPDPRGB= <>
##$CPDPRGT= <>
##$D= (0..31)
0 1.2 0 0 0 0 0 0 0 0.06 0 0.03 0 0 0 0 0.0002 0 0 0 0 0 0 0 0 0 0 0 0 
0 0 0 
##$DATE= 1574073216
##$DBL= (0..7)
120 120 120 120 120 120 120 120 
##$DBP= (0..7)
150 150 150 150 150 150 150 150 
##$DBP07= 0
##$DBPNAM0= <>
##$DBPNAM1= <>
##$DBPNAM2= <>
##$DBPNAM3= <>
##$DBPNAM4= <>
##$DBPNAM5= <>
##$DBPNAM6= <>
##$DBPNAM7= <>
##$DBPOAL= (0..7)
0.5 0.5 0.5 0.5 0.5 0.5 0.5 0.5 
##$DBPOFFS= (0..7)
0 0 0 0 0 0 0 0 
##$DE= 6
##$DECBNUC= <off>
##$DECIM= 24
##$DECNUC= <off>
##$DECSTAT= 4
##$DIGMOD= 1
##$DIGTYP= 9
##$DL= (0..7)
0 120 120 120 120 120 120 120 
##$DP= (0..7)
150 150 150 150 150 150 150 150 
##$DP07= 0
##$DPNAME0= <>
##$DPNAME1= <>
##$DPNAME2= <>
##$DPNAME3= <>
##$DPNAME4= <>
##$DPNAME5= <>
##$DPNAME6= <>
##$DPNAME7= <>
##$DPOAL= (0..7)
0.5 0.5 0.5 0.5 0.5 0.5 0.5 0.5 
##$DPOFFS= (0..7)
0 0 0 0 0 0 0 0 
##$DQDMODE= 0
##$DR= 18
##$DS= 0
##$DSLIST= <SSSSSSSSSSSSSSS>
$$ [...]
##$SUBNAM2= <"">
##$SUBNAM3= <"">
##$SUBNAM4= <"">
##$SUBNAM5= <"">
##$SUBNAM6= <"">
##$SUBNAM7= <"">
##$SUBNAM8= <"">
##$SUBNAM9= <"">
##$SW= 24.0689530833862
##$SWIBOX= (0..15)
0 0 2 0 0 0 0 0 0 0 0 0 0 0 0 0 
##$SW_h= 4816.95568400771
##$TD= 16384
##$TD0= 1
##$TE= 0
##$TE2= 300
##$TE3= 300
##$TEG= 300
##$TL= (0..7)
0 120 120 120 120 120 120 120 
##$TP= (0..7)
150 150 150 150 150 150 150 150 
##$TP07= 0
##$TPNAME0= <>
##$TPNAME1= <>
##$TPNAME2= <>
##$TPNAME3= <>
##$TPNAME4= <>
##$TPNAME5= <>
##$TPNAME6= <>
##$TPNAME7= <>
##$TPOAL= (0..7)
0.5 0.5 0.5 0.5 0.5 0.5 0.5 0.5 
##$TPOFFS= (0..7)
0 0 0 0 0 0 0 0 
##$TUNHIN= 0
##$TUNHOUT= 0
##$TUNXOUT= 0
##$USERA1= <user>
##$USERA2= <user>
##$USERA3= <user>
##$USERA4= <user>
##$USERA5= <user>
##$V9= 5
##$VALIST= <valist>
##$VCLIST= <CCCCCCCCCCCCCCC>
##$VD= 0
##$VDLIST= <DDDDDDDDDDDDDDD>
##$VPLIST= <PPPPPPPPPPPPPPP>
##$VTLIST= <TTTTTTTTTTTTTTT>
##$WBST= 1024
##$WBSW= 4
##$XGAIN= (0..3)
0 0 0 0 
##$XL= 0
##$YL= 0
##$YMAX_a= 596203
##$YMIN_a= -299509
##$ZGOPTNS= <>
##$ZL1= 120
##$ZL2= 120
##$ZL3= 120
##$ZL4= 120
##$ABSF1= 10
##$ABSF2= 0
##$ABSG= 5
##$ABSL= 3
##$ALPHA= 0
##$AQORDER= 0
##$ASSFAC= 0
##$ASSFACI= 0
##$ASSFACX= 0
##$ASSWID= 0
##$AUNMP= <proc_1d>
##$AZFE= 0.1
##$AZFW= 0.1
##$BCFW= 1
##$BC_mod= 2
##$BYTORDP= 1
##$COROFFS= 0
##$CY= 11.3945322036743
##$DATMOD= 1
##$DC= 2
##$DFILT= <>
##$DTYPP= 0
##$F1P= 16.9975609425685
##$F2P= -3.02152046262296
##$FCOR= 0.5
##$FTSIZE= 0
##$FT_mod= 4
##$GAMMA= 1
##$GB= 0.15
##$INTBC= 1
##$INTSCL= 1
##$ISEN= 128
##$LB= 0.24
##$LEV0= 0
##$LPBIN= 0
##$MAXI= 10000
##$MC2= 0
##$MEAN= 0
##$ME_mod= 0
##$MI= 1.114404
##$NCOEF= 0
##$NC_proc= 0
##$NLEV= 6
##$NOISF1= 3.799351
##$NOISF2= 2.8
##$NSP= 1
##$NTH_PI= 0
##$NZP= 0
##$OFFSET= 15.70392
##$PC= 1
##$PHC0= -9435.814
##$PHC1= 23.20087
##$PH_mod= 1
##$PKNL= yes
##$PPARMOD= 0
##$PSCAL= 0
##$PSIGN= 0
##$REVERSE= no
##$SF= 200.130013532006
##$SI= 16384
##$SIGF1= 3
##$SIGF2= 2
##$SINO= 400
##$SIOLD= 16384
##$SREGLST= <1H.CDCl3>
##$SSB= 0
##$STSI= 0
##$STSR= 0
##$SW_p= 3612.71676300578
##$SYMM= 0
##$S_DEV= 0
##$TDeff= 0
##$TDoff= 0
##$TI= <>
##$TILT= no
##$TM1= 0
##$TM2= 0
##$TOPLEV= 0
##$USERP1= <user>
##$USERP2= <user>
##$USERP3= <user>
##$USERP4= <user>
##$USERP5= <user>
##$WDW= 1
##$XDIM= 8192
##$YMAX_p= 0
##$YMIN_p= 0
$$ End of Bruker specific parameters
$$ ---------------------------------
##NTUPLES= NMR FID
##VAR_NAME=  TIME,          FID/REAL,        FID/IMAG
##SYMBOL=    X,             R,               I
##VAR_TYPE=  INDEPENDENT,   DEPENDENT,       DEPENDENT
##VAR_FORM=  AFFN,          ASDF,            ASDF
##VAR_DIM=   8192,          8192,            8192
##UNITS=     SECONDS,       ARBITRARY UNITS, ARBITRARY UNITS
##FACTOR=    0.0002076,     1,               1
##FIRST=     0,             0,               0
##LAST=      1.7004516,     0,               0
##MIN=       0,             -299509,         0
##MAX=       1.7004516,     596203,          0
$$ Real data points
##PAGE= N=1
##DATA TABLE= (X++(R..R)), XYDATA
$$ plain form
0 0 0 0 0 0 -8 8 0 8 -8 11 -16 24 -24 32 -40 48 -56 70 -83 98 -115 134 -155 178 -208 237 -270 308 -349
29 -349 395 -445 502 -562 630 -703 783 -872 969 -1075 1195 -1321 1462 -1622 1795 -1985
45 -1985 2203 -2446 2722 -3038 3402 -3829 4339 -4960 5734 -6728 8065 -9966 12896 -18052
59 -18052 29753 -113405 176866 429012 5168 -299509 -241113 98074 237815 6527 -279232
70 -279232 -111995 214005 228698 -4772 -106328 -22187 142840 153085 -37127 -118403 98159
81 98159 253484 147119 1662 -35310 -13454 72018 115149 58396 61270 136015 77143 -27924
93 -27924 12957 85871 64669 23065 -18461 -10765 123113 191290 28558 -119706 -65115 37628
105 37628 85543 82654 -660 -36952 72317 101980 -49951 -119055 -13682 90002 121850
$$ packed form
0@%%%%qJ6qQj6J9k7M0m8N6p2Q8j04J26j53J81k13K49k89L33l86M45n07N78o57
29c49P44q40R47j064J192j333J486j655J841k044K270k516K783l084L417l780
45a985M188m649N168n760O440p231Q168r299J0694j2462J4793j8031K2862l0948
59a8052M7805j43158K90271K52146m23844l04677N8396L39187J39741k31288k85759
70b79232J67237L26000J4693k33470j01556Q4141J65027J0245j90212q1276K16562
81I8159J55325j06365j45457l6972K1856Q5472M3131n6753K874P4745n8872j05067
93b7924M0881P2914k1202m1604m1526P696J33878O8177j62732j48264N4591J02743
105C7628M7915k889q3314l6292J09269K9663j51931o9104J05373J03684L1848
$$ plain form
116 121850 54689 -93557 -96492 94443 157861 -6405 -132379 -92510 47093 181706 132929
127 132929 -77466 -141170 -2893 74718 34671 -9357 -35596 3500 89348 38714 -103077
138 -103077 -87161 26026 34096 -5482 -21024 -47990 -20133 44880 -7990 -105971 -88527 -41606
150 -41606 -30127 24547 41135 -53385 -112876 -88557 -66158 -13060 36019 -46454 -130428 -53158
162 -53158 27906 -13229 -65797 -89686 -88640 -10109 39559 -38026 -74805 5141 20124 -54118
174 -54118 -84604 -66971 -6050 87277 67641 -60829 -81248 -442 18772 9867 21932 -5012
186 -5012 -14437 38363 40766 9109 34483 19953 -55095 -23171 84206 96142 45368 4403
198 4403 -34944 -3005 78624 44028 -41093 7812 95914 76424 13682 -34941 -40406 53082
$$ packed form
116A21850o7161j48246k935J90935O3418j64266j25974L9869J39603J34613m8777
127A32929k10395o3704J38277P7611m0047m4028k6239L9096Q5848n0634j41791
138a03077J5916J13187Q070l9578j5542k6966K7857O5013n2870r7981J7444M6921
150d1606J1479N4674J6588r4520n9491K4319K2399N3098M9079q2473q3974P7270
162e3158Q1064m1135n2568k3889J046P8531M9668p7585l6779P9946J4983p4242
174e4118l0486J7633O0921R3327j9636j28470k0419Q0806J9214q905J2065k6944
186e012r425N2800K403l1657K5374j4530p5048L1924J07377J1936n0774m0965
198D403l9347L1939Q1629l4596q5121M8905Q8102j9490o2742m8623n465R3488
$$ plain form
210 53082 116729 5987 -92357 -4827 107222 102630 24090 -84454 -110478 29966 139643
221 139643 57951 -41306 -29303 6713 30859 26696 -44200 -59046 47316 88562 882 -44053
233 -44053 -14800 10919 38139 15557 -75061 -65215 65111 99488 14085 -42689 -56584 -35878
245 -35878 33340 41205 -24910 -13308 45871 10815 -40932 -20835 -1348 3663 12567 -27578 -44408
258 -44408 45967 85279 -19434 -94439 -56640 141 40126 32711 -37674 -37469 51612 33463
270 33463 -85120 -94468 1453 63149 52486 -33277 -109963 -27470 103970 49441 -98791 -113856
282 -113856 -17713 74637 92937 -9692 -106997 -38911 55664 6602 -59738 -26852 27769 59180
294 59180 42334 -50265 -87187 12680 71251 2072 -43601 -17203 19244 61896 51758 -44862
$$ packed form
210E3082O3647j10742r8344Q7530J12049m592p8540j08544k6024J40444J09677
221A39643q1692r9257J2003L6016K4146m163p0896j4846J06362M1246q7680m4935
233d4053K9253K5719K7220k2582r0618R846J30326L4377q5403n6774j3895K0706
245c5878O9218P865o6115J1602N9179l5056n1747K0097J9487N011Q904m0145j6830
258d4408R0375L9312j04713p5005L7799N6781L9985p415p0385K05Q9081j8149
270C3463j18583r348R5921O1696j0663q5763p6686Q2493J31440n4529j48232j5065
282a13856R6143R2350J8300j02629r7305O8086R4575m9062o6340L2886N4621L1411
294E9180j6846r2599l6922R9867N8571o9179m5673K6398L6447M2652j0138r6620
$$ plain form
306 -44862 -78636 -697 37270 17432 27523 23059 -7838 488 -3108 -41525 -10161 49720 21547
319 21547 -18920 564 9168 7312 20492 -17728 -62170 -8448 48105 19088 -573 11184
331 11184 -10255 -22611 -14576 -38994 -21733 63320 65868 -25884 -60829 -30006 4233 38147
343 38147 15438 -61425 -45074 54340 62040 -7068 -39187 -44238 -24699 29352 26501 -23253 1372
356 1372 46497 4843 -41397 -30513 -14842 17413 54690 14008 -39847 -4868 30280 5627
368 5627 -1254 -1480 -29228 -4674 54194 44326 11071 3433 -30235 -41359 24088 55301 15219
381 15219 8264 21338 2745 3589 10327 -21862 -8133 55204 40242 -18438 -8242 21628 21827
394 21827 20201 -14354 -56952 -2814 78079 50197 -14150 -24393 -25130 -12900 21611 8680 -18006
$$ packed form
306d4862l3774P7939L7967j9838J0091m464l0897Q326l596l8417L1364N9881k8173
319B1547m0467J9484Q604j856J3180l8220m4442N3722N6553k9017j9661J1757
331A1184k1439j2356Q035k4418J7261Q5053K548r1752l4945L0823L4239L3914
343C8147k2709p6863J6351R9414P700o9108l2119n051J9539N4051k851m9754K4625
356A372M5125m1654m6240J0884J5671L2255L7277m0682n3855L4979L5148k4653
368E627o881k26k7748K4554N8868r868l3255p638l3668j1124O5447L1213m0082
381A5219o955J3074j8593Q44O738l2189J3729O3337j4962n8680J0196K9870J99
394B1827j626l4555m2598N4138Q0893k7882o4347j0243p37J2230L4511j2931k6686
$$ plain form
407 -18006 18808 33381 -22106 -34135 3949 2918 -10458 -10984 -28223 -7307 50636 25205 -54245
420 -54245 -52419 -8603 -2325 1938 2232 -14783 8857 29833 -37410 -84718 -18276 44677 28572
433 28572 -12245 -51503 -43980 37330 61348 -39031 -95412 -30475 36543 46865 15076 -47862
445 -47862 -53342 22511 30262 -50647 -59393 13130 51686 34991 -22941 -82973 -40085 59040 42030
458 42030 -51014 -56745 4029 44606 46046 -16064 -84111 -37891 46502 26415 -22290 -2720
470 -2720 21524 16081 -882 -42710 -45691 35480 71016 -3198 -42976 2753 37612 36034 4544
483 4544 -47336 -27538 60922 64914 -9166 -14770 31955 35855 11288 -21612 -32357 41254 111096
496 111096 43983 -54625 -32822 39691 62407 35900 -22753 -38534 46114 99474 22984 -46638
$$ packed form
407a8006L6814J4573n5487j2029L8084j031j3376n26j7239K0916N7943k5431p9450
420e4245J826M3816O278M263K94j7015K3640K0976o7243m7308O6442O2953j6105
433B8572m0817l9258P523Q1310K4018j00379n6381O4937O7018J0322l1789o2938
445d7862n480P5853P751q0909q746P2523L8556j6695n7932o0032M2888R9125j7010
458D2030r3044n731O0774M0577J440o2110o8047M6220Q4393k0087m8705J9570
470b720K4244n443j6963m1828k981Q1171L5536p4214l9778M5729L4859j578l1490
483D544n1880J9798Q8460L992p4080n604M6725L900k4567l2900j0745P3611O9842
496A11096o7113r8608K1803P2513K2716k6507n8653j5781Q4648N3360p6490o9622
$$ plain form
508 -46638 -16193 28331 37091 17613 -24030 -13150 64611 63688 -33507 -66764 -10564 34100 42942
521 42942 11213 -46411 -34071 36947 31053 -33957 -41545 -16499 -5124 12612 6560 -26279 -13433
534 -13433 8984 -32066 -57102 -14355 11891 5270 4128 -22362 -47831 -12380 10818 -25123
546 -25123 -30423 1198 -2919 -10451 1114 -15225 -23990 2813 -7309 -39790 -13100 25002 13634
559 13634 866 -12260 -43336 -26423 23492 14274 -17897 -5014 366 -10424 5897 2572 -30105
572 -30105 -17918 11590 -4042 -8716 13274 1383 -16086 -4682 -16131 -29729 6486 28703
584 28703 5334 -2034 -4564 -28778 -13913 25749 12618 -11677 1235 2927 3850 31107 19964
597 19964 -25879 -15158 24156 21915 16873 23171 7018 9829 32560 6535 -21809 17809 53421
$$ packed form
508d6638L0445M4524Q760j9478m1643J0880P7761r23r7195l3257N6200M4664Q842
521D2942l1729n7624J2340P1018n894o5010p588K5046J1375J7736o052l2839J2846
534a3433K2417m1050k5036M2747K6246o621j142k6490k5469L5451K3198l5941
546b5123n300L1621m117p532J1565j6339q765K6803j0122l2481K6690L8102j1368
559A3634j2768j3126l1076J6913M9915r218l2171J2883N380j0790J6321l325l2677
572c0105J2187K9508j5632m674K1990j1891j7469J1404j1449j3598L6215K2217
584B8703k3369p368k530k4214J4865L9662j3131k4295J2912J692R23K7257j1143
597A9964m5843J0721L9314k241n042O298j6153K811K2731k6025k8344L9618L5612
$$ plain form
610 53421 35491 16192 474 -9337 28608 54821 6317 -24605 17952 44078 30916 20038
622 20038 -3336 -15906 19177 28574 -11603 -6228 37770 30093 -4521 -19369 -25527 1222 42097
635 42097 12679 -42673 -19705 26457 15433 -10100 -25755 -35073 -2111 29271 -9442 -39213
647 -39213 4150 25701 -13206 -40129 -38938 -15175 34396 33558 -36971 -55725 1294 23276 -3954
660 -3954 -25535 -34452 -10645 36823 19446 -42376 -35119 14091 10883 -15062 -23578 -20872 15116
673 15116 47812 -868 -62792 -34103 18986 20316 831 -20600 -30482 8447 35841 -11686
685 -11686 -47686 -14612 10262 2590 -2828 -16409 -17431 20479 18146 -43071 -50536 6645 30659
698 30659 16633 -5323 -35225 -25175 24546 18687 -31192 -24030 16177 20215 9837 -4299 -22383
$$ packed form
610E3421j7930j9299j5718r811L7945K6213m8504l0922M2557K6126j3162j0878
622B0038k3374j2570L5083R397m0177N375M3998p677l4614j4848o158K6749M0875
635D2097k9418n5352K2968M6162j1024k5533j5655r318L2962L1382l8713k9771
647c9213M3363K1551l8907k6923J191K3763M9571q38p0529j8754N7019K1982k7230
660c954k1581q917K3807M7468j7377o1822P257M9210l208k5945q516K706L5988
673A5116L2696m8680o1924K8689N3089J330j9485k1431r882L8929K7394m7527
685a1686l6000L3074K4874p672n418j3581j022L7910k333o1217p465N7181K4014
698C0659j4026k1956k9902J0050M9721n859m9879P162M0207M038j0378j4136j8084
$$ plain form
711 -22383 2434 34396 -1190 -37491 1604 41782 31830 9019 -18905 -27823 19333 48964
723 48964 5346 -19230 15654 31444 16750 5734 -11285 -7126 33657 32952 -12645 -7615 32150
736 32150 30471 7817 -8914 -25125 -622 47007 31861 -15767 -10121 9717 3846 6922 5360
749 5360 -13235 1102 26462 3484 -17338 3573 7896 -6327 -1926 -5773 -14548 12713 27313
762 27313 -4560 -18495 -5819 -10941 -5347 16980 4067 -13865 3814 5473 -14229 -3453 7041
775 7041 -10602 -6000 10789 -4120 -7825 11302 -1257 -19481 -4537 -339 -8926 10020 14975
788 14975 -12997 -14704 -827 -12183 -8979 12046 -2213 -17808 926 1955 -13725 -1913 1268
801 1268 -19649 -11922 4421 -9781 -7777 11454 -5882 -26473 -12575 -5747 -4725 13908 4729
$$ packed form
711b2383K4817L1962l5586l6301L9095M0178r952k2811k7924q918M7156K9631
723D8964m3618k4576L4884J5790j4694j1016j7019M159M0783p05m5597N030L9765
736C2150j679k2654j6731j6211K4503M7629j5146m7628N646J9838n871L076j562
749E360j8595J4337K5360k2978k0822K0911M323j4223M401l847q775K7261J4600
762B7313l1873j3935J2676n122N594K2327j2913j7932J7679J659j9702J0776J0494
775G041j7643M602J6789j4909l705J9127j2559j8224J4944M198q587J8946M955
788A4975k7972j707J3877j1356L204K1025j4259j5595J8734J029j5680J1812L181
801A268k0917P727J6343j4202K004J9231j7336k0591J3898O828J022J8633r179
$$ plain form
814 4729 -28270 -17030 10318 -1403 -11960 -5714 -10593 -1799 18373 -3339 -28245 544 20904
827 20904 -2840 -15691 -9388 -1757 22828 27479 -19356 -36400 9568 31953 9981 -4741 -11879
840 -11879 -3487 28752 24289 -21865 -19019 24531 24751 -439 -5522 -3347 14991 37028 5650
853 5650 -37314 -8279 38204 27704 -223 -11568 -11179 16050 34494 -2992 -27285 11719 34166
866 34166 6281 -11371 -8923 2305 28943 21216 -28467 -27752 28141 38607 2257 -18196 -18604
879 -18604 2695 34841 14949 -33569 -17096 30534 23308 -8981 -19389 -14060 14576 35367
891 35367 -4683 -44069 -6821 36259 19081 -13188 -28949 -21448 20902 38915 -10506 -41561
903 -41561 -4213 22476 6488 -10654 -21475 -14210 20505 19112 -29012 -32299 12432 20334 -4080
$$ packed form
814D729l2999J1240K7348j1721j0557O246m879Q794K0172k1712k4906K8789K0360
827B0904k3744j2851O303P631K4585M651m6835j7044M5968K2385k1972j4722p138
840a1879Q392L2239m463m6154K846M3550K20k5190n083K175J8338K2037l1378
853E650m2964K9035M6483j0500k7927j1345L89K7229J8444l7486k4293L9004K2447
866C4166k7885j7652K448J1228K6638p727m9683P15N5893J0466l6350k0453m08
879a8604K1299L2146j9892m8518J6473M7630p226l2289j0408N329K8636K0791
891C5367m0050l9386L7248M3080j7178l2269j5761P501M2350J8013m9421l1055
903d1561L7348K6689j5988j7142j0821P265L4715j393m8124l287M4731P902k4414
$$ plain form
916 -4080 -20167 -27580 -6849 28563 9863 -35774 -23368 11931 6602 -9460 -13383 -15890 3829
929 3829 19887 -13896 -37186 -234 22949 -1105 -18771 -18691 -8652 20538 20813 -24716 -32958
942 -32958 9772 20356 -2720 -10896 -12388 -3387 21729 9920 -27893 -14512 22843 15487 -5720
955 -5720 -9115 -10541 5642 29707 6350 -27216 -7703 18370 11319 7729 4746 -10687 821
968 821 21121 3259 -9634 9858 12260 -183 8267 7209 -5510 8746 18696 -1644 -3352
981 -3352 12259 3522 524 16220 7306 -8678 3925 9053 -869 11431 14388 -8533 -6636 12635
995 12635 5264 -1477 7415 -2813 -9068 11542 11241 -9384 -1520 7344 -6738 -4094 7096 -4199
1009 -4199 -3928 10490 -4381 -17168 2395 6773 -7650 -1145 2310 -10753 -3120 5980 -10715
$$ packed form
916d080j6087p413K0731L5412j8700m5637J2406L5299n329j6062l923k507J9719
929C829J6058l3783k3290L6952K3183k4054j7666Q0J0039K9190K75m5529q242
942c2958M2730J0584k3076q176j492R001K5116j1809l7813J3381L7355p356k1207
955e720l395j426J6183K4065k3357l3566J9513K6073p051l590k983j5433J1508
968H21K0300j7862j2893J9492K402j2443Q450j058j2719J4256R950k0340j708
981c352J5611q737k998J5696q914j5984J2603N128r922J2300K957k2921J897J9271
995A2635p371o741Q892j0228o255K0610l01k0625P864Q864j4082K644J1190j1295
1009d199K71J4418j4871j2787J9563M378j4423O505L455j3063P633R100j6695
$$ plain form
1022 -10715 -9178 11147 -1390 -19507 -3858 4609 398 5347 -7293 -26333 -2892 22790 169
1035 169 -19870 -8585 -1161 5665 10432 -14396 -26901 8672 24242 -7654 -22030 -8203 2928
1048 2928 14948 8034 -27860 -26117 19813 25925 -9404 -20973 -11715 2066 20773 8175 -27812
1061 -27812 -16710 21357 13221 -11996 -10716 -3451 7026 18196 -3758 -27624 287 27540
1073 27540 6106 -13100 -7444 -2238 11701 19436 -7511 -19554 12085 21680 -3776 -8459 2261
1086 2261 6162 15600 9166 -18859 -9715 28031 21001 -10588 -10796 485 10764 23149 3955
1099 3955 -25446 -3283 30647 13326 -12274 -8862 327 13837 20927 -8300 -27457 8267 31768
1112 31768 3635 -17961 -13280 -1564 20408 21232 -18030 -29143 10023 23494 -1506 -12916
$$ packed form
1022a0715J537K0325j2537j8117J5649Q467m211M949j2640j9040K3441K5682k2621
1035A69k0039J1285P424O826M767k4828j2505L5573J5570l1896j4376J3827J1131
1048B928J2020o914l5894J743M5930O112l5329j1569R258J3781J8707j2598l5987
1061b7812J1102L8067q136k5217J280P265J0477J1170k1954k3866K7911K7253
1073B7540k1434j9206N656N206J3939P735k6947j2043L1639R595k5456m683J0720
1086B261L901R438o434k8025R144L7746p030l1589k08J1281J0279J2385j9194
1099C955k9401K2163L3930j7321k5600L412R189J3510P090k9227j9157L5724K3501
1112C1768k8133k1596M681J1716K1972Q24l9262j1113L9166J3471k5000j1410
$$ plain form
1124 -12916 -11888 -3912 17885 12093 -23282 -17716 16723 12445 -9720 -11180 -9504 1614 20292
1137 20292 3602 -25840 -9451 15336 3220 -7332 -2523 -5057 2782 13926 -6293 -19477
1149 -19477 5141 13168 -6824 -7036 1271 -1278 7715 8735 -15122 -15039 12348 9616 -6892 -1793
1163 -1793 -466 -4409 7108 3080 -16687 -4829 14910 1002 -9053 338 -2543 -2498 9893 -3058
1177 -3058 -20111 -61 15011 1314 -2170 -465 -11793 -3782 12512 -1663 -11363 5718 6888
1190 6888 -4088 2715 546 -12252 1425 13653 -2886 -5843 7153 892 -1931 9092 -2596
1203 -2596 -14408 5044 14339 1227 1880 1868 -10567 -359 15122 -1454 -11489 5036 7330
1216 7330 1158 6923 -3035 -15901 3673 15012 -4619 -8040 6677 4051 2405 5460 -12566
$$ packed form
1124a2916J028P976K1797n792l5375N566L4439m278k2165j460J676J1118J8678
1137B0292j6690k9442J6389K4787j2116j0552M809k534P839J1144k0219j3184
1149a9477K4618Q027j9992k12Q307k549Q993J020k3857Q3K7387k732j6508N099
1163a793J327l943J1517m028j9767J1858J9739j3908j0055R391k881M5J2391j2951
1177c058j7053K0050J5072j3697l484J705j1328Q011J6294j4175r700J7081J170
1190F888j0976O803k169j2798J3677J2228j6539k957J2996o261k823J1023j1688
1203b596j1812J9452R295j3112O53j2j2435J0208J5481j6576j0035J6525K294
1216G330o172N765r958j2866J9574J1339j9631l421J4717k626j646L055j8026
$$ plain form
1229 -12566 -16260 12079 16993 -5617 -6342 1724 -2337 4450 5743 -12631 -7255 17356 8936 -9118
1243 -9118 -979 3718 -780 5061 -1122 -13765 5724 23053 1097 -13345 -135 3537 2830 6793
1257 6793 -5583 -9585 16789 19626 -11299 -15444 3644 7468 7916 2792 -15483 -5179 25930
1270 25930 13468 -22074 -18752 3047 11747 14951 -843 -23377 -4167 25477 5155 -23335
1282 -23335 -13080 4114 12718 13766 -10498 -27160 2800 24086 -3121 -22809 -10090 3474
1294 3474 15235 13104 -17753 -27861 5885 17055 -7683 -13463 -2385 2909 11555 4208 -22923
1307 -22923 -16859 14669 10306 -12353 -7412 2287 4328 8513 -5668 -25082 -3816 21064 3162
1320 3162 -13347 -2650 2501 3531 4583 -13169 -19477 11758 23437 -5014 -15512 -1647 4643
$$ packed form
1229a2566l694K8339M914k2610p25Q066m061O787J293j8374N376K4611q420j8054
1243i118Q139M697m498N841o183j2643J9489J7329k1956j4442J3210L672p07L963
1257F793j2376m002K6374K837l0925m145J9088L824M48n124j8275J0304L1109
1270B5930j2462l5542L322K1799Q700L204j5794k2534J9210K9644k0322k8490
1282b3335J0255J7194Q604J048k4264j6662K9960K1286k7207j9688J2719J3564
1294C474J1761k131l0857j0108L3746J1170k4738n780J1078N294Q646p347k7131
1307b2923O064L1528m363k2659M941R699K041M185j4181j9414K1266K4880j7902
1320C162j6509J0697N151J030J052j7752o308L1235J1679k8451j0498J3865O290
$$ plain form
1333 4643 8550 2558 -20627 -14658 22183 22773 -8007 -13689 -3789 2420 12298 3333 -19225 -3797
1347 -3797 26372 13621 -12635 -11565 -3630 6813 19001 2539 -18227 2758 24086 6549
1359 6549 -9182 -6220 -4530 8189 21080 2003 -11689 7844 14468 -2582 -3547 1541 -1591
1372 -1591 9937 16290 -2859 -6973 10498 4800 -7566 2007 4787 -744 9784 9675 -7126 -2759
1386 -2759 7260 -6791 -8559 7801 6255 148 5925 -3041 -13347 2131 6638 -9783 -5911
1399 -5911 6015 -1121 -1219 4886 -9168 -14852 2073 1772 -8499 1233 3626 -8626 -2921 2128
1413 2128 -12769 -12115 3125 -954 -2852 6374 -4233 -15890 -870 3520 -10995 -7663 513 -3466
1427 -3466 4069 9352 -12785 -20000 1867 5867 -4256 -1460 -3368 -6059 8536 7005 -18046 -16024
$$ packed form
1333D643L907n992k3185N969L6841N90l0780n682R900O209R878q965k2558J5428
1347c797L0169j2751k6256J070P935J0443J2188j6462k0766K0985K1328j7537
1359F549j5731K962J690J2719J2891j9077j3692J9533O624j7050r65N088l132
1372a591J1528O353j9149m114J7471n698j2366R573K780n531J0528j09j6801M367
1386b759J0019j4051j768J6360j546o107N777q966j0306J5478M507j6421L872
1399e911J1926p136r8O105j4054n684J6925l01j0271R732K393j2252N705N049
1413B128j4897O54J5240m079j898R226j0607j1657J5020M390j4515L332Q176l979
1427c466P535N283k2137p215K1867M000j0123K796j908k691J4595j531k5051K022
$$ plain form
1441 -16024 7513 7789 1194 1260 -8318 -6104 13625 5879 -17909 -9121 9074 8018 7598 4009 -11318
1456 -11318 -5061 13908 2227 -11924 2563 11582 5673 7058 206 -11941 2979 16759 -587
1469 -587 -6559 9760 11432 5224 5669 -6099 -10124 12456 16587 -4329 -2244 13356 9358 3198
1483 3198 433 -10236 -1308 22029 11982 -11405 -1523 13396 7844 2304 -6143 -13201 8037
1496 8037 27514 4017 -16533 -1575 9382 4130 -171 -11243 -11017 17612 24357 -8469 -21119
1509 -21119 -1765 6504 4538 -297 -14985 -9264 19009 14199 -17455 -18551 -1144 2259 4249
1522 4249 -456 -15122 -4870 15661 235 -22542 -12680 265 1255 5275 -2223 -15187 -2056
1535 -2056 9961 -10034 -19586 -4039 1188 495 5819 -5356 -14541 1025 3701 -14186 -11281 3781
$$ packed form
1441a6024K3537K76o595O6r578K214J9729p746k3788Q788J8195j056m20l589j5327
1456a1318O257J8969j1681j4151J4487R019n909J385o852j2147J4920J3780j7346
1469e87n972J6319J672o208M45j1768m025K2580M131k0916K085J5600l998o160
1483C198k765j0669Q928K3337j0047k3387R882J4919n552n540q447p058K1238
1496H037J9477k3497k0550J4958J0957n252m301j1072K26K8629O745l2826j2650
1509b1119J9354Q269j966m835j4688N721K8273m810l1654j096J7407L403J990
1522D249m705j4666J0252K0531j5426k2777R862J2945R90M020p498j2964J3131
1535b056J2017j9995r552J5547N227o93N324j1175r185J5566K676j7887K905J5062
$$ plain form
1549 3781 2414 2298 3349 -12124 -13975 5291 2689 -11394 -2396 6670 1447 3947 639 -15071
1563 -15071 -7545 10552 1518 -8061 3628 7413 3751 5868 -5857 -17167 2726 18896 3308
1576 3308 -4267 3814 3187 4267 7488 -7730 -12219 12380 20149 3180 -284 3368 -1285 4761
1590 4761 7581 -6951 -3031 17890 14391 227 2815 352 -4831 6657 9995 -2261 3519 13720
1604 13720 2948 -930 6914 -2425 -7829 7567 9836 1358 7234 5632 -6510 -614 5880 -7690
1618 -7690 -6396 10607 9165 642 2410 -5579 -10613 3882 4793 -10595 -2926 10329 2475 -3278
1632 -3278 -2161 -10367 -8169 6069 -458 -9889 3795 8378 -7241 -9569 -5340 -9012 -674 6612
1646 6612 -7123 -8691 8551 3760 -13592 -11169 -6099 -4628 6166 3750 -13297 -5732 10105
$$ packed form
1549C781j367j16J051j5473j851J9266k602j4083Q998R066n223K500l308j5710
1563a5071P526J8097r034r579J1689L785l662K117j1725j1310J9893J6170j5588
1576C308p575Q081o27J080L221j5218m489K4599P769j6969l464L652m653O046
1590D761K820j4532L920K0921l499j4164K588k463n183J1488L338j2256N780J0201
1604A3720j0772l878P844r339n404J5396K269q478N876j602j2142N896O494j3570
1618g690J294J7003j442q523J768p989n034J4495R11j5388P669J3255p854n753
1632c278J117q206K198J4238o527r431J3684M583j5619k328M229l672Q338P286
1646F612j3735j568J7242m791j7352K423N070J471J0794k416j7047P565J5837
$$ plain form
1659 10105 -1879 -15703 -9373 -4246 2516 13053 -453 -19239 -6401 7415 -3196 -8547 -4484
1672 -4484 -5308 5628 15259 -4058 -19074 -3955 5549 -1209 -883 -2291 -5350 9398 14796 -9449
1686 -9449 -18406 458 8040 6118 5465 -4983 -6877 12829 12469 -12387 -12650 5669 10672 10247 6568
1701 6568 -7238 -2838 15421 5235 -14139 -2053 14622 12075 7984 83 -8432 4673 16493
1714 16493 -2300 -12045 8826 18400 8226 1000 -6481 -5324 13447 12885 -10983 -8325 16752
1727 16752 17524 1980 -6878 -12331 -1891 18932 9244 -13993 -3864 15135 8424 -2731 -9156
1740 -9156 -12719 2072 18707 3023 -13356 -357 8402 -597 -4158 -8072 -11145 6694 17155
1753 17155 -1291 -11833 -2395 -1542 -4032 1319 -5077 -9422 7137 11575 -5513 -9453 -3371 -7060
$$ packed form
1659A0105j1984j3824O330N127O762J0537j3506j8786J2838J3816j0611n351M063
1672d484q24J0936R631j9317j5016J5119R504o758L26j408l059J4748N398k4245
1686i449q957J8864P582j922o53j0448j894J9706l60k4856k63J8319N003m25l679
1701F568j3806M400J8259j0186j9374J2086J6675k547m091p901q515J3105J1820
1714A6493j8793r745K0871R574j0174p226p481J157J8771n62k3868K658K5077
1727A6752P72j5544q858n453J0440K0823r688k3237J0129J8999o711j1155o425
1740i156l563J4791J6635j5684j6379J2999Q759q999l561l914l073J7839J0461
1753A7155j8446j0542R438Q53k490N351o396m345J6559M438j7088l940O082l689
$$ plain form
1767 -7060 -2258 4806 -5137 -6517 8678 4621 -11020 -8520 -4373 -6105 3041 5217 -7390 -4018
1781 -4018 7528 -4152 -14891 -5293 -1115 -1715 5129 -154 -9741 1141 6134 -11105 -14726 -204
1795 -204 3676 4239 5645 -6496 -10510 5263 3849 -12270 -6937 6005 5120 5536 3555 -9630 -7060
1810 -7060 7597 1368 -8229 2908 8645 3608 5870 1921 -10001 -4116 7187 1624 1618 10931 3779
1825 3779 -3136 5347 3188 -6860 24 6652 3246 9371 10499 -5044 -6009 7918 3744 -4937
1839 -4937 1545 5184 6262 13408 3275 -14244 -4614 11066 3590 -2274 3372 3267 5769 10129
1853 10129 -5057 -14814 2403 11481 -207 -692 5718 1668 2926 2510 -11180 -9191 10518 9524
1867 9524 -2956 581 2817 -1975 740 -1670 -11224 -810 13757 4101 -5246 634 -935 -4639
$$ packed form
1767g060M802P064r943j380J5195m057j5641K500M147j732R146K176j2607L372
1781d018J1546j1680j0739R598M178o00O844n283r587J0882M993j7239l621J4522
1795b04L880N63J406j2141m014J5773j414j6119N333J2942q85M16j981j3185K570
1810g060J4657o229r597J1137N737n037K262l949j1922N885J1303n563oR313p152
1825C779o915Q483k159j0048O884O628l406O125J128j5543r65J3927m174q681
1839d937O482L639J078P146j0133j7519R630J5680p476n864N646j05K502M360
1853A0129j5186r757J7217R078j1688m85O410m050J258m16j3690J989J9709r94
1867I524j2480L537K236m792K715k410r554J0414J4567r656r347N880j569l704
$$ plain form
1881 -4639 783 -3464 -9543 4883 12877 -1230 -6834 -3224 -6906 -3691 4675 -3963 -7918 6701
1895 6701 7874 -5988 -8435 -7808 -8509 3385 8371 -7365 -9436 6133 4514 -7446 -9767 -11516
1909 -11516 -5182 12618 9468 -12290 -11114 4449 1414 -5901 -7524 -9446 2158 16775 3217
1922 3217 -16327 -6610 6065 91 -4434 -5387 -4466 9687 16181 -5699 -17378 -884 6718 -117
1936 -117 -205 -625 373 11558 7706 -13041 -11207 7304 7240 -474 2056 1020 2706 9919 -526 -15246
1952 -15246 -2600 11752 5416 1378 3666 -609 1557 6649 -5644 -10267 6699 12740 3037 1405
1966 1405 803 -4135 2468 6436 -5596 -5438 9479 10377 3635 3124 -4796 -9153 4444 9695 -2321
1981 -2321 -577 8325 4772 2504 2120 -9039 -7419 10212 10445 -2203 31 4462 916 2478 -655
$$ packed form
1881d639N422m247o079J4426P994j4107n604L610l682L215Q366q638l955J4619
1895F701J173j3862k447O27p01J1894M986j5736k071J5569j619j1960k321j749
1909a1516O334J7800l150k1758J176J5563l035p315j623j922J1604J4617j3558
1922C217j9544R717J2675n974m525r53R21J4153O494k1880j1679J6494P602o835
1936a17q8m20R98J1185l852k0747J834J8511o4p714K530j036J686P213j0445j4720
1952a5246J2646J4352o336m038K288m275K166N092j2293m623J6966O041r703j632
1966A405o02m938O603L968j2032J58J4917Q98o742n11p920m357J3597N251j2016
1981b321J744Q902l553k268l84j1159J620J7631K33j2648K234M431l546J562l133
$$ plain form
1996 -655 -11715 -3251 14067 7739 -3490 -183 -653 -3591 1502 -2431 -9174 3851 12561 -352
2010 -352 -6053 -847 -4261 -5139 997 -3570 -4907 7120 6155 -7400 -5806 -1850 -7374 -4467 3017
2025 3017 -1421 -663 5811 -3495 -11965 -2754 -649 -6480 -193 3522 -3579 -494 3271 -7234 -9710
2040 -9710 -1016 -3262 -4180 6244 4774 -6322 -3878 -1216 -6584 -2746 1311 -4916 -617 10812
2054 10812 1127 -10789 -4858 -938 -1448 3347 -16 -6722 4606 12593 -3202 -12971 -4169 1275
2068 1275 4977 7996 -1944 -6971 7326 9061 -7054 -8970 1325 4296 8028 7489 -5506 -4963
2082 -4963 9662 5127 -8097 -3314 4831 6281 10390 5611 -7746 -3111 8246 1127 -4085 4528
2096 4528 6472 4638 7868 932 -8129 1799 8302 -772 -537 6953 4715 4561 6116 -4791 -8648
$$ packed form
1996f55j1060Q464J7318o328j1229L307m70k938N093l933o743J3025Q710j2913
2010c52n701N206l414q78O136m567j337J2027r65j3555J594L956n524K907P484
2025C017m438P58O474r306q470R211K105n831O287L715p101L085L765j0505k476
2040i710Q694k246r18J0424j470j1096K444K662n368L838M057o227M299J1429
2054A0812r685j1916N931L920n10M795l363o706J1328P987j5795r769Q802N444
2068A275L702L019r940n027J4297J735j6115j916J0295K971L732n39j2995N43
2082d963J4625m535j3224M783Q145J450M109m779j3357M635J1357p119n212Q613
2096D528J944j834L230o936r061R928O503r074K35P490k238j54J555j0907l857
$$ plain form
2111 -8648 6188 9674 -20 1189 4358 1190 4328 2894 -9687 -6095 11002 9194 -1610 -1475
2125 -1475 -1218 -102 6368 -305 -14024 -3392 13928 7933 -3011 -5454 -6702 -877 7348 -2914
2139 -2914 -12914 2145 12033 951 -7652 -8060 -7281 2375 6865 -7895 -11166 5704 8185 -4957
2153 -4957 -9455 -9372 -6084 5325 4899 -9762 -7063 5648 257 -9510 -7841 -5893 -1957 6889 619
2168 619 -11184 -2777 4486 -5471 -9596 -3726 -2977 1988 8079 -2523 -10041 302 1906 -6646 -4079
2183 -4079 827 -90 5461 6563 -6979 -8891 2780 2139 -2533 2338 1274 -937 6911 5920 -7453
2198 -7453 -6070 3306 2432 3415 7190 410 -1796 6983 2208 -7751 -1483 6080 4565 6851 5716
2213 5716 -3937 -872 8309 769 -5887 3084 6801 5597 8444 2484 -6528 1210 7833 -985 -1107
$$ packed form
2111h648J4836L486r694J209L169l168L138j434j2581L592J7097j808j0804J35
2125a475K57J116O470o673j3719J0632J7320n995j0944k443j248N825Q225j0262
2139b914j0000J5059R888j1082q603m08P79R656M490j4760l271J6870K481j3142
2153d957m498Q3L288J1409m26j4661K699J2711n391r767J669J948L936Q846o270
2168F19j1803Q407P263r957m125N870P49M965O091j0602p518J0343J604q552K567
2183d079M906r17N551J102j3542j912J1671o41m672M871j064k211P848r91j3373
2198g453J383R376q74R83L775o780k206Q779m775r959O268P563j515K286j135
2213E716r653L065R181p540o656Q971L717j204K847n960r012P738O623q818j22
$$ plain form
2228 -1107 7945 6702 3784 5202 -2921 -6305 5499 7618 -1461 2056 7564 2958 2595 3119 -5410
2243 -5410 -5065 6891 5084 -636 4962 3840 -3398 37 338 -6660 -871 7981 2040 -1658 2171
2258 2171 -3475 -6395 1202 -939 -7790 -60 5580 -599 -1637 -2009 -10350 -7005 3431 -1282 -7460
2273 -7460 506 2007 -3718 -3447 -6581 -11780 -1718 6356 -3749 -7933 311 -788 -4384 -3388 -8890
2288 -8890 -9218 4694 7077 -5652 -5789 809 -2798 -4758 -3206 -7135 -1523 10032 3288 -9563
2302 -9563 -4409 1826 -1720 -829 -1774 -5988 3147 10911 -733 -9390 -1611 698 -1068 2977 943
2317 943 -2540 6470 7873 -5663 -7188 1638 1917 2753 6013 -95 -2816 7525 5831 -5681 -2900
2332 -2900 2616 2251 7080 8196 -2643 -2470 7176 3332 -3417 1924 4447 4287 9875 5362 -6637
$$ packed form
2228a107R052j243k918J418q123l384J1804K119r079L517N508m606l63N24q529
2243e410L45J1956j807n720N598j122p238L435L01o998N789Q852n941l698L829
2258B171n646k920P597k141o851P730N640o179j038l72q341L345J0436m713o178
2273g460P966J501n725K71l134n199J0062Q074j0105m184Q244j099l596R96n502
2288h890l28J3912K383j2729j37O598l607j960J552l929N612J1555o744j2851
2302i563N154O235l546Q91r45m214R135P764j1644q657P779K309j766M045k034
2317I43l483R010J403j3536j525Q826K79Q36L260o108k721J0341j694j1512K781
2332b900N516l65M829J116j0839J73R646l844o749N341K523j60N588m513j1999
$$ plain form
2347 -6637 -1275 9170 3493 -691 3521 3400 5974 10299 564 -8404 1988 8742 1215 557 4288
2362 4288 2624 4924 5400 -6876 -7669 7267 8656 -1252 -977 762 -242 3829 820 -10097 -4752
2377 -4752 8851 4126 -3992 -1266 -1973 -2786 1609 -4119 -10960 547 8724 -975 -6370 -3380 -5233
2392 -5233 -3017 2532 -4690 -8532 1883 4191 -4714 -4410 -3679 -7620 -2308 2880 -4301 -4661 3387
2407 3387 -139 -6274 -3026 -4735 -6875 2437 4558 -4801 -3727 1528 -2892 -3434 -234 -5225 -5129 5727
2423 5727 4156 -5195 -2497 119 -4215 -1053 893 -4550 184 8681 382 -7681 -1588 344 -2065
2438 -2065 2649 636 -4356 4024 8329 -2625 -5997 1183 471 623 5062 837 -2103 6433 5335
2453 5335 -5737 -2942 4292 2638 4796 6951 -1202 -1483 7055 3221 -3550 2093 4597 1389 6709
$$ packed form
2347f637N362J0445n677m184M212j21K574M325r735q968J0392O754p527o58L731
2362D288j664K300M76j2276p93J4936J389r908K75J739j004M071l009j0917N345
2377d752J3603m725q118K726p07q13M395n728o841J1507Q177r699n395K990j853
2392e233K216N549p222l842J0415K308q905L04P31l941N312N188p181l60Q048
2407C387l526o135L248j709k140R312K121r359J074N255m420n42L200m991R6J0856
2423E727j571r351K698K616m334L162J946n443M734Q497q299q063O093J932k409
2438b065M714k013m992Q380M305j0954l372P180p12J52M439m225k940Q536j098
2453E335j1072K795P234j654K158K155q153k81Q538l834o771N643K504l208N320
$$ plain form
2468 6709 7053 -2025 -204 5981 1029 -801 5396 3343 2128 8250 3416 -5623 -500 5984 1725
2483 1725 2445 3950 -1481 1689 8471 -795 -7908 556 4090 497 2809 1205 -4145 2370 4997
2498 4997 -6869 -8324 3218 4813 352 151 -5032 -5625 4473 2770 -9530 -5805 4530 2208
2512 2208 -678 -1455 -7169 -4219 4693 -1462 -9587 -749 5614 88 -2325 -4341 -8574 -1219 6219
2527 6219 -3348 -7834 1174 2847 -2374 -1632 -4789 -7586 1789 4716 -5165 -4909 2743 -679 -3628
2542 -3628 -1627 -6003 -5263 5274 4271 -6091 -3683 909 -2329 -1231 189 -6453 -2931 7656
2556 7656 2141 -6193 -1652 190 -1907 2125 -118 -5926 2192 9456 -559 -6880 -1184 49 2311
2571 2311 6513 -854 -5599 5334 8397 -2743 -4229 1468 1571 4876 6050 -2743 -2547 8486 5583
$$ packed form
2468F709L44r078J821O185m952j830O197k053j215O122m834r039N123O484m259
2483A725P20J505n431L170O782r266p113Q464L534l593K312j604n350O515K627
2498D997j1866j455J1542J595m461k01n183n93J0098j703j2300L725J0335k322
2512B208k886p77n714K950Q912o155q125Q838O363n526k413k016m233P355P438
2527F219r567m486R008J673n221P42l157k797R375K927r881K56P652l422k949
2542c628K001m376P40J0537j003j0362K408M592l238J098J420o642L522J0587
2556G656n515q334M541J842k097M032k243n808Q118P264j0015o321N696J233K262
2571B311M202p367m745J0933L063j1140j486N697J03L305J174q793J96J1033k903
$$ plain form
2586 5583 -4630 -1944 3132 3393 7658 5158 -4982 -1278 8308 2329 -3507 2495 3404 1877 6146
2601 6146 2229 -4620 2200 6245 -1761 -1922 4705 2605 2084 5331 -2128 -6407 3203 4984 -1713
2616 -1713 926 2848 -1556 1063 4365 -4123 -4553 4066 2440 -2231 1749 143 -3372 2322 1723
2631 1723 -7215 -3703 4918 1686 -910 472 -4933 -4759 4129 514 -7547 -1711 3540 -1137 -1094 -1132
2647 -1132 -7060 -2674 4677 -2274 -7364 625 2622 -2314 -1241 -4130 -8223 53 5246 -3536 -5228
2662 -5228 1066 -1788 -3255 407 -3759 -6137 2730 2736 -5227 -2274 2049 -2806 -2250 608 -4746 -3139
2678 -3139 5525 1971 -5001 -953 -140 -3512 1160 2188 -4155 -433 5708 -599 -3647 1387 -333
2693 -333 -1682 4165 1233 -4436 3103 6951 -1459 -3086 1164 -828 2603 7398 -324 -4788 4702
$$ packed form
2586E583j0213K686N076K61M265k500j0140L704R586n979n836O002R09j527M269
2601F146l917o849O820M045q006j61O627k100n21L247p459m279R610J781o697
2616a713K639J922m404K619L302q488m30Q619j626m671L980j606l515N694n99
2631A723q938L512Q621l232k596J382n405J74Q888l615q061N836N251m677M3l8
2647a132n928M386P351o951n090P989J997m936J073k889m093Q276N193q782j692
2662e228O294k854j467L662m166k378Q867Op963K953M323m855N56K858n354J607
2678c139Q664l554o972M048Q13l372M672J028o343L722O141o307l048N034j720
2693c33j349N847k932n669P539L848q410j627M250j992L431M795p722m464R490
$$ plain form
2708 4702 5369 -1411 128 1602 -626 4973 6660 -2723 -1947 7132 4010 -2177 1119 708 1216 8218
2724 8218 4934 -5514 -1387 6503 2176 132 2381 -371 806 7534 1442 -5845 1658 5317 -435
2739 -435 484 1554 -2012 2118 6345 -2488 -5793 2392 3228 -884 1688 67 -4056 2385 4043 -4964
2755 -4964 -3638 3443 332 -2112 1386 -2335 -3902 3684 1259 -7261 -2543 2950 -574 -511 -19 -6327
2771 -6327 -3802 4416 -391 -6282 -367 869 -2960 -136 -1552 -6742 -616 4653 -3848 -6330 670
2786 670 266 -2221 292 -4549 -7631 2274 4585 -4820 -4672 553 -1951 -1138 1140 -5273 -4940 4294
2802 4294 1981 -6334 -1927 1256 -1634 662 628 -6580 -1875 6719 755 -4720 -379 -444 -1458 3652
2818 3652 1740 -5296 1106 5914 -1027 -1950 2272 -76 849 5669 -118 -4088 4503 6030 -1021
$$ packed form
2708D702O67o780J539J474k228N599J687r383P76R079l122o187L296m11N08P002
2724H218l284j0448M127P890m327k044K249k752J177O728o092p287P503L659n752
2739d35R19J070l566M130M227q833l305Q185Q36m112K572j621m123O441J658r007
2755d964J326P081l111k444L498l721j567P586k425q520M718N493l524O3M92o308
2771f327K525Q218m807n891N915J236l829K824j416n190O126N269q501k482P000
2786F70m04k487K513m841l082R905K311r405J48N225k504Q13K278o413L33R234
2802D294k313q315M407L183k890K296l4p208M705Q594n964n475M341o5j014N110
2818C652j912p036O402M808o941r23M222k348R25M820n787l970Q591J527p051
$$ plain form
2833 -1021 220 1887 -1194 3484 6953 -844 -2360 5373 3307 -832 2995 2131 -689 5218 5443
2848 5443 -3158 -88 6243 1712 -828 2701 0 98 6953 2794 -4919 968 4994 -513 628
2863 628 2715 -1882 510 5558 -1284 -4821 3157 3325 -1530 502 70 -3114 2894 5180 -4501 -5054
2879 -5054 2950 1427 -749 2010 -1973 -4991 3103 2937 -5749 -2404 2281 -1230 -601 831 -5082
2894 -5082 -3725 4741 508 -6663 -2217 194 -1945 1269 -288 -8083 -3265 4363 -1424 -5158 -611
2909 -611 -1869 -3053 1731 -2029 -7594 -637 3323 -3928 -4087 -279 -2934 -1352 2511 -4012 -6900
2924 -6900 1887 2537 -3609 -1399 -59 -3218 326 2722 -4221 -2852 4706 514 -4098 320 1129
2939 1129 -1326 3341 1333 -5686 352 6258 774 -2105 1850 -43 1037 5904 432 -4547 3693
$$ packed form
2833a021J241J667l081M678L469p797j516P733k066m139L827q64k820N907K25
2848E443q601L070O331m531k540L529k701R8O855m159p713N887M026n507J141
2863F28K087m597K392N048o842l537P978J68m855K032m32l184O008K286r681n53
2879e054Q004j523k176K759l983l018Q094j66q686L345M685l511O29J432n913
2894e082J357Q466m233p171M446K411k139L214j557p795M818P628n787l734M547
2909f11j258j184M784l760n565O957L960p251j59L808k655J582L863o523k888
2924f900Q787O50o146K210J340l159L544K396o943J369P558m192m612M418Q09
2939A129k455M667k008p019O038N906n484k879L955j893J080M867n472m979Q240
$$ plain form
2954 3693 6462 -382 -291 2158 245 4115 6777 -1981 -4382 5703 6250 290 1047 -58 -1580 5526
2970 5526 6740 -3220 -2176 5423 2890 366 2913 -536 -996 6119 3315 -4768 -55 5257 1608
2985 1608 1224 2043 -3372 -673 7143 1221 -4629 1385 2474 -784 1925 1292 -3770 899 4984 -2273
3001 -2273 -3522 3310 994 -2521 1161 -1926 -4052 3277 3359 -4907 -3207 2137 -967 -1736 540 -3824
3017 -3824 -3473 3188 -5 -6852 -1685 1921 -2437 -1523 -982 -6565 -1672 4891 -2321 -7403 -1554 -617
3033 -617 -2376 1369 -2126 -7298 -460 3848 -3663 -5148 -463 -2083 -1585 2356 -3424 -6256 2398
3048 2398 3015 -4343 -2909 -318 -2339 1672 3924 -3870 -4746 3067 1664 -2542 1021 489 -2108 3256
3064 3256 3328 -4024 -693 4587 -266 -1278 2699 505 -149 5305 1399 -4379 1800 5186 -246 1141
$$ packed form
2954C693K769o844R1K449j913L870K662q758k401J0085N47n960P57j105j522P106
2970E526J214r960J044P599k533k524K547l449m60P115k804q083M713N312l649
2985A608l84Q19n415K699P816n922n850O014J089l258K709o33n062M669M085p257
3001b273j249O832k316l515L682l087k126P329Q2q266J700N344l104p69K276m364
3017c824L51O661l193o847N167L606m358R14N41n583M893O563p212n082N849R37
3033f17j759L745l495n172O838M308p511j485M685j620M98L941n780k832Q654
3048B398O17p358J434K591k021M011K252p794q76P813j403m206L563n32k597N364
3064C256P2p352L331N280m853j012L977k194o54N454l906n778O179L386n432J387
$$ plain form
3080 1141 3463 -805 1049 5182 -444 -2731 4256 4188 -1041 1936 2679 -1040 3595 4387 -3444 -2166
3096 -2166 5897 3686 64 2751 -228 -1399 5102 3706 -3956 -41 5580 1245 331 2097 -2129
3111 -2129 -555 6070 1254 -4612 1234 4324 194 1315 646 -4730 105 6377 -330 -3543 1585
3126 1585 319 -1411 1676 -1122 -4863 1254 4125 -2917 -3010 897 -1919 -1823 1379 -3489 -5104 2721
3142 2721 2379 -4312 -2357 -468 -4208 -590 1470 -4365 -3360 3046 -1172 -5146 -556 -1119 -3803
3157 -3803 798 -393 -5803 -496 3791 -2962 -4833 -632 -2261 -1758 2776 -1505 -5364 1108 2201
3172 2201 -4192 -2884 793 -1803 555 3125 -2795 -3632 3534 1983 -4071 -769 756 -1260 3666
3187 3666 3551 -4402 -2426 4177 894 -1282 2154 267 -776 5017 2377 -4423 253 4240 372
$$ packed form
3080A141K322m268J854M133n626k287O987o8n229K977P43l719M635P92p831J278
3096b166Q063k211l622K687k979j171O501j396p662L915N621m335r14J766m226
3111b129J574O625m816n866N846L090m130J121o69n376M835O272o707l213N128
3126A585j266j730L087k798l741O117K871p042r3L907k816R6L202m868j615P825
3142B721l42o691J955J889l740L618K060n835J005O406m218l974M590n63k684
3157c803M601j191n410N307M287o753j871M201j629N03M534m281l859O472J093
3172B201o393J308L677k596K358K570n920q37P166j551o054L302J525k016M926
3187C666j15p953J976O603l283k176L436j887j043N793k640o800M676L987l868
$$ plain form
3202 372 316 3105 -891 854 6029 535 -4280 1735 3872 761 3491 2559 -2525 1617 5533 -961
3218 -961 -2461 3676 2807 967 3566 323 -2509 3847 4908 -3033 -908 4242 1438 1680 2877 -2250
3234 -2250 -2531 4497 2453 -3167 1237 3577 -287 767 1182 -3532 -354 5081 -265 -3639 1905
3249 1905 2195 -1318 847 -1241 -4896 1201 4559 -2311 -3000 1518 -1390 -2269 867 -2754 -4026 2998
3265 2998 2627 -3912 -2409 667 -2606 -1121 897 -4598 -3948 3535 1133 -4351 -2112 -2077 -3722 1089
3281 1089 1224 -5058 -2516 3109 -1460 -4164 -1278 -2855 -2190 3132 -65 -5684 -484 2852 -2107
3296 -2107 -3149 -971 -3262 360 4620 -1396 -4998 1409 1539 -2949 -780 110 -1825 2737 4049
3311 4049 -3177 -3198 3290 956 -2018 1079 244 -481 4372 2496 -4250 -711 3835 -181 -456 3363
$$ packed form
3202C72n6K789l996J745N175n494m815O015K137l111K730r32n084M142L916o494
3218i61j500O137q69j840K599l243k832O356J061p941K125N150k804K42J197n127
3234b250k81P028k044n620M404K340l864J054M15m714L178N435n346l374N544
3249A905K90l513K165k088l655O097L358o870o89M518k908q79L136l621j272P024
3265B998l71o539J503L076l273J485K018n495O50P483k402n484K239L5j645M811
3281A089J35o282K542N625m569k704K886j577O65N322l197n619N200L336m959
3296b107j042K178k291L622M260o016l602O407J30m488K169Q90j935M562J312
3311D049p226k1O488k334k974L097q35p25M853j876o746L539M546m016k75L819
$$ plain form
3327 3363 631 918 4960 333 -3860 2181 4328 -60 1667 2625 -768 1945 5069 -1075 -2946
3342 -2946 3284 3212 1083 3797 1798 -2264 2205 4427 -2253 -1043 3942 1540 1316 3668 -1213 -3031
3358 -3031 4253 3509 -2872 84 3028 834 2264 2132 -4159 -2910 4443 1897 -2284 951 1441 -630
3374 -630 1907 -250 -5233 -260 4798 -568 -2781 984 -339 -1295 1339 -2366 -5255 1643 3283
3389 3283 -2640 -2320 40 -2922 -1870 725 -3623 -3563 3298 1096 -4529 -1289 -1011 -3782 -560 827
3405 827 -4146 -2021 3340 -737 -3715 -834 -2493 -3384 1587 643 -4167 -122 2558 -2498 -2893 -253
3421 -253 -2926 -1188 4205 -593 -4407 380 1669 -1883 -674 -544 -3221 1687 5340 -1664 -3876
3436 -3876 1217 822 -1394 1137 -452 -1654 4325 4034 -3751 -2402 2702 1017 371 2129 -949 -11
$$ packed form
3327C363k732K87M042m627m193O041K147m388J727R58l393K713L124o144j871
3342b946O230p2k129K714j999m062M469K222o680J210M985k402k24K352m881j818
3358c031P284p44o381K956K944k194J430j32o291J249P353k546m181L235M90k071
3374f30K537k157m983M973N058n366k213L765j323r56K634l705k889O898J640
3389C283n923L20K360k962J052K595m348O0O861k202n625L240K78k771L222J387
3405H27m973K125N361m077k978K881j659q91M971r44m810M045K680n056l95K640
3421b53k673J738N393m798l814M787J289l552J209J30k677M908L653p004k212
3436c876N093l95k216K531j589j202N979k91p785J349N104j685o46J758l078R38
$$ plain form
3452 -11 5543 2137 -4271 -406 3243 928 2158 2876 -799 1344 5147 -1049 -3525 2899 3590 1024
3468 1024 2909 1769 -1117 2731 4059 -2111 -1602 4077 2402 887 3592 439 -1873 2589 2615 -2347
3484 -2347 657 3989 357 980 2183 -2213 -2049 3588 1406 -2050 1416 1729 -1091 1583 860 -5135
3500 -5135 -1949 3828 419 -1783 916 -633 -1754 1674 -1989 -5686 525 3902 -1481 -2345 -864
3515 -864 -2488 -1110 1418 -3823 -4909 2169 2632 -3011 -1811 -1765 -3318 -575 339 -4547 -2404 3750
3531 3750 138 -4559 -2178 -1759 -2890 1419 241 -4312 -454 3168 -2365 -3662 -444 -2722 -2261
3546 -2261 2451 -39 -2971 1335 1049 -3962 -1667 807 -1815 495 3571 -867 -2406 1770 -352
3561 -352 -2374 1219 821 -2204 2337 4197 -1404 -1525 1675 -712 -249 3378 475 -772 4320 2869
$$ packed form
3452a1N554l406o408L865L649k315J230P18l675K143L803o196k476O424O91k566
3468A024J885j140k886L848J328o170N09N679j675j515K705l153k312M462K6m962
3484b347L004L332l632O23J203m396J64N637k182l456L466L13k820K674p23n995
3500e135L186N777l409k202K699j549j121L428l663l697O211L377n383q64J481
3515h64j624J378K528n241j086P078M63n643J200M6j553K743R14m886K143O154
3531C750l612m697K381M19j131M309j178m553L858L622n533j297L218k278M61
3546b261M712k490k932M306k86n011K295K474k622K310L076m438j539M176k122
3561c52k022L593l98l025M541J860n601j21L200k387M63L627k903j247N092j451
$$ plain form
3577 2869 -2643 -594 2222 417 2607 3726 -901 81 5300 1321 -2975 894 2644 1410 3614
3592 3614 2819 -1816 1823 4872 -1103 -2708 2704 2979 1734 3526 45 -2372 2892 3675 -2155 -981
3608 -981 3569 1361 1657 3017 -1683 -2631 3104 1225 -2641 1328 2892 -871 812 1061 -3677 -2310
3624 -2310 2605 43 -1424 2140 -350 -2828 1373 345 -4388 -1507 1445 -1076 -495 1219 -2993
3639 -2993 -3077 1303 -1618 -4970 -44 1977 -1499 -877 -1399 -4798 -1222 1974 -3248 -4293 1561 1126
3655 1126 -1839 -700 -3028 -4005 1000 1529 -4360 -2384 2718 -452 -2730 -1490 -3199 -1836 3530
3670 3530 522 -4572 -90 2627 -1843 -2009 -1114 -2573 382 4249 -524 -3786 1655 1243 -2001 -191
3686 -191 -133 -1610 2576 4566 -1500 -2052 2137 -148 -1119 2482 878 -836 3368 3124 -1741 -446
$$ packed form
3577B869n512K049K816j805K190J119m627R82N219l979m296L869J750j234K204
3592C614p95m635L639L049n975j605N412K75j245J792l481k417N264P83n830J174
3608i81M550k208K96J360m700r48N735j879l866L969J564l763J683K49m738J367
3624b310M915k562j467L564k490k478M201j028m733K881K952k521N81J714m212
3639b993q4M380k921l352M926K021l476O22n22l399L576L196n222j045N854m35
3655A126k965J139k328r77N005N29n889J976N102l170k278J240j709J363N366
3670C530l008n094M482K717m470j66Q95j459K955L867m773l262N441m12l244J810
3686a91N8j477M186J990o066n52M189k285r71L601j604j714M204k44m865J295
$$ plain form
3702 -446 2000 -935 1153 4424 617 -76 4111 1913 -1788 717 1516 109 3871 4050 -1461 308
3718 308 4288 738 -1835 1369 1518 1095 4649 1567 -2937 1332 3773 -1152 -1290 2192 1421 2488
3734 2488 3627 -1980 -3525 2774 2275 -2311 -364 2323 623 1769 956 -4252 -2496 3666 232
3749 232 -2920 807 1462 -538 914 -1166 -4952 -459 2976 -795 -1671 1140 -1166 -2353 555 -2004
3765 -2004 -4286 363 1609 -2214 -398 656 -3773 -2564 603 -2352 -3164 1282 159 -2065 95
3780 95 -1509 -5047 -708 1819 -2437 -1700 1239 -677 -2016 298 -3015 -4083 1928 1803 -2761 -805
3796 -805 1626 -1417 -1289 -357 -3581 -1334 4403 876 -3102 495 931 -1405 67 42 -2399 1794
3812 1794 4890 -804 -2282 1567 724 -1266 1313 44 -690 4369 3786 -2243 -1303 2308 -262 597
$$ packed form
3702d46K446k935K088L271l807o93M187k198l701K505P99j407L762J79n511J769
3718C08L980l550k573L204J49m23L554l082m504M269K441m925j38L482p71J067
3734B488J139n607j545O299m99m586J947K687j700J146q13n208J756O162l434
3749B32l152L727O55k000J452k080l786M493L435l771q76K811k306j187K908k559
3765b004k282M649J246l823J816J054m429J209L167k955q12M446j123k224K160
3780I5j604l538M339K527m256P37K939j916j339K314l313j068O011j25m564J956
3796h05K431l043J28R32l224K247N737l527l978L597M36k336J472k5k441M193
3812A794L096n694j478L849q43j990K579j269p34N059n83o029R40L611k570Q59
$$ plain form
3828 597 2840 -143 101 4476 2072 -2374 783 2259 -564 2333 3625 -234 742 3800 -34 -1655
3844 -1655 1702 941 267 4382 3132 -1842 392 2960 -698 -164 1882 -61 962 4577 539 -3603
3860 -3603 735 1952 -901 374 1226 -1110 1880 3489 -2761 -3942 1580 1585 -737 962 -5 -1543
3876 -1543 2358 996 -4841 -2824 2800 411 -942 518 -1090 -1608 1860 -1731 -5974 -362 2771
3891 2771 -1474 -1485 -279 -2487 -1280 921 -3025 -3966 2017 1668 -2717 -1095 -1076 -3428 -767 503
3907 503 -3557 -1917 2398 -77 -3046 -489 -1700 -3431 836 838 -2970 -469 1757 -1845 -1608 -117
3923 -117 -2412 -2101 2993 1119 -2187 457 874 -1861 349 496 -3075 0 4824 1034 -2000 472
3939 472 -345 -860 2156 438 -2474 2616 4892 -850 -1306 1240 -438 493 2984 -333 -1038 4482
$$ packed form
3828E97K243k983K44M375k404m446L157J476k823K897J292l859R76L058l834j621
3844a655L357p61o74M115j250m974K234K568l658N34K046j943J023L615m038m142
3860c603M338J217k853J275Q52k336K990J609o250j181N522Nk322J699r67j538
3876a543L901j362n837K017N624k389j353J460j608n18L468l591m243N612L133
3891B771m245j1J206k208J207K201l946r41N983l49m385J622J9k352K661J270
3907E03m060J640M315k475k969K557j211j731M267Kl808K501K226l602K37J491
3923a17k295L11N094j874l306K644M17k735K210J47l571L075M824l790l034K472
3939D72q17n15L016j718k912N090K276n742m56K546j678R31K491l317p05N520
$$ plain form
3955 4482 3204 -2316 -352 1694 81 1975 2906 -891 282 4586 635 -2744 1504 1894 173
3970 173 2821 2171 -1556 1544 3341 -1689 -1647 2549 1366 335 3039 1044 -1959 1832 1821 -2463
3986 -2463 166 2931 -245 766 2512 -1167 -2503 1990 372 -1686 1671 1123 -1579 1094 1946
4001 1946 -3123 -2405 1136 -56 -490 1800 -1115 -2739 1586 567 -4112 -1959 1233 -528 289 553
4017 553 -3405 -2334 1885 -1221 -4978 -513 1261 -948 258 -1243 -4248 -1194 1752 -2532 -3436
4032 -3436 1343 427 -1634 26 -2060 -3858 614 959 -3269 -982 2607 -928 -1891 176 -2306 -2352
4048 -2352 2135 724 -2387 691 1678 -2529 -855 445 -2322 -615 2910 -176 -1448 1599 -112
4063 -112 -2209 1060 992 -2234 1146 3729 -156 -490 1391 -1136 -753 3240 603 -1899 2698 3689
$$ packed form
3955D482j278n520J964K046j613J894R31l797J173M304l951l379M248L90j721
3970A73K648o50l727L100J797n030M2M196j183j031K704j995l003L791j1m284
3986b463K629K765l176J011J746l679j336M493j618k058L357n48k702K673Q52
4001A946n069P18L541j192m34K290k915j624M325j019m679K153L192j761Q17K64
4017E53l958J071M219l106l757M465J774k209J206j501l005L054K946m284r04
4032c436M779r16k061J660k086j798M472L45m228K287L589l535r63K067k482m6
4048b352M487j411l111L078R87m207J674J300k767J707L525l086j272L047j711
4063a12k097L269o8l226L380K583l885l34J881k527L83L993k637k502M597R91
$$ plain form
4079 3689 -766 -163 471 -1347 1839 4488 -649 -1427 3851 2452 -1044 244 107 -411 4073 3636
4095 3636 -1925 -116 3998 726 -1348 821 690 1023 4588 1229 -3095 1098 2992 -1016 -1100 1652
4111 1652 -162 1370 3530 -857 -2886 1934 1539 -2034 184 1602 -820 731 1827 -3057 -2220
4126 -2220 1912 -500 -1734 1439 691 -2098 960 25 -3536 -1149 1718 -1515 -909 1532 -1706 -2989
4142 -2989 1089 -1228 -3615 -260 1058 -1331 452 428 -3870 -2175 1786 -1747 -3327 232 -276 -1284
4158 -1284 601 -1569 -5087 -183 2090 -2408 -2099 1090 -624 -1155 523 -3324 -3547 2335 1816 -2765
4174 -2765 -684 1398 -818 -383 91 -3077 -1421 3676 577 -2218 1127 1057 -1411 665 767 -2148
4190 -2148 1037 4024 -730 -1254 2071 -294 -1186 2093 1067 -926 2857 3085 -986 612 2004 -1010
$$ packed form
4079C689m455O03O34j818L186K649n137p78N278j399l496J288j37n18M484m37
4095C636n561J809M114l272k074K169j31L33L565l359m324M193J894m008q4K752
4111A652j814J532K160m387k029M820l95l573K218J418k422J551J096m884Q37
4126b220M132k412j234L173p48k789L058r35l561K387K867l233O06K441l238j283
4142b989M078k317k387L355J318k389J783k4m298J695L961l533j580L559n08j008
4158a284J885k170l518M904K273m498L09L189j714n31J678l847k23N882n19m581
4174b765K081K082k216M35M74l168J656N097l099k795L345p0k468K076J02k915
4190b148L185K987m754n24L325k365q92L279j026j993L783K28m071J598J392l014
$$ plain form
4206 -1010 -74 3723 864 -501 2754 1408 -1182 1693 1074 -1325 2400 4096 -545 -203 3171 934
4222 934 -386 1644 -385 -573 3924 3075 -1905 21 2578 -633 -26 1401 -729 611 4533 449
4238 449 -3413 364 1815 -956 386 684 -1432 1385 3016 -2445 -3557 1241 901 -1171 598 -231
4254 -231 -1800 1335 1167 -4122 -2073 1402 -1123 -1077 947 -1696 -2194 1226 -813 -4099 -584 911
4270 911 -2054 -540 713 -3208 -2469 959 -1934 -3349 734 -244 -2394 407 -354 -4053 -1326 1306
4286 1306 -1867 -1716 1041 -1215 -1091 1711 -1890 -3865 675 1645 -1925 -327 936 -1582 -39 1301
4302 1301 -2788 -2280 2915 1268 -1904 213 446 -801 1632 716 -3395 -256 4323 611 -1385 1211
4318 1211 27 -507 2521 292 -2460 2298 4130 -722 -706 1620 -139 392 3184 89 -995 3486
$$ packed form
4206a010R36L797k859j365L255j346k590K875o19k399L725J696m641L42L374k237
4222I34j320K030k029j88M497q49m980J926K557l211O07J427k130J340L922m084
4238D49l862L777J451k771J342K98k116K817J631n461j112M798l40k072J769q29
4254b31j569L135j68n289K049L475k525M6K024k643m98L420k039l286L515J495
4270I11k965J514J253l921P39L428k893j415M083r78k150K801p61l699K727K632
4286A306l173J51K757k256J24K802l601j975M540R70l570J598J263k518J543J340
4302A301m089N08N195j647l172K117K33j247K433r16m111L139M579l712j996K596
4318A211j184n34L028k229k752M758J832m852J6K326j759N31K792l095j084M481
$$ plain form
4334 3486 2670 -1090 484 1777 -1087 1467 3420 -209 14 3363 503 -1112 2158 862 -876
4349 -876 2585 2814 -1089 435 2421 -672 -144 2160 -345 -582 3240 1355 -1813 668 1332 -1467
4365 -1467 498 1471 -1858 504 3019 -1163 -2919 663 247 -1223 1164 131 -2453 1258 2116 -3007
4381 -3007 -2540 1053 -658 -973 986 -1466 -2502 1645 -67 -4488 -1356 1056 -895 -222 658 -3090
4397 -3090 -1923 1677 -1655 -3873 199 813 -1666 359 -275 -3307 -1113 1173 -2299 -2004 1156 -626
4413 -626 -1928 1094 -986 -3713 379 1167 -2225 -513 1607 -1757 -767 1527 -1431 -2571 1442 805
4429 805 -1251 794 812 -2004 647 1801 -1946 -1063 2569 621 -954 1772 -216 -1164 2354 1325
4445 1325 -2278 688 3189 -3 -143 1456 -802 161 3456 372 -1784 2231 3004 -614 387 1112
$$ packed form
4334C486q16l760J574J293k864K554J953l629K23L349k860j615L270j296j738
4349h76L461K29l903J524J986l093N28K304k505k37L822j885l168K481O64k799
4365a467J965R73l329K362K515m182j756L582m16j470K387j033k584L711Q58n123
4381c007M67L593j711l15J959k452j036M147j712m421L132K412j951O73Q80l748
4397c090J167L600l332k218M072O14k479K025o34l032K194K286l472K95L160j782
4413f26j302L022k080k727M092P88l392J712K120l364R90K294k958j140M013o37
4429H05k056K045J8k816K651J154l747Q83L632j948j575K726j988r48L518j029
4445A325l603K966K501l192j40J599k258R63L295l084k156M015P73l618J001P25
$$ plain form
4461 1112 -1001 1497 3528 -680 -909 3104 1717 -565 1511 581 -936 2786 3021 -1362 50 3074
4477 3074 204 -629 1478 -588 -610 3175 1067 -1933 626 1572 -1081 206 1552 -1390 -168 3016
4493 3016 -54 -2149 685 47 -1581 1095 645 -2498 129 1670 -1870 -2273 591 -793 -991 1322
4509 1322 -1076 -2968 907 993 -3332 -1492 217 -1599 -255 1536 -2516 -2573 1339 -375 -3236 -772
4525 -772 98 -1726 296 368 -3360 -1540 1941 -1305 -2434 516 -375 -1217 929 -936 -3816 304
4541 304 1773 -1886 -1239 924 -936 -789 1461 -1771 -2725 1827 1074 -1945 178 1149 -1610 -33
4557 -33 1480 -1831 -1227 2646 883 -1094 1350 447 -1548 1637 1519 -2047 327 2831 153 -73
4573 -73 1848 -614 -510 2915 1023 -1417 1797 2297 -376 1354 1711 -1220 547 3374 428 -1137
$$ packed form
4461A112k113K498K031m208k29M013j387k282K076r30j517L722K35m383J412L024
4477C074k870q33K107k066k2L785k108l000K559R46k653J287J346k942J222L184
4493C016l070k095K834o38j628K676m50l143K627J541l540m03K864j384j98K313
4509A322k398j892L875Q6m325J840J709j816J344J791m052n7L912j714k861K464
4525g72Q70j824K022P2l728J820L481l246j129K950q91q42K146j865k880M120
4541C04J469l659O47K163j860J47K250l232r54M552p53l019K123R71k759J577
4557c3J513l311O04L873j763j977K444r03j995L185j18l566K374K504k678k26
4573g3J921k462J04L425j892k440L214N00k673J730L57k931J767K827k946j565
$$ plain form
4589 -1137 2285 1430 -717 1541 766 -1247 1795 3358 -896 -390 2431 623 -163 1432 -577 -1186
4605 -1186 2640 2101 -1517 264 2025 -767 -118 1268 -1129 -148 2641 52 -2274 798 650 -1198
4621 -1198 305 551 -2030 -52 2364 -1446 -2052 702 -536 -1451 1155 -314 -2499 735 1299 -2758
4637 -2758 -1644 388 -1355 -402 1190 -1860 -2415 1184 -252 -2636 -771 -60 -1987 231 857 -2480
4653 -2480 -1878 1530 -989 -2349 151 -610 -1488 1361 37 -3412 -884 1453 -1199 -1604 381 -1007
4669 -1007 -844 1837 -708 -2955 752 1518 -1480 -235 825 -1510 116 1665 -1702 -1938 2306 1005
4685 1005 -1170 806 736 -1116 1549 1571 -2178 -326 2885 358 -819 1715 154 -408 2442 1179
4701 1179 -1891 1159 2285 -137 832 1907 -847 379 3266 304 -1042 1573 1718 -350 1346
$$ packed form
4589a137L422q55k147K258p75k013L042J563m254N06K821j808p86J595k009o09
4605a186L826n39l618J781J761k792O49J386k397R81K789k589k326L072j48j848
4621a198J503K46k581J978K416l810o06K754j238r15K606j469k185L234N64m057
4637b758J114K032j743R53J592l050n55L599j436k384J865P11j927K218O26l337
4653b480O02L408k519j360K500p61q78K849j324l449K528K337k652m05J985j388
4669a007J63K681k545k247L707P66k998J245J060k335J626J549l367k36M244j301
4685A005k175J976p0j852K665K2l749J852L211k527j177K534j561n62K850j263
4701A179l070L050J126k422R69J075k754J226K887k962j346K615J45k068J696
$$ plain form
4716 1346 1046 -1400 1358 3009 -437 -455 2328 577 -189 1919 281 -1623 1993 2153 -1234 -162
4732 -162 1902 -362 247 1484 -1073 -903 2356 449 -1964 213 758 -1151 696 921 -2315 -268
4748 -268 2309 -739 -2156 470 69 -1138 916 -167 -2869 381 1915 -1961 -1999 583 -1045 -871
4764 -871 1180 -1430 -2264 1194 615 -2438 -689 306 -1764 -147 1041 -2474 -2048 1623 -709 -2561
4780 -2561 301 -209 -1615 670 230 -2894 -849 1633 -1308 -1427 851 -662 -1259 1246 -250 -2712
4796 -2712 235 1393 -1345 -321 674 -1765 -412 2248 -785 -2125 1219 831 -941 823 170 -1418
4812 -1418 813 2109 -1832 -941 2157 88 -655 1398 -51 -948 2217 1500 -1486 428 2189 -98
4828 -98 652 1765 -500 15 2897 800 -1569 1491 1932 -346 1262 1573 -1046 925 3001 -335
$$ packed form
4716A346l00k446K758J651l446j8K783j751p66K108j638j904L616J60l387J072
4732a62K064k264O09J237k557J70L259j907k413K177N45j909J847K25l236K047
4748b68K577l048j417K626m01j207K054j083k702L250J534l876l8K582j628J74
4764h71K051k610q34L458n79l053J749R95k070J617J188l515M26L671k332j852
4780b561K862n10j406K285m40l124K045K482k941j19K278j513n97K505j496k462
4796b712K947J158k738J024R95k439J353K660l033j340L344l88j772J764o53j588
4812a418K231J296l941Q91L098k069p43K053j449q97L165p17k986J914J761k287
4828i8P50J113k265N15K882k097k369L060M41k278J608L11k619J971K076l336
$$ plain form
4844 -335 -673 1985 567 -475 1730 792 -1130 1610 2148 -1160 -333 1850 -134 -117 1605 -616 -1165
4861 -1165 1965 1128 -1491 526 897 -784 438 1579 -1698 -847 1935 -454 -1493 757 41 -1148
4877 -1148 1001 -11 -2241 -104 1590 -1375 -1491 512 -1070 -1097 1074 -810 -2472 436 679 -2262
4893 -2262 -912 97 -1469 -371 790 -2086 -2056 1191 102 -2122 -331 -464 -1900 337 569 -2809
4909 -2809 -1307 1329 -1007 -1797 216 -1039 -1683 1142 -283 -2510 59 938 -1275 -785 778 -1593
4925 -1593 -1024 1809 -791 -2060 1192 984 -1069 479 680 -1518 566 1893 -828 -945 1485 280
4941 280 -420 1413 62 -1391 1736 2152 -1534 130 1959 121 560 1969 -391 -105 2646 1153
4957 1153 -1094 1598 1766 152 1386 1377 -708 717 2912 83 -810 1568 1147 115 1798 710
$$ packed form
4844c35l38K658j418j042K205r38j922K740N38l308Q27K183j984J7J722k221n49
4861a165L130q37k619K017L71j681J222J141l277Q51K782k389j039K250p16j189
4877a148K149j012k230K137J694k965j16K003j582k7K171j884j662K908K43k941
4893b262J350J009j566J098J161k876L0L247j089k224J791j33j436K237K32l378
4909b809J502K636k336p90K013j255o44K825j425k227K569Q79k213M90J563k371
4925a593N69K833k600j269L252k08k053J548K01k198K084J327k721j17K430j205
4941B80p00J833j351j453L127M16l686J664J829j838M39J409k360K86K751j493
4957A153k247K692J68j614J234rk085J425K195k829q93K378m21j032J683j088
$$ plain form
4973 710 -1242 1444 2529 -1044 -730 1370 413 288 1929 -29 -1560 1794 1328 -1274 136 1242
4989 1242 -592 760 1244 -1378 -1026 1808 279 -1506 733 331 -1194 869 529 -2177 -856 1251
5005 1251 -1135 -1339 595 -1118 -1437 688 -612 -2790 -310 861 -1705 -873 47 -1747 -1017 1106
5021 1106 -1860 -2377 642 -54 -1745 -151 -344 -2128 -239 414 -2604 -1772 1218 -304 -1652 -116
5037 -116 -977 -1276 1040 44 -2600 -362 1284 -806 -1241 465 -1043 -755 1646 -451 -1897 805
5053 805 1306 -1188 -224 610 -1300 266 2249 -853 -1228 1698 600 -697 1182 461 -1057 1642
5069 1642 2313 -678 217 2014 237 241 1735 -103 -637 2583 1627 -886 873 1851 -77 1255 1809
5086 1809 -357 229 2680 699 -924 1082 1393 -207 1808 1450 -967 1165 2524 -426 -735 1654
$$ packed form
4973G10j952K686J085l573L14K100r57j25J641j958j531L354m66k602J410J106
4989A242j834J352M84k622L52K834j529j785K239m02j525K063l40k706J321K107
5005A251k386k04J934j713l19K125j300k178K480J171k566Q32R20j794P30K123
5021A106k966n17L019o96j691J594j93j784J889O53l018Q32K990j522j348J536
5037a16q61k99K316r96k644K238J646k090m35J706j508K88K401k097j446K702
5053H05N01k494R64Q34j910J566J983l102l75K926j098j297J879p21j518K699
5069A642O71k991Q95J797j777MJ494j838n34L220r56k513J759R78j928J332N54
5086A809k166N86K451j981j623K006L11j600K015l58k417K132J359k950l09K389
$$ plain form
5102 1654 116 139 1869 555 -1356 1128 1483 -1466 -94 1207 -433 405 1450 -1081 -1140 1527
5118 1527 5 -1780 -77 353 -956 619 423 -2154 -947 1368 -944 -1543 414 -580 -1479 562
5134 562 -489 -2417 166 589 -1557 -1184 519 -1755 -1395 708 -1483 -2542 -4 152 -1852 -324
5150 -324 -218 -2069 -265 726 -1723 -1752 519 -145 -1274 715 -591 -2148 533 700 -2040 -927 1383
5167 1383 -659 -437 628 -1158 -1436 1764 526 -1886 523 1121 -881 200 627 -1368 184 2353
5183 2353 -139 -1200 1539 896 -526 806 428 -1094 1534 2516 -874 -361 1896 383 -292 1494
5199 1494 115 -342 2161 1739 -943 510 1625 -165 663 1625 -693 39 2788 949 -853 1084
5215 1084 1100 -530 1599 1570 -1139 518 2400 -242 -630 951 -12 -267 1928 501 -1350 956 1499
$$ packed form
5102A654j538K3J730j314j911K484L55k949J372J301j640Q38J045k531n9K667
5118A527j522j785J703M30j309J575j96k577J207K315k312n99J957r94q99K041
5134E62j051j928K583M23k146L73J703k274L60K103k191j059K538J56k004J528
5150c24J06j851J804R91k449k9K271o64j129J989j306j557K681J67k740J113K310
5167A383k042K22J065j786k78L200j238k412K409N98k002J081M27j995J552K169
5183B353k492j061K739o43j422J332l78j522K628R82l390N13K257j513o75J786
5199A494j379m57K503m22k682J453J115j790Q28R62k318P32K749j839j802J937
5215A084J6j630K129k9k709J657J882k642l88J581r63k55K195j427j851K306N43
$$ plain form
5232 1499 -788 -625 963 -647 444 1925 -849 -1890 1065 289 -1428 -30 144 -957 573 967
5248 967 -2232 -1142 1065 -110 -1768 173 -225 -1062 875 -468 -2802 -509 1040 -785 -874 299
5264 299 -883 -1089 745 -1146 -2390 199 648 -1768 -611 342 -1434 -420 645 -1929 -1725 1018
5280 1018 21 -1437 142 -259 -1908 -114 625 -1782 -668 1274 -447 -636 925 -1028 -1582 1219
5296 1219 803 -1462 348 1051 -753 340 837 -1560 -635 2116 314 -1040 1115 734 -912 1124
5312 1124 295 -1645 721 2300 -419 -616 1150 35 -70 1562 87 -864 1908 1982 -470 191 1501
5329 1501 -120 308 1646 -511 -364 2246 823 -772 790 1291 -624 830 1358 -554 596 2325
5345 2325 -19 -908 1450 381 -651 1486 768 -974 834 1455 -1136 -216 1472 -381 -333 1668
$$ packed form
5232A499k287J63J588j610J091J481k774j041K955p76j717J398J74j101J530L94
5248I67l199J090K207j175j658J941l98q37J937j343k334K293J549j825q9J173
5264B99j182k06J834j891j244K589M49k416J157R53j776J014J065k574K04K743
5280A018r97j458J579m01j649J794P39k407J114J942j721j89J561j953n54K801
5296A219m16k265J810P03j804J093M97k397R25K751j802j354K155l81j646K036
5312A124q29j940K366J579k719j97J766j115j05J632j475r51K772P4k452O61J310
5329A501j621M28J338k157J47K610j423j595J562N01j915J454N28j912J150J729
5345B325k344q89K358j069j032K137p18j742J808O21k591R20J688j853M8K001
$$ plain form
5361 1668 -6 -1261 880 424 -1104 373 839 -1147 588 1643 -1013 -1523 704 -57 -1013 768
5377 768 -419 -1550 1108 675 -2058 -1292 797 -411 -493 601 -1314 -1308 1215 -261 -2879 -638 922
5394 922 -969 -364 196 -1665 -761 1235 -1423 -2348 411 157 -1302 268 -355 -2191 17 774 -2070
5411 -2070 -1055 1356 -625 -1282 579 -809 -1432 714 242 -1990 21 1142 -1096 -380 770 -1251
5427 -1251 -1129 1282 70 -1334 972 759 -682 539 809 -1488 86 2185 -232 -592 1330 -128
5443 -128 -393 1350 316 -1327 1101 2201 -468 -127 1258 -382 857 2220 -524 -741 2374 1921
5459 1921 -465 468 662 -425 1386 1543 -1026 -70 2720 900 -1102 978 639 -58 1795 1032 -1306
5476 -1306 923 2583 -781 -792 1301 -63 56 1707 38 -956 1283 1078 -1417 -118 1202 -286
$$ packed form
5361A668j674j255K141m56j528J477M66j986J735J055k656n10K227p61r56J781
5377G68j187j131K658m33k733P66K089j208q2J094j915OK523j476k618K241J560
5394I22j891O05N60j861R04J996k658r25K759k54j459J570o23j836K208P57k844
5411b070J015K411j981o57J861j388o23K146m72k232K011J121k238P16J150k021
5427a251J22K411j212j404K306k13j441J221K70k297J574K099k417l60J922j458
5443a28k65J743j034j643K428J100k669L41J385j640J239J363k744k17L115m53
5459A921k386R33J94j087J811J57k569R56K790j820k002K080l39o97J853p63k338
5476a306K229J660l364j1K093j364J19J651j669r94K239k05k495J299J320j488
$$ plain form
5492 -286 218 1230 -946 -928 1163 -164 -1605 471 432 -1010 352 528 -1696 -715 717 -1097 -1217
5509 -1217 596 -613 -1098 367 -244 -2294 -551 431 -1371 -439 400 -1675 -1022 923 -1065 -2563
5525 -2563 -284 14 -1244 50 -265 -2271 -392 825 -1920 -1999 639 -261 -818 585 -980 -2052
5541 -2052 659 664 -1833 -663 808 -390 -254 471 -1014 -1023 1636 228 -1472 1030 1089 -858 349
5558 349 849 -1200 -23 1748 -318 -703 2046 599 -1119 928 992 -822 874 1608 -537 557
5574 557 1740 -213 -416 1854 618 -523 1835 1493 -227 1027 1216 -882 1127 2292 -359 -513
5590 -513 2061 1074 -117 1149 281 -869 1846 1510 -846 123 2047 328 -428 676 -569 -230 2189
5607 2189 693 -1844 386 1293 -788 -207 125 -1233 438 1717 -900 -1748 547 340 -1524 -84
$$ packed form
5492b86N04J012k176J8K091j327j441K076l9j442J362J76k224R81J432j814j20
5509a217J813j209m85J465o11k050J743R82j802R32Q39k075O53J945j988j498
5525b563K279K98j258J294l15k006J879J217k745p9K638r00n57J403j565j072
5541b052K711Nk497J170J471j198J36P25j485rK659j408j700K502N9j947J207
5558C49N00k049J177J771k066l85K749j447j718K047O4j814J696P34k145J094
5574E57J183j953k03K270j236j141K358l42j720J254J89k098K009J165k651j54
5590e13K574r87j191J266q68j150K715l36k356R69J924j719p56J104j245L39K419
5607B189j496k537K230R07k081N81L32j358J671J279k617q48K295k07j864J440
$$ plain form
5623 -84 148 -1395 637 595 -1836 -1270 862 -806 -1472 387 -617 -1736 523 -121 -2639 -723 410
5640 410 -1706 -731 609 -1096 -1341 489 -928 -2177 -60 -281 -1985 28 525 -2001 -788 563
5656 563 -1192 -1624 186 27 -1019 901 -638 -2282 244 1019 -1302 -883 776 -565 189 1020 -1187
5673 -1187 -1816 1494 1009 -1175 86 966 -345 462 548 -1454 -469 2224 361 -1117 935 1013 -233
5690 -233 1355 458 -1584 864 2509 87 -174 1549 732 -219 1285 -35 -596 1872 1739 -700 404
5707 404 1539 -116 239 1345 -387 37 2380 510 -836 1276 836 -759 759 1251 -184 447
5723 447 1800 -395 -543 1203 -453 -1334 1434 902 -653 172 834 -881 -289 890 -907 -439 1871
5740 1871 -57 -1566 148 244 -1110 48 145 -1468 333 1363 -1105 -1564 724 -464 -1151 506
$$ packed form
5623h4K32j543K032m2k431N66K132j668o66J859j004j119K259o44k518J916J133
5640D10k116R75J340j705k45J830j417j249K117k21j704K013M97k526J213J351
5656E63j755m32J810j59j046J920j539j644K526P75k321M19J659j341P54Q31k207
5673a187o29L310m85k184J261Q80j311Q07Q6k002R85K693j863j478K052P8j246
5690b33J588q97k042K448J645k422k61J723q17r51J504j320n61K468j33k439J104
5707D04J135j655L55J106j732M24K343j870j346K112m40j595J518M92j435O31
5723D47J353k195j48J746j656q81K768n32j555Q25O62j715N92J179j797M68K310
5740A871j928j509J714R6j354J158R7j613J801J030k468m59K288j188o87J657
$$ plain form
5756 506 -339 -1398 701 473 -2512 -1307 732 -1126 -910 586 -1188 -1142 958 -577 -2219 -334
5772 -334 646 -1382 -170 123 -1481 -838 306 -1743 -1696 693 -54 -948 590 493 -1744 -206 482 -1343
5790 -1343 -353 1174 -985 -998 1372 227 -1550 547 523 -652 531 641 -941 85 1381 -799
5806 -799 -1114 1172 166 -290 939 -19 -588 1098 1275 -1321 -457 1717 346 -146 975 -274 -161
5823 -161 1800 377 -1653 974 2060 -40 89 928 -321 675 1847 -287 -1148 1763 1511 -432
5839 -432 470 742 -586 1126 1361 -881 73 2264 284 -753 857 31 -497 1294 1160 -1039 446
5856 446 1612 -909 -197 1183 -348 -558 1635 344 -1025 847 639 -1400 310 854 -1227 -63
5872 -63 1402 -436 -1082 273 -663 -1269 925 -128 -1562 395 878 -1501 -986 372 -1023 -531 612
$$ packed form
5756E06q45j059K099k28k985J205K039j858K16J496j774M6K100j535j642J885
5772c34R80k028J212K93j604O43J144k049M7K389p47q94J538r7k237J538O88j825
5790a343R90J527k159j3K370j145j777K097k4j175J183J10j582J026J296k180
5806g99l15K286j006m56J229r58n69J686J77k596Q64K174j371m92J121j249J13
5823a61J961j423k030K627J086k100J29Q39j249R96J172k134q61K911k52j943
5839d32R02K72j328J712K35k242R54K191j980j037J610q26n28J791j34k199J485
5856D46J166k521P12J380j531k10K193j291j369J872k08k039J710N44k081J164
5872f3J465j838o46J355r36o06K194j053j434J957M83k379N15J358j395M92J143
$$ plain form
5889 612 -907 -1705 1106 350 -2279 -920 612 -1007 -119 196 -1876 -458 1397 -757 -2213 71
5905 71 93 -1000 160 -207 -1999 169 867 -1666 -1549 967 -264 -566 293 -665 -1640 538 318 -1667
5923 -1667 -385 1154 -514 -558 725 -777 -838 1238 -97 -1146 1037 939 -906 262 1275 -967
5939 -967 -290 1515 -93 346 1644 -61 -933 1068 917 -647 890 1567 -167 824 1586 -663 -171
5956 -171 1769 388 -671 1336 1083 145 1087 700 -827 878 1951 -415 -418 1579 892 -285 1130
5973 1130 135 -504 1629 1225 -873 -187 1615 -286 -187 562 -692 -160 1761 722 -1205 885 703
5990 703 -1574 63 707 -785 -265 1234 -675 -1143 664 -417 -1587 348 706 -1612 -347 734
6006 734 -1178 -755 534 -1383 -1046 1098 -512 -2018 184 429 -1684 -720 -275 -1650 -482 1001
$$ packed form
5889F12j519p98K811p56k629J359J532j619Q88L15k072J418J855k154j456K284
5905G1K2j093J160l67j792K168O98k533J17K516j231l02Q59r58r75K178k20j985
5923a667J282J539j668m4J283j502o1K076j335j049K183r8j845J168J013k242
5939i67O77J805j608M39J298j705q72K001j51j564J537O77j734R91P62k249M92
5956a71J940j381j059K007k53r38R42l87j527J705J073k366lJ997o87j177J415
5973A130r95o39K133m04k098O86J802j901R9P49j254N32J921j039j927K090j82
5990G03k277J637O44j492N20J499j909m68J807j081j170J935L58k318J265J081
6006G34j912M23J289j917L37K144j610j506K202K45k113R64M45j375J168J483
$$ plain form
6022 1001 -1383 -1550 906 -153 -1873 -330 -660 -1537 532 606 -2281 -780 768 -827 -1411 115
6038 115 -839 -23 1173 -529 -2077 -197 1268 -1149 -775 755 -543 266 1055 -1144 -1512 997 967
6055 967 -932 249 837 -576 778 1123 -1084 -250 1713 358 -813 865 645 -450 1332 820
6071 820 -882 582 1834 -192 47 1539 -183 -202 1562 424 -676 1186 1051 -335 791 1186
6087 1186 -690 447 1818 190 -329 1651 534 -160 1171 421 -1054 784 1630 -808 -342 1352
6103 1352 144 -129 714 -883 -702 1549 829 -1205 -107 1197 -423 -240 426 -1441 -336 1910
6119 1910 -435 -1592 305 624 -1045 43 -135 -1261 141 963 -1327 -1370 627 -375 -1320 82
6135 82 -569 -1233 236 19 -2070 -671 628 -1422 -913 515 -1070 -1182 328 -487 -1389 188 220 -1484
$$ packed form
6022A001k384j67K456j059j720J543l30q77K069P4k887J501J548j595n84J526
6038A15r54Q16J196j702j548J880J465k417L74J530j298Q09P89k199l68K509l0
6055I67j899J181N88j413J354L45k207Q34J963j355j171J678k20j095J782n12
6071H20j702J464J252k026K39J492j722j9J764j138j100J862j35j386J126L95
6087A186j876J137J371j628n19J980j117o94J331p50j475J838Q46k438M66J694
6103A352j208k73Q43j597J81K251p20k034J098J304j620J83O66j867J105K246
6119A910k345j157J897L19j669J088j78j126J402Q22k290m3J997j002r45J402
6135H2o51o64J469k17k089J399J299k050N09J428j585j12J510q15r02J577L2j704
$$ plain form
6153 -1484 -220 697 -1092 -780 600 -987 -1009 507 -212 -948 727 614 -1267 -421 575 -948 -137
6170 -137 1160 -587 -645 1380 116 -1220 485 649 -142 350 606 -678 616 1685 -913 -836 1182
6187 1182 569 -478 1130 422 -232 1119 1072 -963 219 1819 -22 202 1266 -44 -76 1683 616
6204 616 -1002 1126 1331 -280 426 1216 -624 150 1477 107 -185 1356 446 -685 1078 885 -978
6221 -978 158 1523 -431 149 866 -163 -394 1297 66 -1161 615 1081 -876 -19 629 -638 -4
6238 -4 950 -938 -1118 1285 335 -1306 6 -229 -988 148 238 -1650 -394 1430 -354 -1077 151 -629
6256 -629 -981 789 -314 -1790 382 750 -1334 -864 -68 -651 -337 250 -1074 -1262 744 60 -1617
6273 -1617 -606 144 -1266 -136 416 -1332 -844 878 -429 -1698 117 -94 -760 527 249 -1182
$$ packed form
6153a484J264R17j789L12J380j587k2J516p19p36J675j13j881Q46R96j523Q11
6170a37J297j747n8K025j264j336J705J64p91M92K56j284J294J069k598P7K018
6187A182o13j047J608p08o54J351m7k035J182J600j841K24J064j310l2J759j067
6204F16j618K128K05j611P06P90j840P74J327j370k92J541r10j131J763j93j863
6221i78J136J365j954N80P17j029k31J691j231j227J776M66j957Q57O48j267O34
6238dR54j888j80K403r50j641J312k35p59J136R0j888J256J824j784p23J228p80
6256f29l52J770j103j476K172L68k084M70P96n83L14N87j324j88K006o84j677
6273a617J011P50j410J130N52j748M88J722j307j269J815k11o66J287k78j431
$$ plain form
6289 -1182 253 692 -686 -840 598 -472 -754 994 -363 -1402 283 739 -804 143 497 -640
6305 -640 122 1191 -622 -727 876 517 -478 683 540 -467 775 1212 -852 -113 1406 235 71
6322 71 1340 57 -339 1356 753 -990 477 1320 72 421 1135 -39 314 1700 111 -531 1072
6339 1072 1033 -159 478 713 -284 391 1555 -595 -5 1560 583 -333 859 545 -655 1021 917 -832
6357 -832 260 1322 -612 -169 856 -366 -655 898 87 -948 416 404 -1132 -47 639 -1078 -561
6374 -561 948 -457 -856 601 -684 -1387 739 246 -1180 -168 655 -738 -365 138 -1127 -645 517
6391 517 -149 -1645 -33 226 -1303 -265 49 -1549 -253 535 -1128 -1086 619 -252 -1391 -237 -213
6408 -213 -1102 169 526 -1107 -492 329 -1064 -752 547 -399 -992 1007 74 -1357 345 810 -1060
$$ packed form
6289a182J435M39j378j54J438j070k82J748j357j039J685M56j543R47L54j137
6305f40P62J069j813j05J603l59r95J161j43j007J242M37k064P39J519j171j64
6322G1J269j283l96J695o03j743J467Q43j248L49P14j174L53J386j589o42J603
6339A072l9j192O37K35r97O75J164k150N90J565r77r16J192l14j200J676j04j749
6357h32J092J062j934M43J025j222k89J553q11j035J364j2j536J085O86j717N17
6374e61J509j405l99J457j285p03K126m93j426J012Q23j393L73N03j265M82J162
6391E17o66j496J612K59j529J038L14j598J296P88j663M2J705q71j139J154K4
6408b13q89J271L57j633O15Q21j393L12J299r46n93J999r33j431J702M65j870
$$ plain form
6425 -1060 -55 716 -622 -104 1135 -511 -922 836 430 -587 657 463 -759 519 1311 -784
6441 -784 -322 1355 -51 13 1433 209 -830 1223 1247 -620 421 1375 -142 335 1340 -332 -502
6458 -502 1907 581 -415 803 894 9 1090 1124 -783 -26 1789 67 -488 1268 388 -237 832 371
6476 371 -1118 829 1337 -571 -234 938 -68 -164 750 -500 -611 1247 524 -945 8 823 -510
6493 -510 -323 529 -1145 -457 1143 -157 -1313 45 93 -886 297 320 -1437 -85 832 -828 -1041 39
6511 39 -535 -723 565 -413 -1759 169 316 -1382 -686 12 -1264 -655 618 -1288 -1276 471 -197 -1326
6529 -1326 -122 -211 -1147 279 527 -1229 -843 603 -582 -943 113 -483 -956 710 278 -1274 -266
6546 -266 604 -822 -597 608 -356 -442 862 -476 -806 731 597 -724 447 966 -292 383 1190 -284
$$ packed form
6425a060J005P71j338N18J239j646m11J758m06j017J244j94j222J278P92k095
6441g84M62J677j406O4J420j224j039K053K4j867J041R54j517M77J005j672j70
6458e02K409j326r96J218R1q85J081L4j907P57J815j722n55J756q80o25J069m61
6476C71j489J947N08j908L37J172j006r6R14j250j11J858p23j469R53Q15j333
6493e10J87Q52j674O88J600j300j156J358M8r79J183K3j757J352R17j660k13J080
6511C9n74j88J288r78j346J928J47j698O96O98j276O09J273j906J2J747o68j129
6529a326J204q9r36J426K48j756L86J446j185l61J056n96m73J666m32j552J008
6546b66Q70j426K25J205r64q6J304j338l30J537j34j321J171N19j258O75Q07j474
$$ plain form
6564 -284 -620 1341 309 -516 1099 550 -412 1238 977 -603 303 1708 185 84 1284 -116 -113 1397
6582 1397 581 -554 917 1132 -555 731 1139 -442 -25 1032 28 -337 1194 195 -469 936 789
6599 789 -769 619 1007 -36 154 860 -132 -426 1297 8 -1014 604 812 -843 59 463 -775
6616 -775 49 878 -873 -903 559 -16 -923 7 -388 -1099 396 399 -1105 -752 612 -766 -816 333 -741
6635 -741 -1010 342 46 -1546 -119 -44 -992 -288 94 -1113 -876 713 -515 -1610 89 -125 -1185
6652 -1185 -310 179 -1180 -107 692 -1183 -722 721 -71 -632 648 -116 -1110 916 606 -989 -260
6669 -260 532 -446 -199 719 -513 -455 1220 225 -1025 380 569 -475 791 763 -952 201 1136 -180
6687 -180 -864 597 429 -170 801 296 -617 626 1387 -523 -270 935 193 350 1102 86 -143 1366
$$ packed form
6564b84l36J961j032q25J615n49r62J650k61j580R06J405j523j01J200j400LJ510
6582A397q16j135J471K15j687J286M08j581M17J057j004l65J531r99o64J405j47
6599G89j558J388L88j043J90P06r92k94J723j289j022J618K08j655R02M04j238
6616g75Q24Q29j751l0J462n75r07R30l95p11J495Lj504L53J364j378n0J149j074
6635g41k69J352k96j592J427P5r48P04L82j207K37J589j228j095J699k14j060
6652a185Q75M89j359J073P99j875M61J443p92n61J280p64r94K026l10j595P29
6669b60P92r78K47R18j232N8J675r95j250J405J89j044J266k8j715J153R35j316
6687a80o84J461j68n99R71n05r13J243P61j910K53J205p42J57P52j016k29J509
$$ plain form
6705 1366 1082 -599 420 1028 -125 516 1011 -307 101 1284 361 -262 892 515 -478 553 552 -550
6723 -550 540 1605 -594 -446 821 295 -371 993 137 -1069 629 646 -798 -277 422 -530 -233 949
6741 949 -606 -752 858 -298 -964 130 255 -1008 32 447 -1195 -593 594 -552 -981 170 -662
6758 -662 -978 408 -260 -1193 -40 250 -1028 -734 58 -736 -785 579 -460 -1314 466 -99 -1459 -79
6776 -79 523 -1274 -360 561 -1132 -831 521 -171 -815 337 -127 -918 71 279 -1012 -186 853 -806
6794 -806 -128 798 -245 -559 631 172 -881 599 707 -738 65 965 -641 -160 1042 109 -395 871
6812 871 404 -491 682 567 -708 464 1552 -290 15 810 92 -118 1402 314 -436 970 1242
6829 1242 -329 467 710 -541 412 1137 -167 -255 1416 493 -335 716 579 -499 853 1048 -778
$$ packed form
6705A366k84j681J019O08j153O41M95j318M08J183r23o23J154l77r93J031jj102
6723e50J090J065k199J48J267n26o66J364q56j206J698J7j444N21O99r52K97J182
6741I49j555j46J610j156o66J094J25j263J040M15j642O02J187j146m29J151q32
6758f62l16J386o68r33J153K90j278K94P92p94m9J364j039q54J780n65j360J380
6776g9O02j797R14R21j693L01J352o92o44J152m64p91R89K08j291Q26J039j659
6794h06O78R26j043l14J190m59j053J480J08j445Q03R00j606M81J202r33n04J266
6812H71m67q95J173j15j275J172J088j842L05P95p18k10J520j088p50J406K72
6829A242j571P96K43j251R53P25j304q8J671r23q28J051j37j078J352J95j826
$$ plain form
6846 -778 229 1061 138 -530 1020 -234 -690 1009 388 -712 350 928 -561 -148 605 -492 -271
6863 -271 1005 -269 -762 611 324 -927 -261 396 -987 -38 636 -939 -633 647 -71 -942 355
6880 355 -572 -838 446 327 -1259 -538 282 -817 -645 306 -839 -916 766 -453 -1480 67 221 -1122
6898 -1122 -144 287 -960 -586 342 -589 -1209 327 -123 -902 31 -228 -1037 195 934 -1132 -475 414
6916 414 -249 -161 447 -386 -717 795 150 -1245 155 766 -431 -170 467 -223 -156 1226 89 -945
6934 -945 1017 550 -547 590 814 -513 399 1108 -318 -300 1222 135 -282 1134 76 -267 1037
6951 1037 914 -456 297 1035 -125 280 1336 -287 -89 1425 531 -448 844 769 -219 598 1225 -296
6969 -296 183 1348 87 -283 980 123 -412 952 515 -822 498 924 -345 -134 1123 -299 -342
$$ packed form
6846g78J007Q32r23o68J550j254m56J699o21j100J062N78j489M13P53j097K21
6863b71J276j274m93J373k87j251O66O57j383R49O74j575L06J280p18q71J297
6880C55r27k66J284j19j586P21Q20j099J72R51j145p7J682j219j027J547J54j343
6898a122R78M31j247L74R28r31o20J536m50p79R33k59q09J232P39k066O57Q89
6916D14o63Q8O08q33l31J512o45j395J400O11j197K61O37o90O7J382j137j034
6934i45J962m67j097J137K24j327R12P09j426J8J522j087m17J416j058l43J304
6951A037j23j370P53P38j160M05J056j623J98J514q94r79J292p5r88Q17O27j521
6969b96M79J165j261l70J263q57n35J364m37j337J320M26j269K11J257j422m3
$$ plain form
6986 -342 674 -137 -849 489 245 -913 23 202 -950 -17 292 -844 -827 456 -200 -1178 11 -225
7004 -225 -1141 29 485 -1367 -53 390 -816 -703 471 -612 -1012 466 -361 -1440 -165 157 -1088
7021 -1088 -36 554 -985 -722 418 -306 -1071 202 -292 -1090 606 -1 -1297 -516 237 -802 -487
7038 -487 437 -239 -748 675 -117 -924 815 516 -1320 -31 508 -449 -99 834 -756 -192 1153 -275
7056 -275 -812 627 589 -426 493 829 -733 403 1499 -195 -262 848 234 -630 937 496 -758 633
7074 633 1038 -161 184 1287 -183 -219 1498 38 -588 1299 537 -324 726 510 -386 408 1444 -525
7092 -525 -194 1147 286 -170 988 -29 -721 671 714 -708 -57 1244 -463 -114 652 -382 -422 1052
7110 1052 7 -1345 453 453 -702 165 340 -797 -24 1123 -936 -840 302 145 -798 61 -289 -774
$$ packed form
6986c42J016q11p12J338k44j158R36J79j152R33L09j136J7J283o56r78J189k36
7004b25r16J170M56j852J314M43j206J13J174j083m00J478q27j079J275L22j245
7021a088J052N90j539K63J140p24p65J273m94p98J696o07j296P81P53j039L15
7038d87R24o76n09J423p92q07J739k99j836J289N39r57L50R33j590N64J345j428
7056b75n37J439l8j015R19L36j562J136J096j694o7J110o14q64J567m41j254J391
7074F33M05j199L45J103j470l6J717j460o26J887p62q61J050k16q96P94J036j969
7092e25L31J341q61m56J158j017o92J392M3j422O51J301j707L49P66j034m0J474
7110A052j045j352J798%j155Q67J75j137P73J147k059R6J142j57r43Q59l50m85
$$ plain form
7128 -774 349 498 -1211 -535 684 -648 -1056 132 -295 -957 683 -6 -1692 -323 495 -1008 -382
7145 -382 265 -977 -552 755 -928 -1222 370 -199 -1237 91 72 -797 -78 405 -696 -855 734 -358
7163 -358 -985 433 -232 -828 471 248 -1013 -10 639 -482 -99 940 -219 -728 901 133 -597
7180 -597 652 674 -711 184 939 -576 52 1401 421 -171 979 539 -395 897 536 -566 566 1207
7198 1207 -51 -220 925 -80 10 1169 1 -647 715 964 -320 758 753 -282 32 1005 -293
7215 -293 -149 1163 271 -323 1043 383 -693 387 863 -461 284 785 -497 -252 921 -132 -786
7232 -786 564 327 -590 449 641 -1047 -12 472 -743 -343 734 -283 -1063 488 -136 -703 300
7249 300 162 -1183 -112 526 -792 -741 388 -431 -806 675 -627 -1037 473 253 -1093 -531 401 -770
$$ packed form
7128g74J123J49j709O76J219j332m08J188m27o62J640o89j686J369Q18j503O26
7145c82O47j242M25J307j683k94J592n69j038J328j9q69P19M83j101j59J589j092
7163c58o27J418o65n96J299k23j261J003O49j121L83J039j159n09J629p68p30
7180e97J249K2j385Q95P55j515O28J349r80n92J150m40r34J292l61j102J132O41
7198A207j258j69J145j005R0J159j168o48J362K49j284J078nj035L14R73j298
7215b93J44J312q92n94J366o60j076J080M76j324P45N01j282K45J173j053o54
7232g86J350k37r17J039J92j688J035M84j215M00J077j017p80J551o24n67J003
7249C00j38j345J071O38j318N1J129q19l75J481j302m10J510k20j346N62R32j171
$$ plain form
7267 -770 -423 272 -1134 -633 631 -39 -1167 86 -123 -865 -183 -101 -1193 -220 1055 -746 -941 640
7285 640 -390 -636 686 181 -890 225 696 -781 -350 311 -343 -108 823 -375 -925 651 549 -605
7303 -605 390 562 -343 229 920 -653 -285 875 -54 -376 870 545 -465 1121 684 -689 442 1157
7321 1157 -162 199 1058 91 -337 919 378 -748 946 1128 -459 367 940 -315 385 1519 -124
7338 -124 -328 1307 621 -697 517 210 -553 867 837 -897 -76 1422 324 -595 975 0 -630 773
7356 773 32 -933 541 811 -597 -80 531 -462 -541 402 -359 -1070 591 367 -1157 -202 321 -775 -159
7375 -159 711 -737 -326 676 -275 -940 298 -220 -925 52 321 -967 -393 159 -1020 -226 690 -730
7393 -730 -1115 485 -38 -1257 -231 289 -1144 -22 345 -1077 -693 923 -468 -1100 322 -267 -548
$$ packed form
7267g70L47O95j406N01J264o70j128J253k09p42O82Q2j092R73J275j801j95J581
7285F40j030k46J322n05j071J115M71j477M31O61o54K35R31j198n50J576j02j154
7303f05R95J72r05N72O91j573L68J160r29l22J246l25j010J586m37j373J131P15
7321A157j319L61Q59r67m28J256n41j126J694J82j587Q26N73j255P00J134j643
7338a24k04J635o86j318J214l07p63J420l0j734Q21J498j098r19J570r75o30J403
7356G73p41r65J474K70j408N17O11r93p9R43p61p11J661k24j524R55N23j096O16
7375a59Q70j448M11J002r51o65J238n18p05R77K69j288N74N52j179P94R16j420
7393g30l85J600n23j219J026N20j433J122L67j422L84J616j391o32J422n89k81
$$ plain form
7410 -548 467 397 -904 222 714 -933 -306 436 -374 -197 742 -94 -715 540 349 -520 -2 877 -284
7429 -284 308 882 -540 -597 860 86 -706 1106 817 -479 476 851 -472 541 1035 -196 74 1160
7447 1160 194 -305 852 386 -720 386 903 -213 245 959 -300 -233 975 566 -377 906 468 -277
7465 -277 854 105 -683 280 1134 -204 -183 923 -47 -95 765 138 -887 646 774 -1058 -37 593
7483 593 -461 -210 338 -564 -578 1119 -119 -1084 255 179 -654 -132 182 -1080 -229 850 -734 -792 558
7502 558 73 -1095 76 -308 -796 252 378 -1155 -694 194 -1028 -833 465 -438 -934 301 3 -1147
7520 -1147 -197 -225 -921 -282 514 -961 -764 458 -81 -1062 258 -235 -1106 473 620 -1128 -348 652
7538 652 -578 -415 393 -349 -373 942 -127 -1030 365 897 -557 -38 537 -531 333 1217 -225 -406
$$ packed form
7410e48J015p0j301J126M92j647O27P42q10J77R39q36o21J255j91q69N18Q79j161
7429b84N92N74j422n7J457p74p92J812k89j296R55L75j323J013M94j231K70J086
7447A160r66m99J157m66j106J106N17j116M58P14j259O7J208m09r43J283m38p45
7465b77J131p49p88R63Q54j338K1J106r70m8Q60o27j025J533J28j832J021O30
7483E93j054K51N48r02j4J697j238r65J339p6q33N22L14j262Q51J079j584n8J350
7502E58m85j168J171l84m88J048J26j533M61Q88j222J95J298r03m96J235k98j150
7520a147R50k8o96O39P96j475J97J222n39r81J320m93q71J579J47j748P80J000
7538F52j230J63Q08p42k4J315j069r03J395N32j454N19N75j068Q64Q84j442j81
$$ plain form
7556 -406 824 387 -587 524 527 -423 680 899 -774 -63 1210 154 -280 870 349 -205 723 270
7574 270 -793 652 964 -242 144 942 -105 -110 921 -304 -242 981 633 -419 748 719 -421 96
7592 96 745 -174 -230 1154 273 -496 839 133 -920 294 364 -628 -132 487 -442 -56 879 -254 -757
7611 -757 766 337 -567 168 203 -420 278 354 -899 -440 996 -62 -807 268 -431 -781 230 45 -1123
7630 -1123 -51 523 -623 -780 238 -511 -302 252 -411 -798 427 -39 -1165 -332 398 -684 -328 210
7648 210 -671 -472 728 -644 -866 449 -362 -949 227 530 -746 -180 543 -751 -492 551 -431 -538
7666 -538 496 163 -535 -14 429 -849 87 457 -907 -169 1239 -43 -685 411 86 -450 621 490
7684 490 -710 580 1005 -389 -401 843 379 156 887 97 -303 1121 847 -724 159 811 -66 -28 878
$$ packed form
7556d06J230m37r74J111Lr50J103K19j673P11J273j056m34J150n21n54R28m53
7574B70j063J445L12j206L86P98j047nJ031j225O2J223l48j052J167k9j140N17
7592I6O49r19n6J384q81p69J335p06j053J214P0r92M96O19r29L86R35j133n03
7611g57J523m29r04P35L5o23O98P6j253M59J436j058p45J075o99l50J011j85j168
7630a123J072N74j146j57J018p49K09N54o63l87J225m66j126Q33P30j082L56N38
7648B10q81J99J200j372k22J315q11n87J176L03j276N66P23j294K59J043r82j07
7666e38J034l33o98N21M43j278R36L70j364P38J408j282o42J096l25n36J071j31
7684D90j200J290M25j394j2J244m64k23P31p90m00J424k74j571Q83O52q77L8R06
$$ plain form
7703 878 -198 -17 1035 -17 -434 803 615 -20 485 698 -391 604 786 -292 -437 1203 262 -437
7721 -437 388 293 -310 355 735 -716 -31 1129 -47 -372 722 -302 -417 555 165 -743 143 404 -803
7740 -803 -99 715 -627 -488 441 -191 -740 272 -55 -845 88 162 -899 -131 398 -787 -432 413 -583
7759 -583 -418 411 -258 -902 15 409 -846 -390 193 -951 -470 698 -742 -1011 747 115 -1037 -155
7777 -155 57 -632 131 7 -795 -321 965 -381 -903 70 87 -443 435 -57 -813 426 511 -791 -475
7796 -475 747 -227 -129 288 -449 -486 874 273 -579 216 969 -233 53 551 -61 -159 922 164 -253 908
7816 908 695 -484 838 997 -409 -55 717 -303 78 1148 -88 -544 844 864 -424 515 707 -70
7834 -70 416 619 -407 30 1169 37 -842 729 541 -46 742 313 -579 437 907 -435 -381 847
$$ packed form
7703H78j076J81J052j052m17J237j88o35N05K13j089R95J82j078j45J640r41o99
7721d37Q25r5o03O65L80j451O85J160j176l25J094j024j15R72l90r08Q86K61j207
7740h03P04Q14j342J39R29o32n49J012l27p90R33P4j061P68N29j185L55Q45r96
7759e83J65Q29o69o44R17L94j255M56N83j144M81J168j440k69J758o32j152Q82
7777a55K12o89P63j24q02M74J286j346n22R73J7n30Q78m92p56J239Q5j302L16
7796d75J222r74R8M17p37l7J360o01q52P95P53j202K86M98o12r8J081p58m17J161
7816I08k13j179J322J59j406L54P72j020L81J070j236m56J388K0j288R39J92p77
7834g0M86K03j026M37J139j132q79J571j88n87P88m29q92J016M70j342N4J228
$$ plain form
7852 847 70 -295 521 -82 -591 531 279 -685 129 744 -586 -294 750 -581 -560 518 -467 -730 503
7871 503 276 -783 -107 84 -769 -345 537 -595 -285 337 -279 -1050 69 32 -797 -300 145 -926 -437
7890 -437 112 -867 -546 390 -382 -964 95 48 -609 -50 -135 -952 34 653 -926 -703 417 -183 -351 207
7910 207 -336 -591 713 165 -1090 -509 522 -289 -220 434 -193 -313 953 250 -922 209 777 -391
7928 -391 142 561 -193 222 918 -383 -551 1059 317 -629 553 575 -459 859 582 -223 49 1026 -34
7947 -34 -233 872 256 -259 421 526 -361 379 713 -196 357 1027 16 -122 910 253 -349 486 470 -577
7967 -577 480 302 -733 233 939 -324 -242 563 148 -284 612 -50 -1099 552 633 -718 -381 435 -480
7986 -480 -2 354 -509 -699 525 128 -767 88 98 -516 0 -56 -942 -329 635 -479 -763 398 -294 -794
$$ packed form
7852H47p77l65Q16o03n09J122k52r64Q14O15j330K92J044j331K1J078r85k63J233
7871E03k27j059O76J91q53M24Q82j132L10O22o16p71J119l7q29M97M45j071M89
7890d37N49r79L21R36p72n82J059m7o57N59q5q17R86O19j579K23J120o00j68N58
7910B07n43k55J304n48j255N81J031q11O9O54o27j20J266p03j172J131N68j168
7928c91N33M19p54M15O96j301j68J610p42r46J182K2j034J318k77q05K72R77j060
7947c4j99J105o16n15O80J05q87P40L34r09N53O70j011j38J032o57o02Q35j6j047
7967e77J057j78j035R66P06j263Q2Q05m15m32Q96o62j049J651Q1j351L37Q16r15
7986d80M78L56q63j90J224l97q95Q55J0o14N16n6q86O13R64j114k84J161o92n00
$$ plain form
8006 -794 178 -84 -931 63 424 -1242 -411 169 -766 -741 410 -316 -637 235 -281 -801 -209 487 -768
8025 -768 -510 592 -527 -612 362 -95 -626 91 -161 -718 213 396 -801 -80 530 -171 -179 539 -421 -321
8045 -321 740 30 -718 478 597 -359 244 514 -69 -30 969 -341 -665 440 355 -30 485 267 -357
8064 -357 410 1106 -211 -27 920 123 -243 905 -3 -415 655 352 -763 71 825 -139 49 615 -196
8083 -196 -151 769 99 -460 628 714 -457 175 683 -12 -95 463 -422 -249 457 -9 -372 752 416 -572
8103 -572 34 302 -517 -22 593 -288 -516 815 -105 -834 483 349 -464 261 175 -457 -13 558 -759
8122 -759 -632 569 -82 -561 68 -266 -955 246 187 -1218 -231 414 -567 -535 28 -426 -738 187 -456 -1039
8142 -1039 58 401 -688 -469 -238 -590 -336 235 -690 -494 522 -151 -889 184 157 -530 10 268 -169
$$ packed form
8006g94R72k62q47R94L61j666Q31N80r35K5J151p26l21Q72n16n20N92O96j255
8025g68K58J102j119q5R74m57n31P17k52n57R31J83j197P21O10p01qP18r60J00
8045c21J061p10p48J196J19r56O03K70n83L9R99j310l24J105q5l85N15k18o24
8064c57P67O96j317J84R47p97l66J148r08m12J070l03j115Q34P54r64J88N66q11
8083a96M5R20o70n59J088Q6j171O32N08o95q3N58q85J73P06m66l63J124l36r88
8103e72O06K68q19M95O15q81k28J331r20p29J317j34q13P25q6o32M44N71j317
8122g59J27J201o51m79O29l34o89J201n9j405R87O45r81L2N63m54l12R25o43n83
8142a039J097L43j089K19K31l52K54N71r25J96J016o73p38J073k7o87N40K58m37
$$ plain form
8161 -169 -392 548 -503 -500 390 130 -390 455 570 -468 209 526 -424 -170 704 -459 -161 1011 75
8180 75 -371 506 424 -298 692 336 -488 32 819 91 -225
$$ packed form
8161a69k23R40j051LQ90k60n20Q45J15j038O77L17r50K54Q74j163K98J172r36
8180G5m46Q77q2p22R90l56q24N20P87p28l16
8191b25
$$ Imaginary data points
##PAGE= N=2
##DATA TABLE= (X++(I..I)), XYDATA
$$ plain form
0 0 0 0 0 -8 8 -4 8 -16 16 -17 32 -32 40 -49 64 -72 89 -105 128 -147 175 -201 233 -269 310 -353 404 -460
28 -460 518 -585 661 -741 830 -928 1036 -1154 1283 -1424 1582 -1752 1940 -2149 2378 -2633
44 -2633 2917 -3239 3599 -4011 4485 -5037 5691 -6479 7449 -8679 10297 -12534 15833 -21209
58 -21209 31489 -58283 273559 596203 -14738 -260001 -69412 295979 325739 60549 -177333
69 -177333 43507 350186 279909 -29773 -94153 49705 190123 150027 -24210 -77603 135946
80 135946 248579 71131 -104846 -77933 3665 79672 100445 27407 -8094 48068 4592
91 4592 -92517 -41507 51834 16985 -38709 -44385 -17451 67483 90510 -75981 -194565 -75825
103 -75825 65657 70063 19499 -53630 -81281 10584 41570 -92976 -136180 7941 101266 59152
$$ packed form
0@%%%qJ6j2J2k4L2l3M9o4P2q9J13j36J61j94K33k75L22l76M34n02N79o63P57q64
28d60R78j103J246j402J571j758J964k190K437k707L006l334L692m089M527n011
44b633N550o156O838p610Q496r522J0728j2170J3928j6128J8976k2831K8367l7042
58b1209N2698q9772L31842L22644o10941k45263J90589L65391K9760k65190k37882
69a77333K20840L06679p0277l09682o4380J43858J40418m0096j74237n3393K13549
80A35946J12633j77448j75977K6913Q1598P6007K0773p3038l5501N6162m3476
91D592r7109N1010R3341l4849n5694n676K6934Q4934K3027j66491j18584J18740
103g5825J41482M406n0564p3129k7651R1865L0986j34546m3204J44121R3325m2114
$$ plain form
115 59152 -35654 -134731 -103784 73882 107343 -81127 -176698 -61866 82122 131231 24448
126 24448 -169436 -184972 1420 84325 -1806 -62416 -59560 -24319 28931 -19550 -139730 -102728
138 -102728 35631 35857 -42050 -54749 -52834 -33870 13601 -29977 -115446 -72332 14154 18438
150 18438 24317 21039 -66763 -108984 -38869 14452 36838 53684 -17556 -87128 -1632 86339
162 86339 25347 -41426 -28382 3976 63263 95084 14898 -33423 44989 69597 -8791 -23870
174 -23870 33328 85780 125863 79033 -45132 -50011 61891 88240 45376 43397 30640 16439
186 16439 57622 62949 13181 19423 26795 -22670 7049 104771 88577 -2468 -36334 -35092 2575
199 2575 68505 37372 -48573 -6322 78539 34880 -47918 -63532 -33271 41376 78729 -27969
$$ packed form
115E9152r4806r9077L0947J77666L3461j88470r5571J14832J43988M9109j06783
126B4448j93884j5536J86392Q2905q6131o0610K856L5241N3250m8481j20180L7002
138a02728J38359K26p7907j2699J915J8964M7471m3578q5469M3114Q6486M284
150A8438N879l278q7802m2221P0115N3321K2386J6846p1240o9572Q5496Q7971
162H6339o0992o6773J3044L2358N9287L1821q0186m8321P8412K4608p8388j5079
174b3870N7198N2452M0083m6830j24165m879J11902K6349m2864j979j2757j4201
186A6439M1183N327m9768O242P372m9465K9719R7722j6194r1045l3866J242L7667
199B575O5930l1133q5945M2251Q4861m3659q2798j5614L0261P4647L7353j06698
$$ plain form
211 -27969 -112057 -7003 100514 45092 -60414 -115630 -84222 54554 131257 13287 -103054
222 -103054 -60599 6415 13948 -1401 -46405 -50497 43326 72403 -32490 -79897 -20676 14915
234 14915 13992 -8235 -66578 -45795 72199 82107 -37006 -90161 -54558 -11175 40057 38916
246 38916 -32973 -35890 25420 -1528 -59559 -27729 10304 2556 1049 -19222 -32639 32274 56674
259 56674 -50639 -110124 -29633 44678 50882 20909 -39078 -41988 35685 24615 -80517 -68532
271 -68532 49573 86264 28829 -48611 -84474 2470 111121 38547 -107238 -81635 51441
282 51441 110662 68948 -38389 -105658 -19003 85343 30810 -47915 -2495 58293 52494 11622
294 11622 -55257 -66878 36336 90346 3812 -49447 -32 40781 46364 18413 -58237 -71625
$$ packed form
211b7969q4088J05054J07517n5422j05506n5216L1408J38776P6703j17970j16341
222a03054M2455O7014P533j5349m5004m092R3823K9077j04893m7407N9221L5591
234A4915r23k2227n8343K0783J17994R908j19113n3155L5603M3383N1232j141
246C8916p1889k917O1310k6948n8031L1830L8033p748j507k0271j3417O4913K4400
259E6674j07313n9485Q0491P4311O204k9973n9987k910P7673j1070j05132J1985
271f8532J18105L6691n7435p7440l5863Q6944J08651p2574j45785K5603J33076
282E1441N9221m1714j07337o7269Q6655J04346n4533p8725M5420O0788n799m0872
294A1622o6879j1621J03214N4010q6534n3259M9415M0813N583k7951p6650j3388
$$ plain form
306 -71625 25106 69046 20696 4227 5772 -23416 -18973 -1853 -22453 -931 52824 20760
318 20760 -34309 -11295 11795 -2478 -327 -17872 -46132 6207 62099 18072 -25135 -8579
330 -8579 -14387 -27149 -5727 -5098 3738 60235 47536 -51052 -72262 -5522 33164 37695 10435
343 10435 -46775 -25520 66925 60190 -32048 -55058 -20596 10312 47310 40360 -14859 -4768
355 -4768 39985 2388 -45159 -13179 23190 36170 48877 8233 -43811 -5787 40834 9029
367 9029 -12424 2033 -7442 8378 55120 33298 -22101 -25438 -25051 -22985 34458 59348 2059
380 2059 -22177 1092 -9308 -16028 -412 -14471 -9478 39867 23551 -42491 -31290 13642 5328
393 5328 -11493 -27504 -45934 2720 67999 21513 -60336 -54735 -21955 -6770 17313 8152 -25948
$$ packed form
306g1625R6731M3940m8350j6469J545k9188M443J7120k0600K1522N3755l2064
318B0760n5069K3014K3090j4273K151j7545k8260N2339N5892m4027m3207J6556
330h579n808j2762K1422O29Q836N6497j2699r8588k1210O6740L8686M531k7260
343A0435n7210K1255R2445o735r2238k3010L4462L0908L6998o950n5219J0091
355d768M4753l7597m7547L1980L6369J2980J2707m0644n2044L8024M6621l1805
367I029k1453J4457r475J5820M6742k1822n5399l337L87K066N7443K4890n7289
380B059k4236K3269j0400o720J5616j4059M993M9345j6316o6042J1201M4932q314
393E328j6821j6011j8430M8654O5279m6486q1849N601L2780J5185K4083r161l4100
$$ plain form
406 -25948 -3075 15948 -34510 -48316 1705 8105 -17247 -13556 -13209 -2980 34384 6989 -67705
419 -67705 -51928 15738 22289 5747 4325 -10110 -2925 14012 -32346 -64288 10880 70810 26760
432 26760 -28446 -41132 -17039 45514 53975 -41384 -81971 8730 76673 48319 -5226 -47595
444 -47595 -37904 34955 45537 -32075 -37185 44176 66028 15382 -36610 -59678 -5710 80495
456 80495 51859 -47968 -41201 39384 62041 28896 -26283 -63733 -5149 79880 49545 -19360
468 -19360 -1382 32367 15312 -5036 -20066 -9990 56184 77546 -5266 -46035 15449 52315
480 52315 26742 -7016 -32151 -4362 70446 62832 -23837 -31789 26762 28472 -7585 -23150 -12770
493 -12770 42321 81494 2527 -89565 -44229 45790 46906 -3833 -46200 -42874 30146 65092
$$ packed form
406b5948K2873J9023n0458j3806N0021O400k5352L691L47J0229L7364k7395p4694
419f7705J5777O7666O551j6542j422j4435P185J6937m6358l1942P5168N9930m4050
432B6760n5206j2686K4093O2553Q461r5359m0587R0701O7943k8354n3545m2369
444d7595R691P2859J0582p7612n110Q1361K1852n0646n1992k3068N3968Q6205
456H0495k8636r9827O767Q0585K2657l3145n5179l7450N8584Q5029l0335o8905
468a9360J7978L3749j7055k0348j5030J0076O6174K1362q2812m0769O1484L6866
480E2315k5573l3758k5135K7789P4808p614q6669p952N8551J710l6057j5565J0380
493a2770N5091L9173p8967r2092M5336R0019J116n0739m2367L326P3020L4946
$$ plain form
505 65092 -22400 -90133 -35847 24348 14671 -15870 -41326 -28464 30313 20777 -72821 -88930
517 -88930 -5291 37718 14149 -25884 -63100 -42293 25788 17151 -53959 -54043 -5222 7095 6272
530 6272 -1749 -31173 -24324 4273 -21908 -42397 5955 34814 8074 -7690 -19739 -33657 800
543 800 29251 -5657 -19137 17214 17360 -3597 4924 -283 -12226 10743 12309 -16685 5615
556 5615 42951 20286 -9470 -11736 -21328 -3243 42868 30171 -13693 -3152 14982 1682 7509
569 7509 12142 -13594 -4302 30276 16691 -1179 17739 11364 -10666 2507 8063 -2468 25271
582 25271 44923 10736 -7366 2875 -5495 5859 42473 28213 -6012 7679 21772 14162
594 14162 26736 19468 -19949 -7645 39688 33852 10444 13254 3997 -573 18478 4665 -21134
$$ packed form
505F5092q7492o7733N4286O0195r677l0541k5456J2862N8777r536r3598j6109
517h8930Q3639M3009k3569m0033l7216K0807O8081q637p1110q4M8821J2317q23
530F272q021k9424O849K8597k6181k0489M8352K8859k6740j5764j2049j3918L4457
543H00K8451l4908j3480L6351J46k0957Q521n207j1943K2969J566k8994K2300
556E615L7336k2665k9756k266r592J8085M6111j2697m3864J0541J8134j3300N827
569G509M633k5736R292L4578j3585j7870J8918o375k2030J3173N556j0531K7739
582B5271J9652l4187j8102J0241q370J1354L6614j4260l4225J3691J4093p610
594A4162J2574p268l9417J2304M7333n836k3408K810r257m570J9051j3813k5799
$$ plain form
607 -21134 15134 47212 13522 -18125 -18603 -14930 12368 31285 -14310 -44941 2534 30847 -382
620 -382 -21642 -29587 -32737 -1704 12277 -25845 -28059 13932 3434 -39849 -42616 -25854 -2992
633 -2992 22587 -6002 -57442 -30688 22525 4314 -33057 -34133 -24742 2320 26386 -9552 -42014
646 -42014 -720 23871 -19220 -41511 -16734 11946 38177 25193 -39683 -50575 16486 39393
658 39393 -3563 -24550 -14036 9401 38635 17316 -41538 -29607 28880 23721 -13774 -13871 1297
671 1297 22466 36591 -9498 -60587 -18613 44531 31294 -6079 -18244 -14990 15740 35268
683 35268 -9968 -43403 229 33286 13292 -720 -3844 -3890 21554 20830 -29786 -29097 35748 53084
697 53084 14196 -11475 -20877 -4918 38375 32559 -18276 -10579 36582 34079 7297 -3060 -8239
$$ packed form
607b1134L6268L2078l3690l1647m78L673K7298J8917m5595l0631M7475K8313l1229
620c82k1260p945l150L1033J3981l8122k214M1991j0498m3283k767J6762K2862
633b992K5579k8589n1440K6754N3213j8211l7371j076R391K7062K4066l5938l2462
646d2014M1294K4591m3091k2291K4777K8680K6231j2984o4876j0892O7061K2907
658C9393m2956k0987J0514K3437K9234k1319n8854J1931N8487n159l7495r7J5168
671A297K1169J4125m6089n1089M1974O3144j3237l7373j2165L254L0730J9528
683C5268m5236l3435M3632L3057j9994j4012l124m6K5444p24n0616O89O4845J7336
697E3084l8888k5671r402J5959M3293n816n0835P697M7161k503k6782j0357n179
$$ plain form
710 -8239 11223 38170 7917 -26504 13530 52823 24540 -10650 -21243 -14463 25907 47967
722 47967 556 -29093 10183 28590 1324 -12241 -13356 -6276 24366 22754 -23429 -21160 21638
735 21638 15470 -18250 -26029 -21383 1383 36381 14737 -38310 -29178 4962 -147 -7386 -3915
748 -3915 -15816 -8427 15211 -5079 -30230 -7232 5689 -12696 -11520 -4158 -10593 6086 17572
761 17572 -15454 -32002 -7764 -1523 -3007 12708 2711 -20231 -4711 5669 -14157 -8489 8126
774 8126 -6667 -9575 9290 -1464 -13228 4541 -770 -20704 -4671 8791 -3439 4091 10448
787 10448 -16870 -21122 2507 -1661 -6366 11411 2310 -17900 -621 7985 -10296 -4561 6063
$$ packed form
710h239J9462K6947l0253l4421M0034L9293k8283l5190j0593O780M0370K2060
722D7967m7411k9649L9276J8407k7266j3565j115P080L0642j612m6183K269M2798
735B1638o168l3720p779M646K2766L4998k1644n3047R132L4140n109p239L471
748c915j1901P389K3638k0290k5151K2998J2921j8385J176P362o435J6679J1486
761A7572l3026j6548K4238O241j484J5715r997k2942J5520J0380j9826N668J6615
774H126j4793k908J8865j0754j1764J7769n311j9934J6033J3462j2230P530O357
787A0448k7318m252K3629m168m705J7777r101k0210J7279Q606j8281N735J0624
$$ [...]
8191F09
##END NTUPLES=NMR FID
##END=
