##TITLE=1H_EC-3208(II-36)
 CDcl3, 8 sc, 
 15.11.2019
##JCAMPDX= 6.0         $$ Bruker NMR JCAMP-DX V2.0
##DATA TYPE= NMR FID
##DATA CLASS= NTUPLES
##ORIGIN= UXNMR, Bruker Analytische Messtechnik GmbH
##OWNER= root
$$ XWIN-NMR		Version 3.5
$$ Fri Nov 15 14:05:04 2019 Russian Standard Time (UT+4h)  she@DPX200
##.OBSERVE FREQUENCY= 200.1315
##.OBSERVE NUCLEUS= ^1H
##.DELAY= (6, 6)
##.ACQUISITION MODE= SIMULTANEOUS
##.ACQUISITION SCHEME= undefined
##.AVERAGES= 8
##.DIGITISER RES= 18
##SPECTROMETER/DATA SYSTEM= spect
##.PULSE SEQUENCE= zg30
##.SOLVENT NAME= CDCl3
##.SHIFT REFERENCE= (INTERNAL, CDCl3, 0, 15.7039)
##AUDIT TRAIL= $$ (NUMBER, WHEN, WHO, WHERE, WHAT)
$$ ##TITLE= Audit trail, XWIN-NMR		Version 3.5
$$ ##JCAMPDX= 5.01
$$ ##ORIGIN= Bruker BioSpin GmbH
$$ ##OWNER= she
$$ F:/spectra/data/she/nmr/H-F/1/audita.txt
$$ ##AUDIT TRAIL=  $$ (NUMBER, WHEN, WHO, WHERE, WHAT)
(   1,<2019-11-15 14:03:28.43 +0400>,<she>,<DPX200>,
      <created by zg, POWCHK disabled, PULCHK disabled
       configuration hash MD5:
       00 E9 B6 7A A2 85 ED C7 34 08 36 98 17 FE 4E 26
       data hash MD5: 16K
       C3 A8 04 5D 39 9D 70 41 15 C9 0D E5 C1 21 0A 42>)
$$ ##END=
$$ 
$$ hash MD5
$$ 53 37 53 BA E9 45 75 8B 2F 34 2A 5D 70 86 59 88
##$RELAX= 
##$RELAX= 
##$RELAX= 
##$RELAX= 
##$RELAX= 
##$RELAX= 
$$ Bruker specific parameters
$$ --------------------------
##$DU= <F:/spectra>
##$EXPNO= 1
##$NAME= <H-F>
##$PROCNO= 1
##$TYPE= <nmr>
##$USER= <she>
##$AMP= (0..31)
100 100 100 100 100 100 100 100 100 100 100 100 100 100 100 100 100 100 
100 100 100 100 100 100 100 100 100 100 100 100 100 100 
##$AQSEQ= 0
##$AQ_mod= 1
##$AUNM= <au_zg>
##$AUTOPOS= <>
##$BF1= 200.13
##$BF2= 200.13
##$BF3= 200.13
##$BF4= 200.13
##$BF5= 200.13
##$BF6= 200.13
##$BF7= 200.13
##$BF8= 200.13
##$BYTORDA= 1
##$CFDGTYP= 0
##$CFRGTYP= 5
##$CHEMSTR= <none>
##$CNST= (0..31)
1 1 145 1 1 1 1 1 1 1 1 1 1 1 1 1 1 1 1 1 1 1 1 1 1 1 1 1 1 1 1 1 
##$CPDPRG= <>
##$CPDPRG1= <>
##$CPDPRG2= <>
##$CPDPRG3= <>
##$CPDPRG4= <mlev>
##$CPDPRG5= <mlev>
##$CPDPRG6= <mlev>
##$CPDPRG7= <mlev>
##$CPDPRG8= <mlev>
##$CPDPRGB= <>
##$CPDPRGT= <>
##$D= (0..31)
0 1.2 0 0 0 0 0 0 0 0.06 0 0.03 0 0 0 0 0.0002 0 0 0 0 0 0 0 0 0 0 0 0 
0 0 0 
##$DATE= 1573812207
##$DBL= (0..7)
120 120 120 120 120 120 120 120 
##$DBP= (0..7)
150 150 150 150 150 150 150 150 
##$DBP07= 0
##$DBPNAM0= <>
##$DBPNAM1= <>
##$DBPNAM2= <>
##$DBPNAM3= <>
##$DBPNAM4= <>
##$DBPNAM5= <>
##$DBPNAM6= <>
##$DBPNAM7= <>
##$DBPOAL= (0..7)
0.5 0.5 0.5 0.5 0.5 0.5 0.5 0.5 
##$DBPOFFS= (0..7)
0 0 0 0 0 0 0 0 
##$DE= 6
##$DECBNUC= <off>
##$DECIM= 24
##$DECNUC= <off>
##$DECSTAT= 4
##$DIGMOD= 1
##$DIGTYP= 9
##$DL= (0..7)
0 120 120 120 120 120 120 120 
##$DP= (0..7)
150 150 150 150 150 150 150 150 
##$DP07= 0
##$DPNAME0= <>
##$DPNAME1= <>
##$DPNAME2= <>
##$DPNAME3= <>
##$DPNAME4= <>
##$DPNAME5= <>
##$DPNAME6= <>
##$DPNAME7= <>
##$DPOAL= (0..7)
0.5 0.5 0.5 0.5 0.5 0.5 0.5 0.5 
##$DPOFFS= (0..7)
0 0 0 0 0 0 0 0 
##$DQDMODE= 0
##$DR= 18
##$DS= 0
##$DSLIST= <SSSSSSSSSSSSSSS>
$$ [...]
##$SUBNAM2= <"">
##$SUBNAM3= <"">
##$SUBNAM4= <"">
##$SUBNAM5= <"">
##$SUBNAM6= <"">
##$SUBNAM7= <"">
##$SUBNAM8= <"">
##$SUBNAM9= <"">
##$SW= 24.0689530833862
##$SWIBOX= (0..15)
0 0 2 0 0 0 0 0 0 0 0 0 0 0 0 0 
##$SW_h= 4816.95568400771
##$TD= 16384
##$TD0= 1
##$TE= 0
##$TE2= 300
##$TE3= 300
##$TEG= 300
##$TL= (0..7)
0 120 120 120 120 120 120 120 
##$TP= (0..7)
150 150 150 150 150 150 150 150 
##$TP07= 0
##$TPNAME0= <>
##$TPNAME1= <>
##$TPNAME2= <>
##$TPNAME3= <>
##$TPNAME4= <>
##$TPNAME5= <>
##$TPNAME6= <>
##$TPNAME7= <>
##$TPOAL= (0..7)
0.5 0.5 0.5 0.5 0.5 0.5 0.5 0.5 
##$TPOFFS= (0..7)
0 0 0 0 0 0 0 0 
##$TUNHIN= 0
##$TUNHOUT= 0
##$TUNXOUT= 0
##$USERA1= <user>
##$USERA2= <user>
##$USERA3= <user>
##$USERA4= <user>
##$USERA5= <user>
##$V9= 5
##$VALIST= <valist>
##$VCLIST= <CCCCCCCCCCCCCCC>
##$VD= 0
##$VDLIST= <DDDDDDDDDDDDDDD>
##$VPLIST= <PPPPPPPPPPPPPPP>
##$VTLIST= <TTTTTTTTTTTTTTT>
##$WBST= 1024
##$WBSW= 4
##$XGAIN= (0..3)
0 0 0 0 
##$XL= 0
##$YL= 0
##$YMAX_a= 618436
##$YMIN_a= -422860
##$ZGOPTNS= <>
##$ZL1= 120
##$ZL2= 120
##$ZL3= 120
##$ZL4= 120
##$ABSF1= 10
##$ABSF2= 0
##$ABSG= 5
##$ABSL= 3
##$ALPHA= 0
##$AQORDER= 0
##$ASSFAC= 0
##$ASSFACI= 0
##$ASSFACX= 0
##$ASSWID= 0
##$AUNMP= <proc_1d>
##$AZFE= 0.1
##$AZFW= 0.1
##$BCFW= 1
##$BC_mod= 2
##$BYTORDP= 1
##$COROFFS= 0
##$CY= 11.3945322036743
##$DATMOD= 1
##$DC= 2
##$DFILT= <>
##$DTYPP= 0
##$F1P= 16.9975609425685
##$F2P= -3.02152046262296
##$FCOR= 0.5
##$FTSIZE= 0
##$FT_mod= 4
##$GAMMA= 1
##$GB= 0.15
##$INTBC= 1
##$INTSCL= 1
##$ISEN= 128
##$LB= 0.24
##$LEV0= 0
##$LPBIN= 0
##$MAXI= 10000
##$MC2= 0
##$MEAN= 0
##$ME_mod= 0
##$MI= 1.114404
##$NCOEF= 0
##$NC_proc= 0
##$NLEV= 6
##$NOISF1= 3.799351
##$NOISF2= 2.8
##$NSP= 1
##$NTH_PI= 0
##$NZP= 0
##$OFFSET= 15.70392
##$PC= 1
##$PHC0= -9455.97
##$PHC1= 18.40088
##$PH_mod= 1
##$PKNL= yes
##$PPARMOD= 0
##$PSCAL= 0
##$PSIGN= 0
##$REVERSE= no
##$SF= 200.130013532006
##$SI= 16384
##$SIGF1= 3
##$SIGF2= 2
##$SINO= 400
##$SIOLD= 16384
##$SREGLST= <1H.CDCl3>
##$SSB= 0
##$STSI= 0
##$STSR= 0
##$SW_p= 3612.71676300578
##$SYMM= 0
##$S_DEV= 0
##$TDeff= 0
##$TDoff= 0
##$TI= <>
##$TILT= no
##$TM1= 0
##$TM2= 0
##$TOPLEV= 0
##$USERP1= <user>
##$USERP2= <user>
##$USERP3= <user>
##$USERP4= <user>
##$USERP5= <user>
##$WDW= 1
##$XDIM= 8192
##$YMAX_p= 0
##$YMIN_p= 0
$$ End of Bruker specific parameters
$$ ---------------------------------
##NTUPLES= NMR FID
##VAR_NAME=  TIME,          FID/REAL,        FID/IMAG
##SYMBOL=    X,             R,               I
##VAR_TYPE=  INDEPENDENT,   DEPENDENT,       DEPENDENT
##VAR_FORM=  AFFN,          ASDF,            ASDF
##VAR_DIM=   8192,          8192,            8192
##UNITS=     SECONDS,       ARBITRARY UNITS, ARBITRARY UNITS
##FACTOR=    0.0002076,     1,               1
##FIRST=     0,             0,               0
##LAST=      1.7004516,     0,               0
##MIN=       0,             -422860,         0
##MAX=       1.7004516,     618436,          0
$$ Real data points
##PAGE= N=1
##DATA TABLE= (X++(R..R)), XYDATA
0@%%%%%%%%qQjRj6J6k2L0l2M0n2O0o8Q1r7J12j29J54j78K00k30K62k96L36l78
33a99M24m74N30n93O60p33Q13r04J002j109J228j355J499j664J843k045K277k540
51a340K842l197L618m117M721n462O341p177O415K4522N12719j3047o47321l02377
65d22860K72100M53311K8253m17249k34226L58825L82192j19917l48597q9438
75a37606J96327K12282q1653k79880l159L36752J52815k09996k38289n4112J03386
86c133J71595L8519j03426j3891N0194q5494q5806P1933O8203l8794n8852l9112
98b8064O1595J72434M507k59347j59116J18645J71513O9656n2130j35616j3827
109d9750J42879j3703k07457m7301J84514J64039J777j77495j98364Q6747K84952
$$ plain form
0 0 0 0 0 0 0 0 0 0 -8 0 -1 8 -8 8 -14 16 -16 24 -28 32 -36 45 -52 60 -69 85 -93 107 -123 139 -157 179 -199
33 -199 225 -249 281 -312 348 -385 428 -476 526 -583 645 -710 789 -875 968 -1077 1200 -1340
51 -1340 1502 -1695 1923 -2194 2527 -2935 3406 -3771 2644 27166 539885 526838 -120483 -422860
65 -422860 -150760 302551 330804 -86445 -320671 38154 420346 300429 -48168 -137606
75 -137606 58721 271003 189350 -90530 -93689 243063 395878 185882 -52407 -106519 -3133
86 -3133 168462 206981 103555 89664 139858 54364 -31442 40491 108694 69900 11048 -28064
98 -28064 33531 205965 210472 -48875 -207991 -89346 82167 151823 99693 -35923 -49750
109 -49750 93129 79426 -128031 -175332 9182 173221 174998 -2497 -200861 -114114 170838
120A70838J8966k82458j63289J40619K82397J42655k08825l44188j5058K76207
130A7864J34027j00743j22720j2849J22334R4269j50469k06236P6899K09261K6093
141H7730j06532q2417l515J09250P4433j41670j64191N3315J40338P6524L0069
152G3334p3857j56620m2758P8116O5394O1798J6715j13810o6856J16541Q0545
163C8542q1309q7141j3340N6910J22546L3180j18680l8153J02720Q250j10962
174h7437m4228O8361J41728J13090r4843k10563j6759J51569O9558k2451l4813
185C3212m2187K8823R3781n081p6757j2232j6035m1901P7923J30647n605r0280
197G4308p1475m1940M8955R2341l5094p4579P5025R1340o3966j14668m8358M7003
$$ plain form
120 170838 189804 -92654 -255943 -115324 167073 309728 100903 -243285 -258343 17864
130 17864 151891 51148 -71572 -84421 37913 132182 -18287 -224523 -147624 61637 87730
141 87730 -18802 -101219 -104734 4516 78949 -62721 -226912 -173597 -33259 43265 73334
152 73334 -523 -157143 -199901 -121785 -56391 5407 22122 -91688 -158544 -42003 38542
163 38542 -42767 -129908 -143248 -86338 36208 69388 -49292 -87445 15275 23525 -87437
174 -87437 -131665 -63304 78424 191514 96671 -113892 -130651 20918 90476 68025 33212
185 33212 -8975 19848 113629 108548 31791 19559 3524 -38377 39546 170193 164588 74308
197 74308 2833 -39107 9848 102189 67095 -7484 67541 158881 94915 -19753 -68111 -21108
209b1108J33058L6076j71398j03973J59762J67705n5291j91443j52246N3205K54667
220A09014J31514j69575j83200K7805J05129M0043n6836j09722K0629J79241N3807
231A47849j60892j06134N9176R2822L1213q3973j28990O1086K23244M5482j88494
242g611j51923R444J19639J26569k2196j29560J05J00535k2826r5852m642N3068
254b5250M4338N667o9084k5879J19261N6709j52491j32201O1937J36083P5341
265I4431m2528j19899r560J15953j5552j58648j0946J71048J12412o3441j69881
276i6611q4402J58293J92526j05858k52044q093K27829J70677n7144k28616j29386
287b12829J57786J87775p5519j54134L9250J46081N3932j00203j72330j6358K06368
$$ plain form
209 -21108 111950 148026 -23372 -127345 32417 200122 144831 -46612 -198858 -145653 109014
220 109014 240528 70953 -112247 -84442 20687 60730 3894 -105828 -85199 94042 147849
231 147849 -13043 -119177 -60001 32821 64034 -19939 -148929 -87843 135401 180883 -7611
242 -7611 -159534 -150090 -30451 96118 73922 -55638 -55533 45002 22176 -73676 -78318 -25250
254 -25250 19088 24755 -44329 -70208 49053 105762 -46729 -178930 -116993 19090 94431
265 94431 51903 -67996 -77556 38397 22845 -135803 -146749 24299 136711 73270 -96611
276 -96611 -181013 -22720 169806 63948 -188096 -196189 31640 202317 145173 -83443 -212829
287 -212829 -55043 132732 57213 -96921 -57671 88410 142342 42139 -130191 -146549 59819
298E9819J22197j37032j43925M7834J32421O7753q0629j76371l1864J72515J13934
309A46652n8421o9110j7474n266J6097j0522m5480M6657J01456k2559r7764j4945
321c0679L6163K2456O888n3148n5131P3534J00378l4118p8958j5766l511J232
333c0660J7948q610K1732R0302m093j45055p5046P5539R6923L1786o3078j05574
345i7886K7229J51197K1977j44183q7816M2665Q9575O4999l5825q7489K4623Q4822
357E3888m7898j13290M934R7096Q5591R179j07100r9844O5318J10281k4737p6705
369d3287j3023K6525N8463N2814m5571p8592j397J3074m601N2004N4639k8044
381D3004l5381n316k5397m650L5458r08q47N1676o99p2379j0019M8476Q464k0442
$$ plain form
298 59819 182016 44984 -98941 -51107 81314 149067 68438 -107933 -139797 32718 146652
309 146652 88231 19121 1647 -3619 12478 1956 -43524 3133 104589 82030 -15734 -30679
321 -30679 5484 27940 34828 -18320 -73451 83 100461 66343 -12615 -28381 -31892 -30660
333 -30660 -12712 -21322 410 90712 86619 -58436 -133482 -57943 38980 70766 7688 -97886
345 -97886 -70657 80540 102517 -41666 -129482 -86817 2758 67757 31932 -55557 -30934 53888
357 53888 5990 -107300 -102366 -5270 80321 89500 -17600 -117444 -52126 58155 33418 -43287
369 -43287 -56310 -29785 28678 81492 35921 -42671 -44068 -30994 -35595 16409 71048 43004
381 43004 7623 2307 -23090 -27740 7718 6810 5963 57639 56940 -15439 -25458 23018 31482 11040
395A1040l0542k8372O2320J07806k6476j26324m7244L7059N0889M7323q186n2272
407b979J1622L5181m7819m4425L9804L2358j1385n830j1906L727N2318l453r3798
420d6585l4003O1226M1364R478O481k5823k1008P545l6815m0686O8307Q7548k3791
433E3238p2089l3180J5566O7013L3064r3870q3746P4905J12669P830o4726p5881
445e9207k1889P5395M9815p0242m2054Q1735O6326m0129r1373o5811M6817J37302
457F6685K3596j36293o8170R1241R5722q077j01758j04652M3650J54938L4383
468I1265j08853m8633N0188L3558k4264o2555k3757R9759J04797o9270j31840
479h9605Q268R7814M3186m3820q5986j0883J20773P9416q9759r4412L4849N9756
$$ plain form
395 11040 -19502 -47874 14446 122252 95776 -30548 -77792 -40733 10156 57479 49293 -2979
407 -2979 8643 43824 -3995 -48420 -8616 23742 12357 6527 -5379 -1652 50666 47213 -46585
420 -46585 -80588 -19362 22002 31480 37961 12138 -8870 -1325 -38140 -78826 -10519 77029 53238
433 53238 -18851 -52031 -36465 30548 63612 -30258 -114004 -39099 73570 81400 16674 -59207
445 -59207 -81096 -5701 44114 -26128 -68182 13553 79879 39750 -51623 -117434 -70617 66685
457 66685 90281 -46012 -114182 -22941 72781 64704 -37054 -141706 -98056 56882 91265
468 91265 -17588 -66221 -16033 17525 -6739 -69294 -93051 6708 111505 42235 -89605
479 -89605 -81337 16477 59663 15843 -70143 -81026 39747 119163 29404 -65008 -30159 29597
491B9597k944l7956k0262O0429R8088l9858j54884l0287J26801Q5547l9164r3767
503a8660l8017R1866J07172o4186j46741p90J12644N1922m0985o7641p038Q9289
515F8835M2355j20068j08428P6726J36979K5935q5513j06948o643J17061N8712
526I9003j01594q7532M9199Q4388K4182m3317p6305q175P4673J0242p6305q322
538e9863P6264M0939k4545o8747o3619L9146J02168L354p8062j5431M0839K2829
550A5272n75l6225m1931L3387N5009k4415l1582L6491K6716k6231l9019l5912
562f9015J5504Q9223L7922p6181n4683L1266L2373P77j7181l4118J0135O3121
574B9143J892o2240o155M0090k22k6723k2278l703N7291O1886m5979q8080m366
$$ plain form
491 29597 26653 -11303 -31565 28864 126952 87094 -67790 -98077 28724 114271 75107 -18660
503 -18660 -56677 35189 142361 78175 -68566 -69356 43288 95210 54225 -13416 -20454 68835
515 68835 111190 -8878 -117306 -40580 96399 122334 36821 -70127 -76770 40291 99003
526 99003 -2591 -90123 -40924 43464 67646 24329 -51976 -60151 14522 24764 -51541 -59863
538 -59863 16401 57340 32795 -35952 -99571 -60425 41743 45097 -32965 -48396 -7557 15272
550 15272 14697 -21528 -63459 -30072 24937 522 -31060 5431 32147 5916 -33103 -69015
562 -69015 -53511 35712 73634 -2547 -57230 -25964 6409 7186 -9995 -44113 -33978 29143
574 29143 31035 -31205 -37360 2730 2508 -24215 -46493 -50196 7095 68981 23002 -65078 -69444
587f9444M5085K6688J5107j7097l4174K0942L4330k5516k4519K0306J027r743
599a7008K2546J2159q467J3397m041l8383k05K8642J431J3643L4494j6833m2959
612a584n258P639J6721L7436p852n4699P638N6578M075l4522k3648j6588K1091
625G027M9117p613m0248J5407K1728l2857l1409L590K1209M3924J4489o5608m6205
638d7449M5377L8612k4172k7864j3556Q503M6851J4064n5161k3913L5760J352
650a596l1846J071K1316K9084K0867m5932p1136K1863P4914P783m0353k3529M542
663c2952M1675L2476n1527o1464L5482N9299r568l1342o043J9106L9337o633q3987
676e6141l2947Q6279P3091k9241o7043l5543L1519P3709n73q9865k5382P6277
$$ plain form
587 -69444 -24359 2329 17436 339 -33835 -12893 21437 -4079 -28598 -8292 -7265 -17008
599 -17008 5538 17697 9230 22627 18586 -19797 -20002 8640 10071 23714 58208 41375 -1584
612 -1584 -6842 797 17518 54954 47102 -7597 41 56619 60694 26172 2524 -14064 7027
625 7027 56144 48531 8283 23690 45418 12561 -18848 -15258 5951 49875 64364 -1244 -47449
638 -47449 -2072 36540 12368 -15496 -29052 -20549 26302 40366 -14795 -38708 -2948 -1596
650 -1596 -33442 -32371 -11055 18029 38896 -7036 -78172 -56309 18605 26388 -13965 -37494 -32952
663 -32952 8723 41199 -10328 -71792 -36310 22989 13421 -17921 -23964 -4858 34479 27846 -56141
676 -56141 -89088 -2809 70282 41041 -26002 -61545 -30026 43683 43110 -46755 -72137 4140
688D140M6984l0365m8035k1830L5927N2668l5956p9609K7720R7462J7634o8396
700a656o7545n537P5738O4905n3432q0179L0664P4333K378m9520m0772J0634O6184
713B6195K3410o8971l3259P0091M8629m2910o4031j8839N3617Q4349o953r5543
725b4215k5024P1460L5843l5440m1673n987M8758N1772l8778p2783K2373O9190
737E5496l806n5321l3527K0764P3643L6794p7492q1898L4974P1226N453l5174
749A1132l1913L462N1097J6671o5501l8703M8151L9805j8262l2380j6852K5196
761h097N4002j4173q1496j8189O1969L9563q854l1108l4159J2485M7510r344m8464
774c8355Q966M0871K658j7183j5381r146K7571K5597l9733l7806L6920M4068l372
$$ plain form
688 4140 51124 20759 -27276 -49106 -13179 39489 3533 -76076 -48356 49106 66740 -1656
700 -1656 -69201 -74738 1000 65905 12473 -67706 -37042 37291 39669 -9851 -50623 -39989 26195
713 26195 49605 -19366 -52625 17466 66095 23185 -40846 -59685 -6068 78281 71328 -24215
725 -24215 -49239 22221 58064 22624 -19049 -25036 23722 75494 36716 -36067 -13694 55496
737 55496 51690 -3631 -37158 -16394 57249 94043 16551 -65347 -30373 40853 46306 11132
749 11132 -20781 -17319 33778 50449 -15052 -53755 -5604 34201 15939 -16441 -33293 -8097
761 -8097 45905 31732 -49764 -67953 -5984 33579 24725 -6383 -40542 -28057 19453 10109 -38355
774 -38355 -29389 11482 14140 -3043 -18424 -27570 1 25598 -14135 -51941 -15021 29047 25675
787B5675k1300k9219j4698L6036K7285k9213j4555K9843N295k0579p010m281P490
800i231K9253o803m1392P396M1289L19k1665j4140j5798J3283L9449j549k9511
813i100M563P446j6440K087J3218p240N453J4145j7584j1094K1055j41j7478J0534
827e76N495j5929J0411K0998q653p388k596k3784K367M4846J1045l0503j1914
840f181K532M588K0182k157l4486N322L8545l539k6868J148P695O180Q588k3844
854b295k7127L5428M4715k2571m2470r231J1666K9822J8881l6021l0100L3338
866D035K7433k6511k1512L940J0066J9049k537l9545n0N1770P366m8141k4416
879c9053J4016L1468K9449k2518n4377R037N3085j999l8900r510J6673K6891J2161
$$ plain form
787 25675 4375 -24844 -39542 -3506 23779 -5434 -19989 9854 15149 -5430 -12440 -16721 -9231
800 -9231 20022 13219 -28173 -20777 20512 20831 -834 -14974 -30772 -17489 21960 20411 -9100
813 -9100 -4537 2909 -13531 -11444 1774 -5466 -13 14132 -3452 -14546 6509 6368 -11110 -576
827 -576 4919 -11010 -599 20399 11746 4358 1762 -22022 -19655 25191 36236 5733 -6181
840 -6181 -3649 939 21121 18964 -15522 -10200 28345 24806 -2062 -914 6781 12961 21549 -2295
854 -2295 -29422 6006 50721 28150 -14320 -23551 -11885 17937 36818 797 -29303 4035
866 4035 31468 4957 -16555 -12615 -2549 16500 13963 -25582 -25632 26138 33504 -14637 -39053
879 -39053 -25037 6431 35880 13362 -41015 -31978 21107 19108 -19792 -29302 -12629 14262 26423
892B6423m0867l7209M3323N1116k9659n3320m121L7351M7929j45p0603l7180O0007
905f955N2610k9393m4851n669L1211M1130j4060o7050o439P1763K7024m9318m0933
918d0930Q729M8137L9454l9806p4651J3561P7831J7179m6367l3694N106L9928
930A4477K8019m2275m7620L7243N4545j7950m5750j0770K5090M1516J680o1203
942b2998k7223N9481M3742l1747m1423p015K4530L7372r113n3335N10N8461R295
955D0537m6391k4597J5712L7305K3901m0077n6926K7983O7710j814n1002k6397
967c4056J2981M3399K4583m4629m5962L4922M8060j7133l7942j0714J9360L9731
979C2600N168n6592k8366N0775L8979k3326l4968j4826J7159M3494M132n1383
$$ plain form
892 26423 -14444 -51653 -8330 42786 13127 -40193 -44314 -6963 40966 40821 -29782 -66962 -6955
905 -6955 45655 16262 -28589 -34258 -3047 38083 24023 -43027 -49466 22297 49321 3 -40930
918 -40930 -32201 15936 55390 15584 -59067 -45506 32325 49504 3137 -30557 -25451 14477
930 14477 42496 221 -47399 -10156 44389 26439 -19311 -30081 -4991 36525 38205 -22998
942 -22998 -50221 9260 53002 21255 -20168 -27183 -2653 34719 25606 -27729 -27219 31242 40537
955 40537 -5854 -30451 -14739 22566 46467 6390 -50536 -22553 45157 43343 -7659 -34056
967 -34056 -21075 22324 46907 2278 -43684 -8762 39298 22165 -15777 -26491 -7131 32600
979 32600 37768 -18824 -47190 3585 42564 19238 -15730 -30556 -13397 30097 34229 -17154
991a7154j6206L7245J5998j6418j0514o859R577K4433j2407l6522J1247L4644
1003A7064m539j9654n946m226J4614K1341j8556k5796J7252J5447j4473k572P824
1016b220m300N504L506k2216j324L1903K027k6875l412P605L574J5856j526k8195
1030b0093K569K6022n273j2007P939j731m130J2986l872j7488J3875J5725j4534
1043a2m952Q351q304J613J9792o051j8970N132K717j683J9573M186l0508p408
1057a6524K3383O795k619l399j8838j033L2878L278l2715m337J9293O135O64j0891
1071B070k2627J5738L9168j2214m1852k174K3808J7777O444k5400l2132K3834
1083g560M1253j3994l3945j34J3331J6002P546k6671k0638L1769K4400k8747k2710
$$ plain form
991 -17154 -33360 3885 19883 3465 -7049 -13908 -4331 20102 7695 -28827 -17580 17064
1003 17064 12525 -7129 -13075 -17301 -2687 18654 98 -25698 -8446 7001 -7472 -10044 -2220
1016 -2220 -6520 -1016 2490 -19726 -21050 10853 12880 -13995 -17407 -9802 -6228 9628 8102 -20093
1030 -20093 -17524 8498 3225 -8782 -843 -2574 -6704 6282 2410 -15078 -1203 14522 -12
1043 -12 -4964 3387 -4917 -3304 16488 10437 -8533 -3401 -684 -2367 17206 21392 -9116 -16524
1057 -16524 6859 13654 11035 7636 -11202 -12235 20643 23921 -8794 -13131 6162 12297 12961 2070
1071 2070 -20557 -4819 34349 22135 -19717 -21891 1917 19694 26138 738 -31394 -7560
1083 -7560 33693 19699 -14246 -14380 -1049 14953 22499 -4172 -24810 6959 31359 2612 -20098
1096b0098J1847J7320J4769n014l6129q392M1173J3426l1773j2590J3088J1805
1108I432R002j3475k8852J4210L8169j3692l8833L885K7510J6040m924l6973k5125
1121d3626M1153M3064k9455m3786O769K9814J9412j1379m5331j0945N5412K9196
1133D0298m5552l7281J8042L5748J7903k7094n3025P214O8853J8273n2727l3909
1145d3257J6491L5267K1642k8062m7751J7763N8037q88m6205j5326J9065K8464
1157A5240J0989l4449l2817L4705M5221j8709l9960n653J7523K6193P910l4320
1169h127j9393L5679K2101k9096k0274J0193J5242J4989p720l3464K596M2899
1181B5625K018l9168j2014J7920K0999J3362k0536l5313J5671M0846j1349l4516
$$ plain form
1096 -20098 -8251 9069 23838 18824 -17305 -25697 15476 28902 -2871 -15461 -2373 9432
1108 9432 18434 4959 -23893 -9683 28486 14794 -24039 -20154 7356 23396 18472 -18501 -43626
1121 -43626 -2473 40591 11136 -32650 -25881 3933 23345 11966 -33365 -44310 11102 40298
1133 40298 -5254 -42535 -24493 11255 29158 2064 -50961 -43747 25106 43379 -9348 -43257
1145 -43257 -26766 8501 30143 2081 -45670 -27907 30130 29242 -16963 -32289 -13224 15240
1157 15240 26229 -8220 -41037 -6332 38889 20180 -19780 -25433 -7910 18283 26193 -8127
1169 -8127 -27520 8159 30260 1164 -19110 -8917 6325 21314 13594 -19870 -17274 25625
1181 25625 27643 -11525 -23539 -5619 15380 28742 8206 -27107 -11436 29410 18061 -16455
1193a6455M24J9452J8889M502l2958k7028L3736L6560k3435l3104K998K1346K5437
1206C0364M01m3591k2854L9520K9042k0508k0051J07J0371K0522l312l7997n972
1219b3958L8799J2153k1773j0743p47O686J9289o664l2548K748L0187J730j1425
1232C734j370r409k793J5499l540j5127J2621J1130j3932k456P458r798k580J0952
1246C89o047n309J6329j711j5828O569N925j4195R93J1503l283L864R484j6251
1260g568j3373J5598M906j0098P470M883r643N488P178j4449k267J3871q224p319
1274a3547J8322N567j2528m97l091r289J4007J2045j7495l232K0833j94j5340
1287d439k889m831M360K3972j619k9317L426K5538K89j4424j2005r777J9312L4055
$$ plain form
1193 -16455 -16031 3421 22310 26812 -6146 -33174 562 37122 13687 -19417 -16419 4927 30364
1206 30364 30765 -12826 -35680 3840 32882 12374 -7677 -7570 2801 23323 20011 -17986 -23958
1219 -23958 14841 26994 5221 -5522 -6269 417 19706 13042 -19506 -16758 13429 15159 3734
1232 3734 2364 -7045 -9838 5661 2121 -13006 -385 10745 -3187 -5643 1815 -7983 -10563 389
1246 389 -5658 -10967 5362 3651 -12177 -5608 317 -13878 -12885 -1382 -4665 -801 8683 -7568
1260 -7568 -20941 -5343 -437 -10535 -3065 1818 -7825 -2337 4841 -9608 -11875 1996 -6228 -13547
1274 -13547 4775 10342 -2186 -2683 -5774 -15063 -1056 10989 -6506 -9738 11095 10901 -4439
1287 -4439 -7328 -12159 -7799 16173 14554 -14763 -11337 14201 14490 66 -11939 -21716 -2404 31651
1301C1651j2844l6482L658K3215K713p452j4078r898K7613K8895k5544l4729J0098
1314a3184K3458N740o539k1960o947L7367K2774l5135l1470J2405K1521J1165
1326A9195m055k5082l586L5960P088l8722j5115K1382J8657O154j3798k5423J0855
1339f490L5079j0944l8773J20K6466J5641l67k2031k0857K2408K6529k6269k9740
1352b9228J9041K9033M843j5363k9305m687L9700J4906m1102k1636L0122K8277
1364B4601k01k6075l3248R428M7301L563m3711q394L1598J8545p858l0540k6125
1377d1116K6524M7589j2089m2809j704K7343J5181o593l1063k0650L4473L8995
1389C4081j9594l3618L174J5669R391l049k4314q837L6496K1826k7982k3000O213
$$ plain form
1301 31651 18807 -17675 -14017 9198 11911 4459 -9619 -19517 8096 36991 11447 -23282 -13184
1314 -13184 10274 16014 9475 -12485 -19432 17935 40709 5574 -25896 -13491 8030 19195
1326 19195 15140 -9942 -13528 22432 29520 -9202 -24317 -2935 15722 21876 8078 -17345 -6490
1339 -6490 28589 17645 -21128 -21008 5458 21099 20732 -1299 -22156 252 26781 512 -29228
1352 -29228 -10187 18846 23689 8326 -20979 -25666 14034 28940 -12162 -33798 -3676 24601
1364 24601 24400 -1675 -34923 -25495 21806 25369 -18342 -26736 4862 23407 15549 -14991 -41116
1377 -41116 -14592 32997 20908 -21901 -23605 3738 18919 12326 -18737 -39387 -4914 34081
1389 34081 14487 -19131 -15957 -288 9103 6054 -18260 -27097 9399 31225 3243 -19757 -13544
1402a3544J0396J0456r66k2491n61L3367O242k8825j1296Q034O213R900k349j7354
1416a2778R827K4679j2945k8203K878J4937Q885O130j3562j6373J9553J9776k3149
1429c45k2714J1066J5673J0342J489k1453j0325K5514R291k7792j1853J7062J5642
1442A1597Q989p115k8796l534K9817L923k2911k173J1936P473Q682q361k6649
1455a7122K016K4034j003j0826O637K003j903P278q548j9066Q082J6493l211J273
1469F137N964j2821o645J3157k225j0985O139M682j558J2229J549k4029o243J6476
1483A827K061k790N335m183p68J3129p960k3685N201J8504l42j427J508q184K696
1498I22J0830j4347j6094J5943J4028o158k35r47q499M836L921j6903j390K4021
$$ plain form
1402 -13544 -3148 7308 6342 -16149 -16710 16657 22899 -5926 -17222 -9188 -2975 6925 4576 -12778
1416 -12778 -2951 21728 8783 -19420 -16542 -1605 7280 13410 -152 -16525 3028 22804 -345
1429 -345 -23059 -11993 3680 14022 15511 -5942 -16267 9247 18538 -9254 -21107 -4045 11597
1442 11597 20586 13471 -15325 -18859 10958 14881 -8030 -10203 1733 9206 17888 9527 -17122
1455 -17122 -15106 8928 7925 -2901 3736 5739 3836 11114 2566 -16500 -8418 8075 4864 6137
1469 6137 12101 -720 -7365 5792 3567 -7418 -1279 3403 1845 14074 15623 -8406 -14649 1827
1483 1827 3888 1098 6433 2250 1482 14611 6651 -17034 -11833 6671 6329 4902 6410 -1774 922
1498 922 11752 -2595 -18689 -2746 11282 5124 4889 3942 -4557 279 4200 -12703 -14093 9928
1512I928N202j3876l048k793k901J0950k463j8826Q995K5372l269j6074n821m197
1526a2821N524J6150r309j8576J5884K2143r761j8103r382k176K0825K0131j9535
1539I94k2740J6949J8927p359j5828j4465R22L1883J8143k8390k2178J7275J5633
1552I766n000j3987j5674R517L7471O401l8556j7090K1020J5012k641j2955j3925
1565b0641J6299L3021r738l8650l282K3325Q933m393j0823o452K2758J8940k7603
1578A694l0801J5029K5691K040r144j2068J129K4795M172l5086j4205K8000J9061
1591B0307o719j1767j0444Q437K2587j0151l5512L709L5118J1169j1544j6679
1603a489j2343J4088K2582j5009k7810J2427K7651L843j1156j8229j2568J9191
$$ plain form
1512 9928 15130 1254 -1794 -4587 -7488 3462 999 -17827 -8832 16540 13271 -2803 -8624 -12821
1526 -12821 -7297 8853 -456 -19032 -3148 18995 9234 -8869 -18251 -20427 398 20529 994
1539 994 -21746 -4797 14130 6771 -9057 -23522 -22600 9283 27426 -964 -23142 -5867 9766
1552 9766 4766 -9221 -24895 -15378 22093 28494 -10062 -27152 -6132 8880 6239 -6716 -20641
1565 -20641 -4342 28679 18941 -19709 -22991 334 9267 4874 -5949 -12401 10357 29297 1694
1578 1694 -29107 -14078 11613 13653 4509 -7559 -6430 18365 22537 -12549 -26754 1246 20307
1591 20307 13588 1821 -8623 -186 22401 12250 -23262 -19553 15565 26734 15190 -1489
1603 -1489 -13832 256 22838 7829 -19981 -7554 20097 23940 12784 -5445 -18013 1178
1615A178K1969j7065j9907J3813J7861O54r116k1590j0935K6254K2083j6973j6225
1628g999P992P485K294m953k0713m758K9387J3774j9827j0263N971K244K803n844
1642b407j6836O849K8887J4k3339m968N122J280M281m803j0102J5002J8664j5130
1656B514j9926N362O512k91K550n907q22J9386M482k5405j0860J3067O423J069
1670a846J788o951J761J5192o966k2721K527J5226K078K357J424r687J392J0224
1684E798r963j2626R023Q623J53Q464oj6334k460P098l627K569R184n549k279
1699a932J4123k138j9256k615Q137M683R484N95j5179K458J7115q032j9880J540
1713a0897J1296J1161R976j0992k0615Q087J6652r844j2859N635Q847R743N322
$$ plain form
1615 1178 23147 6082 -13825 -12 17849 18503 9387 -12203 -23138 3116 25199 8226 -7999
1628 -7999 -7 7478 9772 4819 -15894 -20652 8735 22509 2682 -7581 -1610 634 3437 -2407
1642 -2407 -19243 -12394 16493 16507 -6832 -11800 -6678 -5398 -1117 -5920 -16022 -1020 17644 2514
1656 2514 -17412 -12050 -5538 -5829 -3279 -9186 -10008 9378 13860 -11545 -22405 -9338 -2915 -1846
1670 -1846 -58 -7009 -5248 9944 2978 -19743 -17216 -1990 88 2445 3869 -5818 -4426 5798
1684 5798 -4165 -16791 -7768 855 1008 9472 9466 -6868 -9328 -2230 -5857 -3288 5896 347 -1932
1699 -1932 12191 10053 -9203 -11818 -3681 1002 10486 11081 -4098 -1640 15475 7443 -12437 -10897
1713 -10897 399 11560 21536 10544 -10071 -1984 14668 4824 -8035 -2400 6447 16190 21512
1726B1512j6899j6190J2745J1296j0505l578Q799L446N131j12k0025q645J6952
1739C927P100p426K565L268l979L905k920j6995L79J7919J370o010L000k280l692
1754A31M993p593j5696J0390K0892k372r848m404n669M990R536j3616j3095J9101
1768b260J9707q645j5393r648j93J7801P183k2892r277K7819J7182j6646k1780
1781a7042j0501J2249K7774P45l0582l550K9239Q703j9867j9973l567K1958K6291
1794B1877j2598l0262O640K6163j848k0615j2204M812K5133J8136k1874k4090
1806b0730J2627J6176p651j1200j549P816J8655L597k4550j0836J7250O005j0117
1819d507j889L542P268J2475p012k3501l43J7446J953n407L223J92L271P501j1582
$$ plain form
1726 21512 4613 -11577 1168 12464 1959 -1619 7180 10626 15757 15645 -4380 -13025 3927
1739 3927 11027 3601 6166 9434 5455 9360 6440 -10555 -10176 7743 9113 3103 6103 3823 131
1754 131 5124 -2469 -18165 -7775 13117 10745 897 -3507 -9176 -4186 5350 -8266 -21361 -2260
1768 -2260 17447 8802 -6591 -16239 -16432 1369 8552 -14340 -23617 4202 21384 4738 -17042
1781 -17042 -27543 -15294 12480 13225 -17357 -20907 8332 17035 -2832 -22805 -26372 -4414 21877
1794 21877 9279 -20983 -14343 11820 9972 -10643 -22847 -18035 7098 25234 3360 -20730
1806 -20730 -8103 8073 422 -10778 -12327 -4511 14144 17741 -6809 -17645 -395 5610 -4507
1819 -4507 -6396 -2854 4414 16889 9877 -13624 -13967 3479 5432 25 3248 3440 6711 14212 2630
1834B630j8104Q650J6866M8l359j748m236O877Q240j6317j5326J3793J7899J965
1848A7878m336j2232q939J3921J0291j7689j1254J6523J4977J12j0050j8264l726
1861a2788K2421P369k0733o284J7195J0725l301j3691j8802M747K4764K076j8177
1874d479K55J1247j60m805r323r972J1608J8045o638j1916O864K918p765k390
1888f511k843j492J1965Q385r956l703N881p006q599O562M235R64P506j700j0836
1903g148L118L719j0509j219J1202J663j233M882m307p755K605j741o095R989
1917b829J0988p250l968M556m064n192J238l123L440J6029P49j7404j672R505
1931A003j505m550k813k615J2916J6947j0876k2053J757J1517J777o32l811k402
$$ plain form
1834 2630 -15474 -6824 10042 10090 6731 4983 747 7624 15864 -453 -15779 -1986 15913 17878
1848 17878 13542 1310 -7629 6292 16583 -1106 -12360 4163 19140 19252 9202 -9062 -12788
1861 -12788 9633 17002 -3731 -10015 7180 17905 14604 913 -17889 -13142 11622 13698 -4479
1874 -4479 -4224 7023 6863 2058 -7265 -17237 -5629 12416 5778 -6138 726 3644 -4121 -6511
1888 -6511 -9354 -10846 1119 9504 -452 -4155 1726 -5280 -13879 -7317 -3082 -2118 5388 3688 -7148
1903 -7148 -4030 -311 -10820 -12039 -837 826 -407 4475 168 -7587 -4982 -6723 -12818 -2829
1917 -2829 8159 909 -3059 1497 -2567 -7759 -6521 -9644 -6204 9825 10574 -6830 -8502 1003
1931 1003 -502 -5052 -7865 -10480 2436 19383 8507 -13546 -11789 -272 1505 873 -2938 -5340
1945e340J3573R680j7618j5827P981J0281K473K042o039l733J1879M582j7388
1958c454q748Q964O763O705M814j0471r332Q909K856r695n91N074K672Q933J829
1973A5228j5931p783J0825L438n876O03J731M047R710o102k1269n75J6501K750
1987G297n846l06P89N377M569j5089j6139J3666J8750n504j1058Q7M850Q643l304
2002F782k3130n752K6533J5534j4527j3627Q36P714P933r652k0326P883K9582
2015A5783L207k1733j1209M655J0924O817j3613j5281J6522K3098o999k0176o719
2028a4724M367J0897P119j1466q409J5779J0945j3665j2690l40L966J1108O384
2041I271j1637n901J1680L016j0869m665r15K943J3532N704j2872o047P231j358
$$ plain form
1945 -5340 8233 17913 295 -15532 -7551 2730 5203 7245 1206 -2527 9352 13934 -3454
1958 -3454 -12202 -3238 3525 10230 15044 4573 -4759 4150 7006 -2689 -3280 1794 4466 13399 15228
1973 15228 -703 -8486 2339 5777 -99 504 2235 6282 15992 9890 -11379 -11954 4547 7297
1987 7297 1451 1145 1934 7311 11880 -3209 -19348 -5682 13068 7564 -3494 -3407 1443 10086 6782
2002 6782 -16348 -22100 4433 19967 5440 -8187 -7351 363 8296 -1356 -21682 -13799 15783
2015 15783 18990 -2743 -13952 -9297 1627 8444 -5169 -20450 -3928 19170 12171 -8005 -14724
2028 -14724 -10357 540 7659 -3807 -12216 3563 14508 843 -11847 -12187 -8221 2887 9271
2041 9271 -2366 -8267 3413 6429 -4440 -9105 -10020 -7077 6455 12159 -713 -6760 471 -887
2055h87n328J552l09M130J2935k524j7166j551R964j0k943o45j116R417J0973
2070A6492j2054j8286M821J2450M34k611j820o1J0786L866j9583j2252J5268J3195
2084A0645k348n958n236K265J2255k397k0869k607J8706Q424m549n250n514J403
2098a030Q841p043j3125Q524J5833p81o179m619o112L266P996o177n794R642O153
2113I395m921j020k777q600K138Q369r47R53N126n061n677L644k362p708N736
2128c712R007q87k83j614p855J184P085o418p387J0569R133l094l672o188n740
2143i872P215O278q426j114J2739K215q464n522m173J909J1200Q86j1298L517
2157b910J2106l126r856l863k158O553J1075l891q648N650N720q229n731L75J241
$$ plain form
2055 -887 -6215 -4663 -4972 -842 12093 9569 -7597 -9148 816 806 -2137 -2782 -3898 5519 16492
2070 16492 4438 -13848 -9027 3423 3857 1246 -574 -635 10151 14017 -5566 -17818 -2550 10645
2084 10645 8297 2339 -2897 -632 11623 9226 -11643 -14250 4456 12880 8331 3081 -2433 -1030
2098 -1030 7811 768 -12357 -3833 12000 11219 5040 421 -5691 -2425 5571 -606 -6400 3242 9395
2113 9395 4474 3454 677 -7923 -5785 2584 1637 2590 7716 2655 -3022 622 -1740 -9448 -3712
2128 -3712 5295 4408 4125 2511 -5344 -4160 2925 -3493 -10880 -311 8822 5728 2056 -4132 -9872
2143 -9872 -2657 3621 -4805 -5919 6820 9035 571 -4951 -9124 -7215 3985 4871 -6427 -2910
2157 -2910 9196 6070 -3786 -7649 -9807 -3254 7821 3930 -4718 932 6652 -1577 -7308 -6933 -5692
2172e692Q987P706r428q409O454K147n681mk47o46J0327N747j0976p456L328K26
2188c617R65M418l431j519J0901J668j3915o166N156M770N880M76j0272k70J4244
2203I288q59j5578m185O822Q616P302n385j3506M755J2598o960j3854K801J1444
2217C299P976J329j3754j0676J2320J1661j2015j0309P448J0270N865m473j6057
2230g116m342J5423N319j2802k606J0365N343n12q940j3237M602J7520p47j2484
2244d214P68P803J880j620q613r036R153J3662m842p894L189J904j196o72p141
2259f869l862J3066J0041q293p279K89k11K988L201p901l157J2659O330p959n824
2274b781k252q70P433L873r479q18J2757R03j0144n664j712N207J1830j403j3279
$$ plain form
2172 -5692 3295 11001 1573 -6836 -382 1765 -3916 -3920 -4167 -4813 5514 11261 285 -7171 -3843 -3617
2188 -3617 -2652 1766 -1665 -3184 7717 9385 -4530 -10696 -5540 -770 5110 5586 -4686 -4956 9288
2203 9288 8429 -7149 -11334 -4512 4104 11406 6021 -7485 -2730 9868 2908 -10946 -8145 3299
2217 3299 11275 12604 -1150 -11826 494 12155 140 -10169 -2721 7549 13414 8941 -7116
2230 -7116 -11458 3965 9284 -3518 -6124 4241 9584 9072 132 -13105 -8503 9017 8270 -4214
2244 -4214 -3446 4357 6237 4617 -3996 -13032 -3879 9783 4941 -2953 236 2140 944 272 -6869
2259 -6869 -10731 2335 12376 4083 -3196 -2907 -3118 -130 3071 -4830 -7987 4672 11002 3043 -2781
2274 -2781 -5033 -5903 1530 5403 -4076 -4894 7863 8766 -1378 -7042 -8754 -3547 8283 6880 -6399
2289f399J613J1625j598r237m363L0Q350J0650o718j1983M951Q392o128p062L35
2304g542L226J0188M397j2546r289R045N455o201j840J945K202P448m53j2042
2318f007k342Q752n8m728L794K477L13M221m706j0385K606Q538j142qL409l461
2334A273j503M563l568o283M027M194j298L789J902p966j405N141l704l728N771
2349A205L089L30K790n528r972M928Q637l858m100L301J175K803K217r881p505
2364a0369R205P653n603j762K800p5K274j808j0901r25J4291L839p298j785m33
2379h97l3M231k004r496L535J2010p84n711k58k095r98M659k673n590P041Q085
2395I022m959m851j443l475L237P833l836n257N141L444m300j598k745m046O383
$$ plain form
2289 -6399 -4786 6839 5241 -3996 -8359 -8329 21 10671 3953 -8030 -3079 5313 -815 -7877 -7542
2304 -7542 -4316 5872 10269 -2277 -11566 -2521 2934 -3267 -5107 -3162 -960 6488 6035 -6007
2318 -6007 -8349 403 345 -4383 -589 1888 2201 6422 1716 -8669 -6063 2475 1333 1325 4734 1273
2334 1273 -230 4333 765 -5518 -1491 2703 1405 5194 7096 -870 -2275 2866 -838 -4566 1205
2349 1205 4294 4624 7414 1886 -8086 -3158 5479 1621 -2479 822 1997 4800 7017 -2864 -10369
2364 -10369 -1164 6489 886 -876 1924 1849 4123 2315 -8586 -9511 4780 8619 1321 -464 -897
2379 -897 -930 3301 1297 -8199 -4664 7346 6562 851 593 -1502 -2500 2159 -514 -6104 937 9022
2395 9022 4063 -788 -2231 -5706 -2469 5364 1528 -3729 1412 4856 556 -1042 -3787 -7833 -1450
2410a450P435n579m393N691M88m342j529l772nJ2474L431j1356m691N832J593
2425a73r27j691n687L838J3082j985j3244j000P346J052j340l042l109Q904J0668
2440A2692r872j4141L693R346K455j018n738k907J0601O158j2734q791P262P136
2454D142J133j563o131o38J0576L56j4043k702J0070N194R68k925q431J31R756
2469E893j484r354J664O321J304J128k610q070K378Q137m067n751M619L990M58
2484D556J117o833p739O627Q968m117m380L024L54J178J435p554m659R892O052
2499G921o826k600K594L77K159j503r689N42J3853K789r074l251L76J334N054
2514D056k369r054L939J1986k726q590j342J031K518M106m965o873Q495Q797o679
$$ plain form
2410 -1450 5985 406 -3987 1704 2192 -2150 -3679 -7451 -7456 5018 8449 -2907 -7598 -1766 -173
2425 -173 -1100 -2791 -8478 -4640 8442 6457 -6787 -7787 -441 611 -729 -3771 -6880 2024 12692
2440 12692 2820 -11321 -7628 1718 4173 3155 -2583 -5490 5111 11269 -1465 -10256 -2994 4142
2454 4142 5275 3712 -2419 -3057 7519 7875 -6168 -8870 1200 6394 7362 4437 -3994 -3863 5893
2469 5893 4409 -4945 -3281 3040 4344 5472 2862 -5208 -2830 5307 1240 -4511 108 4098 4556
2484 4556 5673 -1160 -8899 -2272 6696 2579 -1801 1223 1577 2755 4190 -3364 -8023 1869 7921
2499 7921 1095 -1505 1089 1466 3625 2122 -7567 -7025 6828 9617 543 -2708 -2332 -998 4056
2514 4056 1687 -7367 -3428 8558 5832 -2758 -4100 -3069 -551 3555 -1410 -8283 212 9009 2330
2529B330p793p89Q30M934N459o281n402P334L309o669k312J426r38N005L919o947
2545b585k349O382p43n524J106N97n13O998J784q050j710L927j386n8L350k713
2561a487r78O718o84p173Q20L302j858J785J789m175K255O750m999q037K694M242
2577I64Q17K960k012o202M301N658o899m839N228K731O26J804n647l409P569K725
2593F375r149k607O710K700J897n97q813k225R371J392o602L94L366K53K092j428
2609C129q113J434Q534j573n415J984J423O47L240m204q397M296Q506j686l080
2624G25j14k835J184N272m098o588O126N532l583j969j85k740L235L805p197l802
2640g232Q767L987m258k618l268j029P273K553q243j521Q080K06m148j424k783
$$ plain form
2529 2330 -5463 -6252 -5422 -488 4971 -1310 -6712 622 3931 -2738 -5050 -3624 -4562 443 4362 -2585
2545 -2585 -4934 1448 705 -4819 -3713 -3116 -3629 3369 5153 -2897 -4607 -680 -2066 -2124 1226 -1487
2561 -1487 -2465 4253 3569 -3604 -2784 518 -1340 445 2234 -1941 314 7064 2065 -5972 -3278 964
2577 964 1781 4741 2729 -3473 828 6486 -413 -5252 -24 2707 3333 5137 -510 -3919 3650 6375
2593 6375 -2774 -5381 1329 4029 5926 5329 -3484 -5709 3662 5054 -1548 -1154 2212 2465 4557 3129
2609 3129 -4984 -3550 4984 3411 -2004 -20 1403 2050 5290 1086 -7311 -3015 5491 3805 725
2624 725 611 -2224 -1040 4232 134 -6454 -328 5204 1621 -348 -533 -3273 -38 3767 -3430 -7232
2640 -7232 1535 5522 1264 -1354 -4622 -5651 1622 4175 -4068 -5589 2491 2697 -1451 -2875 -5658
2655e658J940P988k380r159L332Q284k142n035k268j575N735Q170o151q875M987
2670b807N547l244j922j367q75P049M388q979n216P321L346l053j975k417O17
2685c587R171J820j0903l104O524J686k41L23l908N9P574j188q703J111N638q
2701B264M33m78m993K328P825l936p857K102L874J574K494l159o393L966O394
2716F438n325m158L858J974P14J151n017m201P185M159p597k743M521J849J717
2731D525m08p178k569Q849J986o735K92K961m63J403j551o137K431Q198k557o598
2747c551K295K136J69J729l148o450N346O961l892l837J605j128P64L344l977
2762a634m177P001L283n230k283J336o45K465K893o623k543P505J964m148j460
$$ plain form
2655 -5658 -3718 4270 1890 -7269 -3937 4347 2205 -2830 -5098 -6673 -938 7232 1081 -7794 -2807
2670 -2807 2740 -504 -2426 -3793 -4668 2381 6769 -2210 -7426 -105 3241 188 -1787 -4204 -3587
2685 -3587 5584 7404 -3499 -6603 -79 1607 1366 1689 -2219 -2160 5414 4226 -4477 -3366 2272 2264
2701 2264 2697 2219 -2774 -446 7379 3443 -4414 -2312 1562 3136 5630 2471 -3922 44 6438
2716 6438 1113 -3045 813 2787 3501 4652 -365 -4566 2619 6778 -819 -3562 959 2808 4525
2731 4525 4117 -3061 -5630 3219 5205 -1530 -1238 1723 1260 2663 1112 -5025 -2594 5604 3047 -3551
2747 -3551 -1256 880 1049 2778 -370 -6820 -1474 5487 1595 -2242 -637 -1765 -1001 2343 -1634
2762 -1634 -5811 1190 4473 -757 -3040 -1704 -2349 116 3009 -3614 -6157 1348 3312 -836 -2296
2777b296r33j518N730K512o544j500N723l77l128M98j932K20O930r77p722J359
2793c955N638q46j573p94l783K824P709k849p259K346L009j085Q85p63l285M155
2809C74M764n251m570M532K277j533J505k686k823O341L156o671k554L860L27
2824A048K25K564l938j897O096j87o361J561L745j141J166l81n372J470P200k396
2840C402o488K121K492K6K778j865o386K714O293l440l756K187J244O58K301n516
2856a235m222O450N600n662m103J773J133L417J934p300m345Q076L862m565k385
2871a572J5l8M793O19q088p64Q689O05n303r01n28J035N878j435q622J382P448
2888C213j015l118m52j863J035N429l123n469M169L974l790j315M67j496L339
$$ plain form
2777 -2296 -3229 -4747 983 3495 -3049 -4549 1174 797 -2331 -1833 -3765 -3545 3385 2408 -5314 -3955
2793 -3955 1683 837 -736 -1530 -5313 -2489 5220 2371 -4888 -2542 467 -618 267 -496 -3781 374
2809 374 5138 -113 -4683 -151 2126 593 2098 -588 -3411 2930 6086 -585 -3139 721 1048
2824 1048 1273 3837 -101 -1998 4098 3911 -2450 -889 2856 1715 2881 2500 -2872 -1402 5798 3402
2840 3402 -3086 -965 1527 1553 4331 2466 -3920 -1206 5087 1647 -2109 78 1322 1980 4281 -1235
2856 -1235 -5457 993 6593 931 -3172 -1399 -266 3151 5085 -2215 -6560 1516 5378 813 -1572
2871 -1572 -1557 -1595 3198 3817 -4271 -5035 3654 4259 -1044 -1945 -2473 -1438 4440 3005 -5617 -4235 3213
2888 3213 2198 -920 -1372 -3235 -2200 3229 106 -5363 -1194 2780 -1010 -2325 -1858 -3354 -15
2903a5L592n765m197O009K474l126k64j090j795N033K435o503j385N803k76k714
2919a784P60j881Q95N535j029p847J008P091m69j728j535l248K768P188k968p580
2935d824K720M424n65K7k171l468N038N744o087o030M649L769k60j63m201l665
2951e063O976N165o639l746L422J248O13J850n195k284O967J604o313m56L428
2966A577n17P65O36n403O23O787p15n335P14J219n39K904n10n020K137M864l183
2983A004l001K885m8n21K367k652l618N053L448n116k308K495n86J925K456m828
2999a045k961N792J972m984m6J055p41L189L91o311n29P371j14m824n85l23J345
3016a348N435j536q009Q01O708o86k539j15k069J594N232k864o814L595M735k141
$$ plain form
2903 -15 3577 -2188 -6385 -376 2098 -1028 -1292 -2382 -4177 856 3291 -3212 -4597 1206 930 -1784
2919 -1784 -1024 -2905 -2010 3525 2496 -5351 -4343 2748 2279 551 -984 -4232 -1464 5724 2756 -4824
2935 -4824 -2104 2320 1755 1782 -389 -3857 1181 6925 838 -5192 -543 3226 2966 2803 -1398 -5063
2951 -5063 1913 7078 439 -3307 115 1363 1976 3826 -1369 -3653 3314 4918 -1395 -1851 1577
2966 1577 1060 1825 2461 -2942 -2319 4468 3753 -1582 -868 351 -188 2716 2206 -2814 -677 4187 1004
2983 1004 -1997 888 840 319 2686 34 -3584 1469 4917 -199 -2507 -12 -598 1327 3783 -1045
2999 -1045 -4006 1786 3758 -1226 -1272 -217 -958 2231 2622 -3689 -4218 3153 3039 -1785 -2370 -2693 -1348
3016 -1348 4087 2551 -5458 -4657 2051 1365 -1174 -1289 -3358 -1764 3468 604 -6210 -2615 2120 -21
3032b1j146k24k445L427M819n391m965M010L104p87O53j825l357L812L457m733
3048a612j950M393j18j262J672k112j900M873R29n718P28M045q21l48O42l977
3064b536k09N897q22m788K393K543k095Q74p40l784K807N271l948m470L681J764
3080A838n28O43l195l518O167M634n067l314K183J029P35R25m029j647O590K071
3096E517o480j195K595N53J893j55n887P4P969J72n624q58R50K88L854l93n724
3113b451R45N632j946l753J196l68P92L922k392n074L181L654k672k039P84j566
3129b155K186M208l732m499L700J772k498J86R30j854K633J878n432j554N132
3144I01P9k624P99j114l08N111o32o771K14M808K49j649R60k413J037M122k893
$$ plain form
3032 -21 -1167 -1391 -3836 -409 4410 -981 -5946 -1936 1168 381 1034 -791 -4148 -336 3121 -1612
3048 -1612 -3562 831 713 -549 1123 -989 -2889 1984 2913 -2805 -2077 1968 1147 799 1441 -2536
3064 -2536 -2745 3152 2330 -2458 -65 2478 383 1257 517 -3267 -460 4811 863 -3607 74 1838
3080 1838 1310 1953 -1242 -4760 1407 6041 974 -2340 -157 872 1607 2532 -1497 -3144 3446 5517
3096 5517 -963 -2158 437 990 2883 2728 -3159 -3085 4884 5056 -568 -1426 -476 -188 3666 3273 -2451
3113 -2451 -1506 4126 2180 -1573 -377 -745 47 3969 1577 -3497 -316 3338 666 -1373 -589 -2155
3129 -2155 31 4239 507 -3992 -292 1480 -1018 -832 98 -1756 877 2755 -2677 -4231 901
3144 901 980 -1644 -845 -1959 -2267 2844 2212 -4559 -4345 463 712 -937 23 -2390 -1353 2769 -124
3161a24n456K794N041j250j592r50k028L604M269n516m928M329L976j105n39k164
3177a639k536M171K965m649k052M548J429j922K81l258q33N293J427n523l64M011
3193A349k43J13j28m086m82O191J52l606Q69J188j581J396j38m143K033N268j485
3210B667l774J308L29k09K171j728l916L578M188k524k699R31p23J126K239k726
3226B38k373N244J351m791j088J316J67J971J277n241J34N548K7n040l30Q77M31
3243b82L844m90n709J643M591k402l623J039J086Q68L624l149n225K994L883k628
3259F4k068P98k4J977L153m203m173L217K256k097M52L96j433K382J867m904k107
3276d447M101R54j113Q17j469j769L848R09n434m10L611K66M21R90l364j104M422
$$ plain form
3161 -124 -5580 -2786 2255 1005 -587 -1537 -3565 39 4308 -1208 -6136 -1807 2169 1064 525 -1639
3177 -1639 -4175 -4 2961 -1688 -3740 808 2237 315 596 -2662 -3495 1798 3225 -2298 -2662 1349
3193 1349 1106 1219 1091 -2995 -3477 2714 2866 -740 129 1317 -264 1132 994 -3149 -1116 4152 2667
3210 2667 -1107 201 530 321 2492 764 -3152 426 4614 2090 -609 322 -401 725 2964 238
3226 238 -2135 3109 4460 -331 -1419 -103 64 2035 3312 -1929 -1795 3753 3780 -1260 -1590 -713 -282
3243 -282 3562 3072 -2637 -994 3597 1195 -2428 -1389 -303 565 4189 1040 -4185 -1191 2692 64
3259 64 -2004 -1206 -1230 747 3900 -303 -4476 -1259 997 -1100 -648 -252 -1685 697 2564 -2340 -4447
3276 -4447 -346 608 -505 312 -1157 -2926 922 1831 -3603 -4013 -402 -136 285 1275 -2089 -3193 1229
3293A229p92m697J902L237k83J09p66l483J547M539k156m258L001K542m29j4k143
3310i15l170L775L273l693j583L781Q12j466o79k648j013N705J866m941p74L168
3326A498o4l69K20l775L02N885k03m122R28J060j088N89K00l312K038M940j999
3343B728l644O83N76k34K302r08l664K753L851k558k210O56j630J286L637k203
3359A421l361L131K544l298j154pp85L479K484m333k919M032J318l114m08n10
3375a480L9M285R81o038m31M119m92k569L15L8J142M200l157n444J765M099j638
3392b66j275P63p54K102K192l836m062L584K549k216M55M58j272K094P43m327
3408c068j766M627J353j451P76k106j087L140N79l906j83L405L70k50M88k796
$$ plain form
3293 1229 437 -4260 -2358 879 596 705 -61 -3544 -1997 2542 386 -3872 -871 1671 1242 1228 -915
3310 -915 -4085 -310 2963 -730 -2313 1468 2280 814 135 -2513 -3526 2179 4045 -896 -1670 1498
3326 1498 1434 1065 1285 -2490 -2188 3697 3494 -628 300 1360 272 861 1061 -2251 -213 4727 2728
3343 2728 -916 -233 343 109 2411 1503 -2161 592 4443 1885 -325 331 -1299 -13 3624 1421
3359 1421 -1940 1191 3735 437 -717 -724 -1509 1970 4454 121 -2798 1234 2552 -562 -970 -1480
3375 -1480 -1441 2844 3825 -2213 -2644 1475 983 -1586 -1271 -1233 -91 4109 952 -4492 -2727 1372 -266
3392 -266 -1541 -778 -1532 570 2762 -1074 -5136 -1552 997 -1219 -764 -306 -1578 516 1259 -3068
3408 -3068 -4834 -207 1146 -305 471 -1635 -2722 418 997 -2909 -3092 313 683 433 921 -1875
3424a875r37L565M2l495J178L070l55K40j122l986J227N489j266l700J340J802
3440A217K18N53k547l757L622M744k781k588J896Q24l05M63l362j694N713K783
3456D999m389j895J719J10Q33j70l090K40N495qm102k01J473o37P53k68k272K144
3474G34M370k727m047R86R73l07J892l97k681K465K135l032k019J759n21K79K743
3491B605j369k706K785P36l246l74J292o66K132K581l838k525K472O43j632N57
3507e53r4q41L409R20m632j676L016P73j147M95j087M78L560j282n605N44L961
3524B39P8m33k87j900J638L079l098m394K972L037p00J2n10j659K006J265l895
3541b550j339M179J523j458J47j376j542K213J169l086K10L528o79q48P44j734
$$ plain form
3424 -1875 -2812 753 795 -2700 -1522 1548 1193 1433 311 -3675 -2448 3041 1775 -1925 -585 1217
3440 1217 1435 1988 -559 -4316 -694 4050 1269 -1319 577 1401 1096 1559 -1803 -3497 2216 4999
3456 4999 610 -1285 434 544 1377 1207 -1883 -1643 3852 3844 -258 -459 1014 377 1130 862 -1410 734
3474 734 5104 2377 -1670 -684 289 -18 1874 1477 -1204 1261 3396 364 -1655 104 -417 -138 2605
3491 2605 1236 -1470 1315 2051 -1195 -1569 -277 -943 1189 3770 -68 -2593 -121 522 -1110 -553
3507 -553 -647 -1488 1921 2841 -1791 -3467 -451 322 -825 -330 -1417 -939 2621 1339 -4266 -3722 239
3524 239 317 -116 -403 -2303 -665 2414 -684 -5078 -2106 931 231 243 -267 -1926 80 1345 -2550
3541 -2550 -3889 290 1813 355 502 -874 -2416 -203 966 -2120 -1910 1618 939 91 835 -899
3557h99j229K526M92k341J624K163j906R4K25k690k97L854L35k228J273n27p23
3574b54J434m87l303J742M012j044j719N4o38K97J915k428k695M220L627k575
3590B158k809l17J29K295J496l273j618M701J366l503j652M1N37K674ql604N92
3607g95M628j371l867m51O55R69L137p39l872J410K852k437k252J245J59Q24K375
3624B470j631k531J634Q98k584K1J403n20J649J868k760k560J950M3q93J698P4
3641B29j560J882J247l439j612K250M87J25J337j799k96K667o09m277J58L046
3657a64R07Ql38k573O59L365j904m061J925L580K19o18j739k553K818K766l735
3674a438k459L457K844n60j075k663j734M284J771l782p65L667K45j259m56j993
$$ plain form
3557 -899 -2128 398 890 -1451 173 2336 430 524 749 -1941 -2238 1616 1951 -277 996 469 -254
3574 -254 1180 693 -2610 -868 3144 2100 381 435 -203 94 2009 -419 -3114 1106 4733 2158
3590 2158 -651 -968 -839 1456 2952 -321 -1939 2762 4128 625 -1027 -986 -449 2225 2217 -1387 -795
3607 -795 3833 2462 -1405 -1856 -1201 -232 2905 2166 -1706 -296 2556 119 -2133 -888 -729 95 2470
3624 2470 839 -1692 -58 840 -1744 -1723 -320 -840 809 2677 -83 -2643 -693 -650 -1543 155 229
3641 229 -1331 551 1798 -1641 -3253 -1003 -516 -391 946 -853 -1149 1518 909 -3368 -3210 -164
3657 -164 743 751 413 -2160 -1501 1864 -40 -4101 -2176 1404 1623 1005 -734 -3287 -469 2297 -1438
3674 -1438 -3897 -440 2404 1844 769 -1894 -3628 656 2427 -1355 -2120 1547 1792 533 77 -1916
3690a916m35L736P20l296J044K300j195j081j6j835J063L389n30k126J327k8k073
3707i52J241P70k006J137K425j127j192P25j498n18K063l65j671J947K186j751
3723A414j665q6j276J550L138k143k168K754J179k659j080j96L34K636J261l654
3739f61o46L224p9l077n39Q01J033L322j349m359O37L558j589k085O22P20J648
3756A181J703k662l225J697K445k108k06J270o32J546J025l025k081K328J021
3771B77j548J473N78j662P46R32k511k82J561l21R7K110j132k429J943N72k215
3788a811L40J172j87J699N93l388j145K578Q88k292Q60R37M65R79j131l438Q16
3805b065L544q32k337J564J042K19P76l204k650L287L370j893k042J779O47k69
$$ plain form
3690 -1916 -2351 1385 2105 -1191 -147 2153 958 -123 -139 -1974 -911 2478 1948 -178 1149 1121 -952
3707 -952 289 1059 -947 190 2615 1488 296 1021 -477 -995 1068 703 -968 979 3165 1414
3723 1414 -251 -337 -1613 -63 3075 932 -1236 1518 2697 38 -1042 -1238 -904 1732 2993 -661
3739 -661 -1307 1917 1838 -1239 -1778 -977 56 3378 2029 -2330 -1693 1865 276 -1809 -1187 -467 1181
3756 1181 2884 222 -3003 -1306 1139 -969 -1175 95 -537 1009 2034 -991 -3072 -744 277
3771 277 -1271 202 780 -882 -136 796 -1715 -1997 -436 -757 -660 1450 318 -2111 -168 404 -1811
3788 -1811 -1471 -299 -486 1213 1806 -1582 -2727 -149 739 -1553 -693 244 709 1688 557 -2881 -2065
3805 -2065 1479 647 -1690 -126 916 1135 1911 -1293 -3943 -656 2714 821 -1221 558 1205 936
3821I36m95k665j15M502J223m180k50J754k05P8k48k659J706M057p65l244L71
3838a99P48r43O98L44j404J534K455j996j990Q51n33j21J894J50k064J447J544
3855B415j993p47L27j380R56L566j689k383J119R35j429o9m42q18K927J966k955
3872C06j941J770Q71j420k43n66N20L326J73m688p83K965Q3q19J20o48J195K740
3890B961k592l879J541K870q43q15K73m46J730J224l594k336L149J811j319J89
3906g6m09l11J358k09l430K10L555O20j587K86m53j104J520m0k187J070K278p78
3924C13L5M63k077r10K104R6r27J370k3p83N89M03k851M17L071j81j293N46k40
3943A22NJ170j158l047K369L201j179j586P60p82L17J040k072j323L535K057l035
$$ plain form
3821 936 441 -2224 -2339 2163 3386 -794 -1044 710 505 583 335 -2324 -618 3439 2674 -570 -199
3838 -199 549 -394 304 648 -756 778 3233 1237 -753 98 -435 -556 1338 1488 -576 871 2415
3855 2415 422 -325 2 -1378 -422 3144 1455 -928 191 1126 -303 -372 -814 -1632 1295 3261 306
3872 306 -1635 135 1006 -414 -657 -1223 -703 2623 2796 -1892 -2675 290 373 -446 -326 -974 221 2961
3890 2961 369 -3510 -1969 901 58 -757 -484 -930 800 2024 -1570 -3906 -757 1054 -265 -76
3906 -76 -485 -796 562 353 -3077 -2867 688 1308 -279 7 -446 -1550 -30 -70 -2257 -1187 1091 313
3924 313 348 811 -1266 -2176 -72 24 -903 467 444 -339 250 653 -2198 -1781 1290 1109 -184 362 122
3943 122 127 1297 139 -2908 -539 2662 1483 -103 657 -125 192 1232 -840 -2163 1372 3429 394
3960C94p02O78l16P61M27k423O06L410k54k758qL30k49J159J00j979J603K151
3978B930j952k210J072L46m62J686n81j211J665O68k591o00J640q72M41J851r17
3995I03j417Q55k08j086Q51L46j256J546J777k566j439J102K18j85J332j074j122
4012a423K494J019l273j218J370P90O79O06k285j02K695k69l596j35K301Q57L90
4029I00m45k666J082K738k181k475J890J848k51L71j324j495J698J056k637m87
4045b378K730O01p21n0j441j022K273O74k251Q50J834m59m83N9j712m17K738m52
4063C73j181J489K64j142K33L67k148R18K313m62r75Q48o04n15J271o49k116J393
4081c23K670q21j203j01j112P08J716j160j860K597J806j823j340k90j27J674
$$ plain form
3960 394 -308 370 54 815 1242 -1181 -575 2835 2581 -177 -185 145 -104 1055 1155 -824 779 2930
3978 2930 978 -1232 -160 186 -276 1410 829 -382 1283 1951 -640 -1240 400 -472 -31 1820 903
3995 903 -514 341 133 -953 -102 244 -1012 534 2311 -255 -1694 -592 -374 -559 773 -301 -1423
4012 -1423 1071 2090 -1183 -2401 -1031 -241 438 1044 -1241 -1343 1352 1083 -2513 -2648 -347 510 900
4029 900 455 -2211 -1129 1609 -572 -3047 -1157 691 440 811 -513 -2008 -310 746 -1891 -2378
4045 -2378 352 953 232 182 -1259 -2281 -8 666 -1585 -735 1099 640 157 216 -1496 -1913 825 373
4063 373 -808 681 945 -197 36 403 -1745 -827 1486 1024 49 897 293 -222 1049 400 -1716 -323
4081 -323 2347 1526 323 222 -890 -182 1534 374 -1486 1111 2917 1094 -246 -536 -663 1011
4097A011J562k835j021L358N93k667n59l23M07K393j22k829M02K897q26k343K8
4114h74M42P98J795j203k268J256J706k099q03J143J20Q69R73j814j577K084J8
4131E66j815K75J372q93J217O04k372o59J501j64p30J399J97j514J203O08k448
4148a653j63J740j97L26P81r57j249J735l98k114O00J609J61K84R7k517M81K417
4166I83q86k126J218P44O59L69j566j937J519K435j869r20J717L70k18n6j722
4183a286j018K765J163k166M2J395o17R5K67j898j67K747k14j518J068K52j113
4200b03J24O43j286Q29J884r65j051R20r53o65J236M63j379J049J168j316l76
4217A22N73j415l9K098k42j267R73P11j646K36m00o70J617J563j725j364J651
$$ plain form
4097 1011 2573 -262 -1283 2075 2668 1 -558 -881 -474 1919 1797 -1032 -630 2267 1441 -902 -874
4114 -874 -432 366 2161 958 -1310 -54 1652 -447 -1250 -107 13 882 1855 41 -1536 548 566
4131 566 -1249 -974 398 -495 722 1326 -1046 -1705 -204 -368 -1098 301 498 -1016 187 795 -1653
4148 -1653 -1816 -76 -273 53 834 -123 -1372 363 -35 -2149 -1549 60 221 505 602 -1915 -1434 983
4166 983 97 -2029 -811 -67 592 961 -605 -2542 -1023 1412 -457 -1377 340 710 492 436 -1286
4183 -1286 -2304 461 1624 -542 -500 895 278 373 640 -1258 -1425 1322 1108 -410 658 910 -203
4200 -203 -79 564 -722 107 1991 1026 -25 895 -58 -723 513 976 -403 646 1814 498 122
4217 122 695 -720 -759 1339 1097 -170 803 1514 -132 104 -296 -966 651 2214 489 -875 776
4234G76K86j200K42n93k29K322M13k574o37K135m14r60J64o13P43K403p32l298
4252a766Q05J797p83m72o7l81R28J998k141k367J691J170r82L91J38q33J364O95
4270A185k113j135J946M45o99O90l42j557J420L63j686j07J666n12n9J307j504
4287f92j031J613L13j734R60P67l65M50L29k305k36K264M9j196J051J73m8L99
4305G61p92k200J536K095j003r14J122m28K03N13j588j325K477J866j832j060
4321e69Q93k3R3M37j995p6L020K09k141Q0M68K4J54K12j626R28K332r26k029M53
4341h2J38l46J386n66j335J314J470j325r98P22n31j73J864p98r04J272K39j727
4359c80J31O99j043Q13J452j055j242J171j65r62Q17l85q37J765O79j823n64J221
$$ plain form
4234 776 1062 -138 104 -489 -718 1604 2017 -557 -1194 941 527 -433 -269 -882 -139 2264 1532 -1766
4252 -1766 -961 836 53 -419 -486 -867 61 2059 -82 -2449 -758 412 -570 -179 -41 -874 490 1185
4270 1185 -928 -2063 -117 328 -371 319 -23 -1580 -160 203 -1483 -1590 76 -436 -495 812 -692
4287 -692 -1723 -110 203 -1531 -571 196 -169 281 610 -1695 -1931 333 382 -814 237 410 362 761
4305 761 -31 -2231 -695 1400 397 -517 605 177 380 893 -695 -2020 457 2323 491 -569
4321 -569 324 301 394 831 -1164 -1240 1780 1989 -152 -72 396 420 574 786 -840 88 2420 1494 -535 -82
4341 -82 56 -290 1096 530 -805 509 1979 654 -344 378 -153 -326 1538 740 -164 1108 1347 -380
4359 -380 -249 450 -593 220 1672 617 -625 546 381 -581 236 -149 -986 779 1458 -365 -929 292
4377B92n67j09M39o84j65K012k23k501K7J785o25J98J1q21K55J939j476j996J270
4396i39J365m76J50k30r83R50J199k215q71J994L57k87L64r82j105J561O65j806
4414a289J63J492j53l67K31q54o97J682j0j337Q54O62k53J99J46j550r1J776k38
4433C66p59P93L4j052J121o6j679Q99J718o85o92O32q86o4J373j008j418J708
4451C35J511j476k65N00q93L59J343j659o49J998N85j518k06L01o14J081L50j537
4469d54K76J575p3j785K06j07N7J464k37j498N38J546j095p35K13kK28J380j270
4488B27j247J089P42j442J66O63q26O64J506j490j634J521K53n91M70P8q19J145
4506D75L09j792k22J113l43K33N55p92n04J538oj916K25Q51J33J91N24j569j7
$$ plain form
4377 292 -275 -384 55 -629 -794 1218 995 -1506 -1479 306 -319 -121 -110 -931 -676 1263 -213 -2209 -939
4396 -939 426 -50 100 -130 -1113 -163 1036 -1179 -2050 -56 301 14 378 -604 -1709 -148 517 -1289
4414 -1289 -1126 366 213 -154 77 -777 -1474 208 198 -1139 -285 377 124 323 469 -1081 -1172 604 366
4433 366 -393 400 434 -618 503 437 -1242 -343 1375 690 -2 630 -256 -320 1053 45 -1373 335
4451 335 1846 370 105 605 -288 71 1414 -245 -894 1104 1689 171 -35 266 -348 733 1083 -454
4469 -454 -178 1397 1324 -461 -255 -362 -305 1159 922 -576 -38 1508 413 -322 -109 -111 117 1497 227
4488 227 -1020 69 811 -631 -465 198 -628 36 1542 52 -1582 -61 192 -399 71 149 -670 475
4506 475 784 -1008 -1230 -117 -460 -227 328 -464 -968 570 564 -1352 -1127 -276 -143 48 572 -997 -1014
4525a014J955r33j675J188N67J5K79n27j313R57J409j305j077J013O65j98L98
4542D04q96q84J174Q66j218m25J242J14m32N58j550k15J976l8j298M75Q43l88
4560C08L7r4j473L70K067n20j010Q31j23o23L73L91j498R57J639j377k15L77n86
4579a69J34J152n58j286Q77J333j103j80O8q46R49J197j268q08J302O93j506K58
4597B39k32n34J447O54k037j64J521l83o39J25o4n34J821k78j362J75Q28j49p08
4616b74J57m89N17R48n65j240O77R24j088N8L64m00L72J132j456r32J258J29o16
4635e24K98Rn45R63L97j204m09J156l62j28M86n47k95J080J39j303k54J156k53
4654a40J61M42j127n70J696o70j010O79P49n61P18P4j803M63J781r54r14Q81R0
$$ plain form
4525 -1014 941 8 -1667 -479 88 103 382 -145 -1458 -501 908 -397 -1474 -461 204 6 404
4542 404 -492 -1376 -202 664 -554 -979 263 377 -55 503 -1047 -1262 714 676 -622 -147 696 308
4560 308 345 251 -1222 -852 1215 695 -315 516 393 -230 143 534 -964 -7 1632 255 40 417 -169
4579 -169 -35 1117 559 -727 150 1483 380 200 268 -578 371 1568 300 -508 794 1487 -19 239
4597 239 7 -527 920 1574 -463 -627 894 511 -128 -3 -67 -601 1220 942 -420 -245 583 434 -274
4616 -274 -117 -606 -89 859 294 -946 -269 655 -433 -375 -11 -411 -39 1093 -363 -1295 -37 92 -524
4635 -524 -226 -217 -762 201 598 -606 -1015 141 -221 -349 137 -410 -705 375 514 -789 -1043 113 -140
4654 -140 21 463 -664 -1234 462 -208 -1218 -539 210 -351 367 441 -1362 -899 882 -72 -986 -105 -15
4673a5N3M03m59j479J499J020j212n77R21j16m9L80j121m90J647O30j463OQ50
4692D28n28L48M13j486J48J883n28j142M58K04m02R16k62j159O34J009m54r28
4710d48O11j38P3P47k58j197J009O50r53j48J54o28N05Q36p40p05J305M4r37M85
4730B67j01m80O76M59r43n32J480k21q71K55j69n54J485O5j216k02J129k92m78
4749b43L80n77Q0J258m58j665O72P16j88K76n15n14R13P84o89j249Q38K60j58
4768g9M44o73n62O62R02j412l9O83l91J73L78n23k80R71L40j246j70Q77l93N30
4788A92k9p39R6J016l83p80L22K52j80M49j99r64L69J437q80n83N37j02J83O07
4808F21n06j234Q53R39p98m49O83k15J61O78r25q54J448O08r25j78K49l94L36
$$ plain form
4673 -15 38 441 -18 -1497 2 1022 -190 -767 154 38 -11 369 -752 -1242 405 1035 -428 -422 428
4692 428 -100 248 661 -825 -677 1206 678 -464 -6 198 -204 712 450 -709 -75 934 480 -448
4710 -448 163 25 98 845 587 -610 399 1049 96 -52 102 -526 -21 815 75 -630 675 719 -218 267
4730 267 166 -314 362 821 -122 -654 826 605 -266 -11 -180 -734 751 816 -400 -602 527 235 -243
4749 -243 137 -440 -360 898 440 -1225 -553 163 -25 251 -264 -778 135 919 230 -1019 -181 79 -79
4768 -79 365 -308 -870 -208 694 -718 -757 -74 -465 -292 86 -437 -717 254 594 -652 -822 55 -338 192
4788 192 163 -576 -480 536 153 -627 -305 -53 -233 216 17 -947 -578 859 -21 -604 -67 -169 14 621
4808 621 115 -1119 -266 673 -125 -574 109 -106 55 733 -192 -1046 402 1010 85 -93 156 -238 98
4827I8O88j014m73J879n13l91k16j20j92P03J85j278L87R75j94n52M78n59R1Q66
4847H48m15r08N68P15p92o0K49k92K11P88j014m64J115J47q66M3O01p75M36O92
4867H27r62m67J020ml61L42k80q21J210K44j284L9Q38k06m83M63n53j63J044l03
4887A40p53K87N76n42k36M28q27M18J348o89j241O99N67j83M6k97o74Q56O54j015
4907d38m51R63j13m47N84o16l60R72M03r13k34N97l14K9N83o91k8J060l89q41
4927f44N50j23K4L75K20j165J80J294n12l93L93J24m90Q07k31p80K59P23n26j16
4947c1N06o34L41O80n23r54R43J51m11K20j31k19N86L85r70j24P01J76n22J08
4967B78j72j41P81p8p91J07P11k77n60L63k59K5P12m19q47O40N58l55j6J0m76
$$ plain form
4827 98 786 -228 -701 1178 665 274 58 -62 -254 449 634 -644 -257 718 524 -28 450 -109 -18 848
4847 848 433 -475 93 808 16 -44 205 -87 124 912 -102 -566 549 696 -170 -127 474 -301 135 827
4867 827 -135 -602 418 414 53 395 115 -706 504 748 -536 -497 341 135 -348 115 -438 -601 443 140
4887 140 -613 -326 250 -292 -528 -100 -927 -509 839 150 -1091 -392 175 -8 38 -259 -933 -77 577 -438
4907 -438 -889 74 -39 -486 98 -518 -878 94 497 -416 -650 -53 -367 -338 245 -446 -474 586 197 -644
4927 -644 -94 -217 -193 182 402 -763 -583 711 199 -194 199 323 -167 640 409 -371 -112 611 85 -31
4947 -31 475 -159 182 862 339 -615 328 479 68 288 157 -62 524 909 -61 -185 516 692 170 278
4967 278 106 -35 746 668 -123 -16 695 418 -142 221 -38 -13 699 280 -567 73 631 276 260 270 -206
4988b06M05M99n86j008R66P16p11O6O0p23N22O32j092m33J174J09o32M22m62n33
5008h15Q52P14r85k36Q16o57J16L30r38L1J144q9p84j4K05p9K03L63j039J46J139
5029D23m74n97J34N08n33O33n25o44J061J046j298n11N94MlM23n30n42J198J69
5049E36p69m12M13J76L27J5n77l42J074M1p08l73P95p9L51J63j112K66Q02l91
5069A96n30L04M41m54N51mj066M60O40l38m69O74j58J83M84n77o88O07L61n88
5089B9J05L43o19O14L30q91l13P95K18l22K83j40o67O93L37j020k18Q61j04k95
5109A9K44m16j1N55k14q12K92J112l56k41j93n35K35O71o70l91J002o4l47K1k94
5130c93m70O85P36r87l86Q83k85j20N4j81l25O38L38p55J65N72o22q6J20l06L14
$$ plain form
4988 -206 199 698 112 -896 70 786 75 141 201 -522 0 632 -460 -893 281 390 -242 180 -282 -815
5008 -815 37 751 -234 -470 346 -311 -195 135 -803 -772 372 283 -501 -515 -310 -389 -186 177 -862 -716 423
5029 423 -51 -648 -514 -6 -539 94 -431 -1075 -14 1032 -266 -777 -183 -179 -182 241 -289 -831 367 536
5049 536 -233 -645 -232 -56 271 286 -291 -633 441 482 -226 -599 196 117 468 631 -481 -215 587 196
5069 196 -334 -30 411 -43 508 504 -562 -102 538 200 -269 405 247 430 914 337 -351 256 617 29
5089 29 134 477 -142 472 802 -89 -402 393 611 289 572 432 -235 458 795 -225 -443 418 314 19
5109 19 263 -153 -164 391 177 -635 -343 769 413 172 -21 -556 -321 350 -320 -711 291 227 -120 -99 -393
5130 -393 -863 -178 558 -429 -815 68 -217 -337 -283 -464 -789 -151 187 -568 -403 169 -453 -539 -419 -725 -411
5151d11O57J33o08l13K87j48K75J6q06O55R77p31m67L69k4n37P55K04p02M31L37
5172C49l80m95L62J74j25O30n76m35O89O69q30k37L39m46N99K41o35j81N84J37
5192D33q57O76jl20P67p2o31J77J89n1o70N30j10K73L70j30r20J55R48p79J26
5213A03O86o30j67O79n65q13P06O14l83L8J94m83p7J170j017n64O10J25j60M66
5233E32n42l94M86L49p67R5N39l5k20K17o39j56P87K40j203L32M23p8K05j28r23
5254h80L41O67J09n91Q9K84m5o5l08m02N05P50m97n47L57l9j00K09n16q4P09M71
5276D17m78j93L62l86k52M07l76O8N45K45m28l49K74l03N5N65m41K5R35o83n59
5297e50M49J47j31M51J24q64K83R81n90p94N27J43n5N07j27q05M70K03m46P0K70
$$ plain form
5151 -411 246 379 -229 -542 -255 -403 -128 -112 -918 -263 714 -17 -484 -115 -139 -676 79 283 -419 12 349
5172 349 -31 -526 -164 10 -115 515 -61 -496 193 862 32 -205 134 -312 287 528 -107 -288 296 433
5192 433 -424 252 251 -69 698 626 -5 172 361 310 -360 170 60 333 703 573 -347 -192 756 -23 103
5213 103 789 159 -8 671 106 -707 -1 613 230 268 462 -21 -98 1072 55 -509 101 226 66 532
5233 532 -10 -404 82 431 -336 -241 298 263 43 260 -379 -535 252 492 -711 -379 44 -34 171 43 -880
5254 -880 -539 128 237 -354 -265 19 -26 -91 -399 -801 -296 454 -43 -590 -233 -272 -372 -163 -679 -763 -54 417
5276 417 -61 -254 108 -278 -530 -123 -499 -431 114 359 -69 -418 -144 -447 -392 173 -268 -243 692 9 -550
5297 -550 -101 46 -85 366 490 -374 -91 890 300 -494 33 176 121 628 501 -304 166 369 -77 -7 263
5318B63j83K15M90n23n62M77K22q90N85M41l72K88K53o98p70R48K19m60N36k66
5338B13k50O97l78q80J93P48j71k97O28l75J63J67n87m92M32P96n52J15k84j99
5358c13M57K4k19l88N38J85l87Q6L6m86K15K66l16L15J98j64k93K38n30j46N03
5379a81L13k11J58K70l28j29K7n86J87M67j39o54N27K72m42J76j87j24N48L79
5399C43l68j03K5j67J12J13k24m02O05O29n43j43j62Q1j58L83k44O9N69J05j212
5420f92N48M12m72K42K52m12k07P24m19l51J13O34p39N91L89o29J4L77n96j7L82
5441A44l4K33O5L0n85J78k0j79J83L61j78P9L37n66o20M77K97k13K56K55n54N39
5463D85L73j032n22O20L12jK79k21m16N86j78o21k41Q82o0j07p0k77K73J11k62
$$ plain form
5318 263 80 295 785 262 -300 177 399 -491 94 535 163 451 704 6 -764 184 403 -57 479 213
5338 213 -37 660 282 -598 -405 343 172 -125 503 128 291 458 -129 -621 -189 607 55 170 -114 -313
5358 -313 144 168 -51 -439 99 284 -103 -17 19 -467 -252 14 -302 13 211 47 -246 -8 -538 -684 -181
5379 -181 132 -79 79 349 21 -108 -81 -667 -480 -13 -152 -806 -279 -7 -449 -273 -460 -584 -36 343
5399 343 -25 -128 -103 -270 -158 -45 -269 -671 -66 563 20 -123 -285 -204 -362 21 -223 -154 415 520 -692
5420 -692 -144 268 -204 38 290 -122 -329 395 -24 -375 -262 372 -367 224 613 -16 -2 375 -221 -238 144
5441 144 110 343 408 438 -147 31 11 -168 15 376 198 277 614 48 -572 -95 202 -11 245 500 -54 485
5463 485 858 -174 -696 -76 236 235 514 293 -123 463 285 -336 -577 305 245 138 68 -209 64 175 -87
5484h7k91J85O33k25o0l2o49K79P12p12j10O81O4n3k28k60k14K85K74n3O4K53
5506D56j78m09O2m33JN70J60n43L61k1k02j74K89j44k78P31Q6o22L81j89n38O48
5528A4k36k18N51L61j93m01rj3n1J38J94m96K92O86n17l89J01P2J62P9m25J70
5550a28M69op15j83L92K90L05l5o59O1N64m14m68L99L08P5p9M4n59L44L70p88
5572d13N8L42K38M9m7n8o3j6J92k30j59L88J7k97K24l7l79J87L42j52K04J45m87
5595D8q3L37m84p1L31J56L0K24l7p56M11Q7k95P8M78l86L69l29n51K45L48Q2m70
5618b38L80J24o6j28K18o99J35O64k64m89M29L94m20l32L0k93O09K69l75k6J87
5639A09k7m18J82qj87K45K77p18L59J32l84O4J60k21M54J00K00m48j10j82l3J87
$$ plain form
5484 -87 -378 -193 440 215 155 123 -526 -247 465 -247 -357 324 388 335 107 -153 -367 -82 192 139 203 456
5506 456 278 -131 -69 -502 -501 69 229 -314 47 26 -176 -350 -61 -205 -483 248 334 -288 93 -96 -634 14
5528 14 -222 -440 111 472 279 -122 -131 -144 -195 -57 137 -359 -67 619 102 -287 -186 -114 48 127 -298 -128
5550 -128 341 335 -380 -563 -171 119 424 389 -270 -209 355 -59 -527 -128 180 255 176 220 -339 5 375 -413
5572 -413 -355 -13 225 274 227 169 106 90 282 52 -107 281 298 1 225 188 -191 -4 338 186 390 535 48
5595 48 -35 302 -182 -253 78 234 264 488 451 -305 106 193 -102 -24 454 68 437 108 -443 -198 150 232 -238
5618 -238 142 266 200 72 290 -409 -274 390 126 -363 66 460 40 -292 -262 -555 54 323 -52 -78 109
5639 109 82 -336 -154 -162 -349 -104 173 -545 -186 -54 -438 -374 -214 -435 19 119 319 -129 -239 -421 -454 -267
5661b67N01p18L05M33k42k77L6J39k47O70q4n18M94M9k10o47L01j72L87O93o16
5682A0l09M00K2k59J23j37K45K76L30n62m72K85L18m80Q2Q3K49L88l51m85p2Q45
5704E29m23k40J25M40n1K30m58l80J02O6J23P1M10k09k6K2m90m5O94j8l55L06
5726D23l52P1j11J84n11k95Q84M5m10L87j44n04L86O1p0O0K30l75L9K84j025J18
5748f25P49m1n54M98J3m4k88Jl17K16O02l13K4k23M78k73n1k71q7N13L55j65o87
5771d90L36O4j64P0k95J42O76o1n89l9K24l1l43K95jM0K34J16p33K64J78k93n4
5794d54K93K97Q6Q9m83j04K4N18l44R2K69j02K2K73k98k07J29q6L03J2J2m18J6
5817f1Q0K17j73M92l66j18N93m72k31j71L74k90L79J00o3J42L3p03n6M97K06o6
$$ plain form
5661 -267 234 -484 -179 254 12 -265 -229 -90 -337 333 249 -269 225 274 64 -583 -282 -454 -67 626 10
5682 10 -299 101 123 -136 -13 -150 95 371 701 139 -333 -48 270 -210 -128 -45 204 592 241 -244 -316 529
5704 529 106 -134 -9 431 380 610 152 -228 -126 -60 63 134 544 335 309 331 -159 -204 490 472 117 423
5726 423 71 142 31 215 -296 -591 293 338 -72 315 171 -333 53 114 44 104 334 -41 -2 282 -743 -625
5748 -625 124 83 -471 27 40 -4 -292 -291 -608 -392 210 -103 -79 -302 176 -97 -148 -419 -506 7 362 197 -490
5771 -490 -154 -90 -254 -184 -479 -337 339 278 -311 -350 -126 -157 -500 -205 -206 -166 68 184 -549 -285 -107 -400 -454
5794 -454 -161 136 222 311 -172 -276 -252 266 -78 14 283 181 203 476 178 -29 100 14 317 329 341 -77 -61
5817 -61 19 236 63 555 189 71 664 192 -39 -210 164 -126 253 353 290 432 465 -238 -294 203 409 343
5839C43P7j58k58N57l89k94j50O58n75M08k06j42J10Q0k25m83O90J22k28L06k4
5860B19m68J95K9j36l2L91J47k98J34j72m58L31o0mJ17K10k24j15L0k56M6L14
5882f0K10k00J13j83m34K55J4l19L46M74j02J61k93k50m5L15n14p1K21P84l35
5903H7o74K77pq9N40l98j19M60J89n43q5L00j08J19P7k7m0L57r5o05K60Q3k04
5926b45M28kJ05m39J97K58n74J76J50K69K61j20k97o4j7l43o5M98o2j14L26N3
5948C79n04k2L19j18R3K45n2J79j90m43j62J31L89j49j8P5J2K50k00n31k0L93
5970E6q9K50J83l99J87K32n58j52L32J80p7J24k70j66J67L83o88j9L76K39J23
5991D14k24k50k63L0M10J6m11M18N7m43K21k75N8J59K50k60p7N03m83L9M7J2k99
$$ plain form
5839 343 420 262 4 561 172 -122 -272 386 -189 219 13 -129 -19 61 -164 -647 43 165 -63 243 219
5860 219 -249 -54 -25 -161 -193 198 345 47 181 9 -449 -118 -178 -182 -65 145 -79 -194 -164 -420 -374 -60
5882 -60 150 -50 63 -120 -554 -299 -285 -604 -258 216 114 275 -18 -268 -313 2 -512 -583 -362 422 87
5903 87 -587 -310 -317 -406 134 -264 -383 77 266 -277 -362 -62 -170 -51 26 -1 -41 316 221 -384 -124 -41 -245
5926 -245 183 181 286 -153 44 302 -272 -96 54 323 584 464 167 103 86 -257 -322 176 114 0 326 379
5948 379 -125 -147 172 54 147 392 340 519 329 -114 -276 -145 244 95 77 152 164 414 214 -317 -337 56
5970 56 -33 217 400 1 188 420 -138 -290 42 222 145 269 -1 -167 0 383 -305 -324 52 291 414
5991 414 190 -60 -323 -293 117 133 -278 140 197 -246 -25 -300 -242 -83 167 -93 -170 333 -150 -111 -64 -52 -351
6014c51N83j08k23K40k17j82M6P3o4N3K94k58J87r5p1J5p6R1l83O26m8j49j33
6037a50K1M4k56N3M9K96J3J1j38K15k00j43M25j09k18N9K51j42k99N4K49q3J34
6060A36R0l55K05J2n9m60N43m9P3K65p4k59j0K78m49NM72K07o39J61L2n7MR4r6
6085G0K86j5j36j84K05l58R1J1Q7j35L81j8j85j69Jj46L55p1J61j56p1J03j50
6108d3J98k63R7n8J36Q5k43j1k05P7M11m66P9L99P8m83N6j34pR6R4o7R9J51k6
6133E0p7k68O7k09M21K9k8r7Q5J69n29M44j79k26R77n87n0R2l40J4j39O2L36R2
6157A09M9k27K6k35K98j88j21K12j89M56lj68k79L31K9j96K87n5l1J88on45J68
6180i0J14n6K9K79r7j30J62k19j39J40k1O4L75k76j60J29j97Q4k24K51J80j1J56
$$ plain form
6014 -351 232 124 -99 141 -76 -258 -212 -139 -203 -150 144 -114 73 -22 -93 -78 -154 -63 -446 180 132 -17 -150
6037 -150 -129 -85 -341 -288 -239 57 70 81 -57 158 -42 -185 240 131 -87 -28 223 81 -218 -164 85 2 136
6060 136 226 -129 76 88 29 -431 112 63 136 401 327 68 58 336 -113 -108 364 571 -68 93 125 68 72 166 70
6085 70 356 341 205 21 226 -132 -41 -30 57 -78 303 285 100 -69 -68 -214 141 70 231 75 4 107 -43
6108 -43 155 -108 -11 -69 67 152 -91 -102 -307 -230 181 -285 -206 193 271 -212 -156 -290 -297 -201 -107 -174 -75 76 50
6133 50 -27 -295 -228 -437 -16 13 -15 -112 -27 142 -387 57 -122 -348 629 42 -8 84 -256 -242 -381 -319 17 109
6157 109 158 -69 -43 -278 20 -168 -289 -77 -266 190 187 19 -260 71 100 -96 191 136 105 293 287 -258 -90
6180 -90 24 -32 -3 276 179 49 211 -8 -147 -7 -28 36 411 135 -25 104 -93 -9 -233 18 198 187 343
6203C43j65j72k68N85k95k47M71J8k8K27m20n00L17L70p6k66M66j51l29J72q6
6224c4r3K57j34M0OO9k74M21q6o1k02L02l63J41k28K43l54J62q1K58J21j72K9
6247c3k23K26Q8j98Q5J49m38N56j78p4l22K24j67J82J08J31o8k02J35j59K25j33
6269h6O4mJ34j98J13M2m47L59k0k42M21p2N4l72J66n1O3J94l45j03M47J59j54
6292A22J9l72j25J42J24j22r2J38L1l5K52l71M38m1k56J96q0m2p3j0J25M08j80
6315A96k94K85l4p2J5J6qOJ73j95M6N4k38J68k72J79L44l32j28k10N04j30K7j29
6339b9M48k78k8J02P8j33j49k43N7M20j01K08J32l43p2j93L44l00J09m3j6K52
6361B22l27Q7J18j28J67l81j6M74k06J29P9n54L73l4O2l41L43Kj01m4R3l16K09
$$ plain form
6203 343 178 6 -262 323 28 -219 252 270 242 469 49 -451 -134 236 160 -106 360 209 -120 52 -34
6224 -34 -127 130 -4 36 42 111 -163 258 172 111 -91 211 -152 -11 -239 4 -350 -188 -269 -11 110 -62 -33
6247 -33 -256 -30 58 -140 -55 94 -344 212 34 -40 -362 -138 -305 -123 -15 116 48 -154 -19 -178 47 -86
6269 -86 -22 -26 108 -90 23 65 -382 -23 -43 -285 136 64 118 -254 -88 -139 -76 118 -227 -330 117 276 122
6292 122 141 -231 -356 -214 -90 -212 -304 -166 -135 -170 82 -289 149 108 -148 48 -32 -74 -147 -157 -32 376 196
6315 196 -98 187 153 81 96 112 104 110 283 88 134 188 -50 118 -154 25 369 37 -91 -301 203 73 100 -29
6339 -29 419 141 113 215 293 160 11 -232 -175 245 144 352 484 141 69 -124 220 -80 29 -14 -30 222
6361 222 -105 -18 100 -28 139 -242 -258 216 10 139 218 -336 37 3 65 -276 67 69 -32 -76 17 -299 -90
6384i0J7O3j5j93K18m07L72m11K80n6K87k20j22J64j27K30l11K02Q0j66N49j54
6406A90k08l1p8j27J10m1J38l3J98l39q5L19m3j16J66j27j03L15Jj38j32J65q
6429gj74J5O0m5P7J52j23K93j56j02K14m29J28L02l80K47m3J37L9j07o4j74j06
6452b46J47K25m3j2j30K49l27K05K83r5j04Jj72J55j77K17j4q4J08m4j50K38M9
6475B79j5k03j35R4J53l4J09l38j04J08k42L57k25J27M1L2r2M32l66M7N8j19K4
6498a2j42j16J45M27l68j4K2j0j19J70J49k77J09k55M14k41N8k52M67J01l98r1
6520b33o1J84p1N0j93j1L81p2J3L8j82j20k1J5M79m32N61k13Nj09k19q7M51j27
6544B6K93n56L32K66l82l6J29J42j62J30k74KR6j7P9l09L85J48J0m27j8J97j41
$$ plain form
6384 -90 -73 -10 -25 -218 0 -407 -35 -446 -166 -222 65 -155 -277 -113 -240 -10 -321 -119 -39 -205 344 190
6406 190 -18 -49 -127 -254 -144 -185 -47 -80 118 -221 -306 13 -30 -146 20 -107 -210 105 106 -32 -164 1 -7
6429 -7 -181 -166 -106 -151 -74 78 -45 248 92 -10 204 -225 -97 205 -175 72 29 166 205 98 34 -140 -246
6452 -246 -99 126 83 71 -59 190 -137 68 351 256 152 153 -19 136 -41 176 162 78 186 142 -8 230 279
6475 279 264 61 -74 20 173 139 248 -90 -194 -86 -328 29 -196 -69 -28 4 -88 344 -22 25 83 -36 -12
6498 -12 -154 -270 -125 302 -66 -80 -58 -68 -187 -17 132 -145 -36 -291 123 -118 -60 -312 155 256 -142 -233
6520 -233 -294 -110 -181 -131 -324 -335 46 -26 -13 25 -157 -277 -298 -283 196 -236 325 112 117 8 -211 -298 153 26
6544 26 319 -237 95 361 -21 -57 72 214 52 182 -92 -90 6 -11 68 -241 144 292 302 -125 -143 54 -87
6567h7J26r5J50r1j81j6L89k26j6o1L72j49J0j20K35j91L6r0k0j05J38M3j65K81
6591A67N5P3j39j01Q9k2k97K88L7j1j21l48K21q8M85o9n5J4l07K62r4R9m4l41
6615b47L49r4J16j53k7J07j02r4o6K99j2j50j3j64J4j19N15%l59jq2M75r1k86
6639a85J10J29l2l47K89j1J46j55N0n3r0r7j67L57R8k41j31Q7L35l32L10o2J09
6662A17L5j20k23K02R8j18J55K5n8J4j50P2J37l27K29j92O0N7J47k9m2K5J3K99
6686D26m8k07Q7k96K60o11M20j28L70j50k84L43Jk57J31P3j18p9J94j70O5J66
6708A88k60J56j49L9N2O6j87L66r6J23j93K59l02J11k80L4j5K23j94J69k65J55
6730@J29Q2l91J75R5l8j44j07O4L08j38k91M9J40J50j62J26j05j37R6j50N1Q1
$$ plain form
6567 -87 39 -56 94 3 -178 -194 195 -31 -47 -108 264 115 125 5 240 49 85 -5 -25 -130 8 51 -114 167
6591 167 222 295 156 55 144 122 -175 113 150 139 18 -330 -109 -197 288 219 164 178 -129 133 39 138 94 -247
6615 -247 102 8 124 -29 -56 51 -51 -145 -211 88 76 -74 -87 -251 -237 -356 159 159 -200 -201 -283 192 101 -185
6639 -185 -75 54 22 -325 -36 -47 99 -56 -6 -59 -149 -246 -413 -56 42 -199 -330 -243 92 -240 70 8 117
6662 117 152 32 -191 11 109 -9 146 171 113 127 -23 49 186 -141 88 -104 -44 13 160 131 89 114 127 426
6686 426 378 171 258 -38 222 -389 31 -97 273 123 -161 182 183 -74 57 130 12 -67 127 -43 22 188
6708 188 -72 84 -65 -26 26 92 -95 271 175 298 105 364 62 173 -107 -73 -88 135 -59 110 -155 0
6730 0 129 211 -180 -5 90 52 -92 -199 -135 173 35 -256 -207 -67 83 -79 47 -58 -195 -99 -249 -198 -117
6753a17j38r1K58j4k31J67k11J55J5l8K68j59J04j50J42j37j12J6j0L57l97L79
6775E6n89M08P5o9J57j62j64K53J81K34n26J9P7L7K70k27K17k43M3O5j01K93k70
6798C4K64n7m1mp0J23j54p2L4j45J25J96r9j43Q5R0N3j09lJ63j19p5j22J45R8
6823A97O4k65J29k10L5K30m2k52J73r6rn6J72J06j21J19k55L32p9j22k4P0p9K80
6847B97l07J3k23J85K97m47k8Q7Q4j18J74J09j45R0K56l22k28M48k24P8j04j48
6869a76K46k02J03j16K99k92j79L68k04J79l8n6J87k78j0o3J89J62l08O6oj31
6891b60jJ97K0k22K20mJ7k38M73j55M9k4j43j24M70k11J50k73L7K09l17mJ51l7
6915b0n3J05j64Q1L6L4j11J47l18K68m8Jn8L02r7N1j53R7j22j55L19l79Q9J92
$$ plain form
6753 -117 -255 -346 -88 -102 -333 -166 -377 -222 -207 -245 23 -136 -32 -182 -40 -177 -289 -273 -283 74 -323 56
6775 56 -533 -125 -50 -119 38 -124 -288 -35 146 380 -146 -127 -50 -13 257 30 247 4 47 112 11 304 34
6798 34 298 241 200 196 126 249 95 23 57 -88 37 233 134 -9 76 166 219 110 107 270 151 76 -46 99 197
6823 197 261 -4 125 -85 -50 180 138 -114 59 -37 -46 -102 70 176 55 174 -81 251 172 50 26 96 17 297
6847 297 -10 3 -220 -35 262 -185 -213 -126 -42 -160 14 123 -22 68 324 2 -226 222 -2 76 -28 -176
6869 -176 70 -132 -29 -145 154 -138 -317 51 -153 26 -12 -68 119 -159 -169 -232 -43 119 -189 -123 -129 -260
6891 -260 -261 -64 -44 -266 -46 -50 -33 -271 202 47 96 72 -71 -195 275 64 214 -59 -22 187 -130 -134 17 -20
6915 -20 -73 32 -132 -51 -15 19 -92 55 -263 5 -43 -42 -100 202 105 156 3 100 -22 -177 142 -237 -148 44
6939D4r9J37K67o83M40L2J55l30M16k86j38j23K46R2j21j53K21j84R9J05L7j8
6961A56j2k86J41J36l22M46j80L46k58j04l04K87n5r7O3m9O7l1R2J59L8o07L47
6984b7k00L65l80L32l24L80Mj41m9k01M03k47J87j24o8J57j49L0N4l49L58j0k82
7007b81L26k8J15l46j53K50k1j0n5J23k5J35L17n40p9J16K52j83J11j58L0Q9K16
7030B01k66M7P6p5J75j10n5J41o4k60r9M42l5k19L85j37l30K08P7pl65K31M66
7053D27k92m18M77m58K86M56k90k99J13p4K0K61Q3o06N18Qj50J27j69R8qJ2K57
7076C79k61n3L18n4j97o7Lj36L33o2j86K2k53K37J44q1L9j42R0k93M30No1K31
7100C85n54J39m3Q0M6k95K31J74k91K51O8l28J60j56J36j5j3M9j76O4N1Rk39L76
$$ plain form
6939 44 -55 82 349 -334 106 138 293 -37 379 93 -45 -168 78 170 49 -104 117 -67 32 137 174 156
6961 156 144 -142 -1 135 -187 259 79 425 167 63 -241 46 -9 -106 -43 -92 -25 -56 36 195 233 -374 -27
6984 -27 -227 138 -242 90 -234 146 150 9 -40 -241 162 -85 102 -22 -90 67 -82 -52 2 -347 11 1 -281
7007 -281 45 17 132 -214 -367 -117 -138 -148 -203 -80 -105 30 347 -193 -272 -156 96 -87 24 -134 -104 -15 201
7030 201 -65 -18 58 -17 158 48 -7 134 70 -190 -289 153 118 -101 284 147 -183 25 102 95 -270 -39 427
7053 427 135 -283 194 -264 22 478 188 -111 2 -72 -52 209 292 -314 204 212 62 189 20 118 110 122 379
7076 379 118 65 383 329 132 65 68 -68 265 203 17 39 -214 23 167 86 125 -17 73 -220 210 215 154 385
7100 385 -169 -30 -73 7 53 -242 -11 163 -128 123 191 -137 23 -133 3 -12 -25 24 -152 -88 -37 -28 -267 109
7124A09M8k04j32L25k63j95K3J06J78J51k84p5J1K42K14l07J28J51j80m6K36q6
7146A50k36R0J06J56l74k53M83M4m71K49N4J26J25k26j80k35L51K44k21L96m07
7167b9nM8J54j33r4M1k41K54J72j25j49J01N8J49k79L56l8l77m4M48j63q8K3M3
7191H2N8j83K19l3j68O4J87j94o8R0K6K6k9L2k39k3M91l60K83M3l57L94j56L6
7215B21k74p7M10j86J90k54j79j8K12PO6J13j41k9j86K85j63m7k6l0p9K51l7l94
7239c65K59j02J29k85L43j75L32J54m97J28K8k42O6R1Q7j5J44k59L05l35M5k8
7261a92j68M50j56K08r5k79K45k12J93J01l23K9M0M53l77J02K6k63K45j1j13m8
7283a45N4J08m4j59M7L20j13M2R8L0n11K12K15l05K46l6N0J82j78l05j32L22O9
$$ plain form
7124 109 157 -47 -179 146 -117 -312 -289 -183 -5 146 -138 -213 -202 40 254 -53 75 226 46 0 236 150
7146 150 -86 4 110 266 -108 -361 122 166 -305 -56 -2 124 249 23 -157 -392 -41 203 -18 378 -29
7167 -29 -34 14 168 35 -59 -18 -259 -5 167 42 -107 -6 52 201 -78 278 240 -137 -181 267 104 16 39 82
7191 82 140 -43 176 143 -25 39 226 32 -36 54 80 106 77 109 -130 -153 338 -22 261 304 -53 341 185 221
7215 221 -53 -130 280 94 284 30 -149 -167 45 52 118 231 90 61 -125 160 -3 -50 -76 -106 -185 66 29 -365
7239 -365 -106 -208 -79 -364 -21 -196 136 290 -207 -79 -51 -293 -227 -136 -49 -64 80 -179 126 -209 -164 -192
7261 -192 -360 90 -66 142 47 -232 13 -199 -6 95 -228 -199 -159 294 -83 19 45 -218 27 16 -97 -145
7283 -145 -91 17 -27 -186 -139 181 68 110 208 238 -273 -61 154 -151 95 59 109 291 113 -192 -324 -2 67
7306F7R2k8k3j27K86k33p8J11m9K13k82M03l93J76j11l8l36M96j29J1K47l02R1
7329F4j26K15j99K3j18J7L18q5p6k02K82J21j48r4J54l4J22k89O8j39j1M60n68
7352b45J78J77m34K47K10j04n0j12J82q8J90m70O33m53l2M0J0M58l94k1K37k92
7374a33k82J58K34NL96k52n20J97J82j48j27M71O3n23L2J97j81j58K24K23J05
7395A63m8k72J58k56J13N3J32j83j49K97j37p0J30j41L29r8n6J83k36K56m0k93
7417a65j89M94m08J50k0k2L39m17K62k83N32j57n9j5L44l56j47L39k04j51L18
7438A85q3J52J38om76K14m4n4R5K85m71J11m7j33J1L17Q4k77K42l01J9R6m2q6
7462g1L4K08j49K7k52K57L01r9k50M3j19J38N7j03Pq6j30L07k59L43r0J24l63
$$ plain form
7306 67 159 131 108 -19 267 34 -44 67 18 231 -51 352 -41 135 24 -14 -350 146 17 28 275 -27 64
7329 64 -62 153 -46 -23 -141 -124 194 109 33 -169 113 234 86 -8 146 112 234 -55 13 -126 -137 323 -245
7352 -245 -67 110 -324 -77 133 29 -21 -133 49 -39 151 -319 314 -139 -171 -131 -121 337 -57 -78 159 -133
7374 -133 -415 -257 -23 -18 378 126 -394 -197 -15 -163 -290 181 244 -279 -247 -50 -231 -389 -165 58 163
7395 163 115 -157 1 -255 -142 -89 43 -140 -289 8 -129 -199 -69 -210 119 21 -35 148 -88 168 128 -165
7417 -165 -354 140 -268 -118 -138 -160 179 -238 24 -259 273 116 57 42 386 30 -117 222 18 -133 185
7438 185 102 254 392 386 -90 124 80 26 121 406 -65 46 -1 -134 -123 194 278 1 243 -58 -39 57 15 -71
7462 -71 -37 171 22 49 -203 54 355 256 6 49 -70 68 125 22 29 -57 -187 120 -139 204 114 238 -125
7485a25MJ38j06l9j07J65K5J75j63j0J08l59K67J58m35j33L63j4%j23j42M66m25
7508c12K39J49r0K5np1l75N56l70L94j52l6K9Pj71q2K02J79l21J04L54j2k78l6
7532g3L16l5m33K20n0j6K61m42JJ29k9R1K5L57m86O2J64PK86j65o6k85M2O02n23
7557d0J69j27L24p1j35j09L3K9j82K06M02k99j86P6M9p1j67L59k54K06k2l22K62
7580A30J3j8j43k88N37l70N21k47m54J87P7L18k50L2j58Q4K79l29J56p3N2J29
7602A85k80J05p9j9p1K13Pk4m7l51N41j56j04P6J30J48j40k06m5n0J32j68J31
7625g2N7j66M05l56j88K21j39M67k62k85O21o5j83Lj82RJ28k07P6l6L53l05K29
7648A23m17j11N68N5m00OJ84J1K94n42O44o40K06j2j09P3m4J88k19Q3O6k3j97
$$ plain form
7485 -125 -121 17 -89 -128 -235 -70 -45 130 -33 -43 65 -294 -27 131 -304 -437 -74 -88 -88 -211 -353 113 -312
7508 -312 -73 76 -14 11 6 -65 -440 116 -254 140 -12 -48 -19 -12 -183 -265 -63 116 -205 -101 253 241 -37 -73
7532 -73 243 208 -225 -5 -55 -71 190 -252 -251 -122 -151 -60 -35 322 -164 -102 62 69 355 190 124 -161 -119 483 -40
7557 -40 129 2 326 255 120 11 44 73 -109 97 499 200 14 90 139 68 -99 260 6 212 190 -132 130
7580 130 143 125 -18 -306 231 -139 382 135 -319 -132 -55 263 13 45 -113 -29 250 -79 77 4 56 185
7602 185 -95 10 -69 -88 -159 54 61 37 -10 -361 180 24 -80 -4 126 274 134 -72 -117 -167 -35 -203 -72
7625 -72 -15 -181 224 -132 -320 -99 -238 229 -33 -318 303 238 55 58 -124 -115 13 -194 -118 -154 199 -106 123
7648 123 -294 -405 163 218 -182 -176 8 19 313 -229 415 -225 -19 -31 -140 -67 -111 77 -142 -59 7 -16 -213
7671b13M4M01j88N6J15p6J97j61kM0r5j89r1J96J23J7K40n73J61J22k35J97r6
7694a0R8J18J29m05L69N6j64j04r6K50Q6O1j62k55J69j47J42K1j72K66l17J7K93
7717B43m27J13j04J19Q8j92K49l16K61m6L07k08J70o35M05J89k28L9k90mL17R2
7739A42q6j44J21r5K20n31M05n3r9J84n6J76J7k68j98M76l90K49jk69J23O4L7
7762B4k58k5K12O1m30K18R9j64M7L67j41j10K00k8l30J53p5J96j38J40J34q1J37
7785B08l07k50K38J34j0l2p1K04r9J48o4J44k98M08L1m25K41l54L60j72k66L22
7807I0k31K24J93j19p0J1j98k3j17L58j67J07P3j18J16k30K06Q4jk68L18j40O
7830A04j05O3k68L11k15L16p1p8p2k05K45j15k0P5K05l2O2j41M3k74j58K69K49
$$ plain form
7671 -213 -169 232 44 100 215 139 336 175 173 213 118 -71 -162 34 157 174 414 -159 2 124 -111 86 -10
7694 -10 88 206 335 -70 299 355 191 87 -9 241 327 388 226 -29 140 -7 135 156 -16 250 -67 -50 243
7717 243 -184 -71 -175 -56 32 -160 89 -227 34 -12 295 87 257 -378 27 216 -12 27 -263 -267 50 142
7739 142 56 -88 33 -62 158 -373 32 -21 -120 64 8 184 201 -67 -265 211 -179 70 69 -200 -77 -13 24
7762 24 -234 -259 -47 14 -416 -198 -99 -263 -216 151 10 -100 100 72 -258 -105 -180 16 -122 18 152 71 208
7785 208 -99 -349 -111 23 13 -19 -90 114 15 163 99 243 -55 353 384 -41 200 -154 206 34 -232 90
7807 90 -141 83 276 157 87 98 -100 -123 -240 118 -49 58 131 13 129 -101 105 189 188 -80 238 98 104
7830 104 -1 62 -206 105 -110 206 135 57 -15 -220 25 -90 -110 -35 170 138 200 59 102 -172 -330 -61 188
7853A88l86Q9J73J7j57L20j77j46n6K72p1k22J95j25p8K28j13jQ4J50k72j95J7
7876b66K72l1Q8j49J24j83K37l11n8K15k17L26j59O5J28k23p9L63k07k30M30M0
7898A75n0k43L30o8l77J62J98m09k40O19K5m6m37K31J26p0M76m69J56L80k94l17
7920a42M11m63L34k82R0M8k6J45j78l21M16J28Qj26J02R1O6k19j04J78kJ02k61
7943eQ8O5K9L4j76j23O6J89j81K02K22j37J4j18j72j02J39J07j77m6L52l26ON16
7967D66o47K40l61L78l3K95o08N1J25Q4J18j53k9r8J59m07L97k9j10J83J4j82
7989a47N33k80J00k52k3J83m2l33N6J28L3K22j70o9l4L1J7J12k56K17O0k18r7
8012b29pL9J24Jm1l6k6L76j66J31l42k2J35L0k84L85r1n7O7j02q0K2L05j03j00
$$ plain form
7853 188 -198 -109 64 81 -76 244 67 -79 -135 137 66 -156 39 -86 -164 64 -49 -50 34 184 -88 -283 -266
7876 -266 6 -25 63 -86 38 -145 92 -219 -277 -62 -279 47 -112 -47 81 -142 -221 142 -65 -295 135 175
7898 175 125 -118 212 144 -233 -71 127 -282 -522 97 122 76 -361 -130 -4 -74 402 -67 89 469 175 -142
7920 -142 269 -194 140 -142 -52 -4 -30 115 -63 -384 32 160 168 42 144 235 301 82 -22 156 154 256 -5
7943 -5 83 148 177 211 35 -88 -22 167 -14 188 410 273 287 169 -3 -105 34 141 -36 -82 270 -56 -50 466
7967 466 -181 59 -302 76 43 338 -270 -219 -94 -10 108 -45 -74 -172 -13 -420 -23 -52 -162 21 35 -147
7989 -147 386 106 206 -46 -69 114 72 -261 -205 -77 -44 178 8 -61 -95 -64 -47 65 -191 26 86 -132 -229
8012 -229 -236 -197 -73 -72 -113 -149 -175 201 35 166 -176 -198 -63 -33 -317 68 -23 -80 -13 -115 -195 -173 132 29 -71
8037g1J04M2r0l1N0K47l77k4J7O5L9K41r3J7j24J60l06j70K61K63j98J64l6N9
8061B09j74o3N3J44N4j38j72O9J48J75n82L67O4k4k4L2J04l85M76p5l90K29k64
8084a67L14k91M42m27J28L5J66l24J80K82l02n7k01J88N4j07O8J19nj03K3l8k0
8107d3K13k7l2J3j73K11k10J42j89J88n91L89L36j97n9r9m3J22J93k37j61M65
8129B11j16r7nl13J06K95P0l63K69m22L16n6j09L58j11M3k09o7m1K03K0P8j88
8152a28K8K40j18M0j37L9j91K71k91L36M6l56L88k25K02o5Rl76O30k83k58M11
8174B12j77j01j76P3K07J29o8k80O7Q6J14j28j45L37k73J78n0
$$ plain form
8037 -71 33 75 -15 -46 4 251 -126 -150 -133 -68 -29 212 119 136 12 172 -134 -304 -43 220 22 186 150 209
8061 209 35 -28 25 169 223 85 -87 -18 130 305 -277 90 154 130 106 138 242 -143 333 258 -132 97 -167
8084 -167 147 -144 298 -129 -1 34 200 -124 56 338 36 -21 -222 -34 20 -87 -19 100 95 -8 15 -23 -43
8107 -43 170 143 111 124 -49 162 -48 94 -95 93 -498 -109 227 30 -29 -128 -171 -49 144 -93 -254 211
8129 211 95 -2 -7 -320 -214 81 151 -212 57 -365 -49 -105 -214 144 33 76 -133 -200 -241 -38 -18 60 -128
8152 -128 -100 140 22 62 -75 -36 -227 44 -247 89 135 -221 167 -58 144 79 88 -288 342 59 -199 212
8174 212 35 -66 -242 -169 38 167 99 -181 -114 -28 86 -42 -187 150 -123 55 5
8191E
$$ Imaginary data points
##PAGE= N=2
##DATA TABLE= (X++(I..I)), XYDATA
0@%%%qJ6j6K4m0M8n6P2q9J13j44J76k08K48k99L56m18M91n75O64p66Q87j019J163
27F20j326J503j699J917k155K419k710L029l376L757m175M633n140N695o305O982
43C669p730Q561r494J0542j1730J3092j4665J6508j8707K1383k4723K9027l4816
56a9083M3071n5887P8693j31509M68233K34918q69689r5756M02561M45317j45226
67C55643m15283j66020M20877K97942k42201m12552R676K56444J65815j45528
77A24813k42847K9975L20035N9047l03039k31131P6175J81435J41569k4052j51373
88a9393n5758O1187m9239o8479Q5556Q3634n8931n9081M931O1456R7775m5555
100C8103k38758q3443K12563J91819j4890j16571j20075K510J35070R01j72210
$$ plain form
0 0 0 0 0 -8 8 -8 16 -24 24 -32 40 -49 64 -80 96 -112 136 -163 193 -225 266 -309 355 -411 476 -543 620
27 620 -706 797 -902 1015 -1140 1279 -1431 1598 -1778 1979 -2196 2437 -2703 2992 -3313 3669
43 3669 -4061 4500 -4994 5548 -6182 6910 -7755 8753 -9954 11429 -13294 15733 -19083
56 -19083 23988 -31899 46794 -84715 383518 618436 -251253 -347009 55552 500869 355643
67 355643 -59640 -225660 195217 493159 250958 -161594 -151918 104526 270341 124813
77 124813 -118034 -88059 231976 291023 -12016 -243147 -166972 14463 156032 131980 -19393
88 -19393 -75151 -13964 -63203 -131682 -46126 37508 -21423 -80504 -75573 -14117 83658 38103
100 38103 -200655 -284098 -71535 120284 105394 -11177 -131252 -128742 6328 7229 -164981
111a64981L54K18111J10789j05232j89507j11095J37270K55096l5845k95028q5680
122b65748K34292K37237p276k76931k73431R8873L39631R7350j87051j36087L3642
133a05499J13697M9492j42083j53376J27497K27261k0121j64641o0297M6470R5073
144A3473L9534j30018j19583J16670J78121K1328o2307r4818j12587J9419J43071
155A2303P6967K168k3670r5610m5997J21541P8593j01969q1243M6036Q5259P9982
167A54360p961j29994m6773J08250K2619j03864j0441J08522J00838J4999j38136
178G2419j83578L6618J97114N5834q5007n6515j7757K6501O7816k3979j00159
189a0693j2021L2907p044N8780Q9489n8425j34065m8490K0935O5500P9117l5928
$$ plain form
111 -164981 -164627 53484 164273 59041 -130466 -241561 -104291 150805 114960 -180068 -265748
122 -265748 -31456 205781 198505 -78426 -351857 -252984 86647 183997 -3054 -139141 -105499
133 -105499 8198 57690 -84393 -237769 -110272 116989 96868 -67773 -128070 -81600 13473
144 13473 53007 -77011 -196594 -79924 98197 119525 57218 -37600 -150187 -130768 12303
155 12303 89270 91438 67768 -27842 -73839 47702 126295 24326 -56917 -10881 74378 154360
167 154360 146399 16405 -30368 77882 100501 -3363 -13804 94718 195556 210555 72419
178 72419 -111159 -74541 122573 178407 93400 36885 19128 45629 113445 89466 -10693
189 -10693 -22714 10193 3149 61929 151418 92993 -41072 -89562 -68627 -3127 75990 40062
201D0062q6765N0211P2790q6643j14153J0899Q8533R7376m084j58308p2161J71714
213I471J34061j25399j94962m7042J41378K28643M7232k30715j80138R3380J49730
224B5639J3052p3548o9262M2802J51250J3979j84431q8054J13780J04853j0517
235C9543q4434p6073Q1490J83491j7197k28208j09754J07523J54553P5449o7438
246E8945j40174q09J11896j3202r8003J5659Q1679K8437k0237n5378j9557R0400
258C9656L4771j45750r3436J23959J51420J3554r2933j10239M212J16176N20j31104
270h9194J6714J79015O0180j28946j50155j2005J71541J45996j36424k27497N9882
281a10893K57856R2245j56133k18947m5823K03210J77168j08734j72780N7779
$$ plain form
201 40062 -46703 3508 76298 -10345 -124498 -113599 -25066 72310 68226 -90082 -162243 9471
213 9471 143532 18133 -176829 -223871 -82493 146150 193382 -37333 -217471 -124091 25639
224 25639 38691 -34857 -104119 -61317 89933 103912 -80519 -168573 -54793 50060 39543
235 39543 -44891 -120964 -39474 144017 126820 -101388 -211142 -103619 50934 126383 58945
246 58945 -81229 -82038 29858 16656 -81347 -65688 15991 44428 24191 -31187 -50744 39656
258 39656 74427 -71323 -164759 -40800 110620 124174 31241 -78998 -74786 41390 41910 -89194
270 -89194 -72480 106535 166715 37769 -112386 -124391 47150 193146 56722 -170775 -110893
281 -110893 146963 239208 83075 -135872 -181695 21515 198683 89949 -82831 -25052
291b5052J46945k989j33485j18724M7679K04314P7680j79701j42361R2701J38967
302A05974M707j15708j30831K8029J92230Q4755j22247j06768O843K3329J8598
313a1089O755k3544L2717P4684m2130j11423m50O7009J8361j1941l5528k8626
325f5205O8781Q1035o1005j01901K962L6901J4390K3112N547K298M3705k4294
337B6326j30624l5371J24162R7279j9002q1956p2622M5444J31920o283j57852
348g8579n6394J03360J01164J9745o1720q5651K1957Q4098l8158r7161L8768J18449
360F9878M3246n0132j07377o2666Q9948J14979m2525r5144Q479N5585L9453J3262
372G6986o1320p8075K0702N4516P811K8773L1860m9341n6083N407K371L371L9521
$$ plain form
291 -25052 121893 118904 -14581 -133305 -85626 118688 196368 16667 -125694 -32993 105974
302 105974 110681 -5027 -135858 -107829 84401 169156 46909 -59859 -53016 -29687 -11089
313 -11089 -4334 -27878 4839 79523 37393 -74030 -74480 -7471 10890 -1051 -36579 -65205
325 -65205 3576 84611 23606 -78295 -75333 -38432 -24042 -930 4617 6915 50620 26326
337 26326 -104298 -139669 -15507 81772 62770 -19186 -91808 -46364 85556 79273 -78579
348 -78579 -134973 -31613 69551 89296 27576 -58075 -36118 47980 9822 -87339 -48571 69878
360 69878 113124 62992 -44385 -107051 -17103 97876 55351 -39793 -31314 24271 63724 76986
372 76986 15666 -62409 -41707 12809 20620 49393 81253 31912 -24171 -18764 -16393 -13022 26499
385B6499Q370j8549K3232n151o9915o920O1953Q113l4762j5720N95M9959O6984
398I4688n5572j31921j4088Q9805N9893J3496k9093n9245J404L9759l1702l9043
410f1619M9437M2463k5123j7703n42J363K8209p601p8331j3063Q8210M6259k3783
423B8176k0135k6843k3751J4619l587j6490O2776O8880n2398q8991p432M4774
435b0402N2107R886q2516n7008R3068J05293l8257r8775m9961J8936Q2327M5103
447E9801o9123m4664P7736M9643p2053q4134r921P7739J11216r304j43899m9070
459a06033J18322Q3539n5055j04076m7932Q1203J43950J014j39545m9469P6408
470B326L9228l4561m0024P620Q7517O6222r1808j27408L9430J20975K0212o9910
$$ plain form
385 26499 34869 16320 39552 34401 -35514 -42434 19519 27632 -7130 -22850 -22255 27704 94688
398 94688 39116 -92805 -106893 -17088 42805 56301 27208 -32037 -30633 9126 -22576 -61619
410 -61619 -12182 30281 5158 -12545 -13087 -11724 16485 8884 -69447 -82510 5700 51959 28176
423 28176 8041 -18802 -42553 -27934 -31521 -48011 14765 83645 31247 -57744 -65176 -20402
435 -20402 31705 41591 -40925 -97933 -4865 100428 62171 -36604 -86565 -67629 14698 59801
447 59801 -9322 -53986 23750 73393 1340 -82794 -92715 -14976 96240 86936 -56963 -106033
459 -106033 12289 95828 40773 -63303 -111235 -30032 113918 114932 -24613 -74082 2326
470 2326 41554 6993 -33031 -25411 62106 128328 36520 -90888 -51458 69517 89729 19819
482A9819o3011J8624J09008M6565j12803r6184O1009P9945j4772m2572m764M7685
494D8549N3799o0460j36495O116J51048O3193q6027r4869l449R1785P2271q5502
506A9959j35753L2836J37084L0006p8313o4086J1074P3677K0965j10308p4765
517a37624J09232J30997k9115j21635p4914L7158J18102L7815j12346p5508Q0298
528c7540R1356j2927o8352n6612J4488P9869J5192p2395m201Q0292K1400n7376
540f806n9778j9609O0666R4021j4733r4244j1394N9534J8312k1031k9766k1063
552d5891L7945N5197k6581m4691K9161K4959l7731l3891J6L3682O9206J2095r0083
565a6607n3692N3331M5502j3702k1791j6312J4447N1180m702o6926o161N1680
$$ plain form
482 19819 -43192 -24568 84440 131005 18202 -77982 -16973 62972 48200 5628 864 48549
494 48549 102348 41888 -94607 -88491 62557 125750 39723 -55146 -58595 33190 105461 19959
506 19959 -115794 -82958 54126 84132 5819 -58267 -47193 26484 47449 -62859 -137624
517 -137624 -28392 102605 73490 -48145 -123059 -85901 32201 70016 -42330 -117838 -37540
528 -37540 53816 40889 -27463 -84075 -69587 10282 25474 -46921 -51122 29170 50570 -6806
540 -6806 -66584 -86193 -25527 68494 53761 -40483 -51877 7657 25969 4938 -24828 -45891
552 -45891 -7946 47251 20670 -24021 5140 30099 -7632 -41523 -41507 -7825 61381 73476 -16607
565 -16607 -70299 -16968 28534 14832 -6959 -23271 -8824 42356 37654 -29272 -35433 16247
577A6247K150l1885n390J6348M3399L2190n8852q2730K2641P4189K2620j0641
589D0286k2265k8285J7182L6014k3714l0174K5626J5125j3275J4890J2070j8772
601B4708k353q10k8105L797L9440M390p274J3650k2197m5867M735K8818J3532
614B6464J6036j4286n0782N659N5439n791n1208j6704Q670K4781L6420j4688n0788
627c0778O090K6962k8533k6262K3448K9862K0556o166o1256l5057N7595M5327
639B1788l5144l3300P081K0105L2360L624n5426k2441M6583J4655l0396N466L0936
652E891J3155l777m1426m8098L8217Q1019m565n8721j5843K2370L2762J4158m8610
665a3468m8770M7308O5229k0694m5543K238K2422J9303j5792o3185r742R3857
$$ plain form
577 16247 18397 -13488 -18878 -2530 40869 73059 14207 -68523 -45882 28307 50927 40286
589 40286 18021 -10264 6918 42932 19218 -10956 14670 29795 16520 31410 43480 24708
601 24708 22355 21545 -6560 -2763 36677 41067 33793 47443 25246 -20621 -15886 12932 26464
614 26464 42500 28214 -22568 -16909 38530 32739 -18469 -35173 -26503 -1722 34698 20010 -30778
627 -30778 -24688 2274 -26259 -52521 -29073 789 21345 15179 -46077 -81134 -23539 21788
639 21788 -13356 -46656 -39575 -19470 12890 16514 -38912 -61353 -14770 -115 -30511 -25045 5891
652 5891 19046 15269 -26157 -74255 -36038 44981 40416 -18305 -34148 -11778 20984 35142 -13468
665 -13468 -62238 -14930 50299 29605 -15938 -13700 8722 28025 12233 -50952 -60694 33163
677C3163N6702o3007p6058o225M9937N8390j4424q4716j2403Q7893L7791n6511
689A0532n0068K308M1899L9765l3846o5148L5974R2395q909q9907m5034L4602
701c5437P7806M0892o5287p6033M2753P9720j5855o3412k1707L1435N7056R385
713F1316o8694k9437P0788L9104o1967n7520J5714O3785N5511l2295r7760j3578
725e5033Q5456L1479n4552l9256J5065M5690K9479m6571o7855K9421P1545j5421
737B9447o4500j3464M1258N4459N611q3501o5584N9016Q2161j2790n4970k0657
749d3514J7335M1356O158o1268k8606O0471M1986l3736l6198J059K8948L5550
761B9541k2200p0557r8P8512L3420l6432l8275j5713K1427M3970q222m8271J0992
$$ plain form
677 33163 89865 26858 -49200 -55425 -5488 52902 38478 -46238 -58641 29252 67043 10532
689 10532 -39536 -37228 4671 44436 10590 -54558 -18584 73811 64902 -25005 -70039 -35437
701 -35437 42369 83261 17974 -58059 -15306 64414 48559 -14853 -36560 -5125 51931 61316
713 61316 -7378 -36815 33973 73077 11110 -46410 -30696 33089 88600 56305 -41455 -55033
725 -55033 30423 61902 7350 -31906 -16841 28849 58328 11757 -56098 -26677 44868 29447
737 29447 -35053 -48517 -7259 47200 52811 -30690 -96274 -37258 44903 32113 -22857 -43514
749 -43514 -26179 15177 21335 -39933 -68539 -8068 33918 182 -36016 -34957 -6009 29541
761 29541 7341 -63216 -63314 15198 48618 12186 -26089 -41802 -20375 23595 15373 -32898 -21906
774b1906M7569m462k9796q843K911K1578J9369l3676l0976M2136M2838k2264l6330
787a1852j5597L131L5591K5834l2371k2870K9608Q141k7891n455R531P643J8215
800B1658o962l6739P418M2727m754l4333q159L980J6345L1765o746l8226J131
813a0895J7295j1138l99J7884m220m189J1437j2493j4667K0428O046j9958N990
826A121J2891j2880L493J9570j2516j6733K119p018N002L7487M257m1531j3837
839a8575J6002P972R858k646k8588L035L8216n513l4939K351J6570N96m1j4352
853a0054j7677L1276L6622l2560m7967O232K8774K2262N144l4678k7314L5043
865d897K9351l1860k4716J6238J6107Q110n191k9928J723M6557K234n3211j4930
$$ plain form
774 -21906 25663 21201 -8595 -17438 -14527 7051 26420 -7256 -38232 3904 46742 24478 -11852
787 -11852 -27449 -24318 11273 37107 4736 -18134 11474 19615 -8276 -13731 -4200 3443 21658
800 21658 14696 -22043 -14625 28102 23348 -10985 -19144 -15164 1181 32946 26200 -12026 -10895
813 -10895 6400 -4738 -5137 12747 8527 4338 15775 3282 -11385 9043 15089 -4869 1121
826 1121 14012 1132 4625 24195 11679 -5054 -2935 -9953 -4951 32536 36793 -4738 -18575
839 -18575 -2573 5399 15257 12611 -15977 -12942 25274 19761 -15178 -12827 3743 4339 4298 -10054
853 -10054 -27731 3545 40167 7607 -40360 -34128 -5354 16908 22052 -12626 -39940 -4897
865 -4897 24454 -7406 -32122 -15884 223 8333 3142 -26786 -25063 21494 23728 -29483 -44413
878d4413L3736L0628Q946k8192m5219J5633N6675n093m7031k059K9382J8097k424
891A8666l4945k5431M4140M6092l8889n3430J5945M8104K6706k0360o2827k0350
903e6579O8993M9077m6007n0356J1808L8911K3889k3066n6059M542P2671J7233
915E5057o3059l4636L0654M5714J5059m6299n9874K8399Q1337K672o4748k7966
927c7690K5153L8227J2944m2458l9326M1462N2769k9362n2226M804L5817K6601
939C6715j1783n4243j5054O3912L7391m8346m5638J2491L3864K3274j6075m6572
951c0064M164N7082L467n4874j7262L3536L1153M086m0565m2224L5524O5927j6127
964C3823o3217j3107L3539L6528O732m5511l7992M0667M8551k6947m4254M162
$$ plain form
878 -44413 -10677 19951 28897 705 -44514 -28881 27794 22701 -24330 -26389 2993 21090 18666
891 18666 -16279 -41710 2430 48522 9633 -43797 -27852 20252 46958 26598 -36229 -56579
903 -56579 12414 61491 15484 -34872 -23064 15847 39736 16670 -39389 -34847 37824 55057
915 55057 -8002 -42638 -11984 33730 48789 2490 -57384 -28985 52352 55024 -9724 -37690
927 -37690 -12537 25690 38634 -3824 -43150 -1688 51081 21719 -30507 -25703 10114 36715
939 36715 24932 -29311 -44365 19547 56938 8592 -37046 -24555 9309 32583 16508 -30064
951 -30064 -25900 31182 34649 -20225 -37487 -3951 27202 31288 -9277 -51501 -15977 49950 33823
964 33823 -29394 -42501 -8962 27566 34298 -11213 -49205 -8538 40013 13066 -31188 -27026
976b7026K9613K5084p029n0702j7878N6583L5085l9472l8995M461K7607L1106
988B8437o126n0524j2067M6492J7307k7662j2915M250R639J6063j0701l1627J2411
1001a7023L7554q519k8521k91Q050J1037J4442j7268k5409J8428K2122j5625q365
1014i388J1961j660j380M874j3752k402K9385J007l0980j802J8647L944N412k584
1028A1282k3442J847K8765l188j9531P118N393p011P895R92j6271R681J7678j5252
1042E956j1142J1964j596l487J5099n371k1707O604J2191l585Q926K124k7419
1055a1443o197K8681P465j4229n180r028Q26K7194K101l4833l734K7367M678j0368
1069C300q251j1756J4036L1630j5353m3233N835L5718J0329r129k3066k1201K5872
$$ plain form
976 -27026 2587 27671 20642 -30060 -47938 8645 43730 4258 -34737 -30276 -2669 28437
988 28437 22311 -28213 -40280 6212 23519 -4143 -17058 -12808 -3169 12894 2193 -29434 -17023
1001 -17023 20531 12012 -16509 -16800 -8750 2287 16729 -539 -25948 -7520 14602 -1023 -9388
1014 -9388 2573 913 -467 4407 -9345 -11747 17638 18645 -12335 -14137 4510 8454 13866 11282
1028 11282 -12160 -10313 18452 15264 -4267 2851 8244 1233 9128 10120 -6151 3530 21208 5956
1042 5956 -5186 6778 5182 1695 16794 11423 -10284 -3680 8511 4926 13852 15976 -11443
1055 -11443 -17640 11041 18506 4277 -903 -9931 -9105 18089 20190 -14643 -18377 8990 13668 3300
1069 3300 -4951 -16707 -2671 28959 13606 -29627 -23792 11926 22255 13126 -9940 -31141 -5269
1082e269L8682j9971l9057P318K4519Q477k953k1841j5742K9885K3385l1741k4090
1095b8398K1918K0459R36j1568k7508k783M0662J1738l8018j3234K3047J1671
1107H922k491j2482j9986J3221L5170j4555m0451J0541L5062M882j8150k7498
1119b7815j0074M1282L6412l6789m5545J8998L7997O272k1052l2669j2N3359K2005
1132D2369n2983l4481L4145L7415L7l2673l6002J8923O5023O542o4868k7651L6312
1145g892L6588M149l2215l5869K3693N5157r477n4777p191L3920K2551k985l2236
1158f584k2526L5818M0502k8774m5502P091L0348J7361l828l1577j5988L5777
1170A2118K1378l4359k1262K0679J8333K214j1431k5718M751L9435j448m2864
$$ plain form
1082 -5269 33413 13442 -25615 -18297 6222 14699 11746 -10095 -25837 4048 27433 -4308 -28398
1095 -28398 -6480 13979 14915 3347 -24161 -26944 13718 25456 -12562 -25796 -2749 8922
1107 8922 6431 -6051 -26037 -12816 22354 7799 -32652 -22111 12951 17833 -317 -27815
1119 -27815 -37889 3393 39805 3016 -42529 -23531 14466 20738 -314 -32983 -32995 20364 42369
1132 42369 -10614 -45095 -10950 26465 26502 -6171 -42173 -23250 41773 48315 -16553 -44204 -7892
1145 -7892 28696 32845 630 -35239 -11546 43611 34134 -20643 -27834 6086 28637 25652 -6584
1158 -6584 -29110 6708 47210 18436 -27066 -19975 10373 27734 23906 -7671 -23659 12118
1170 12118 33496 -863 -22125 -1446 16887 19101 7670 -18048 -13297 26138 24690 -18174
1182a8174o754L0664J7442k451k2138k6766J8686L9511j3826l8739O773K8281
1194A2509R170q390k7625j6968L4875L3720l0070l6084J4271K8786J0657j1885
1206A2966l6686j2886M3846K8280l0733k6125J0401J4505R413p100l0749j581
1218b6449M1161R752l1932j2407R973P829J0530o890k7343N348L3899k22k2414
1231i165k721p12j294J4099P70j5283Q406J4232j4613p639J0919m467m713J2394
1245B13j000q292J2378J472j7384L910J1499j0596r52J4901j467m679O155j1128
$$ plain form
1182 -18174 -24928 5736 23178 20727 -1411 -28177 -9491 30020 16194 -22545 -15772 12509
1194 12509 21679 13289 -14336 -31304 3571 37291 7221 -28863 -14592 14194 24851 12966
1206 12966 -23720 -36606 7240 35520 4787 -21338 -10937 3568 12981 5881 -24868 -26449
1218 -26449 14712 24464 -7468 -19875 -9902 -2073 8457 1567 -25776 -20428 13471 13249 -9165
1231 -9165 -11886 -12598 -13892 207 977 -14306 -5900 8332 -6281 -13920 -3001 -7468 -12181 213
1245 213 -787 -9079 3299 4771 -12613 -8703 2796 -7800 -8752 6149 4682 3 6158 -4970
$$ [...]
8191F
##END NTUPLES=NMR FID
##END=
