##TITLE=1H_EC-3208(II-35)
 CDCl3, 8 sc, 
 14.11.2019
##JCAMPDX= 6.0         $$ Bruker NMR JCAMP-DX V2.0
##DATA TYPE= NMR FID
##DATA CLASS= NTUPLES
##ORIGIN= UXNMR, Bruker Analytische Messtechnik GmbH
##OWNER= root
$$ XWIN-NMR		Version 3.5
$$ Thu Nov 14 14:00:40 2019 Russian Standard Time (UT+4h)  she@DPX200
##.OBSERVE FREQUENCY= 200.1315
##.OBSERVE NUCLEUS= ^1H
##.DELAY= (6, 6)
##.ACQUISITION MODE= SIMULTANEOUS
##.ACQUISITION SCHEME= undefined
##.AVERAGES= 8
##.DIGITISER RES= 18
##SPECTROMETER/DATA SYSTEM= spect
##.PULSE SEQUENCE= zg30
##.SOLVENT NAME= D2O
##.SHIFT REFERENCE= (INTERNAL, D2O, 0, 15.7039)
##AUDIT TRAIL= $$ (NUMBER, WHEN, WHO, WHERE, WHAT)
$$ ##TITLE= Audit trail, XWIN-NMR		Version 3.5
$$ ##JCAMPDX= 5.01
$$ ##ORIGIN= Bruker BioSpin GmbH
$$ ##OWNER= she
$$ F:/spectra/data/she/nmr/H-F/1/audita.txt
$$ ##AUDIT TRAIL=  $$ (NUMBER, WHEN, WHO, WHERE, WHAT)
(   1,<2019-11-14 13:59:22.82 +0400>,<she>,<DPX200>,
      <created by zg, POWCHK disabled, PULCHK disabled
       configuration hash MD5:
       00 E9 B6 7A A2 85 ED C7 34 08 36 98 17 FE 4E 26
       data hash MD5: 16K
       2D 30 27 7A CF BF 25 F2 B8 D9 B0 E9 33 7E CD E2>)
$$ ##END=
$$ 
$$ hash MD5
$$ C1 93 43 2A E4 8A 02 A7 C1 50 FD C3 13 60 E8 70
##$RELAX= 
##$RELAX= 
##$RELAX= 
##$RELAX= 
##$RELAX= 
##$RELAX= 
$$ Bruker specific parameters
$$ --------------------------
##$DU= <F:/spectra>
##$EXPNO= 1
##$NAME= <H-F>
##$PROCNO= 1
##$TYPE= <nmr>
##$USER= <she>
##$AMP= (0..31)
100 100 100 100 100 100 100 100 100 100 100 100 100 100 100 100 100 100 
100 100 100 100 100 100 100 100 100 100 100 100 100 100 
##$AQSEQ= 0
##$AQ_mod= 1
##$AUNM= <au_zg>
##$AUTOPOS= <>
##$BF1= 200.13
##$BF2= 200.13
##$BF3= 200.13
##$BF4= 200.13
##$BF5= 200.13
##$BF6= 200.13
##$BF7= 200.13
##$BF8= 200.13
##$BYTORDA= 1
##$CFDGTYP= 0
##$CFRGTYP= 5
##$CHEMSTR= <none>
##$CNST= (0..31)
1 1 145 1 1 1 1 1 1 1 1 1 1 1 1 1 1 1 1 1 1 1 1 1 1 1 1 1 1 1 1 1 
##$CPDPRG= <>
##$CPDPRG1= <>
##$CPDPRG2= <>
##$CPDPRG3= <>
##$CPDPRG4= <mlev>
##$CPDPRG5= <mlev>
##$CPDPRG6= <mlev>
##$CPDPRG7= <mlev>
##$CPDPRG8= <mlev>
##$CPDPRGB= <>
##$CPDPRGT= <>
##$D= (0..31)
0 1.2 0 0 0 0 0 0 0 0.06 0 0.03 0 0 0 0 0.0002 0 0 0 0 0 0 0 0 0 0 0 0 
0 0 0 
##$DATE= 1573725562
##$DBL= (0..7)
120 120 120 120 120 120 120 120 
##$DBP= (0..7)
150 150 150 150 150 150 150 150 
##$DBP07= 0
##$DBPNAM0= <>
##$DBPNAM1= <>
##$DBPNAM2= <>
##$DBPNAM3= <>
##$DBPNAM4= <>
##$DBPNAM5= <>
##$DBPNAM6= <>
##$DBPNAM7= <>
##$DBPOAL= (0..7)
0.5 0.5 0.5 0.5 0.5 0.5 0.5 0.5 
##$DBPOFFS= (0..7)
0 0 0 0 0 0 0 0 
##$DE= 6
##$DECBNUC= <off>
##$DECIM= 24
##$DECNUC= <off>
##$DECSTAT= 4
##$DIGMOD= 1
##$DIGTYP= 9
##$DL= (0..7)
0 120 120 120 120 120 120 120 
##$DP= (0..7)
150 150 150 150 150 150 150 150 
##$DP07= 0
##$DPNAME0= <>
##$DPNAME1= <>
##$DPNAME2= <>
##$DPNAME3= <>
##$DPNAME4= <>
##$DPNAME5= <>
##$DPNAME6= <>
##$DPNAME7= <>
##$DPOAL= (0..7)
0.5 0.5 0.5 0.5 0.5 0.5 0.5 0.5 
##$DPOFFS= (0..7)
0 0 0 0 0 0 0 0 
##$DQDMODE= 0
##$DR= 18
##$DS= 0
##$DSLIST= <SSSSSSSSSSSSSSS>
$$ [...]
##$SUBNAM2= <"">
##$SUBNAM3= <"">
##$SUBNAM4= <"">
##$SUBNAM5= <"">
##$SUBNAM6= <"">
##$SUBNAM7= <"">
##$SUBNAM8= <"">
##$SUBNAM9= <"">
##$SW= 24.0689530833862
##$SWIBOX= (0..15)
0 0 2 0 0 0 0 0 0 0 0 0 0 0 0 0 
##$SW_h= 4816.95568400771
##$TD= 16384
##$TD0= 1
##$TE= 0
##$TE2= 300
##$TE3= 300
##$TEG= 300
##$TL= (0..7)
0 120 120 120 120 120 120 120 
##$TP= (0..7)
150 150 150 150 150 150 150 150 
##$TP07= 0
##$TPNAME0= <>
##$TPNAME1= <>
##$TPNAME2= <>
##$TPNAME3= <>
##$TPNAME4= <>
##$TPNAME5= <>
##$TPNAME6= <>
##$TPNAME7= <>
##$TPOAL= (0..7)
0.5 0.5 0.5 0.5 0.5 0.5 0.5 0.5 
##$TPOFFS= (0..7)
0 0 0 0 0 0 0 0 
##$TUNHIN= 0
##$TUNHOUT= 0
##$TUNXOUT= 0
##$USERA1= <user>
##$USERA2= <user>
##$USERA3= <user>
##$USERA4= <user>
##$USERA5= <user>
##$V9= 5
##$VALIST= <valist>
##$VCLIST= <CCCCCCCCCCCCCCC>
##$VD= 0
##$VDLIST= <DDDDDDDDDDDDDDD>
##$VPLIST= <PPPPPPPPPPPPPPP>
##$VTLIST= <TTTTTTTTTTTTTTT>
##$WBST= 1024
##$WBSW= 4
##$XGAIN= (0..3)
0 0 0 0 
##$XL= 0
##$YL= 0
##$YMAX_a= 491860
##$YMIN_a= -329668
##$ZGOPTNS= <>
##$ZL1= 120
##$ZL2= 120
##$ZL3= 120
##$ZL4= 120
##$ABSF1= 10
##$ABSF2= 0
##$ABSG= 5
##$ABSL= 3
##$ALPHA= 0
##$AQORDER= 0
##$ASSFAC= 0
##$ASSFACI= 0
##$ASSFACX= 0
##$ASSWID= 0
##$AUNMP= <proc_1d>
##$AZFE= 0.1
##$AZFW= 0.1
##$BCFW= 1
##$BC_mod= 2
##$BYTORDP= 1
##$COROFFS= 0
##$CY= 11.3945322036743
##$DATMOD= 1
##$DC= 2
##$DFILT= <>
##$DTYPP= 0
##$F1P= 16.9975609425685
##$F2P= -3.02152046262296
##$FCOR= 0.5
##$FTSIZE= 0
##$FT_mod= 4
##$GAMMA= 1
##$GB= 0.15
##$INTBC= 1
##$INTSCL= 1
##$ISEN= 128
##$LB= 0.24
##$LEV0= 0
##$LPBIN= 0
##$MAXI= 10000
##$MC2= 0
##$MEAN= 0
##$ME_mod= 0
##$MI= 1.114404
##$NCOEF= 0
##$NC_proc= 0
##$NLEV= 6
##$NOISF1= 3.799351
##$NOISF2= 2.8
##$NSP= 1
##$NTH_PI= 0
##$NZP= 0
##$OFFSET= 15.70392
##$PC= 1
##$PHC0= -9458.059
##$PHC1= 21.20088
##$PH_mod= 1
##$PKNL= yes
##$PPARMOD= 0
##$PSCAL= 0
##$PSIGN= 0
##$REVERSE= no
##$SF= 200.130013532006
##$SI= 16384
##$SIGF1= 3
##$SIGF2= 2
##$SINO= 400
##$SIOLD= 16384
##$SREGLST= <1H.CDCl3>
##$SSB= 0
##$STSI= 0
##$STSR= 0
##$SW_p= 3612.71676300578
##$SYMM= 0
##$S_DEV= 0
##$TDeff= 0
##$TDoff= 0
##$TI= <>
##$TILT= no
##$TM1= 0
##$TM2= 0
##$TOPLEV= 0
##$USERP1= <user>
##$USERP2= <user>
##$USERP3= <user>
##$USERP4= <user>
##$USERP5= <user>
##$WDW= 1
##$XDIM= 8192
##$YMAX_p= 0
##$YMIN_p= 0
$$ End of Bruker specific parameters
$$ ---------------------------------
##NTUPLES= NMR FID
##VAR_NAME=  TIME,          FID/REAL,        FID/IMAG
##SYMBOL=    X,             R,               I
##VAR_TYPE=  INDEPENDENT,   DEPENDENT,       DEPENDENT
##VAR_FORM=  AFFN,          ASDF,            ASDF
##VAR_DIM=   8192,          8192,            8192
##UNITS=     SECONDS,       ARBITRARY UNITS, ARBITRARY UNITS
##FACTOR=    0.0002076,     1,               1
##FIRST=     0,             0,               0
##LAST=      1.7004516,     0,               0
##MIN=       0,             -329668,         0
##MAX=       1.7004516,     491860,          0
$$ Real data points
##PAGE= N=1
##DATA TABLE= (X++(R..R)), XYDATA
0@%%%%%%%%kK%Qj6J6j6K2k8L0l7M5n2O4p6Q5r7J16j33J49j74J97k21K52k84L20
34A70l59M01m48N00n56O17o85P57q37R28j025J134j260J394j543J718j915K140
52A131k404K716l085L525m053M651n124M028K3145M18542k8810n19917k24013
65c29668K11428L52622L4644l32890j95036K94277L06763j06893k67796o0479
75i3028J43810J63081o0538k27890J979K82396J10392j80121j76084l9386P1298
86d091J42578L7830r2127j0888M2725q0991o5479P4286M6510m1942l5791k8398
98a5778M1196J42929J520k18058j17908J00665J21109N6761k2630j12418j9058
109d1670J18185j8971j70253j9487J47790J08460K553j28497j59729P6332K32036
$$ y = [0, 0, 0, 0, 0, 0, 0, 0, 0, -2, 0, 0, 8, -8, 8, -8, 14, -14, 16, -21, 24, -28, 36, -40, 45, -52, 64, -69, 80, -94, 103, -118, 134, -150, 170, -189, 212, -236, 264, -292, 325, -360, 397, -440, 488, -537, 597, -663, 731, -812, 906, -1009, 1131, -1273, 1443, -1642, 1883, -2170, 2481, -2643, 1385, 24530, 443072, 414262, -105655, -329668, -118240, 234382, 269026, -63864, -258900, 35377, 342140, 235247, -32549, -93028, 50782, 213863, 153325, -74565, -72586, 209810, 320202, 140081, -36003, -75389, -4091, 138487, 176317, 84190, 73302, 116027, 35036, -30443, 43843, 90353, 48411, 12620, -15778, 25418, 168347, 169867, -48191, -166099, -65434, 55675, 112436, 89806, -22612, -41670, 76515, 57544, -112709, -132196, 15594, 124054, 126607, -1890, -161619, -85287, 146749]
120A46749p782k35794j08535J22639K16613J08818j77405k77362J0481K24843
130B3265Q3276q0213q0069j2622R1830P3883j32781j58158Q6262J55620o307p1708
142b7722m3602p900Q1792N4472j22732j19952N4913R4700N6124M9796n7511j44437
154a32059l1995O7911N2194O1049Q207j15069l9333J24110N2915q6695o3014m813
166a06592M7985J06827J6319j07355j0928Q9873j8983r0632j2590N6947J07063
177G7934Q5868r0129j61943J3857J11096K3751j0084p348l7025K0858P0085j6746
189H0174m5895Q637m1724n7468Q6746J21383j3522p6948o7938m0449O4730Q5383
201A03109o1699p2538Q3794P9257n8725r4570n2171M1114J36778K2101j74032
$$ y = [146749, 138967, -96827, -205362, -82723, 133890, 242708, 65303, -212059, -201578, 23265, 106541, 26328, -53741, -66363, 25467, 99350, -33431, -191589, -105327, 50293, 43986, -27722, -71324, -79224, 2568, 57040, -65692, -185644, -130731, -36031, 20093, 69889, 12378, -132059, -164054, -96143, -43949, 17100, 25307, -89762, -129095, -4985, 47930, -38765, -101779, -106592, -58607, 48220, 64539, -42816, -53744, 36129, 17146, -73486, -86076, -29129, 77934, 163802, 73673, -88270, -74413, 36683, 60434, 50350, 43002, 5977, 26835, 96920, 80174, 34279, 42916, 1192, -56276, 30470, 151853, 138331, 61383, -6555, -47004, 17726, 103109, 41410, -31128, 52666, 131923, 73198, -21372, -73543, -32429, 104349, 126450, -47582]
212d7582p4823J57981J29479n8268j61535j32129O4690K37001Q0842j75022j30941
223a10307N1542Q4417K4093o2863r9304M7434J65541P655j48378n5310O1325O3498
235B9343J7990q1653j01967Q6498J81368r115j56213q6947J4909Q6551R3659l2219
247D2204r1593L0811O0171n7201n6056L2160L5207J8762p718n9720J0919J17977
259G5923M59j56657o8461Q5035J00490M0662n5560r4749L5757J01853o5147j40117
271a40512L8228J54513O7657p1533j48174m3438J71513J32577j45956j91062N0518
282a25669J90749J07063p5398j93948o1774J67347J09966j09459r0142P3716J00769
293I3220J2681r7914j30854L3753J80662L8964j36267o5091O5961Q1552K8390
$$ y = [-47582, -122405, 35576, 165055, 106787, -54748, -186877, -122187, 114814, 195656, 20634, -110307, -58765, 25652, 49745, -13118, -112422, -64988, 100553, 108208, -40170, -95480, -34155, 29343, 47333, -34320, -136287, -49789, 131579, 122464, -33749, -120696, -105787, -19236, 74423, 42204, -49389, -18578, 41593, -15608, -71664, -39504, -4297, 14465, 6747, -52973, -42054, 75923, 76382, -80275, -148736, -63701, 36789, 77451, 21891, -72858, -37101, 64752, -395, -140512, -102284, 52229, 119886, 48353, -99821, -143259, 28254, 160831, 14875, -176187, -125669, 65080, 172143, 96745, -97203, -158977, 8370, 118336, 8877, -81265, -7549, 93220, 105901, 7987, -122867, -89114, 91548, 130512, -5755, -70846, -4885, 76667, 105057]
304A05057q1763j27256K1392J34857L5695m6363j1303j6285k9075O908j1808j7249
316c7193O5980N2038o2228n0403K7443J2732l081j123m4800j3441Q3278L8937
328F8139n9451k8574Q291k1736m592J4176m732M7535P3154n6843j23552r154P5137
341b2202N5104J2312o2128o9120O5899J07968l8822j07933k5818L2789N5983M9334
353E3366l4654n2108M3844L2643p2185m7812L9366N0777M4626N498p8777m6998
365f2414O0373L6758l1767p687o63j5271M1676N1075l1860m7642j7119k5843K6079
378b4305R0786J4664o6497j7789J3304j0080M058l828k3975M3746O5406m6577
390C8913p4956K3352M6212n98k5706n1530j1123J03199P4227q0810r8123O17L5574
$$ y = [105057, 23294, -103962, -82570, 52287, 87982, 41619, 30316, 14031, -15044, -8136, -19944, -37193, 28787, 80825, 18597, -31806, -4363, 8369, 5288, 4165, -40635, -54076, 29202, 68139, 8688, -19886, -11595, -33331, -37923, -23747, -28479, 19056, 92210, 35367, -88185, -97339, -22202, 32902, 45214, -16914, -86034, -20135, 87833, 49011, -58922, -84740, -51951, 4032, 53366, 18712, -33396, 10448, 43091, -29094, -76906, -37540, 13237, 57863, 63361, -15416, -62414, -2041, 34717, 2950, -4737, -5400, -20671, 21005, 72080, 40220, -7422, -24541, -50384, -24305, 66481, 81145, 14648, -3141, 10163, 83, 4141, 313, -23662, 20084, 85490, 38913, -36043, -12691, 33521, 32923, 7217, -44313, -55436, 47763, 121990, 41180, -56943, -56326, -20752]
403b0752L7448K2206l6206j9674M9455j531p4251n056N4795Q827j7808j3398j3989
416b9934M0446N2902n8362r1143K2890O6469J3291l795j2180j4056K6764k049
428A1243q3515k0097J03764O2879m8998o6674k7600M6201Q9521k0747j32210k7216
440a13449J14506P7948k3141p2631o4398L0456R0685j6578r2173J6285R5332K4782
452F7624n4938q1100l3803Q9858J01890n7486j13519J6730R0724M2010l3964r5458
464f1432n1070R2712R7007m3543o8337K1615L5284m814l3955m7924K3288J08348
476F7179K3363j04238m8114O0878N3073m325n3770n5502M8277J06456j2127r5422
488a4272q120N3284Q372k7061l0352J0480Q8724M3710j08280r9530N7708R8867
$$ y = [-20752, 16696, 38902, 2696, -16978, 32477, 30946, -43305, -48361, 6434, 15261, -2547, -15945, -29934, 10512, 63414, 5052, -86091, -63201, 3268, 16559, 12764, 584, -13472, 13292, 11243, -72272, -92369, 11395, 74274, 25276, -41398, -68998, -22797, 66724, 45977, -86233, -113449, 1057, 79005, 55864, -16767, -81165, -50709, 39976, 23398, -68775, -52490, 42842, 67624, 12686, -68414, -102217, -12359, 89531, 32045, -81474, -64744, 25980, 67990, 34026, -61432, -112502, -19790, 77217, 33674, -34663, -13048, 22236, 17422, -16533, -64457, -41169, 67179, 90542, -13696, -61810, -932, 52141, 47816, -5954, -61456, -13179, 93277, 81150, -14272, -22392, 30892, 39264, 12203, -18149, -7669, 81055, 124765, 16485, -83045, -25337, 73530]
500G3530J2258n8711o7191J4934J07722K8503j14066p0607N9313O2605k13l7040
512A1037l9087L1716P3353l5231j15952r657R1537N5132j4236o1023n9340L4699
524c7052Q0516k0015p6620k870M0178K4751J4472k5768m6123J5374L1598l1696
536c3255j7512M3368K5420o323j0959m3291k7708N1660M0887l0796j5107J7548
548f068k070N035J0617l1570j7334L4939N174k1173K5793K6329k1190k1081j9689
561c2288k1777L8248O0866j9935m7674N740J0264l243J2206j0877k5974K7893
573f551L1101k6033j3137K1643r315j9490N473n756O862M8136R448m6562j8207
586b2388M419p295K5762L6518j8970k4322J4683J945r11K0637j8712m2582K5817
$$ y = [73530, 85788, 27077, -40114, -25180, 82542, 111045, -3021, -73628, -14315, 48290, 48077, 11037, -28050, 3666, 77019, 41788, -74164, -83821, 7716, 62848, 48612, -12411, -71751, -37052, 43464, 23449, -53171, -56041, -15863, 8888, 23360, -2408, -48531, -33157, -1559, -33255, -50767, -7399, 18021, 11698, 739, -42552, -70260, -18600, 22287, -8509, -23616, -6068, -8138, -3103, 7514, -24056, -41390, -6451, -1277, -22450, 3343, 29672, 8482, -12599, -32288, -54065, -15817, 45049, 25114, -22560, -16820, -6556, -9799, 2407, -8470, -34444, -6551, 24550, -1483, -14620, 7023, -2292, -21782, -16309, -22065, -15203, 32933, 42381, -4181, -22388, -17969, -25264, 498, 37016, 18046, -6276, 8407, 10352, 9441, 30078, 11366, -31216, -5399]
599e399N1112j914j6181p697j8849P837K3301k5659j7899N2354L3684l7878l9532
612b720j3321J3050N2363J4650o6860k8744N9463L4458k7918l4852k8444P237
624b1638N3663R096n0821M27M3902j0974m3959j9518N258M4053M4135m2742o8133
637e7251K4685N4770q650l4553k2072j078M7871L5452m9181m1623L9430K5934
649A3734l4223k4624P402L4295N0017j6337q7629j8075P5568L7386l2317l6858
661c1661j0795L8876N5620k8865p9764O792O6372R625l2469j9452P883M7543K6835
674E6540p2002p2194N0074Q5358M543n0344m6399K633O6057L0908p1888n2763
686f9477M9611N3804n925l2419l2084J1430N5559n173p7300p518P9531L7470l4123
$$ y = [-5399, 45713, 43799, 27618, 19921, 1072, 8909, 32210, 6551, -11348, 41006, 74690, 36812, -2720, -16041, -2991, 49372, 64022, -2838, -31582, 27881, 62339, 34421, -431, -28875, -21638, 32025, 41121, -9700, -9273, 34629, 23655, -20304, -39822, -34564, 9489, 53624, 10882, -57251, -32566, 22204, 13554, -20999, -43071, -44149, 3722, 39174, -10007, -51630, -12200, 13734, -20489, -45113, -37711, -3416, 46601, 30264, -57365, -75440, 128, 37514, 5197, -31661, -42456, -3580, 52040, 23175, -56589, -49797, 16575, 26200, -6269, -25721, -17838, 29705, 56540, -15462, -87656, -37582, 47776, 52319, 1975, -44424, -41791, 24266, 55174, -16714, -69477, -19866, 33938, 28013, -4406, -36490, -25060, 30499, 25326, -51974, -59492, 20039, 57509, 23386]
699B3386n2745l1142L8662P0584j5603p2862N316N9718J4389k6982l4112j1705
711c3096M4593L8287m7710m3461N0307N2914k0879m9082l3069J6773P2127K5336
723G3040o9390l9094M6889L3782j9026k7830j8514K0444N0261j0258o1845L125
735a8416N2113K907l5010k6037m697M4051M9214l6253o7681P896M0692M680p476
748E983j2802j4674K5119K5756l4454l0715K6293J7920j3064n092o272J159L4159
761A9316P700m8487k0116K8101J5350O716O890k3093j5856K5341M445k3174R890
774f977J6989j3950j340J1530j1298J469J7849j9470k2372K3466J7793p642N896
787A1943m708k7231L770J9546r604K590K1036j4782k0277J5520M819j3094Q063
$$ y = [23386, -29359, -60501, -21839, 48745, 33142, -39720, -34404, 25314, 39703, 12721, -21391, -33096, 11497, 49784, 2074, -41387, 8920, 61834, 40955, -8127, -41196, -24423, 47704, 73040, 3650, -35444, 11445, 45227, 26201, -1629, -20143, 301, 50562, 40304, -21541, -18416, 33697, 36604, 1594, -24443, -29140, 14911, 64125, 27872, -39809, -31913, 8779, 13459, 5983, -6819, -21493, 3626, 29382, -5072, -35787, -9494, 8426, -4638, -9730, -16002, -14843, 19316, 27016, -21471, -41587, -13486, 1864, 8580, 15470, -7623, -23479, 1862, 6307, -16867, -6977, 10012, -3938, -5278, 6252, -5046, -3577, 14272, -5198, -27570, -4104, 13689, 6047, 11943, 7235, -19996, -16226, 3320, -6284, -3694, 17342, 2560, -17717, -2197, 2622, -10472, -2409]
800b409J148j8003J2420K0303j6464o484J5533j4081j8608J6238J2581K548J2666
813A7388j6985l6105J7065L7090r954j9943L708J128J2221J6594k6700k5973L2027
826A561K4766k7542j6063J4717J6028J7354j0371n2545q299O0375K7209l4652
838A2538k5713r02J7641L0692j1726n0820N472N2351J748l3297r241Q202K0592
851A7537J5700l6255m1418L7757N5442j5453m3010j6423Q723L5413J9235m2291
863e043l0791M1316L0575k8234k5665R26J5431K6916q000m9994K492O2329J1264
876D3522m8726k9912O951L3682L6628k4847n7224J4482N6359l907m1324j3704
888b8020J3334L4039J7269m6010m1606M5338N1680k5204m7997j2848K5137N0832
$$ y = [-2409, -1261, -19264, -6844, 13459, -3005, -9489, 6044, -8037, -26645, -10407, 2174, 4722, 17388, 403, -35702, -18637, 18453, 8499, -11444, -7736, -6608, 5613, 22207, -4493, -30466, 1561, 26327, -1215, -17278, -2561, 13467, 30821, 20450, -32095, -40394, 19981, 47190, 12538, -13175, -14077, 3564, 34256, 22530, -28290, -22818, 29533, 31281, -2016, -11257, -3055, 17537, 33237, -3018, -44436, -6679, 48763, 33310, -9700, -26123, -17400, 18013, 37248, -5043, -35834, 5482, 36057, 7823, -17842, -16916, -1485, 25431, 17431, -32563, -30071, 32258, 43522, -5204, -35116, -28165, 5517, 42145, 17298, -39926, -25444, 30915, 27008, -14316, -28020, -14686, 19353, 36622, -9388, -50994, -5656, 46024, 20820, -27177, -40025, -14888, 35944]
900C5944J0283o4887l7399M9827M0995k2027k9964r261J7927L9597p116n8009
912c4090o234N5183J6290l3426k4336j295L1152L8124k6683o0190R882N1739O092
925B2208k2728j4670m545K2715K2166l2234l0481L4239L1166k1335k3993k062
937a9554J2090L0735J922m9870j4742M8115K2204k4388j7606n158R738K6837p088
950A3235l9134R832M2907m715l0183p493M260K0857K3376k7583l9961K3176M0486
963B9060o527j9730j1366q250K0620K5901k2471k5032K0567J4024j2478j669k470
976A79p936J9347J2517k8085j1795K2486M278o485O124j2807j3896K1712J2828
989A8467j6879j984M038j4987M706K1182q588j3210J0090m007q420J6424J060
$$ y = [35944, 46227, -18660, -56059, -6232, 34763, 12736, -17228, -26489, -8562, 31035, 23919, -34090, -40324, 14859, 31149, -2277, -26613, -27908, 3244, 41368, 14685, -45505, -35623, 16116, 22208, -520, -15190, -19735, 2980, 25146, -7088, -37569, -3330, 27836, 6501, -17492, -19554, -7464, 23271, 25193, -24677, -39419, 8696, 30900, 6512, -11094, -16252, -6514, 20323, 13235, -25899, -16067, 26840, 22125, -8058, -15551, -11291, 9566, 32942, 5359, -34602, -11426, 29060, 22533, 2803, -8563, -16813, 3807, 29708, 7237, -17795, 2772, 16796, 4318, 2649, 179, -7757, 11590, 24107, -3978, -15773, 6713, 10991, 4506, 10630, -2177, -16073, 5639, 18467, 1588, -396, 3642, -11345, -6639, 14543, 5955, -7255, 2835, -1172, -9592, 6832, 7892]
1002G892k0109O795J4424j4548l817J2970n682p78J1912j5255j5792K3252J3801
1015A5065j7683m633L057p284J2307J3731k0674q804K1459k198j7466R535R029
1028E441n493N267p058j9740J8629K9251k0143k6744R826J2373O775N028k2281
1041h869j7206L2712K0818l2205j8910J8238J5737O379j1402l5440K521N3228
1053B5601J0899m6607k2106J8153K5345J7343k0561m4929J0933N3645J148m0466
1065a1602j1558J4950K1680J2786k9364l6089L1465M6997j7949m0057m863J7899
1077e705K7717J0097l9858k8309L8423L3192k5195k5060L423J3392J9944l779
1089A8282l7224k062M6533N647m0507j4385J6786K2294J5067k3104m0553J8886
$$ y = [7892, -12217, -5422, 9002, -5546, -9363, 3607, -2075, -2853, 9059, -6196, -21988, 1264, 15065, -2618, -7251, -4194, -11478, 829, 14560, -6114, -14918, 6541, 4343, -13123, -3588, 5441, -52, 5215, -1843, -21583, -2954, 26297, 6154, -20590, -10764, 1609, 8384, 13412, -8869, -26075, 6637, 27455, -4750, -23660, -5422, 10315, 16694, 5292, -30148, -27627, 25601, 36500, -10107, -32213, -14060, 11285, 28628, 8067, -36862, -25929, 27716, 28864, -11602, -23160, -8210, 13470, 26256, -3108, -39197, -7732, 39265, 21316, -18741, -23604, -5705, 22012, 32109, -7749, -36058, 2365, 35557, 10362, -14698, -11275, 2117, 22061, 18282, -18942, -21004, 25529, 31176, -9331, -23716, -6930, 15364, 30431, 7327, -33226, -14340]
1101a4340M7548j1560m0536k819K0344K0402M278l5433k5606M1122L6314l4065
1113E649l8968Q625K9077K5743q761n1766j5345N4877K9087l6741k9801O355K3732
1126A763K5293j3548m8613J719N2693R720l6395j6360R247K2841K1218k4582m4531
1139c9535J6612M8141r41k8018j0297J675J7833J8744k3963k8010K4944K6856
1151B4041j6471j5136K519J855J3271N298k7618q417L3757R842k3411p811K963
1164e318J411J3913n91k3443O933K7331j1529k2113O172P060K498R433j2936j8737
1178a9916K1734K2460k0517j7765N894K300R825J3592j6869j6310J9992R398j8261
1191d443j568N722m821J1497J0899k0703r518J9191J075r960N656m632q743J9368
$$ y = [-14340, 33208, 21648, -18888, -21707, -1363, 19039, 23317, -12116, -37722, 3400, 39714, 5649, -33319, -24694, 4383, 30126, 21365, -30401, -45746, 9131, 38218, 1477, -28324, -21969, 1763, 27056, 13508, -35105, -33386, 19307, 29027, -7368, -23728, -14481, 8360, 29578, 4996, -39535, -22923, 25218, 24277, -3741, -14038, -12363, 5470, 24214, 251, -27759, -2815, 24041, 7570, -7566, -5047, -3192, 10079, 15377, -12241, -20658, 13099, 22941, -470, -8281, -5318, -3907, 10006, 9415, -14028, -7095, 20236, 8707, -13406, -7234, -174, 2324, 11757, -1179, -19916, 1818, 24278, 3761, -14004, -8110, -5810, 4015, 17607, 738, -15572, 4420, 13818, -4443, -6011, -289, -5110, 6387, 17286, -3417, -12935, 6256, 7331, -2629, 3027, -1605, -10348, 9020]
1205I020J1301k1925r226P333k372Q370J4713j6223j5734J7447P658j3574m79
1218c691j200p681J7282J3874k2670j1692J7424K817p579R48j0152k886K8194
1231A2988Q926l1082j0907J4646N354M873J005j9450l40K9724j133k7611j035
1244a4042J1970L696P060m914j9125J2537K5879j7105k6748R396J6024N664M203
1257A4495j5656j4985K2961J5446k8033j4670K0916J2922K12o610k0045K251L3249
1270B2453l031m0124k054L2160J3610n302k0717k4155J8532L8319j5355l8991
1282b4655Q433K9921Q452j0168k7642j7123L5032L2830k9356l4494J6360K7106
1294A4696P707j2798l5689r535M5603K5878l3248k5160J3423J7100P689j0891
$$ y = [9020, 20321, -1604, -10830, -3497, -5869, 2501, 17214, 991, -14743, 2704, 10362, -3212, -3691, -4891, -12572, 4710, 18584, -4086, -15778, 1646, 4463, -3116, -2168, -12320, -15206, 12988, 21914, -9168, -20075, -5429, -75, 4798, 5803, -13647, -13987, 15737, 14604, -13007, -14042, -2072, 1624, 8684, 3770, -15355, -2818, 23061, 5956, -20792, -11396, 4628, 10292, 14495, -1161, -16146, 6815, 22261, -5772, -20442, 474, 13396, 13608, 6998, -13047, -10796, 22453, 19422, -20702, -22756, 9404, 23014, 17712, -3005, -27160, -8628, 29691, 14336, -24655, -16222, 13699, 22151, 11983, -15659, -32782, 2250, 35080, 5724, -28770, -12410, 14696, 22403, 9605, -26084, -35619, 9984, 35862, 2614, -22546, -9123, 7977, 15666, 4775]
1306D775l2179K627M5031Q308l6044j2205J4408J1768O948j5047k7111J6533M0032
1319B7844q041l3272l225J1477R150O970j6472j6889K6542K4599k6177k5248J0645
1332a2097J4146P826j719k2291l584L5545Q870l6603j6599J7378J6183R194q960
1345G289k6158P769L5771p828l8165j767K3367J6009N098k0780k6186K0664L3455
1358B8538j7868l2046N416J9239J5652M938k7169k2873K5526K3046j9951j4929
1370a2481J0510Q856Q976P17k7043j1760K7766J1144j7451k234O964j609P613
1383I968J59k2687k211K1714m83q210R658j569j1541N044J29j1859Q650J3050
1397I812j0521k133J1450q991j0076R058j697o795J3205N003j3132L947O387j4979
$$ y = [4775, -27404, -24777, 20254, 28562, -7482, -19687, -5279, 6489, 13437, -1610, -28721, -12188, 27844, 19803, -13469, -16694, -5217, 3933, 10903, -5569, -22458, 4084, 28683, 2506, -22742, -12097, 2049, 9875, 8156, -14135, -17719, 17826, 26696, -9907, -26506, -9128, 7055, 16249, 7289, -18869, -11100, 24671, 16843, -21322, -23089, 278, 16287, 21385, 605, -25581, -4917, 28538, 10670, -21376, -15960, 3279, 18931, 23869, -3300, -26173, -647, 22399, 2448, -12481, -1971, 6885, 15861, 16578, -10465, -22225, 5541, 16685, -766, -3000, 3964, 2355, 9968, 10127, -12560, -14771, 6943, 6460, -1750, 7908, 6339, -5202, -158, -29, -11888, -3238, 9812, -709, -2842, 8608, -383, -10459, -1401, -3098, -9893, 3312, 8315, -4817, -870, 5517, -9462]
1411i462l231J2822m320p68J5025m078j3665N174r72j1401J0932J1483j1389n84
1425d434J1659p225n555O103j0378o892K0788R052j4373j025L377q012M320O423
1439C828j5144k99K4556K614j6127m013l985j461J9135K234k3431K525K4364P78
1453A5574j2401q919j1635Q336K9635k591k7760K985J9389j319p741j1753j1203
1466a9403K0731K9635j6234k8898Q636J6533j216o065j4691n393L0106J8900k8155
1479D486k1843J4715J1401l080m716j1126N853K8622j840l6191n318K3170N647
1492I780n972o908p372J5796K2326k1020l3527J0915K5604L66p966r048k353K1486
1506A2107J0473l3730k2269K5539K3710m170j1606j3694M37K6774K442l6226r792
$$ y = [-9462, -12693, 129, -4191, -4959, 10066, 5988, -7677, -2503, -3475, -14876, -3944, 7539, -3850, -4434, 7225, 0, -5555, 548, -9830, -16722, 4066, 13118, -1255, -2280, 1097, -6915, -2595, 3828, -11316, -11615, 12941, 15555, -572, -4585, -8570, -10031, 9104, 11338, -12093, -9568, 14796, 15574, 3173, -5746, -17381, -9045, 20590, 17999, -9761, -6776, 12613, 11294, 3553, -8200, -19403, 1328, 30963, 14729, -14169, -5533, 11000, 9784, 3719, -10972, -16365, 13741, 32641, 4486, -17357, -2642, 8759, 5679, 963, -10163, -4310, 24312, 22472, -13719, -19037, 4133, 9780, 3808, -3100, -10472, 5324, 27650, 6630, -26897, -15982, 9622, 9988, 2022, -7026, -9379, 12107, 22580, -11150, -33419, -7880, 15830, 11660, 54, -13640, -13203, 13571, 16013, -20213, -30005]
1519c0005K9395J6509m127j2636j9063M468K7970m063l1118K196K5826R491m242
1532A0601j6554k1682J2635L0385q237k4662O424J6725M661j823j8104j8240J9937
1545g934K5607j3051j5788R388O911l63j918j8029o327K8076J4846k0851q832
1558h265J0343J550p39l281j4178N743K8074j053k3666l28J0579j528j215m968
1572b932q144J7970K1211j7624k3386P570J0785l66Q65p095n161K1397J0681k5440
1586C31j4571J2321O431J618L167r637j488J8652p23k4444k828J1709K496P012
1600A0046L966j4715m051J3639m922j1884N898L111k647J1702L954j7832m536
1613h271P590m524J497R013o850l363J5817j360k0712k700P169J901J0305K700
$$ y = [-30005, -610, 15899, 11772, -864, -19927, -15459, 12511, 8448, -22670, -20474, 5352, 14843, 10601, -5953, -27635, -15000, 15385, 7148, -17514, -11090, 5635, 10296, 8473, -9631, -27871, -7934, 17673, 4622, -11166, -1778, 5133, 4770, 2852, -15177, -21504, 6572, 21418, 567, -8265, 2078, 3628, 2889, -392, -14570, -8827, 19247, 18194, -5472, -5800, 4779, 3251, 2036, -2932, -11076, 6894, 28105, 10481, -12905, -5335, 5450, 5084, 5949, -1146, -6307, 15090, 25771, 331, -14240, -1919, 4512, 6130, 9297, -340, -1828, 16824, 16101, -8343, -11171, 538, 3034, 10046, 14012, -703, -4754, 8885, 3963, -7921, -2023, 1088, -1559, 10143, 14097, -3735, -8271, -681, -5205, -3708, 5305, -1545, -4908, 10909, 9549, -11163, -13863, -6694, -4793, 5512, 8212]
1627H212j6315o19J6521n784j6456K544M708M207J2335l102j7879L854J1219j1301
1641g856o991J0108L654K737P333j0868j3661J0302O488j1599K693J0006j730
1654F16K032L653j4933o712J4582J395q039P703N904n010L298l345j7295K881
1668a3270J9815j7o671L325l072p86R674r110j9677J1680K2768j958q811n254
1682a364n688R107J1958j7710j6921K1766K2697p120j5562j3093m10K2783J0271
1695B0714k6505j1375K7010J6146j2226j7672j2820P697K7382J079k8240k08K6261
1708A7243M031j7368j4454n908J6534K4637j0811k5018Q586J8038p094j3262n664
1721a0510J142J8085J3013j9192j4688J5050O895j3661o436J651O520J7490M23
$$ y = [8212, -8103, -8722, 7799, 2015, -14441, -11897, -7189, -2982, 9353, 6251, -11628, -7774, 3445, -7856, -14847, -4739, -1085, 1652, 8985, -1883, -15544, -5242, 1246, -10353, -7660, 2346, 616, 2648, 6301, -8632, -15344, -762, 633, -7406, 297, 6201, 1191, 4489, 1144, -16151, -13270, 6545, 6528, -143, 3182, 110, -676, 8998, -112, -19789, -8109, 14659, 12701, 3890, -1364, -7052, 2055, 14013, -3697, -20618, 1148, 23845, 16725, 1163, -11930, -12340, 10443, 20714, -5791, -17166, 9844, 25990, 13764, -3908, -16728, -9031, 18351, 19430, -8810, -9018, 17243, 21274, 3906, -10548, -16456, 78, 24715, 13904, -11114, -2528, 15510, 8416, -4846, -10510, -9368, 8717, 21730, 2538, -12150, 2900, 9795, -3866, -10302, -8651, -2131, 15359, 15782]
1734A5782k4752o572J7183J672r919m27R42O736J5147q391k5507J671J7300j6
1748H49l816m78l681R656J3708j6490k4508Q139J8915L978r24q335r579J3655
1762A089J3438k0715j8097J3489J7246M898l093j6549p747J9230Q292k2151q877
1775a9547J7624J2703K477q163j9439k550K2315K464j8601K350J4698K673k023
1788F981q086j4231N807J7726n747j0475J0861P789o697l410o743o558J2729J1183
1802A1129j0603k460J2133l429j0493N14j166K87J2970K196j1934L500P816r919
1816E41n959M673j680L678J2804k888j0611K461j028q871O283Q383o649J180R965
1831A2282m984p433P70p150j165J6218L410j3507J075R105m748n030m157p250
$$ y = [15782, -8970, -15542, 1641, 3313, -6606, -7033, -6091, 645, 15792, 7401, -18106, -16435, 865, 849, -2967, -3445, -7126, 2530, 16238, -252, -24760, -16621, 2294, 6272, 5348, -2987, -12566, 1089, 14527, -6188, -24285, -10796, 6450, 11348, 8255, -8294, -16041, 3189, 11481, -10670, -19547, -1923, 10780, 13257, 5094, -14345, -16895, 5420, 7884, -10717, -8367, 6331, 9004, 6981, -1105, -15336, -9529, 8197, 2450, -8025, 2836, 10625, 3928, 518, -6225, -12783, -54, 11129, 526, -1934, 10199, 6770, -3723, -3209, -4375, -4088, 8882, 11078, -856, 2644, 10460, 541, -5418, -745, -2425, 1253, 14057, 11169, 558, 3019, 1991, -6880, -597, 7786, 1137, 2317, 12282, 7298, -135, 635, -6515, -7680, 8538, 11948, -1559, -484, 8621, 3873, -1157, -5314, -12564]
1845a2564R472K0515o168j8169K210O120j695m94m865o286J5475J5240j4524j5688
1859a1421N181L963L90K621n093l129J5424O650j7533r683N007K046N976P211
1873G610p920m778J1219k30j3866m70L561k59R711N570j2154l678R452l971r450
1888i653L037L100L251J1424l416j7810J364J1159m947m809L595K199O952P182
1902A2628j4978j5949J2317J2659q288o173M205N710J0420k626k4864p862K3993
1915A192J2150j1941p409K158Q098R747j1234k4590N972K8404L318j5340o338
1928e813K578R174O927j7064j7554J7593K4298n623j4448n026R9Q843N543j4830
1942e303p610J9923J1860j1767r049l108j017R474L995j2025J44J5940R47j1386
$$ y = [-12564, -3092, 17423, 11255, -6914, -4704, 1416, -279, -773, -5638, -11924, 3551, 18791, 4267, -11421, -6240, -2277, -1887, 734, -4359, -7488, 7936, 14586, -2947, -12630, -7623, -5577, 399, 7610, -310, -5088, 6131, 5901, -7965, -8435, -4874, -5133, 4578, 10148, -2006, -5684, 3768, -203, -9653, -6616, -3516, -265, 11159, 7743, -10067, -8703, 2456, -2491, -7300, -3705, -1506, 5446, 12628, -2350, -18299, -5982, 6677, -1611, -7784, -3579, 2131, 12551, 9925, -14939, -22801, 1192, 13342, 1401, -6008, -3850, 4248, 13995, 2761, -21829, -15857, 12547, 15865, 525, -5813, -3235, 5939, 12866, -4198, -21752, -4159, 20139, 14516, 68, -4958, -4859, 3984, 9527, -5303, -12913, 7010, 18870, 7103, -1946, -5054, -6071, 3403, 7398, -4627, -4483, 11457, 12404, 1018]
1956A018m059l727k92J2309L778j0786K346Q672o455o972L45k749M090J3226k775
1971G969j2170M072O085o482l981j175j545J1881J2575j2751j3719O676N233l994
1985a326j464k460J777J5618L917k0631j0276J2761O265l154k621m737N959J6226
1999A5854n379k3965k159J4457N025O2k573o255N051J0865j1867j5797P967J2040
2013C326k04N55k495o677M446N140j1583n065J1485L783j237M394m340r947K599
2028e820L300n222N764P877n256k100O176o090q663M884L249q95P082R53q218
2043b979L161M569j0142n677R238M240J377L283o046o911O865Q92j0527K623J2578
2058F544J43k502j421p136P86Q575n678r579J0296J2008l355n900n613o230P808
$$ y = [1018, -3041, -6768, -7060, 5249, 9027, -1759, 587, 9259, 2804, -4168, -3823, -6572, -2482, 10744, 7969, -4201, -129, 5956, -526, -4507, -5682, -7227, 4654, 17229, 4478, -9241, -2565, 2668, -1326, -2790, -5250, -3473, 12145, 16062, -4569, -14845, -2084, 4181, 1027, -1594, -6331, -372, 15854, 10475, -13490, -15649, -1192, 3833, 3895, 1322, -4933, 118, 10983, -884, -16681, -8714, 3326, 3122, 3677, 1182, -5495, -1049, 4091, -7492, -12557, -1072, 2711, 1474, 5868, 1528, -8419, -5820, -2520, -7742, -1978, 5899, 643, -1457, 4719, -1371, -10034, -5150, -1901, -2796, 4286, 5239, -2979, 182, 4751, -5391, -11068, -1830, 2410, 3787, 7070, 1024, -5887, 978, 1870, -8657, -6034, 6544, 6687, 4185, 2764, -4372, -3586, 4989, -689, -10268, 28, 12036, 8681, 2781, -2832, -9062, -1254]
2073a254R557q649n904J2192N455o959m771n666k432J2349O488j1031k157R950
2087G168J56n737k062p205J70J5615M910j1193k397K674k938J643J216q084K228
2102c836J5306q4j1152k801n75M43P350j785j0420O962J4783n098j2623m088N88
2117g030O909R287o780r766J0439R599j1481j0857J181N102R459K962j3411m173
2131h560J5421K709j6419p059O996Q795Q771n094j5782K741J4989n257j4868J452
2145a1165J0901P636K251j2391j2791J0863J2694j0283j0331O439Q495N927r55
2158G290j5088q509J3383Q193r025j932N805J532K512j711j2918k629J4548L696
2172E147o250J002Q52k073M727j610j1965J275J2884K513k797l60o253j863Q533
$$ y = [-1254, 8303, -346, -6250, 5942, 11397, 4438, -333, -5999, -8431, 3918, 10406, -625, -2782, 7168, 7324, 1587, -475, -7680, -7510, 8105, 13015, 1822, -575, 2099, -839, 804, 2020, -6064, -3836, 11470, 11386, 234, -2567, -3142, -2699, 4651, 2866, -7554, -592, 14191, 9093, -3530, -7618, -7030, -121, 9166, 2386, -7380, 3059, 12658, 1177, -9680, -8499, -3397, 6062, 9024, -4387, -8560, 6861, 9570, -6849, -13908, -6912, 1883, 10654, 5560, -10222, -7481, 7508, 2251, -12617, -11165, -264, 7372, 9623, -2768, -15559, -4696, 7998, -2285, -12616, -6177, 2318, 8245, 7290, -7798, -16307, -2924, 5269, -3756, -5688, 117, 1649, 4161, 2450, -10468, -13097, 1451, 5147, -1103, -101, 751, -1322, 3405, 1795, -10170, -8895, 3989, 6502, 3705, 3345, -2908, -4771, 3762]
2187C762k492r524O500J0772j614l948l534o280M445R667o572q049J0180P930
2201A1243m433m990o107l321J0113P263r831l214J1145J496q434l704l229L000
2215c003J1965N37j2354J225R780l399p012j100j558N520J0515l906j0135M048
2229A123L781o912j354L026q46N613O334q424o887M771K75m199N075J384m254
2244a494M998M413p959l874J608k634K096R462k733o871M190J250o734j027J417
2259c892j072P218N941r992o076P165J157o027p3j37J932J0131M27j4534k462
2274a0294Q616j37l115J364j49L474P451p164j3366M561J0053j760j862M86j573
2289c415N419N275j0841r423Q812P310k091Q50r98l534M470J576r962j812J0697
$$ y = [3762, 1270, -8254, -1754, 9018, 7404, 3456, -78, -6358, -1913, 7754, 1182, -6867, 3313, 11243, 6810, 1820, -4287, -7608, 2505, 9768, -63, -3277, 7868, 9364, 930, -2774, -6003, -3003, 8962, 9499, -2855, -1630, 8150, 4751, -2261, -3361, -4919, 601, 11116, 7210, -2925, 1123, 4904, -2008, -3362, -336, -1182, 4431, 10765, 2341, -4546, 225, 500, -3699, 1376, 2760, -1494, 3504, 7917, -42, -3916, -2308, -4942, -2846, 6616, 3883, -2988, 1202, 2452, -4282, -5309, -3892, -4964, 2254, 8195, -1797, -7873, -708, 449, -5578, -5651, -5788, -3856, 6275, 6702, -7832, -10294, -1678, -1815, -4930, -3566, -3715, -241, 7210, 46, -13320, -8759, 1294, -466, -2328, -1842, -3415, 2004, 7279, -3562, -12985, -4173, 3137, 1046, 1896, 898, -2636, 1834, 3410, -6552, -8364, 2333]
2304B333L415k022K68n131l626P775R01r102J190Q883P83Mq62r390j494J0096
2320D021k41p289M178N680q60m80n242q444N780J1998m197q160M276M078N32n98
2336E032q886o499J2257J0771q116o905M270K023J95j969r218N33J6699M046j3759
2351D74n447N314K790J874l919r235N776J5923k982j3650j793L709K273K666m123
2366c50n876R212R318j0078j0653K673M159K803L111o134m639R176L759j0305
2380c824m600M222J064L318L522o246l301P531j356q843J356M403R32M673O47
2395C498j0198r55Q105j723n028K765P66J546P003l397j1012K211P588k472k249
2410c552L064o34L083M903q922r515Q233Q157l015j644j006j775O103K951j1192
$$ y = [2333, 5748, 3726, 3994, -1137, -4763, 3012, 3913, -5189, -3999, 4884, 5667, 5671, 4809, -4581, -6075, 4021, 3780, -3509, 669, 6349, 5489, 5009, -233, -8677, -2897, 9101, 4904, -3256, 1020, 5098, 5630, 5032, -3854, -10353, 1904, 12675, 4559, -2346, 1924, 3947, 4142, 2173, -7045, -6512, 10187, 14233, 474, -4973, 341, 3131, 5005, 1086, -8149, -2373, 13550, 10568, -3082, -4875, -1166, 1107, 3773, -350, -6226, 2986, 12304, 2226, -8427, -5754, -1595, 1208, 4319, -1815, -6454, 2722, 6481, -3824, -8424, -4202, -3138, 180, 3702, -2544, -5845, 1686, 330, -8513, -7157, -2754, -1822, 2851, 3498, -6700, -7655, 450, -1273, -6301, -3536, -2770, -1224, 5779, 2382, -8630, -6419, 1169, -1303, -3552, -488, -1122, 1961, 6864, -2058, -11573, -3340, 4817, 1802, 158, -848, -2623, 3480, 6431, -4761]
2425d761m972J0414M981l615N5k284j790N255o32r930K392J0765L45m132p65l940
2441b614o61P214j979o759M865O295l324j039Q91o020L60O755k117l075N898J078
2457E768n272J361m97n873M533P054l703k232K910k280j998M296l347n594P046
2472B172N688m762j718J075l690J353L450o314j126J0483J488p969k340l95r8
2487b703O172N86r195J872J0037j740q069j064p33K066O961k797p818N346P187
2502F108o109o353P54O44N475O174p356p582O735M445n437k169N86r86O789M382
2518F100q639m257O538L08m044J465J37OP066L14j1001j321P262M15r83J234l711
2535c111Q88P802k511r779J616N697n96J410J29m714L039O257o969p877N919O318
$$ y = [-4761, -9733, 681, 5662, 2047, 2102, -182, -1972, 3283, 2651, -7279, -4887, 5878, 6223, 2091, 1326, -2614, -3275, 3939, 1960, -4799, 66, 6361, 3037, 1998, 2889, -3131, -2771, 3984, 1867, -1208, 4690, 5768, 496, 1857, 1360, -4513, 20, 7074, 3371, 1139, 4049, 1769, -229, 4067, 720, -4874, 2172, 7860, 3098, 1380, 2455, -1235, 118, 3568, -2746, -3872, 6611, 8099, 130, -2210, -2605, -2703, 3469, 4055, -5140, -3268, 6769, 5029, -3040, -4104, -4837, -2771, 4190, 1393, -6425, -1079, 6108, -1, -6354, -5600, -4956, 519, 6693, -663, -8245, -1510, 2935, -2502, -4671, -4085, -5071, 1718, 6100, -2539, -6796, -258, 50, -3994, -2529, -2392, -2386, 4680, 4994, -6007, -7328, -66, 349, -634, 600, -3111, -2223, 5579, 3068, -6711, -5095, 602, 6, 1416, 1545, -3169, -130, 6127, -842, -8719, -2800, 3518]
2551C518m25L1m011m862P141N217r435l824P058L729j49j072n777j828R112N83
2567E006j0148O21Q890J687j420l782p407L145J0908k300r094K861N579l16n67
2582C663l494o057N783Q028n452n586N246K017j733k46m429l662R125N660p295
2597A568l396L229j124M95K324n135k280P988K212o276n63J508k666K412J905
2612B201n856J129Q162j855o686N37n18J1O169k57p593K110O885l878l985J445
2628a979j195J316N954l741o023N708M400o842k229J765j21M745L612p429m769
2643f828P331J741n448Q33O37p00N161R87q409l37P170j662l774K045n02L56O055
2660D656k550q916K090N896j674L57J779m439N71O364l592n980L623K900j857
$$ y = [3518, 3093, 3124, -887, -5749, 1392, 6609, -2826, -6650, 408, 4137, 3988, 2916, -2861, -4689, 4423, 5006, -5142, -4521, 4369, 6056, 4636, 854, -6553, -3408, 7500, 5200, -3894, -1033, 4546, 4230, 3663, 169, -5888, -105, 7923, 2471, -3115, 2131, 4148, 2415, 2169, -2260, -5922, 3203, 8863, 1568, -1828, 1401, 277, 772, 3096, -2039, -4319, 3669, 5881, -395, -958, 550, -2116, 296, 2201, -3655, -2526, 5636, 3781, -2905, -2368, -2886, -2875, 3294, 3037, -4556, -2446, 4439, 561, -3424, -1979, -3174, -1858, 4096, 355, -5668, 40, 4440, -2402, -4631, -2866, -2987, 1758, 5370, -2059, -6828, 503, 2244, -3204, -2371, -1734, -2434, 2727, 3714, -4695, -5032, 2138, 476, -3298, -1253, -1755, -1399, 4656, 2106, -6810, -4720, 1176, -498, -141, 1638, -2801, -2230, 4134, 542, -5438, -1815, 1085, -772]
2675g72K838m11n272L119N037n753m231N084J933K54K628m618n627N934M964n608
2691e01j824L682o88J390K501o278k809P433J021n703J139K816m91J895m40p923
2707d780J012R328n64n837J776Q6n68L228j717o529M332O500l942l585K786o17
2723I09K10K581m531m372P497N072n981k492P38j708L841L014o972j981P831R25
2739D581n627R6l67j247N616M01p965R32P903j246n054m18j681J764P203j944
2755B947q378K516N761k813j690k4k316L201N713m817o379N136L656l482o86r19
2771b574k409O601M415q048m844N933J916j353Q66l051j721O840J335q385m22
2786d901O251p54j116M35l508J087P256k618q371K557M895n70O48n35n188K949
$$ y = [-772, 2066, 1655, -3617, -498, 4539, -1214, -5445, -361, 1572, 1826, 4454, -164, -5791, 143, 5107, -501, -2325, 1357, 669, 2059, 4560, -1718, -4527, 2906, 3927, -1776, -637, 2179, 1688, 3583, 3143, -4780, -3768, 5560, 4996, -841, 935, 1021, 453, 3681, 1964, -4565, -233, 6267, 2325, -1260, 1526, 909, 1119, 3700, -831, -5203, 2294, 7366, 1385, -1107, -369, -2077, 1764, 4778, -2194, -4175, 3656, 4581, -1046, -950, -1317, -2564, 3052, 3453, -4512, -3580, 4323, 3077, -1977, -2395, -4076, -2312, 4891, 2947, -5431, -2915, 2846, 33, -1657, -1681, -3997, -796, 4917, 100, -6279, -1143, 2513, -969, -1655, -2574, -4983, 1618, 6033, -2015, -6859, -926, 990, -363, 503, -2548, -4269, 2571, 3906, -4479, -4901, 1350, 596, -520, -85, -3593, -2506, 4750, 2132, -6239, -3682, 1213, 643, 1291, 756, -4432, -1483]
2802a483O041m927m872M722K820j920O19k039k906N593L669p303k567N584Q06
2817A837J53R96m853k558P262J930o525N21L319r13Q61Q93n602K68P819j344n917
2834a853J703J887l79L297k105p142K988P559k175l997J001q17q4M789l045n987
2850d360M842N075m567k098J449j455K747L260o147l932P062K655m626k56q74
2865a225j727M339K915o600j151N709j102l161J559l67j547M708o37o675K719
2880b243N458l075k140J619k418O51N991k580n984L726K245k884N28Q43l101K490
2896h74M601n641l380N623J496k856R34k269k480N748L791p412k334M726N72k2
2912B23Q05m231j349O925O78p349O98M291m47Q86n68n534J760Q177k330o753J450
$$ y = [-1483, 4558, -369, -5241, -519, 2301, 381, 1000, -1039, -3945, 1648, 5317, -1986, -4553, 1031, 1837, 1990, 2986, -1867, -4425, 2837, 4767, -1758, -1237, 2082, 1169, 2030, 2923, -2679, -2411, 5408, 4064, -1853, -150, 1737, 1358, 4655, 2550, -4592, -1604, 5955, 3780, -217, 784, -33, -117, 4672, 1627, -4360, 482, 5557, 990, -1108, 341, -1114, 1633, 4893, -1254, -5186, 1876, 4531, -95, -351, -1225, -2952, 1387, 4302, -2298, -3449, 2260, 1158, -2003, -444, -811, -2358, 2350, 1713, -4962, -2243, 3215, 140, -2000, -381, -2799, -2148, 3843, 1263, -4721, -995, 1250, -1634, -1106, -263, -3364, -874, 3727, -1914, -5294, 329, 1825, -1031, -97, -2366, -4846, 902, 4693, -2719, -5053, -327, 245, 223, 1028, -3203, -4552, 2373, 3051, -4298, -3600, 691, 244, 1130, 562, -4972, -3212, 4965, 2635, -4118, -2668]
2929b668K541M26L057k423n853L255O309l589l345K654L8L35K937l696l657N837
2945B158L029m962j361K295q89K227K396n593k699O608Q07m141J091O90k222K868
2961B302J409n553R56O199k514m396J981M6m4M160k449o092L129N554l060k748
2977a120J556j505J529M006m579m644N861K907m203j202O54p87M041K133p489
2992b842k923O969K388l528m93j300j304N870J116p847n27O283p61j848M96k638
3008b889N43N894j808p412K815M306q84n25l96m174J968N754l050m986L766J275
3024A97j652J944j122l489L340L550n115j868M901l20j310J404k761k183N397
3039I13K016n581J47L311j167j47J358l532j67O109j617m864K525K321j427Q35
$$ y = [-2668, -127, 299, 3356, 933, -4920, -1665, 4644, 1055, -2290, 364, 402, 737, 3674, -22, -3679, 2158, 5187, 225, -1136, 1159, 270, 2497, 4893, -700, -3399, 3209, 4016, -125, 966, 1656, -566, 2302, 3711, -1842, -886, 5313, 2799, -1597, 384, 430, 386, 4546, 2097, -3995, -866, 4688, 1628, -1120, 436, -1069, 460, 4466, -113, -4757, 1104, 4011, -192, -1394, -740, -1527, 2514, 4647, -2842, -5765, 1204, 3592, 64, -429, -1729, -3033, 2837, 3953, -3894, -4421, 1862, 1101, -747, -251, -2889, -2346, 3548, 1740, -5672, -2857, 1449, 565, 40, -356, -4530, -2562, 3192, 142, -4844, -1078, 197, -1455, 489, -633, -4122, -782, 2768, -2347, -4215, 686, 366, -944, 460, -2301, -4484, 913, 2929, -2652, -2505, 806, -361, -508, 850, -2682, -2849, 3260, 1643, -3221, -696, 1625, 198, 1033]
3055A033q46m094L498O149l767m554K046J339LK384k574m404N150M076m634k726
3071a921K836n51J330K287m963k249O634K025n283j206O91k41L729J625n897j590
3087b744N963l22l283J105p66p73L873M7n205J104M294k326j866J525j297L62
3103c09M497j940n208K194K704k345N90J127k809Q70L929l659k963M037P78k842
3119a349J277K1j948L336J725n919j402N260O5j497J079k336j286M863k56n887
3135d254J330M626j181j117L34l025J210N139l144n368L089L552k52K3k125m269
3151e432L782N003l876l448L225J129n87J368k979k972M632L180m479q70K742
3166D18j10J27J538m416j677N836J487l907K0J208j978K208J435m080j66N264
$$ y = [1033, 187, -3907, -409, 5740, 1973, -2581, -535, 804, 807, 3191, 617, -3787, 1363, 5439, 805, -1921, 915, 364, 1694, 3981, -982, -3231, 3403, 5428, 145, -1061, -370, -611, 3118, 4743, -1154, -2744, 3219, 2897, -386, 719, -47, -820, 3053, 3100, -2105, -1001, 3293, 967, -899, 626, -671, -309, 4188, 2248, -2960, -766, 1938, -407, 183, 1310, -1499, -629, 3300, -359, -3322, 715, 1493, -1349, -72, -51, -1999, 1337, 3062, -2857, -4259, 1001, 1066, -431, 648, -1688, -2974, 1889, 1633, -4254, -2924, 1702, 521, -596, -262, -3287, -2077, 3062, -82, -5450, -2361, 1191, 939, 962, -1163, -5432, -1650, 3353, -523, -3971, -746, 383, -204, 1164, -1815, -4787, -155, 3025, -1454, -2324, 418, 308, 435, 1973, -2443, -4120, 1716, 3203, -704, -684, 524, -1454, 754, 2189, -1891, -2057, 3207]
3182C207r83l329J597j07j247K594o1m601K987M286k608k145J006j550O27L742
3198C415k132l281L568K440l677r86R75q41J789K557m578j178N081L85m305J5
3214g53K10l02M443O84n958l91M691j074k836J259r61O91M502j942n610J875M064
3231B592k091j187M60j552K252M217l930m840K618K583j478J116l35k723K580
3246B82K917m474k519L492M80p52J697j589k403M005R98n046n64L628m74Q73J379
3263A930l642j963M766j6m241J390K406q76P24k28m035J481M511k221l607K724
3279h97J838l77J104k366m398M100M155l641j809K804k6m24J109l260j628N086
3295A370K044m616n71K470m47P22K37m003j58O096L1l832N08K49j202K256J72
$$ y = [3207, 2224, -1105, 492, 385, -862, 1732, 1671, -2930, 57, 4343, 1735, -410, 596, -954, -327, 3415, 1283, -1998, 1570, 4010, 333, -653, 322, -519, 1270, 3827, -751, -1929, 3152, 3537, -768, -753, -543, -845, 3598, 4282, -1676, -2067, 2624, 1550, -1286, -27, -988, -297, 4205, 2263, -3347, -1472, 2592, 501, -686, -226, -1778, 474, 4691, 761, -4079, -1461, 1122, -356, 760, 425, -2298, 282, 3199, -1275, -3794, -302, 178, -574, 1123, -466, -2869, 1136, 2134, -2912, -3476, 152, -322, 551, 1930, -1712, -3675, 1091, 1075, -3166, -1776, 630, -246, 478, 250, -3785, -2304, 2207, -14, -3621, -897, 941, 564, 1668, -698, -5096, -996, 3159, -482, -2291, 513, 487, 63, 1172, -2088, -3716, 1370, 3414, -1202, -1773, 697, 250, 972, 1209, -2794, -2952, 3144, 3175, -657, -149, 100, -1102, 1154, 1326]
3312A326l627J963M479k454k286J063o28m46L114r78l509K796K912k364j367p6
3328h2j756J616M090k338l071K638J248k491K30m34j620L932K514m511j817L365
3344A513J83k095N72j177m50N026J61n353m22L460j095r42J074j412Q33M251k874
3361A253m702K234K594j277m05L56j342K170K606m419k974L168J326r73J218p83
3377E0j760K386Q61m454l32L670O9q60J350k464j132L520l61l559J013K374l71
3394@J112L29m162o02L947l54k614J659O16l06J926j411m200J440M548j425k002
3411a499J300k57N30K101l107l876L823L762k011j344J025j489J251J518l483
3426a756j432M909J516l082m83J09o35J936K19l967J104M722m63k795N43r21p57
$$ y = [1326, -2301, -338, 4141, 1687, -599, 464, -164, -610, 2504, 1526, -1983, 813, 3725, 1361, -6, -82, -1838, -222, 3868, 1530, -1541, 1097, 2345, -146, 84, -350, -1970, 1962, 4476, -35, -1852, 1513, 1696, -399, 173, -1004, -1454, 3572, 3733, -1620, -2042, 1418, 323, -619, 455, -957, -124, 4127, 1253, -3449, -1215, 1379, 102, -303, 53, -1289, 881, 3487, -932, -3906, -738, 588, -385, 833, 50, -1710, 676, 1537, -2917, -3249, 421, 490, -370, 980, -1484, -2616, 904, 543, -3016, -2003, 371, 0, 1112, 1441, -2721, -3323, 624, 270, -2344, -685, -69, -375, 1551, 140, -4060, -2620, 1928, 503, -1499, -199, -456, 74, 2175, -932, -4808, -985, 2777, 766, -578, 447, -1042, 209, 1727, -1756, -3188, 1721, 3237, 155, -328, -219, -854, 1082, 1301, -2666, -1562, 3160, 2697, -98, 445, -476, -1233]
3443a233K846m41k768K213K888k299j866P33r29N61L103j543l148L392J248k487
3459B70n12J81j408K190L189k864k131K450k65j855J075p28p62L634J395m494
3475f35r79K251j43l60J031k493k5M581k21n078j24K136J29M69N27k405Q65L834
3493C360k475m512J543K170j66J483j183k741K760K487l995k589K704J339p7J380
3509A488k350j630K786O29l989K06L090K04K04J51l024m72L693q82k911J683J967
3526H43p14P26n17l209O92L024j387j202K552o5j282J378j333l174K666K761j727
3543C2m18J414j336j11J830k261k648L439K794j644k75l73j781J650J537l240
3559a391r86M266J126k271n16j170n56L432K74l773O99M129q55k112l49j432R33
$$ y = [-1233, 1613, 1172, -1596, 617, 3505, 1206, -660, 73, -856, -295, 2808, 1265, -1883, 1509, 2757, 270, -242, -61, -1469, 721, 3910, 1046, -1085, 1365, 1100, -755, 320, -408, -1170, 2464, 3859, -635, -1614, 637, 494, 134, 1165, -1328, -1353, 3228, 3007, -2071, -2195, -59, 70, 539, 1066, -1339, -474, 3360, 885, -3627, -2084, 86, -80, 1403, 220, -2521, 239, 2726, -1269, -3858, -1154, 185, 108, 1488, -862, -2492, 294, 923, -3066, -2860, 230, 434, 638, 789, -2235, -2707, 986, 104, -2807, -1124, 843, 129, 855, 338, -2871, -2179, 845, -542, -1744, 808, 743, -539, 839, -494, -3668, -1002, 1759, 32, -386, 1028, -308, -419, 1411, -850, -3498, -59, 2735, 1091, 816, 443, -1338, 312, 1849, -1391, -2377, 1889, 3015, 744, 228, -942, -1498, 1934, 2208, -1565, -866, 3263, 2408, 296, -53, -1485, -552]
3576e52L109q05l288K346K604k575j443L56j080K036K775k294k176K572L40k612
3592f87L77N12j183K278J935k902j266K315j311j518J974j31p59K402M54l442
3608i52r3J376j336P67J493j841l15K691n85l053L64P56k86J747P00k790Q1L228
3626A952k165k725J228R64P82K301k288l280K372K373k749j448J317Q69J888P68
3642B159l268k193K922J266k991MK133J42J221m08m124L80L725m99k259J229P68
3659B07n22J580j267l192J470L317j467q92J646q10m79J002j252k445K678K505
3675B079j600K24M87k312K34K446j885j450K975R93j455P51j363k099J856K224
3691B105k496l28K994n50p95m7k175k99L584Q18l495N48K392q87o58p03k139J581
$$ y = [-552, 2557, 1752, -1536, 810, 3414, 839, -604, -248, -1328, 708, 3483, 1189, -987, 1585, 1925, -687, -310, 202, -981, 1297, 3232, 330, -936, 1379, 68, -1450, 524, 393, -366, 2036, 2490, -952, -1045, 331, -1005, -238, 1255, -586, -901, 1790, 1205, -1848, -1484, -728, -1014, 733, 1433, -1357, -1276, 1952, -213, -2938, -1710, -746, 36, 2337, 49, -3231, -859, 1514, -1235, -2683, -1366, -497, 1391, 2159, -1109, -3302, -380, 886, -2105, -2101, 32, 174, 1395, 987, -3137, -2757, 968, 469, -1790, -561, 207, -315, 1265, -2, -3194, -1724, 1593, 126, -766, 880, 70, -409, 593, -659, -3104, -426, 2079, 479, 703, 1190, -1122, -888, 1558, -327, -1777, 1198, 2191, 736, 1487, 124, -1975, -119, 2105, -391, -719, 2275, 1725, 930, 883, -1292, -1591, 1993, 2811, -684, -136, 2256, 1369, 711, 8, -2131, -550]
3709e50M247j429l457J602J880j413q49j091q36L037K861l245k721K304N34j031
3725a57L29j114k27L270P84l873r03K175m79p75J245q00L9K978j313l306P23J310
3743i4p73J000J121j587k29J883j727j695J263J50m56J984M99k679L80J167j648
3760a441o79J407k55P06K278j722k999J954J081j579J33P61l48J692Q08l308j808
3777c319L235Q84j854L35J060LJ474j173l633N42L779k70j913P37L55j65J454
3794A531k067k564K258L187j558j056J102p96kR54k164r22L495Q50j742K70j67
3811F09j816J182J136j618mK243k43r90P51j018j849J800J479j501L66J088q94
3828G21l90Q22k220n08L560N05k129j45L68q25Q79K20k845R85L439p74k319N93
$$ y = [-550, 3697, 2268, -1189, 413, 2293, 880, 31, -1060, -1896, 1141, 4002, 757, -1964, 340, 874, -157, 172, -942, -1169, 2101, 2885, -988, -1891, 284, -195, -970, 275, -525, -486, 2492, 1179, -2127, -1404, -94, -867, 133, 1254, -333, -562, 1321, -406, -2101, -838, -688, -1144, 840, 1339, -1340, -960, 207, -1441, -2120, -713, -968, -262, 2016, 294, -2705, -751, 330, -1249, -1116, -355, -703, 989, 1797, -1511, -3319, -84, 800, -1054, -719, 341, 344, 1818, 645, -2988, -2446, 1333, 1063, -850, -113, 242, 77, 1531, -536, -3100, -842, 2345, 787, -269, 833, 37, 35, 989, -1175, -2097, 1398, 2248, 506, 776, 609, -1207, -25, 1111, -507, -511, 1732, 1489, 499, 1250, 232, -1617, 183, 1662, 161, 527, 1615, 721, 331, 1153, -1067, -1575, 1985, 2490, 361, 216, 584, -241, 638, 858, -1987, -1002, 2437, 1663, -656, -63]
3846f3K8k40J180j220j645K799K775l392j602R16J11L09R67j692o63L145O89l560
3864a158q08K129q58R37K90j592N08K435j121l174Q14J373j60J125m8j851O87
3881d72J662k377q29J450J52N8J611o73k620J121J302j619k31J540p20R54J361
3898A670j962k440J870P89p09J156k60j364K033Q84l133j047K724J91m66P38q13
3915a39r68K746q17l578P80L245L87p39n92j293K13K427j812k698K615K487j012
3932A252o78l51j231J360J074k032r61L262Q69j861n02n92p80K172J47k109Q49
3949a12K407j006j449Q2p31k32K615j57j918J031J197j465m53N06j635R43K608
3966B231q08j723Q76l02j316J191N45j836J095K284j404j313K79q28O97J514j197
$$ y = [-63, -35, -275, 905, -315, -1960, 839, 3614, 222, -1380, -464, -353, -44, 923, -769, -1432, 1713, 2402, -1158, -1966, 163, -695, 242, 532, -1060, -552, 1883, 762, -2412, -1598, -225, -385, 740, 692, -1159, -472, 1190, -1187, -2016, -566, -414, -356, 1255, 582, -2038, -917, 385, -1234, -1465, 75, -645, 309, 1670, -292, -2732, -862, -73, -782, 374, 114, -1250, 783, 1667, -1466, -2513, 211, 402, -64, 674, -139, -1107, 1639, 822, -2756, -1976, 1269, 1656, 917, 325, -968, -755, 1672, -140, -2838, -223, 2264, 1252, 574, 223, -1008, 352, 1426, -606, -1567, 1695, 2564, 703, 201, -391, -1171, 1001, 1148, -961, -112, 2295, 1289, -160, -78, -809, -1041, 1574, 1417, -501, 530, 1727, 262, -191, 315, -1320, -377, 2231, 1423, -300, 576, 274, -1042, 149, 694, -1142, -47, 2237, 833, -480, -201, -1029, -332, 1182, -15]
3983a5j182J923J416k104j147L07n30J513J778k570r23K229P09k486n56O33J51
4000h54J777M14k797M21K205r83k456J197O66M08J361r01k374J560J174k010n29
4017a721J408r0M08J284j597j665J991L23j957J081J008p58O82L61j952l28J646
4034A24k37r42J722r7j486J253Mj750L03J399l10O04Q76j694r41K084J5k205M58
4053h20J358M07M28m92k512O38K827j492j635J322J053m0K97j611j724K053K096
4070B153j873j107J739O06m47l24j578r06L116P01k282j02J623q79l03R7j213
4087i79K35K924q19j813J027M69r94k45K93j407J548J991j447j319R36n49q64
4104a013J220K55j301J495J059j799p94J054r44K33J650q29j488J800L30j274
$$ y = [-15, -1197, 726, 2142, 38, -1109, -802, -1332, 181, 1959, -611, -1534, 695, 1404, -1082, -1638, -1005, -854, 923, 1337, -1460, -1039, 1166, 183, -2273, -1076, -410, -2, 1359, 458, -1916, -356, 818, -1192, -1721, -313, -403, 5, 1289, -308, -1973, 18, 341, -1616, -535, 473, -285, 397, 758, -1194, -1522, 124, -113, -1055, 667, 570, -916, 337, 341, -1409, -1106, 293, -17, 587, 1463, -231, -1172, 912, 927, -1278, -820, 538, 945, 1373, 881, -1631, -993, 1834, 342, -1293, 29, 1082, 1042, 1339, -272, -1996, 57, 2153, 280, -827, 912, 1518, 1071, 747, -831, -1737, 1379, 2080, -202, -304, 1319, 440, 137, 234, -979, -744, 2180, 1361, -452, 575, 1044, 50, -195, 98, -1309, 239, 2230, 783, -536, 400, -149, -1013, 207, 462, -839, 656, 1715, -84, -878, 176, -768, -535, 1115, 286, -1202, 598, 928, -346]
4120c46o72J46n95J863J491k389q98J762L0j451K90k75J30K623p50k802Q0K533
4138G70r80r08J71j58R61J822j365k911J597J523q95n96P73n29J165Q20k030j679
4156b449K174P78j233K98N99l60Q02l6k124N5J873o7o68J026l98q53J166l27j827
4175a571J478J289j122N9P89j410r5J298n99j052J339L59n17J126m18k113N35
4192f25K246j191q98J650k96l43N81j115j843K250J376j371n28P52j41OL98j614
4210g06p51K764N99j645k49K90l2L97k79j540N63K512o76j827N43j3k40M60r7
4229G3j254J414J816j807r50O39m74j11J340o33r53J516K98k032K46P47j046M79
4247f92J607r09p74J173m23r53L33K60o70J297R02j842k58R80m34l54N90l72k95
$$ y = [-346, -1018, -872, -1467, 396, 1887, -502, -1400, 362, 392, -1059, -769, -1044, -914, 1709, 959, -1843, -1763, 770, -210, -1118, -947, -1105, -144, 1678, 313, -2598, -1001, 522, -373, -969, -196, -725, 440, 1260, -770, -2449, -275, 503, -730, -432, 167, -193, 609, 573, -1551, -1496, 377, 310, -358, 668, 270, -583, 583, 256, -1571, -93, 1196, 74, 133, 922, -488, -583, 715, 116, -936, 403, 762, 245, 1371, 953, -1160, -625, 1621, 430, -468, 1182, 886, 543, 1124, 9, -1834, 416, 1792, 421, -107, 645, 504, 510, 908, -706, -1457, 1307, 1906, 261, 12, 302, 270, 667, 388, -1152, -589, 1923, 1247, -580, -37, -50, -290, 170, 73, -1181, 233, 2049, 242, -708, -69, -543, -654, 686, 53, -900, 616, 914, -1118, -872, -125, -1171, -692, 915, 6, -768, 405, -18, -971, -638, -378, -1048, 249, 1151, -691, -949, 31, -403, -757, -167, -539, -834]
4266h34J924j86k313L14J248n21J35M47j239M04K189j522k341J260J363o09K92
4283A1k73q45J325J187j928j210J853J47k40P27p71m89J149N57k366J04J750K97
4301I85o62L94j059l61J715m87j630J265R79q42L03M1j501K49J753j050k63P62
4319E91J20m75P80n95j416Q94J284q76k85J300j024L6O67j030r08J489P69j073
4337B48q9O47j091L42R16j382n17K000J28j544L68k33l19J045Qj358M84K054j198
4356E09j209N66m69L34J090p61j610J654J376j651r38M42k63L18J431j187r44
4373a312J667K68j708K88N77o36J148R23j904l9J116o66p22Q39j38l57J399k57
4391D86j374J26Q02o17l7P71m89j41J344p51j123L51O32n84N27L30r04K59J385
$$ y = [-834, 1090, 904, -1409, -1095, 153, -368, -233, 214, -1025, -621, 1568, 46, -2295, -1035, 328, -281, 11, -262, -1107, 218, 1405, -523, -1733, 120, 267, 27, 754, -17, -506, 643, 1200, -1166, -1062, 688, 985, 323, 717, -342, -703, 1012, 525, -1105, 160, 1139, 297, 600, 641, -860, -611, 1142, 92, -171, 591, 711, 236, 1016, 421, -995, -101, 1183, 307, 22, 1322, 298, 334, 1001, -29, -937, 552, 1321, 248, 159, 806, -285, 57, 973, -409, -926, 1074, 1202, -342, 26, -207, -526, 519, 527, -831, -347, 1707, 509, -700, -134, -603, -269, 821, 60, -1550, 104, 1480, -171, -1109, -667, -930, -612, 819, -368, -1312, 355, 623, -1085, -797, -220, -856, 292, 1215, -689, -728, 388, -278, -1000, -161, -299, -656, 743, 486, -888, -762, 40, -577, -614, 157, -332, -473, 871, 120, -1003, -652, -20, -604, -77, 253, -651, -392, 993]
4410I93j235j318J706J54m60O01k02q15Q16M59j146k68J252l15K59M26q67q58
4428h18J776j29j775O69J283n57K25q8j228pJ821p06q81Q64N13o15K63n20r94
4447i04R23J236r58m61R46l54k56Q21p99j231J422P42r56o0O71j032J15R10j070
4466b95l54J376K44r84R9L33j073Q67Q15j696P7J491m61o31L42n91m67J355K11
4485F58j472P51Q66o61o07Q7p29N87J267n79j163O45N81n51k5J5n62O47J278j562
4505e29o43J471k50p07L33Mm75J490k1j490n7J079j61o19L53m94n3J463j56j844
4525a306M76J155o70L95K03q11M58J138j196r89J067K89l46O44N5j367Q04Q39
4543H38j014p37J137j49%Q47p46j050J292L89j002k67R28m33K79N68j173l49J258
$$ y = [993, -242, -1560, 146, 300, -160, 441, 239, -576, 240, 699, -447, -715, 537, 222, 481, 907, 40, -818, 958, 829, -946, -277, 1006, 449, 674, 586, -642, -649, 1172, 466, -415, 449, 962, 347, 610, 90, -904, 19, 1255, 297, -164, 782, 428, 172, 993, 194, -1037, 385, 1127, 171, 111, 782, -250, -135, 775, -295, -649, 727, 971, -13, 86, 419, -654, 213, 1028, -668, -591, 900, 439, -192, 150, -441, -908, 447, 658, -814, -63, 803, 142, -465, -378, -1107, -520, 747, 168, -995, -350, 231, -320, -345, -330, -892, -245, 1033, -529, -1172, 299, 49, -658, -325, -321, -796, 694, 673, -817, -874, 205, 44, -575, -222, -716, -769, 694, 538, -1306, -830, 325, -345, 50, 253, -558, -100, 1038, -158, -1147, -80, 209, -137, 507, 562, -805, -1, 838, -176, -913, 224, 75, 75, 922, 176, -874, 418, 807, -195, -462, 466, 33, 312, 880, -293, -642, 616]
4562F16m0q59L81L81l99N77P8j401J13J483p76k44O00j15l73P54n34r77Q61Q76
4582A002r01m05O66k88r4N94o36q87J567J94o03MM9n13L99K85q24k98J287l37
4602B61o57M79m95k13P89M78j473M86J079l65p57N08q73K10J133l01j169N23Q02
4621D45p63K3J04o16N74R23p54p15Q24J83m77L07k70o63Q68N59q39j32N98m56
4641b77K32r3k83k46J091J60j227J82M53k67l7L88n81K87P94l59p15L75O02m42
4661C7K57J19j269Q40O99r25k65P82Q5n31P07o51q8M01N50j009J25N02l41L54
4681C79m3k10p55J046J10q18M82L6o08O69K32q54O1N95L6l55K92k79M8O84l87
4702C61p42L35N37k85k47K87K7j13O63n42p81N32N41o23J7K30n64M42O35q04l46
$$ y = [616, 576, -283, 98, 479, 80, 657, 735, -666, -553, 930, 154, -90, 510, 395, 22, 776, 242, -735, 126, 1002, 101, -304, 362, 74, -20, 574, -62, -949, 618, 812, 209, 213, 262, -251, 148, 433, -391, -689, 598, 261, -396, 83, -412, -625, 164, 642, -831, -345, 734, 369, -388, 120, -753, -543, 590, 289, -880, -357, 445, -318, -295, -191, -807, -233, 690, -64, -779, 45, 228, -249, 58, -212, -875, -7, 552, -287, -419, 179, -277, -45, -138, -421, -667, 424, 584, -643, -461, -8, -275, -312, 76, -505, -218, 576, 217, -498, -123, 479, 37, 294, 413, -856, -16, 683, -242, -507, 275, 360, -171, 536, -115, -203, 198, 748, -261, -136, 366, 25, 379, 336, 126, -629, 417, 527, -291, 191, 227, -381, 288, 520, -334, -273, 322, 358, 3, 295, 16, 64, 748, 361, -381, -46, 491, 206, -41, 246, 273, 160, 823, 281, -500, 32, 573, -50, -33, 197, -367, 75, 710, -94, -440]
4723d40P77q4r7J3l80k09N50L26r13J02R32o12j14L53p76J57Q20j86p28M99M72
4744D62o42j28K26n88M28P72m20j040P46K24l91J81J34o54N42N94n47m10M24j74
4764b61j53N92l54l36O75j4m49l71R22p35N01J77n84k64P48K30q07M00J11j58
4784a30N81j70q98M33Q80o33l85L26O7N1K14r8r99Q00M90n22l23Q73m25J7J56
4805C05l71n63J083K55q37o3N61n82J61M26k54n48Q78K04p93J09K48l94O78q0
4825D23m26p4M61k90j89M37r6m24Q31l49r27P13N74n01k09J60j73P1L56l76p62
4846g70J088J70n68K64k18l84M72N21q09j68O04n9k69K13l80j46O20n7p04R7Q52
4867C69m46ll16j56J83P49o93j98L14K23k23J86o4k41J78O70p10m54M68J77j71
$$ y = [-440, 337, 253, 156, 169, -211, -420, 130, 456, -457, -355, 577, -35, -149, 204, -572, -415, 405, 219, -509, -10, 462, -180, -308, -82, -670, -242, 530, 110, -930, -184, 40, -351, -170, -36, -690, -148, 446, -101, -511, -87, -261, -414, 178, -176, -512, 163, 149, -300, -671, 251, -484, 17, 194, -390, -654, 94, 324, -483, -83, 28, -130, 451, 281, -617, -184, 696, 63, -322, 4, 71, 122, 336, 238, -761, 39, 529, 7, -316, 557, 132, 149, 305, -66, -629, 454, 709, -128, -191, 370, -212, -51, 375, 121, -427, 451, 655, -138, -29, 219, -175, 503, 423, -3, -77, 384, 94, -95, 342, 246, -178, 653, 304, -623, 90, 664, 163, -46, 114, -59, 12, 368, -8, -770, 318, 488, -80, 184, -34, -418, 54, 575, -234, -402, 202, 143, -126, 87, -293, -439, 181, 124, -580, -483, 369, -77, -80, -396, -552, -369, 380, -313, -511, -197, 26, -197, -11, -75, -316, -138, 532, -178, -632, -164, 13, -158]
4888a58L63j19p01M32N16n21k04P57q05L09M21p66L18K67K13n74q9P58n32L74
4908B59r7p45O82K84k32k25K75k16N7J77M8m35L14M36k53m79J80r3L20q8k02n50
4930e83N34O74m06j53J57m47L01N09o01k33N36J79m73J77l18K09K91J5m30k27
4950b89J014n69k00o2J0J86LK09n53K68M96m20j35K17m51J7N56j30l05MM27l63
4972g0j0nk23K56N19o12l31L79O1J8K62n74J15L44K08o87P0L84j06m5J42l34L4
4995b05L26m0o22J61K95J25M2q9m70M08K78j0n18L13Lj50K95j39n20L67O53o80
5017a77j07M37j86j13M5j03l82J002n7p54K56J12j58K07L41p02J7Q00r8n30R0
5038f0M9l44L84R9l50k20P82k12l14J50J04p0J86L74r06L77L10k57l08M39n31
$$ y = [-158, 205, 86, -615, -183, 333, -188, -392, 365, -440, -131, 290, -476, -158, 109, 322, -252, -341, 417, -115, 259, 162, -583, 99, 383, 151, -74, 201, -15, 42, 219, 267, -168, 146, 582, 329, -150, 30, -63, 257, 169, -33, -583, -49, 625, 219, 66, 223, -224, 77, 586, -15, -248, 288, 467, -6, 171, -147, 62, 353, 368, -62, -289, 725, 156, -44, -106, -96, 90, 93, 302, -251, 17, 513, 93, -42, 175, -276, -259, 297, 167, -138, -134, 293, -70, -80, -85, -308, -52, 467, -145, -476, -97, -36, -18, 244, -330, -215, 129, 337, -350, -280, 104, -2, -47, 95, -239, -205, 121, 81, -541, -380, -85, 40, 82, -7, -477, -69, 209, 199, -319, -6, -3, -153, 142, 3, -517, -150, 503, -177, -284, 153, -33, -146, -101, -204, -586, 416, 359, -395, -139, -27, -185, 22, 363, -339, -322, 478, 380, -150, -60, -11, -355, 29, 128, -222, -442, 340, 128, -186, -36, 68, -2, 184, 558, -348, 29, 339, 82, -226, 213, -318]
5059c18M52L54l44k30O02j31j31l99j17L06K20J5n52K63K87q9o8L44l65k37L93
5080B55L8k86Q7J90l53J88p0k13J64K74l01m15O42l62J04K05j57J13O5M7k89l44
5102d18N44l14l4L03R8n76N13L13n93j88N42m47L92m0l48K56Q2L49j162L06N15
5123I3m12M39l5l11j45Q73m44n10J94M83j24n6M7m87J19K58P4o21L59Q9J6L10
5145B09n07j43M52K06m66N9M38j79J21j35q4k65N12j60J0Mjj65J89L3m25Q4P63
5168E50l32RJ42n18l1L97N1o56N70J7j24L9J66p33O90N6p2l37K76Rn5P5J48l59
5192b2L69L16o19k42M43qm12M80l13k5L82J30l52p1Q1L5l79L74n74L17K30K37
5214C77l83k18L48k45M28l23j7QJ36j2k82J88l66K17K91j49l19N24J95n41j28
$$ y = [-318, 134, 488, 144, -86, 516, 385, 254, -145, -262, 44, 264, 279, -273, -10, 277, 188, 120, 464, 99, -138, 255, 293, 7, 94, 284, -69, 119, 49, -164, 0, 274, -27, -442, 200, -162, -58, 147, -10, 103, 168, 215, -74, -418, 126, -188, -222, 81, 179, -397, 116, 429, -164, -352, 190, -257, 135, 95, -253, 3, 85, 434, -728, -422, 93, -319, 120, 85, -226, -371, 502, 58, -452, -258, 225, 101, 45, 92, -395, -276, -18, 56, -565, -206, -117, -101, 209, -298, -441, 11, 217, -249, -190, 248, 69, 190, 55, -29, -294, 218, 58, 68, 72, 71, -94, 95, 128, -297, -213, 550, 218, 227, 369, -149, -180, 217, 268, -388, 182, 199, 75, 114, 280, -453, 237, 293, 221, -116, 160, 169, 114, 189, 337, -22, 347, 663, 44, -198, 245, 237, -175, 305, -8, -33, 349, 479, 127, 56, 137, 172, -207, 167, -407, -90, 140, 377, -6, -224, 124, -121, 307, -16, -33, -25, 111, 99, -183, 5, -361, -144, 147, -2, -321, 203, 398, -143, -271]
5235b71J56K39k01J01k30J51j75M27n00J5K76K23j43L02n70j32M55N6n65L38j9
5256f7p4N1J4j79O4J44k8M9k83K34J49j94j64M8o3M89k01Jp9m1L87q8m21m5L17
5281B0K68l49J00j70K02j51j39j10K59J72Q2k82J53j55K61K31l85k7j6L97n15
5302a54L48j12q3Q8K14k97%L08J19n33kJ49r1L8K85n39L48P7m9l69L53k05j51
5325b58J01J37j79K86L6j4J7N1m77L7L23K67l48l2P4k39J69J50m73K91K99m5l69
5348a96j7Q2K17j5k48Q2J31M83n56m87M39k1k66M25l10j14N86j16l03K99l32J38
5370i9J82J74m22J44K90l17k55J86l1r0L87p9l81O5J41k34J68K91r6j52O7n8l77
5393d96L06L26j82J0L2l19N66j39j17l00L26o6Q8J30N2j51R8m4m84L31L59l47
$$ y = [-271, -115, 124, -77, 24, -206, -55, -230, 197, -303, -288, -12, 211, 68, 370, -200, -332, 123, 179, -386, -48, -67, -141, -90, -76, -255, -191, -47, -75, -26, -309, -75, 74, -120, -284, -236, -299, 190, -11, -10, -89, -130, 257, 169, -252, -297, 20, 288, -61, 39, -131, 71, -80, -219, -329, -70, 102, 184, -98, 55, -100, 161, 392, 7, -20, -36, 361, -154, 194, 82, -1, 87, 301, 4, 4, 312, 431, -102, -104, 45, -46, -8, 277, -262, 86, 163, 114, -255, 98, -107, -258, -157, -20, -199, 87, 123, 109, 126, 177, -300, -263, 60, 327, -21, -53, 21, -218, -49, 101, -372, -81, 218, 173, -196, -213, -131, 86, 71, -177, -95, 36, 519, -37, -524, -85, -106, -372, 53, -257, -371, 215, 99, -204, 95, -237, -99, 83, 257, -165, -21, 269, -48, -303, -117, -148, -238, 149, 70, -311, -246, -105, -339, -171, 120, 24, -128, -61, -119, -496, -190, 136, -46, -36, -4, -323, 243, 104, -13, -313, 13, -53, 35, 165, 217, 66, 164, 120, -364, -33, 326, -21]
5415b1J29J97n35K11L35J7o70J65K26Q9k26J21p8K73J43l39k18K92J7j0L2Jj52
5438aj20J94L0n28M14M5q4J53k37j99J50J69q0j39N02k57k18L62l01K0M39j30
5460A84n58M31k66j06K23R9j06j36L17m3r3J23n44K83J66j78j40M09L15l39k76
5481b35K38r3Q2K3j24k56O07k68l0j32J26j73M19J6j83p9J41L4m84J13N0K04K27
5504B23m99J3K34O7k16J60K53K14n67N20n77K77j71J70r6l19M73k34J18J46l41
5525a52J01j41L4J1M44j29j34J95r6n9j24J77k11K61l8k98K77L2j61m1k6M1J57
5548A20L8k05j38Q9M80n22q2L52J40m27K77M7k98L21J9j67J78j05P1k52J72n7
5570E1jJ24l09j09J69O9m1j89N37l66o5O63j94k46k82N08l32L08l38j04K0K98
$$ y = [-21, 108, 305, -230, -19, 316, 333, -337, -172, 54, 143, -83, 38, -40, 233, 376, 37, -181, 111, 128, 118, 150, 151, -1, -121, 73, 103, -425, -11, 34, -50, 103, -134, -333, -183, -14, -94, -233, 269, 12, -206, 156, -145, -125, 314, 184, -374, 57, -209, -315, -92, 7, -99, -235, 82, 39, -54, 69, -475, -192, -26, -204, -344, 65, 380, 41, -235, 3, -90, -8, 15, -109, -365, 242, -26, -56, -188, -62, -235, 184, 200, 17, -62, 79, 113, -371, -258, -208, -4, 223, -276, -263, -29, 38, -178, -18, 235, 449, -118, 402, -175, 102, -69, 101, 5, -314, 159, -75, 43, 189, -152, -51, -192, -158, -147, 297, 168, 34, 229, 133, 74, -50, 127, -84, 177, 139, -159, 118, 150, -11, -52, -78, -37, 120, 158, -47, -185, -96, 384, -138, -220, 132, 272, -155, 122, 169, -129, 192, 211, 44, 222, 117, 188, -64, 108, 51, 50, 174, -135, -244, -75, -6, -47, -236, 301, -65, -130, 533, 339, 93, -189, 319, -13, 295, -43, -147, -127, 171]
5592A71l92L14n4j10J09j75K17l10K50J52j81R5j40l31M24j25r9J27k25J79j48
5613b52M89l90j24L06o8j7p1K64k10j13K78j24j73L99Q5m93q0k6K32j03L02m85
5635c74N31q9J69m05M40J37n79kM1m8M96k64k80K44K24n2j42j72J23j01L58k38
5657A7j65o4L60m7L7Q1j72k06J89j26p3L63j42j09K87o0m67J52Q0m9j39L82J0
5680A39k89L79j74l7J96q8j68j00M10m68K25J87j12j53Q0oM9j56L8J40k77J3j6
5703a88P8N19n24j48PL72k8k74K79l48K72L76l23j58K28m43K18j00J50o1J66j98
5725a28m86N52L28q35M53J10k63N51k69o8n80O74j25k75L19M3l48N44j32m63M00
5746BL02r0m90M96j99j81j7j4M8k3M64l76nM24n23K66R0l38L5L54j17l27M02m1
$$ y = [171, -221, 93, 39, -71, 38, -137, 80, -230, 20, 172, -9, 86, -54, -385, 39, -86, -185, -58, -283, -104, -252, 237, -153, -277, 29, -39, -56, -127, 137, -73, -186, 92, -32, -205, 194, 279, -214, -294, -320, -88, -191, 111, -374, 157, 68, 237, -168, 272, 409, -170, -172, -131, -179, 317, 53, -227, 17, 241, 189, 47, -125, -2, -103, 255, 17, -148, -212, 148, 101, 138, 219, 47, -159, 30, -96, -169, 194, 52, -57, 230, 170, -297, -145, -65, -114, -253, 129, 139, -150, 229, 55, 18, 214, 126, -42, -142, 268, -200, 25, 212, 100, -53, 27, 21, 70, -86, -48, 92, -185, -172, -188, -110, 409, -115, -263, -256, 116, 88, -186, 93, -255, 17, 393, 70, -88, 140, -303, -85, -185, -35, -96, 70, -128, -614, -62, 266, -569, -116, -6, -269, 282, 13, -55, -635, 39, -86, -361, -42, 1, -347, 197, 65, -398, 2, 304, 214, -276, 220, 21, -160, -177, -191, -143, -166, 298, -78, -83, 341, -182, 84, 174, -164, -129, 225, 108, -219, 183, 142]
5770A42r0m27L81K56l51J73O1j93J67K3k35l03N95k13J4J74l46L36K42j92l44
5791a30Q8K52l35K25J25j88r1N66n84k79N54K42m04J63k20j46J83J50l43K13K20
5812B61m9l07K33n3m70M26J97m31K26MK2j54K85o12K78K66j72j21K41j30k54N14
5834B00P4o30J46K78M0k82J08j26lL09j95j86M07O1j87j19J38l80m4K12J03qK62
5857A78j87j12J7J85q3k59N47o26P6N62l33O1pj45MJ53K3j99L31K2m63Q5M73L4
5881C37m68K9N8K14QM6m92L28L9k01J37K64m08R0J96j07J56K26m4m01R4j86j63
5904b48O2N49k65K40J6o65q3M69j24k65N62j3k24K54k36J6r4L35k23n51N70p2
5926A0j48J22K12j27K21p1l69J18K87l23k56K98j30N1J17Q8l75N44J88m13m38
$$ y = [142, 52, -375, 6, 262, -89, 84, 145, -48, 119, 142, -93, -396, 199, -14, 0, 174, -172, 164, 406, 214, -130, -42, 210, -125, 100, 225, 37, -54, 512, -72, -351, 203, 445, 41, 204, -16, -162, 21, 171, -172, 41, 261, 212, -95, 138, 85, -385, 41, 238, -193, 33, 37, 59, -95, 190, -422, -144, 122, -50, -171, 70, -60, -314, 200, 274, -356, -210, 68, 108, -174, -66, -192, -195, 114, -81, -267, 140, 201, 14, -105, 33, -347, -391, -179, -76, -84, 178, -9, -121, -104, 81, -2, -261, 286, -340, -264, 298, -35, 26, 19, -126, -122, 31, 54, -145, 186, 208, -255, -170, 303, 337, -131, -102, -44, 170, 178, 224, -268, 60, 99, -102, 35, 299, -109, -19, 177, 70, 226, 452, 408, 7, 101, -85, -248, -186, 363, 98, 338, 354, -311, -394, 75, -49, -314, 248, 235, 11, 265, 29, 45, -49, 286, 63, -488, 82, 10, -138, -16, 196, 69, 290, 219, -150, -32, 255, -68, -324, -26, -156, -105, 12, 100, -275, 269, 457, 44, -394]
5947c94K76N8J13r0j17O4L41k57k0k7J45m32L29P4l75K52q1K26n42M63K9j67j42
5970b74J84J6K09p5l2k83J96k16J87j01J83K1j97K42m17M19J4o9j45J59K71k54
5992C8j04K31j27L54q8n52M35j95j37J44J33j64K2J67N4k86r5L75k97J39K89l18
6014A8J09N8l6j95N51l77k72J18J21n0L9J92m46L2K23m3K69J9j98m18L64J20l34
6037a36k22M45n43P75K1o03o5M16r5JK44K7l45J21J95n68M17j18J5R2P8o1k15
6060a24K52n38M30o3j04j1J04K7k56K89M2k73l9N79k22j72M4J30m62M30j74K1
6082i0N0L43n59J07K91j97j71K83j71l18O24J32o50K58R0Q6OJ19l84M2L15m02
6104a96J52J37k7k43Q4L98l68P2L47l38r6J97o0k81K84M70m95k9O2j14l49O76
$$ y = [-394, -118, -60, 53, -37, -154, -90, 251, -6, -26, -53, 92, -340, -11, 63, -312, -60, -141, 85, -457, 6, 35, -132, -274, -90, -74, 135, 60, 28, -255, -59, -275, -88, -189, -6, 15, -182, 60, -357, 62, 76, 7, -138, 21, 292, 38, -66, 165, 38, 392, 304, -248, 187, -8, -145, -1, 132, -32, -10, 157, 211, -75, -170, 205, -92, 47, 336, 18, 127, 185, 149, -46, 505, 128, -144, -26, 95, 45, 84, 276, -170, -138, 85, 42, 311, 330, 132, -286, 78, 198, -136, -358, 87, -456, 319, 340, -263, -328, 88, -7, -6, 238, 265, -80, 41, 236, -332, 85, -33, -18, 74, 152, 91, -124, 128, -410, 20, -43, -147, -158, -54, -27, -283, 6, 48, -225, -264, 315, 93, -79, -35, 95, -367, 63, -111, -90, -40, 303, -256, -149, 142, -55, -226, 57, -114, -432, 192, 324, -326, -68, 22, 108, 114, 233, -151, -109, 206, -196, -44, 93, 66, -177, -93, 305, -63, 9, 356, 18, -78, 119, 59, -222, 62, 532, 37, 8, 70, -44, -393, 283]
6126B83k01r8K65k76k46N05k69j58K75L81o64M76J10n80j71N08j5l37K59m9K05
6147B03J31k1l49n9K84k00k58L07J2k00K90L4n86M99k1m60K58N32k91k90O17n55
6169a23p4K80k02k96L04K21m03L38K24k75k49M55k60j23K57r4k79J48L34l48L33
6190A68J30m62j9N61l43l09P4M85l14M7J0j57K91L1j98k26L25L9Mmk37L2K9Jr2
6215a34J98j33o8P0K59k40k10N09k21m11O55k65l58J76N31n65O6L15j65j31L57
6236B35q6l52N47K8p46L73L90n65J70J94n52M96o9K3j24J60j92l5j9K77k00N2
6258EL88p91N77O1n1k62L44j5l85J21J15j31K85n4k62k87N22p0N0Qj65j14K25
6281A14K78p32K14J52M3O2K72o29LL94q2l32K45L84m12K19o3l84N41Rl23j50M85
$$ y = [283, 82, -16, 249, -27, -273, 232, -37, -195, 80, 461, -203, 273, 383, -197, -368, 140, 125, -212, 47, -2, 203, 334, 313, -36, -95, 189, -11, -269, 38, 50, -150, 140, 174, -412, 87, 66, -394, -136, 396, 105, -185, 432, -123, -197, 83, -119, -415, -111, 110, -293, 45, 269, -6, -255, 200, -60, -183, 74, -20, -299, -151, 183, -165, 168, 298, -164, -183, 378, 35, -274, -200, 285, -29, 18, 28, -129, 162, 193, -5, -231, 94, 133, 137, 133, -104, -72, -43, -42, -134, 64, -69, -137, -67, 192, -48, -258, 251, 30, -381, 274, 9, -349, -173, 358, -207, -141, 174, 9, -122, 235, 149, -203, 344, 372, -374, -1, 389, -176, -6, 188, -364, 132, 63, 86, -38, 122, -70, -105, -124, 153, -47, 5, 393, -398, 179, 240, 189, -73, 271, 256, -129, -8, 107, -24, 261, 207, -55, -342, 180, 110, 160, 168, 3, -111, 114, 392, -340, -126, 26, 69, 131, 403, -226, -223, 171, 89, -243, 2, 386, -26, 193, 130, -254, 287, 296, -27, -177, 308]
6304C08O3n17m7J77j35J95J83p29P26j43n47L58L80k61p9O06n80j45K8M42n37
6325b54n2L36j68k89M28l6r5L07Qo58N07J3k31p0O57n55J5M76n13o9O79m02n22
6348d88K80L26l86K83J58n44K12L39k77j6M70m3n20R1J71k13O49n37k65J84L30
6369B04m66k90Q60k96j81M39k6m65L85k2k59N4O12k02k69j1J09m50N60J55m65
6390b4k63M05J4k63J72J23n70N76j67J01N9J33o12N76j14j9l06K70j78M9J36j95
6412i7p2L95J01n12O02l10l76M8M37m14Q5N47m93k57P2kJ96K69l8n35J87N38o87
6435c16L34J29l93L72n0l17k92M61q3l37L71J27j80ML04m15J85K32n3m26M27J93
6457B77m05m5K72m23J67K95k00k65M8J15N0N53m62k06J39K88m83M3N36l29L07
$$ y = [308, 371, -146, -193, -16, -151, 44, 227, -502, 224, 81, -466, -108, 272, 11, -68, 538, -42, -187, -159, 283, -254, -306, 30, -138, -427, 1, -35, -130, 177, 185, -473, 34, 47, -184, -254, 403, -152, -137, 339, -174, -243, 436, 34, -488, -208, 118, -268, 15, 173, -371, -159, 180, -97, -113, 357, 314, -206, -115, 56, -157, 492, -45, -310, -126, 204, -262, -552, 308, 12, -169, 270, 244, -221, 164, 142, -117, -63, 549, 347, 78, 67, 176, -274, 286, 441, -24, -287, 118, 132, -131, 41, 164, -406, 170, 3, 104, 163, 296, -316, 260, 146, 127, -179, 91, -87, -38, 98, -97, -169, 226, 327, -185, 417, 107, -269, -221, 216, -198, -113, 434, -59, -316, -244, -246, -50, 219, 181, -354, -167, 371, -316, 18, 147, -246, 126, 76, -241, -533, -72, -155, -492, -121, 6, -174, -170, 134, -281, -96, 136, 83, -343, 84, 277, -128, -173, 99, -324, -157, 138, -62, -327, -279, -164, -114, 439, -23, -229, -90, 198, -285, -242, 294, -35, 272]
6478B72L51m15l87L10K11o64L71p2l15N25K14m95k2N22m19q8K65r7j22N33J01
6499E79q51K84L47k16n8j80J98m9L33k11n16N36J32n18M16rj15J38Q5m87J44M71
6521D53n01O2k5L51m34K97L42o78j88O90m81j03M79k35m42P69j47m24J60K78m18
6542a95L49L15p12K44J66m04p3L87p6m83M34K70m29J17L63p4o47P13l51L8M20
6563C72l76l30N95j07n22J37P5J12l1J65l33PM71j65l00N53l8m22K66m4j93k26
6585c34K74J46k47N42j60m18K91J03l34J46R1o92L17N51k32m3J86j69p5L09k21
6606C1l79K97J66j94j19N86l70k00L86k21k47O37j95l21K7N04n66J20L24k19J41
6627A88K8l51P3M46j00q51O51J63m19M49J35k59l11M91l71j25M33j51m5j35J88
$$ y = [272, 623, 208, -179, 131, 342, -322, 49, -23, -338, 187, 401, -94, -116, 406, -13, -101, 164, 67, -55, 478, 579, -272, 12, 359, 143, 85, -95, 103, 54, 387, 176, -340, 196, 328, -190, 226, 217, 102, 240, 325, -162, -18, 453, -48, 14, -11, 340, -94, 203, 545, -133, -321, 369, -112, -215, 264, 29, -413, 356, 209, -215, -55, 223, -195, 154, 469, -243, 1, 167, -237, -310, 77, 1, -482, -48, 222, -207, -90, 273, 199, -448, 265, -86, -48, 372, -4, -334, 261, 154, -368, -231, -156, -44, -75, 90, -243, -236, 235, 70, -230, 323, 285, -137, 129, 85, -108, -334, -60, 86, -161, 381, 221, -197, 94, 197, -137, 9, 100, -592, -275, 276, 44, 1, 187, 18, -57, 252, 31, -348, -51, 115, -79, -198, 388, 18, -182, 204, -17, -264, 373, 178, -143, -116, 388, -178, -58, 266, 47, 188, 216, -135, -62, 384, 284, -567, 84, 247, -172, 277, 412, 153, -158, 333, -38, -163, 270, 119, 74, -61, 127]
6648A27j89L91n4k32l32L73k97r0O44l89k27N99j16l00QM89l94N3J12k11J52J22
6670B39j85k80L44R7m41L21J04n48J48J58j18L6J76k84P9N75l49m05L99K06m67
6691a95P2K56n85M30N61n51j33K77J21l42j2O2l2J62K83l56k94M17K76q46L77
6712e2L7k52K98J64m62J3K27P9k01N6O8j31J46j02l67N18L45n01l0M68l67J62
6734A16k19j59J87L93l2m58K77j69PK9L46n20K92L69n57J72M31k10j52K5K1m54
6756b65L66K26j66j48K95k24l45N80l88M5L75j82j46K4J79m32j8O79m20q1P00
6777F54n62k21Q1J72k42M30K12q97M12J54j55L72k12k12k95M73k12O7r0L41o38
6798c68K93L8j78J08M55n62m9J73J1j00j44K01j95L31m2m03R3O64o91j09O05j30
$$ y = [127, -62, 329, 275, 43, -289, 84, -213, -303, 341, -48, -275, 324, 208, -92, -84, 405, 11, 64, 176, -35, 117, 239, 54, -226, 118, 215, -226, 95, 199, -349, -201, -43, -161, -125, 51, -233, -154, 421, 72, -333, 66, 272, -195, -123, 133, -452, -22, 539, -12, -145, 132, 253, -89, -101, -39, -71, 91, 374, 18, -276, 141, 417, -429, -52, -15, -267, 31, 195, -267, -254, -27, 52, -149, -93, -25, -156, -10, -112, -479, 39, 384, -117, -147, 321, -46, 116, -103, -262, -75, 318, 286, -172, 105, -64, -57, -28, 318, -202, 90, 459, -98, 74, 505, 295, 143, 168, 189, -265, 101, 327, 161, 13, 308, 84, -261, 319, -69, -24, 351, 169, 23, 47, 226, -206, -224, 455, 35, -46, 654, 92, -129, -48, 124, -118, 312, 524, -373, 39, 193, 38, 410, 198, -14, -309, 164, -48, 19, -71, 270, -368, -75, -37, -215, -107, 348, -214, -263, -90, -79, -179, -323, -122, -317, 14, -28, -431, -338, 326, -365, -474, 131, 1]
6820Al35L88K90m66J51k29M9j88L18k30l0K20k9l34K19L37p33O37R6k90J74R6
6842A12r0l30N81m20j18K28K50o99L90K87k61J39M65n94k08P35n20j37N12j90
6862A32j35O5K34n12j32P47k00l61P01j08n41L04j96k31P52j26o50L04L33k35
6882A45m42Q95r41M67M57m41n85L19M21n57M07j62o07O77M58m89J11L97m50n15
6902d35Q06j53p52N16K65j42p3L39n39J8K33k63K78L34l2m52M4K21k92J64j97
6923a12o2J37L14n68l95O90j98nL67q1n76L80O10o88j46L91j97k8N30j05n12J17
6945a37J83l73L03L24m27L6K90n41m1M84K08q62L47K15k60K09K30m61K05l6q1
6966a85l61O19m3k46L58o2o68M14L77j80j83J36j60p0P59k36n24M14K97q53M25
$$ y = [1, -334, 54, 344, -122, 29, -200, -151, -339, -21, -251, -281, -61, -90, -424, -205, 132, -601, 36, 132, -158, 16, 112, 22, -308, 273, -147, -265, -37, 213, -486, -96, 191, -70, 69, 534, -60, -268, 467, -53, -190, 322, 132, -3, 62, 296, -216, -348, 399, 199, -162, 539, 431, -110, 194, -2, -233, 519, 393, -257, 47, 380, 145, -297, 598, -343, 124, 581, 140, -445, -126, 295, -262, 145, -17, -624, 53, 511, 22, 133, 530, 80, -435, 371, 218, -534, -18, 247, 105, 32, 371, -168, -150, 83, -180, 98, 432, 400, -52, -8, 213, -79, 85, -112, -174, -37, 277, -291, -686, 4, -194, -199, 168, 87, -489, -109, 501, -187, -333, 58, -139, -167, 363, 258, -254, -137, 46, -327, -24, 300, -127, -91, 199, -342, -383, 101, 309, -553, -206, 9, -251, -42, 188, -273, -68, -104, -185, -546, 73, 30, -216, 142, 80, -588, -174, 203, 23, -160, -24, -184, -254, 505, 269, -255, 159, 456, -397, 28]
6987B8M25n33L7M09m56j07N72j86l36J27P1j10N4K61l70J7L27j23l67M07m85K86
7009e2J79m3m54K15M79k95L82j97j36L8K61M8p01M46J15m66R4K60m32M02N06p50
7031a01j58P27k93m50L38j05r6J83L32o95J78K70k87p5O56n48j18J79l4m14M44
7052f7M1m1l13P97n74j25N37k35j40K28k59k04M74j62l67L87K28m03j28Q20q20
7073c26n8J029q40m61P41j1n57K13M70l89K69M91o46m52L80R8Nj24J42J06P7K8
7095A85n44K75L23j13Q8k54L6r8L29j37k31K44J19n96L30N52o85n8P87n60k07
7116b15M88j59k59J33J66m04L92Q5p1m90R33n68j06K08j52j69M89J69o99l6O12
7137C47m14J32N38p84O0M20P6o49K72J72k9J40n7m19N21N5l56m41N63O5k93L50
$$ y = [28, 453, -80, -43, 366, -90, -197, 375, 189, -147, -20, 51, -59, -5, 256, -114, -97, 230, 107, -260, 147, -338, -52, 127, 84, -370, -155, 324, 29, 411, 214, 78, 116, 377, 425, -276, 170, 285, -181, -87, 173, -259, 143, 649, -101, -259, 468, 175, -275, 63, -42, -138, 45, 377, -318, -140, 130, -157, -232, 424, -124, -242, -63, -97, -511, -67, -26, -67, -380, 417, -157, -282, 255, 20, -120, 108, -151, -355, 119, -43, -410, -23, 205, -198, -326, 494, -326, -384, 645, -195, -656, 85, 74, -483, -270, 200, -189, 80, 571, -75, -527, -147, -49, -44, -168, -26, 80, 157, 185, -359, -84, 239, 126, 214, -40, -4, -102, 227, 90, -141, 103, 222, -374, -44, 508, -177, -235, 552, -8, -215, 273, 114, -145, -12, 154, -250, 142, 227, 156, -334, 599, 31, -75, 133, -19, -188, 301, 470, -229, -265, 347, -67, 65, 603, -181, -121, 299, 375, -274, -2, 170, 141, 281, 224, -195, 326, 381, 25, -416, 147, 212, -81, 269]
7159B69j57k93K10L47k90k54M90k4m99M24m19L17K71l97m55L54K92k34O1L94p90
7180c83J41L21l99j43L12K85o38O93j67j89j92M76l07n16J060n68k49P18j45k19
7200a09K52m5m07K56K02n41K77N03o23j83Q27j68p23O43j68n55P22L53q87J63
7220b11K37M7k85L52k61o7N88j81o85N07J05l85J8J47J46j36L05k40l86O37J81
7241D33o18K08K01l88J90L37n02mR92n56k98L32o2o84N46J79o34M90J81k08k23
7262h8N69l84m49N92J59l66J92%m68O46r2o27P8L38q9j24L00m0k55M71r7m83K33
7285A6N55m29m79O87l79m64P81j55m69M71J4o02R5K79j88O2M75m68j86O73k95
7306fk94J99jm38O03K08n27j62N80m57L5K52p9r9L60j04o76N04K24l17J88J13
$$ y = [269, 112, -181, 29, 376, 86, -168, 322, 298, -201, 223, -196, 121, 392, -5, -460, -106, 186, -48, 13, 407, -383, -242, 79, -320, -463, -151, 134, -504, 189, 22, -167, -359, 117, -190, -706, 354, -214, -463, 255, 110, -109, 143, 98, -309, -53, 149, -392, -115, 388, -235, -418, 409, 241, -482, 161, -7, -562, 160, 513, -374, -211, 26, 73, -212, 140, -121, -188, 400, 219, -466, 41, 146, -239, -221, -74, 72, -64, 241, 1, -385, 252, 433, -185, 23, 224, -164, 26, 363, -139, -143, 849, 293, -5, 327, 265, -419, 127, 306, -328, 162, 343, 135, -88, 481, 97, -352, 240, 399, 33, 225, 225, -243, 403, 311, -316, -238, 100, 11, -113, 187, 147, -108, 363, 266, -217, 16, 571, 142, -337, 350, -29, -493, 288, 133, -336, 135, 149, -453, -358, -79, -267, -205, 270, -198, -384, 289, -6, -300, -101, -102, -540, 63, 271, -256, -418, 162, -295, -260, -8, -87, -186, 174, 70, -606, -102, 122, -195, -7, 106]
7328A06l75j08M04k51r7M70J61r19P53J70o07J39N32m70k34K64k14J69K64k07
7348e0n14O46L98n48p5M5J93j00L42l92k55P44m68M2J56M45l79j56L41o12M75
7369B78L61q18J73J88p8k16M10j98j19K68K90n19QL24j03l14N86j66m66J09N0
7390D8k22K17K19l2l05Rk87L70O18m95l98O11N4o00L21K59m53l01N09k87j07O78
7412D26m46n36J110m69m62L85m5j81M11P3o40K68L86m26k15N02J11m30j0L16m45
7433c17L39L32p23k45P96j94k74K62m2j92K48O0o01K63N69l47l32P56j87m24M56
7454B03q3l31L79p6m23K90J62m00oN62l24l47M96m7j61K00J18l12J04L4j41J53
7476E0Nm02J55M78j38m36N39K3m23O3J94r9L43L19q06l63R49m7o03L99j81r3M48
$$ y = [106, -269, -377, 27, -224, -321, 149, 310, -609, 144, 314, -293, -154, 378, -92, -326, -62, -276, -107, 157, -50, -564, 82, 480, -68, -143, -98, 95, -5, 337, -55, -310, 434, -34, 8, 164, 609, 230, 74, 415, -197, 278, 639, -179, -6, 182, 104, -112, 298, 100, -19, 249, 539, 20, 28, 352, 249, -65, 521, 355, -111, -2, 48, -174, 43, 262, 230, -75, -66, -353, 17, 635, 140, -258, 353, 407, -193, 128, 387, -66, -367, 142, -145, -252, 426, -20, -556, 554, 85, -377, 8, -37, -218, 193, 266, -374, -106, 280, -146, -361, 141, 252, -178, -188, 128, -317, 22, 354, -369, -614, 182, -12, -286, -24, -66, -258, -10, 50, -551, -288, 281, -66, -398, 358, 171, -253, 203, 120, -211, 168, 92, -331, -41, 121, -279, -285, 277, -47, -394, 102, 55, -106, 94, 212, -100, 4, 38, -103, 50, 55, -347, -192, 286, 148, -288, 251, 274, -149, -86, 108, 9, 352, 671, -135, -498, 451, 404, -199, 200, 19, -74, 374]
7499C74N6r38K37R26n16O2K88m05j90M61j79n32O87K55q57K3N84m43K73K20m72
7520h6j70N05J28n47K06J1j02J6K48k58J11M41n54o52R86m90l06N62L27m74K36
7541A38K91o68k39P80l08l50Q36n95O2oL65q05K88K79k51j86O25n60j52L98M8
7562a0k99L40l71j69N71L67o43j62P20l04l15K32j06l04P37k0p51M63L10o56L05
7583f5J08k57Q3M91m02l61N84q5m23M13R6o62P69K9m31k17P58k67n16L35R4j73
7605i9M13M9m82k39P83m42L6J87l41%J59J6m37M33R9k60K04L13n09J85K40j8n92
7628c02Q43l30j64L19k03l35Q9Q28p28L45j15j58M4K70k19m07M51p0k59J02K16
7649B17j23q0K63l61j60P27o30J15j31J99j13L48l9n15K04L14l70j7J74k73j68
$$ y = [374, 430, -508, -271, 655, 139, 201, 489, 84, -106, 355, 176, -356, 331, 586, -271, -248, 336, -107, 166, 386, -86, -256, 249, 377, -170, 36, 47, -55, -39, 209, -49, 62, 503, -51, -703, 283, -207, -513, 49, 376, -98, 138, 429, -239, -478, 302, -6, -356, 480, -115, -53, -59, 306, -499, -211, 68, -183, -369, 256, -304, -456, -58, -10, -309, 31, -340, -509, 62, 429, -214, -376, 344, 40, -275, -43, -149, -453, 284, 264, -487, -24, 286, -370, -65, 43, -214, -131, 360, -42, -403, 181, 96, -327, 86, 182, -480, 289, 318, -113, -330, 428, 161, -355, -20, 74, -99, 314, 363, -119, -358, 425, -17, 19, 206, -135, -135, 24, 40, -397, 36, 135, -125, 79, 392, -117, 68, 308, 290, -302, 541, 211, 47, 366, 163, -172, -83, 745, 17, 362, 247, 89, 133, 403, 184, -223, 228, 158, -101, 1, 217, 94, 14, 277, -84, -244, 483, -147, -32, -163, 36, -77, 271, 232, -283, -79, 235, -135, -152, 22, -251, -419]
7670d19P58m18n78Q83J37p38J62M02l87m33P56j29k39J11J94m69L56l8m70N90
7690C1M6j38l65P24l10k57N23m71j26K10M70o43K5N41n01K28K27k97k36M77j3
7711A45m02L09R3m22M23q6n17L07O15m94m41M54l64M80J37k66l86P57k76n10O30
7732A86j98j79L68K22k57m74P64p4m27J06L75m78r4N23l75k12P13l70MM0j47n1
7754c5M30l38l59N02L31o57K45M07l23m51L66J59m82K89K79n07L89Q5n86L7M77
7775B58l13k17M99J7n13L67J50n93M69M13q55k5M23k11J60k0m94L00N43k16m69
7796c27p7P52k49m60K76k07K00N09m16n56L41L35m35K73K36L9j00k44O6l09O62
7817C09j75o52N97P1k41K03N4p31N56K08k47l0N46n20m38O78j46k55L41j33l18
$$ y = [-419, 339, -79, -657, 226, 363, -375, -213, 189, -198, -631, 125, -4, -243, -132, 62, -407, -51, -89, -559, 31, 77, -61, -426, 298, -12, -269, 254, -217, -343, -133, 337, -306, -281, 260, -241, -13, 214, -83, -319, 158, 145, -257, 52, 145, -277, 146, 60, -457, -150, 465, -29, -470, -16, -380, 100, 237, -29, -415, 342, 66, -444, 186, -12, -191, 177, 399, 142, -332, 432, 358, -69, 37, 412, -66, -160, 363, -12, -224, 489, 119, 123, 163, 16, -35, 395, 57, -302, 200, 531, -126, 119, 526, 203, -248, 118, 277, -205, 84, 363, -144, 245, 330, -256, -219, 258, -55, -272, 227, 244, -269, 98, 248, -345, 124, 537, -318, -343, 80, -131, 29, 9, -485, -185, 358, 142, -327, -404, 348, 99, -361, -85, -292, -92, 417, 1, -555, -214, 121, -314, -41, 195, 234, 134, -110, -44, -353, 309, 134, -518, 79, 150, -91, 112, 166, -565, -9, 199, -48, -78, 468, -52, -490, 188, 42, -213, 128, -5, -323]
7838c23K93J77j32k55O58m88k84O80m18m1O06k98n19J47Q29o65q4J82O9l76P70
7859E28k21o10K68N75r40K85R7N7J27M04o46j85O71j97j55k86L80k58L87k25j81
7880a25O4M96o01q9O65m02n8L83j30p10O29K67p20L41M22m85L71P0m14Q5K86m0
7902C05n56L65N4k90j99M78k44k85N36m52K41L12k84n08O64J25o02q1M56k06P
7923a64J81l85K72L78l47k32M7M24m09K02J86n99M25K12l41m82O07N8r4k1n4l98
7945e34Q36m5o31M8M97j47k03L32k88k14O68r7p63K65J41R5j00N17j76l25K42
7966A18j67l0L15j29l69M23k94PJ03K07m18K79K60m22k87R07j77p06J72M38l29
7987i9L71p8o15N83M15o44L4K51J53l2m22K43n1K00J70p19J33N74l02m03K44O2
$$ y = [-323, -30, 147, 15, -240, 418, -70, -354, 326, -92, -133, 473, 175, -344, -197, 632, -33, -117, 65, 134, -242, 528, 307, -303, -35, 540, -400, -115, -18, 39, 166, 570, -76, -261, 410, 213, 58, -228, 152, -106, 281, 56, -125, -61, 435, -166, -255, 410, 8, -50, 333, 203, -507, 122, 389, -331, 10, 432, -53, 318, 388, -26, 59, 345, 305, -251, 114, 168, -122, -321, 157, -87, -372, 164, -288, -47, 265, -19, -527, 137, 262, -340, -421, 35, -171, -164, 17, -368, -96, 282, -65, -297, -250, 174, -235, -33, 153, -446, -21, 191, -150, -632, -25, 33, -61, -82, -136, -534, 302, 257, -374, -326, 171, 24, -179, 153, -135, -349, 319, 222, -541, -276, -135, -40, -140, 377, 201, -124, 118, -49, -79, 236, 107, -262, 161, -133, -126, -23, 184, -234, 45, 305, -117, -404, 503, 326, -380, -208, 230, -99, 272, 194, -421, 162, 577, -67, -33, 218, 371, 339, -83, 160, 109, 309, 479, -240, -107, 467, 165, -238, 6, 68]
8009F8j43M32l7q58L88P10o74n7O14k07k30L17l98k58L64K60m63L59j67J34k10
8030e6N3P4j53O13n04l1K49j56k47N03j53m80K70L8m89R3M79l58j89N23J32l94
8052a83K91J82n11K62J53l99j62M35k94L7J45j16j03J01J60k86o2P54n74R9K33
8073A62l81R4L24k64l81Q12l75l16L56J66m87L64J86o40K46K22Q1p73L58J10Q5
8094e1J80n2l83K13P47q91J4Q26l88p8J01k61k35L06K61l47l06O63m16n1N33J21
8116E06n73K31K32k69J76Kl43K09M33l74m45K26K24k31K59M1k17J96J72o40P2
8137a13K93m9k92M80m50j27P57j05p44L72N39n90K28k74l06N42J75o96O7N69J9
8158B95m19J45Q6l71M60K35q00kP58m47j21L39n7l60L11j31k57L29J65k42n4N04
$$ y = [68, -75, 357, 320, -538, -150, 560, -114, -171, 443, 236, 6, 323, -75, -333, 31, 291, -172, 187, 20, 154, -56, -3, 71, -82, 531, 27, -4, 245, 89, -158, 345, 192, -288, -18, 20, -469, -376, 103, -255, -444, 79, 211, -183, 108, 290, -221, 41, 194, -205, -367, 68, -226, -189, -44, -160, -263, -162, -2, -288, -350, 404, -170, -71, 162, -219, -125, 199, -65, -446, 366, -9, -325, 31, 197, -290, 74, 260, -380, -134, 88, 169, -604, -246, -136, -51, 129, 77, -306, -93, 654, -237, -223, 603, 215, 137, 238, -23, -258, 48, 309, -38, -344, 319, -97, -148, 385, 506, -67, 164, 396, 127, 303, 305, -38, 171, 604, 230, -215, 11, 235, 4, 263, 304, 87, 283, 455, -185, -113, 180, 131, -161, 319, -131, -258, 499, 394, -350, 22, 561, -29, 199, -75, -381, 161, 336, -360, -293, 276, 295, -124, 21, 107, -264, 196, 431, -369, -371, 387, -60, -181, 158, 101, -259, 52, -79, -336, -7, 158, -84, -138, 366]
8180C66m74l6M06n23j07M15q9m22O2N97m82
$$ y = [366, -108, -144, 262, -261, -368, 47, -42, -464, -402, 195, -287]
8191b87
$$ Imaginary data points
##PAGE= N=2
##DATA TABLE= (X++(I..I)), XYDATA
0@%%%qJ6j6J6k4L3m1N6p2Q8j12J44j71K03k48K94l42M01m69N42o27P25q31R48
27E05j079J224j385J565j760J973k208K466k751L061l402L779m191M643n142N692
43B990o300O979p739Q592r560J0671j1954J3456j5250J7431k0153K3661k8379
56a5555L5109m5549O4116j07062L79465J81336p03217n6410L18694L42612j06793
67B86746l26296j44324L39985K43216k03585l25065J9095J92236J23197j06811
77I8394j92795K2947K65225L8423k56204j71515O9770J31814J13837j0760j29912
88b0776m7907N5678m5974n4015Q4435O0403o2259l7062J1168L8314P9513l3088
100B8430j99740o1603J79377J41088j3689p3871r9124j2996J10740R98j42307
$$ y = [0, 0, 0, 0, -8, 8, -8, 8, -16, 17, -24, 32, -40, 48, -64, 80, -91, 112, -136, 158, -184, 217, -252, 290, -337, 388, -443, 505, -574, 650, -735, 830, -930, 1043, -1165, 1301, -1450, 1611, -1791, 1988, -2203, 2440, -2702, 2990, -3310, 3669, -4070, 4522, -5038, 5633, -6321, 7135, -8115, 9316, -10837, 12824, -15555, 19554, -25995, 38121, -68941, 310524, 491860, -211357, -267767, 50927, 393539, 286746, -39550, -183874, 156111, 399327, 195742, -129323, -110228, 82008, 205205, 98394, -94401, -71454, 193771, 232194, -24010, -195525, -125755, 6059, 119896, 109136, -20776, -68683, -13005, -58979, -112994, -28559, 31844, -30415, -67477, -56309, -17995, 61518, 28430, -171310, -232913, -53536, 87552, 73863, -8, -99132, -112128, -1388, -390, -142697]
111a42697J4647J77630O6742q3052j30857q9833J05788K05357m4805k43297m3362
122b07739J97578J72581j4317k21714k16234R7427K76401N3555j51382q6799K4543
133g6100P7896M1155j16825j17369J21829J72639m2640j17139k2059K7863O1724
144A0974L2330j07312q7117J06827J28249Q929k7078p3539j13942J5969J27316
155B1606O0027M862k1707r4150k6051J25703M8721j10113n6077N0574O5245O5980
167A34620j2909j16325k2992R6524n912q7766J7246Q7439O3437Q046j16448j41755
179i6795N0382J48494J3192n8435j7776k0399Q958N3293k5982p0847N835K886
191g194k7693P5419R4356o4298j19467l8478J4710P1083P3725o0174q2036P0593
$$ y = [-142697, -128050, 49580, 116322, 33270, -97587, -187420, -81632, 123725, 78920, -164377, -207739, -10161, 162420, 148103, -73611, -289845, -192418, 83983, 137538, -13844, -100643, -76100, 1796, 42951, -73874, -191243, -69414, 103225, 60585, -56554, -78613, -50750, 10974, 43304, -64008, -151125, -44298, 83951, 92880, 65802, -7737, -121679, -105710, 21606, 81633, 86495, 64788, -29362, -55413, 70290, 119011, 8898, -47179, 3395, 68640, 134620, 121711, 5386, -17606, 78918, 73006, -14760, 2486, 89925, 153362, 161408, 44960, -96795, -46413, 102081, 115273, 56838, 39062, 18663, 27621, 80914, 54932, -15915, -10080, -7194, -34887, 40532, 134888, 70590, -48877, -87355, -72645, -1562, 72163, 11989, -70047, 546]
203E46O8830q5091r4580O396P3732J00617p798j61440m9770J73528R9628j23288
215A310j56772l3813J29734K05730J3460k23178j22466J11345J11326p452o7401
226c8177n8319O0338J39471k3184j68937l6670J08200O2208j8870o9785n6352
237a00077R1906J48215n7527j87361m5078R3099J00757N2951n7681j03803K3533
248d1066P2971m6548n6180N2079N0297n369j7763l9095O963Q6494j2072j45764
260i5053l0680J36412R6670j8442q2592p8525L7635R7958m9318j16579O5417J58597
272A21500J1357j22692j15209J3446J66484R2488j64973j64633J09797K03424
282A50989K8155j45073j66339P93J90733J00199j35560j01497R2217R0489m0118
$$ y = [546, 69376, -15715, -110295, -103899, -30167, 70450, 62652, -98788, -148558, 24970, 124598, 1310, -155462, -189275, -59541, 146189, 159649, -63529, -185995, -74650, 36676, 29224, -38177, -96496, -36158, 103313, 80129, -88808, -125478, -17278, 44930, 26060, -43725, -100077, -8171, 140044, 82517, -104844, -149922, -56823, 43934, 96885, 39204, -64599, -41066, 31905, -14643, -70823, -18744, 31553, 26184, 8421, -30674, -23711, 62783, 50711, -95053, -125733, 10679, 107349, 88907, 6315, -72210, -34575, 63383, 14065, -102514, -37097, 121500, 132857, 10165, -105044, -91598, 74886, 167374, 2401, -162232, -52435, 150989, 179144, 34071, -132268, -131475, 59258, 159457, 23897, -77600, 14617, 105106, 64988]
293F4988j07115p5265P2346J68210O278j66576n7784J01763P1679k4308q8416
304c4200q3797N6940J46008J4248r6704l4227L576j5759J4586J7529o551M3318
316B4967L5536p2217n9160M4015L0794j5512m362j7716k447O9587K7521p9542
328a8536m1312L1240K916m4K9344P207J6817L3886o3170j07954K7891J11884L9893
341G0062k9303n9395m3839O5120R1188n8660j15881Q694P8367N0587J5561m6164
353B6337n9544L3471L9007o0356l6504O6513N6598L351k6640p1152l2731P2945
365A1295M7558m5871k1573J7586k916K2688L2948m5889n8948O682J6587L0172
377A0319O6615p394q9549k4857L6180K119j654R099j0705K4153M4428n1810p8006
$$ y = [64988, -42127, -117392, -45046, 123164, 129442, -37134, -94918, 6845, 78524, 54216, -34200, -117997, -61057, 84951, 99199, 2495, -31732, -28156, -43915, -29329, -11800, -18351, 24967, 60503, -11714, -70874, -26859, 3935, -11577, -15939, -33655, -36102, 33485, 61006, -18536, -59848, -28608, -25692, -25736, 3608, 10815, 27632, 61518, -1652, -109606, -81715, 30169, 70062, 40759, -18636, -62475, 2645, 93833, 35173, -80708, -72014, 6353, 56940, 72501, 26337, -33207, 264, 39271, -21085, -57589, 8924, 65522, 68873, 42233, -28919, -61650, 11295, 58853, 12982, -8591, 8995, 6079, 28767, 61715, 15826, -43122, -36440, -19853, 10319, 76934, 69540, -20009, -44866, -8686, -6567, -8221, 878, -9827, 14326, 58754, 6944, -71062]
390g1062L4284O1494j4631l5106k1440J1447Q1633M1383j03959r7289M0971P3262
402I87K7126k63l7866k8298L8983O521o4684N94P0979P954l5400q305J620K4830
416D778L1545n4410p6147M6798Q8625J46l3654j4774j3055J3752N666n2476k247
429e5453J03756M4136q3363p0020R948N7647O0512l4791j14074M81J34203N6876
441A09858p4660q3512k6732N2134Q4341j7903r0900J9714R5532j400q2623n5071
453g1222J3226R3343P5104p5262j13302L8557J06164J0657o7038p2526o980J03395
465C4116Q4678o8715q9214K8781M8176j5507l1633j5940L3299Q3479j131j14565
477b4176l9913Q4540N1882l3416n3161k5334N3338Q5371l2562j09810k731P3340
$$ y = [-71062, -36778, 24716, 10085, -25021, -46461, -35014, 46619, 88002, -15957, -113246, -72275, 987, 28113, 27850, -10016, -38314, 669, 7190, -57494, -56900, 14079, 22033, -13367, -21672, -20052, 4778, 36323, -18087, -94234, -47436, 41189, 41335, 7681, -7093, -20148, -6396, -730, -53206, -55453, 48303, 92439, 9076, -60944, -50996, 6651, 67163, 32372, -81702, -81221, 52982, 109858, 35198, -48314, -75046, -22912, 61429, 43526, -47374, -27660, 67872, 66472, -16151, -71222, -57996, 35347, 110451, 35189, -78113, -39556, 66608, 77265, 10227, -62299, -69279, 34116, 118794, 50079, -39135, -10354, 37822, 22315, -9318, -25258, 8041, 91520, 90389, -24176, -64089, 20451, 72333, 38917, -14244, -39578, 13760, 99131, 66569, -43241, -45972, 27368]
489B7368P449l7512j4459K0167N7234J0304j09299p7809Q8081J06285k3733q2206
501b8130m2994L4553Q8228M267j19557n4359R1129P1852k7558n0194k1940K9932
513b4771N3521l7701r8287J7803J14377L6255n6177o3791k7655M8775P5847k5708
525A2488q0393J0764O3490J6554j2012k7481l5370K0035M3624j9164k0054M3082
537A5563K1661k9471k1990k0618p564N4960M0950m0957k9249K3639M798q095O925
550A0552j9649j4119L7470J5248k7034J0943K1832l0157k7734J960L282L4640
562A7234M6835l1431o0646J0437K8935m151K976j222j8909K1330L1142k8653k4717
575a0840K2977N05k1131J1660J1469L464K9235j215n5001j7397K8130R553J5511
$$ y = [27368, 34817, -2695, -17154, 3013, 60247, 70551, -38748, -116557, -28476, 77809, 54076, -28130, -71124, -36571, 51657, 55924, -63633, -117992, -26863, 44989, 17431, -32763, -54703, -24771, 28750, -8951, -107238, -89435, 24942, 61197, 5020, -58771, -86426, -37651, 38196, 12488, -67905, -57141, 6349, 22903, 10891, -16590, -51960, -31925, 11699, -7465, -27519, 15563, 37224, 7753, -14237, -34855, -42419, 12541, 53491, 12534, -16715, 6924, 11722, 3627, 10552, -9097, -23216, 14254, 29502, 2468, 13411, 35243, 5086, -22648, -20688, -17406, 17234, 64069, 32638, -28008, -17571, 11364, 7213, 10189, 8967, -9942, 11388, 42530, 13877, -10840, 12137, 12642, -8489, 3171, 14640, 18104, 47339, 46124, -8877, -26274, 1856, 11409, 26920]
588B6920K6042k4734l4163J5545J2948r818Q806q806l2190K5466N0897j6273l8551
601B089o638m941O001K3158j4666j9796L9870K2412n3120m1087J2296K7455L5247
614B8280J339o3806k4636O4441L0739m8899l8488j177K2814M5523L945n4626p490
627d2041M5333j0128m6034p46K9935L5419K1570m6684o0529L4364O4275j6593
639H141m4863m409J9535L8770K0893n0425m2357M5194L4786l6256k1403K6501
651e893L2133K0242k8914p3814k14Q7959L1010n4177l7685J0929L8310L3949l6371
664A7464p2132J8583P7680L085m9425j3705J9009L1011O685o3901n0418O7366
676h698Q6013k4236p2846k8416K5448N7941J6167p1461m3205O5090N6841k8478
$$ y = [26920, 52962, 28228, -5935, 9610, 22558, 12740, 21546, 12740, -19450, 6016, 56913, 40640, 2089, -4549, -9490, -3489, 19669, 5003, -14793, 25077, 47489, -5631, -46718, -34422, -6967, 28280, 29619, -34187, -58823, 5618, 36357, -12542, -51030, -52207, -29393, 16130, 20075, -34551, -42041, 3292, -6836, -52870, -53616, -23681, 11738, 33308, -13376, -73905, -39541, 24734, 8141, -36722, -41131, -21596, 17174, 38067, -12358, -54715, -9521, 25265, -10991, -32394, -5893, 26240, 46482, 17568, -56246, -56460, 31499, 62509, 8332, -29353, -18424, 19886, 53835, 17464, -54668, -36085, 41595, 44680, -4745, -18450, 559, 31570, 38255, -25646, -76064, -8698, 77315, 53079, -19767, -48183, -22735, 35206, 51373, -20088, -63293, 1797, 58638, 30160]
688C0160m5039j4337K0237M5055o764o6839K163Q4082K1991o1928m8957J161M9179
701A0164N6264k5269p4778J0452O7965L367m5895k4800P191M1009K7699m6259
713G110m1525M9602M7089m0656n5140n619L5663N6875M956p6212l6386N7935L6029
726C9721l4544l0883KK3913L5361j5855o0032N146N7875k064m5717j3390J7603
739b2864L7294K7554m4171o4441K1949N8457O68k2560q334m841J8528K0931l1376
752a3206k9378L2461K6151j9175r549M867K980K0097K612m4740j4226M2763K1268
765B2925r578m093j7356j4454K5413J1735k3873L238K1792j3200r347J3074n617
778F59o600J4552j0939k0682K4875K2129j7137p820r60j9174N218K6442m611q430
$$ y = [30160, -14879, -29216, -8979, 36076, 29312, -37527, -35364, 48718, 70709, 8781, -40176, -39015, 10164, 66428, 41159, -33619, -23167, 44798, 48165, 2270, -22530, -15339, 25670, 53369, 7110, -34415, 15187, 62276, 21620, -33520, -39139, -3476, 53399, 58355, -17857, -54243, 3692, 39721, 5177, -25706, -25704, -1791, 33570, 17715, -42317, -37171, 20704, 18640, -27077, -40467, -22864, 14430, 41984, -2187, -66628, -44679, 13778, 14446, -8114, -16448, -21289, -2761, 18170, -13206, -42584, -10123, 16028, -3147, -12696, -7829, -4849, 15248, 17860, -26880, -41106, 1657, 22925, 13347, 9254, -8102, -22556, 2857, 14592, -9281, -6043, 15749, 2549, -6798, 6276, 659, -5941, 8611, -2328, -23010, 1865, 23994, 6857, -963, -1923, -21097, -15879, 10563, 5952, -2478]
792b478J5306r954k3664J5883J3811j5577K630R027j3569O421K1375j5595j5130
805a1514J5728m850j6322J8875J8637p694j829j1394k5565J8717L9696j3363k8712
818i590P530J0628L178Q066k0037k2518L0579K7217l0291j9900K2475J5185q42
831B1680j5290l6616J629O1504J9110n0799k9051J6369K1092J6756j5141m2831
843c1588Q583N4093k103m4383n884K0446J3317L307k8694k9432M0193N0461k9194
856A9122n2956q25K6497K7429P699l9932k7220M3107L1318l7013k8363J5070K0983
869D916J3454j0721l9386O164N7997L245n9599k1273K9941L4511J6545l0232m9890
882d4328J9445N9059j0155n0433m016K8442K4436K426m1674l0871M8108M7738
$$ y = [-2478, 12828, 2874, -20790, -4907, 8904, -6673, -4043, 4984, -8585, -2164, 19211, 3616, -11514, 4214, -636, -16958, 1917, 20554, 12860, 11031, -363, -25928, -7211, 32485, 19122, -9590, -2060, 8568, 11746, 19812, -225, -22743, 7836, 35053, 4762, -15138, 7337, 22522, 21680, 6390, -30226, -28597, 32907, 52017, 1218, -27833, -11464, 9628, 26384, 11243, -31588, -23005, 31088, 28985, -15398, -21282, -836, 12481, 15788, -12906, -42338, -2145, 48316, 19122, -33834, -34659, -8162, 19267, 26966, -12966, -40186, 2921, 34239, -2774, -31137, -16067, 4916, 18370, 7649, -31737, -25573, 32424, 35669, -23930, -45203, -15262, 19249, 35794, 5562, -44328, -24883, 34176, 24021, -26412, -30428, -1986, 22450, 24876, -16798, -47669, 439, 48177]
894D8177l7725n1806P703L8940L3458p720o1420k6951O0264M2154l6778l5874
906b7578O640K4113K4862j2790n0841K78N9849J1824m6051k0244J7407K8593K0323
919C6385l0535n2343J9341N9695q95l8008j0503P928J8631J4785k8112k7272L5311
932D408L2366k9851k8171J0956J8645J6614n513m1655q895N2047K0017l8508k0701
945a8241Q974J3589J7605p487l4255Q839M2398q981l8328p83J7908J4580J0291
958B6109k5684l3259K7023M2399j5912l2332k996M989J6903J9379k2419k7920
970b3720K2138J9595j7374p929N164l617J1000J0401k5196j3117K6690Q143j4988
983b810P42m409j0679J8773J4813k1374q824J1103o989P67K0588p398j9026R571
$$ y = [48177, 10452, -41354, -33651, 5289, 38747, 31027, -30393, -57344, 2920, 45074, 8296, -27578, -20938, 3175, 28037, 15247, -35594, -35316, 24533, 36357, -9694, -29938, -12531, 16062, 36385, 5850, -46493, -27152, 32543, 31648, -6360, -16863, -8935, 9696, 24481, -3631, -30903, 4408, 36774, 6923, -21248, -10292, 8353, 24967, 19454, -22201, -31096, 20951, 40968, 2460, -18241, -9267, 4322, 21927, 14440, -19815, -10976, 31422, 22441, -15887, -16670, 1238, 15818, 26109, 425, -32834, -5811, 36588, 20676, -11656, -14652, -9663, 7240, 26619, 4200, -23720, -1582, 18013, 639, -7290, -2126, -5743, 5257, 15658, -9538, -22655, 4035, 12178, -2810, -2068, -6477, -17156, 1617, 16430, -4944, -13768, -2665, -9654, -8887, 11701, 4303, -14723, -5152]
997e152M835r407J1077N240j9101K619J8257j1334q717J5077q09q115R246p219
1011c503j4479K1322J5554k1674r427J0671j562N456J1977j7825j2125K1998L308
1024I691j9689P113J4019r246k323j9j2823J3439K5613k0523k9874J6305K0387
1037A2070j857k826j5568j2330K8727J9951l4084k0459K7244J7476p410j3699
1049b765k1260P773M7060M122n3411j7018L4455K4752k33k3495l3123J6523N2495
1062C5875n066m9387o672K8729J6830o28k6442k5313L2277M3081k6258m6010O863
1075b2121L0568J7164l547l5530k0907M0652L1808l2819l0288J4623J9005Q813
1087A7421q053l0210L88M3083K736m5506j0025L0663J8635p98k4061l0235K1498
$$ y = [-5152, -317, -9724, 1353, 6593, -12508, -9889, 8368, -2966, -11683, 3394, 2585, -5530, 3716, -3503, -17982, 3340, 18894, -2780, -12207, -1536, -3098, 2358, 14335, -3490, -15615, 6383, 9691, -9998, -2885, 11134, 1888, -435, -454, -13277, 162, 25775, 5252, -24622, -8317, 12070, 10213, 7387, -8181, -20511, 8216, 28167, -5917, -26376, 868, 18344, 10934, -2765, -24025, -16252, 30808, 34930, -18481, -35499, -1044, 23708, 23475, -20, -33143, -16620, 35875, 30809, -18578, -25250, 3479, 20309, 19681, -6761, -32074, 203, 43284, 17026, -28984, -22121, 8447, 25611, 22064, -13466, -34373, 6279, 38087, 5268, -25020, -10397, 8608, 17421, 9368, -20842, -20454, 22629, 25365, -20141, -30166, 497, 19132, 18334, -5727, -35962, -14464]
1100a4464M5905j5649m5814M874L1383J2066q188k9036j5980L9921L1837l9384
1112b529l8262K3286L5749Q394j9773m1083l710N6847K4378m7836l0792K2621
1124a2710K7545J0145j8548l8908Q185N3372M754m5986j3479K3895J9654O268
1136B4187k4799l4412K2213M9724r148m0127n394J3938J4839R655k1530k4471
1148b5325K5467K8599k1331k2393R538Q051N256K414k1145p160L2206R487l0794
1161g130r529J3552M249O435L13j9486L681K5878j0800k5855R812J5600j636J198
1175F282p404j4791J7983K1389k3127k1680J4693J0903K992O823j4490j6616J8419
1188A376J3554k0056n009J2843j771L366Q109j7436j1206K0615N333j5142K540
$$ y = [-14464, 31441, 15792, -30022, -25148, 6235, 18301, 10113, -18923, -34903, 5018, 36855, -2529, -40791, -17505, 18244, 26638, 6865, -34218, -37928, 18919, 43297, -4539, -35331, -12710, 14835, 24980, 6432, -32476, -24291, 29081, 33835, -12151, -25630, -1735, 17919, 24187, -612, -35024, -12811, 36913, 27765, -12362, -17756, -3818, 11021, 20676, -854, -25325, 142, 28741, 7410, -14983, -5445, 2606, 7862, 10276, -10869, -18029, 14177, 23664, -7130, -16659, -3107, 1142, 7577, 7890, -11596, -7915, 17963, 7163, -18692, -8880, 6720, 5084, 6282, -1122, -15913, 2070, 23459, 332, -21348, -6655, 4248, 7240, 14063, -427, -17043, 1376, 14930, -5126, -10135, 2708, 937, 4303, 12412, -5024, -16230, 4385, 9718, -5424, -2884]
1201b884L422p501J2830R776k3324j1553J6680L771J206R860j3899j6678J7503
1214g91J1681j6394m197O877l069J0388J1654k1795j4119K0842P443j2980N9m40
1228d841j196K0459N907l2644j0606K4489Q914m074j380j2661j130K5805n19l0682
1242a4159J24K1846K486k180l573j3832Q120K2610j6150k7232J4900K2840j883
1255A3917n718j1456j1068J8610J5984k6598j5259K6667J4197j1685j0158j0896
1267a3463L406K7065k688l7968J773L8289Q035k0530j8747j0759K0212L2999j6754
1280A0870l9834J2705L5769r14k1673j9139l721L3787K6764l2904l5377K3652
$$ y = [-2884, 538, -6963, 5867, 15643, -7681, -19234, -2554, 1217, 2423, 12283, -1616, -18294, -791, 10890, -5504, -9701, -2824, -5893, 4495, 16149, -5646, -19765, 1077, 8520, -4460, -4401, -4841, -6037, 14422, 20329, -12315, -22921, 1568, 10482, 6408, 5028, -7633, -8763, 17042, 16523, -14159, -14035, 7811, 10297, 8117, 4544, -9288, -1168, 21442, 5292, -21940, -7040, 15800, 13917, 8199, -3257, -14325, 4285, 20269, -6329, -21588, 5079, 19276, 7591, -2567, -13463, -10057, 17008, 14320, -23648, -21875, 16414, 24449, 3919, -14828, -25587, -5375, 27624, 10870, -28964, -16259, 19510, 18596, -3077, -22216, -25937, 7850, 34614, 1710, -33667, -10015]
$$ [...]
8191a66
##END NTUPLES=NMR FID
##END=
