##TITLE=1H_EC-3208(II-34)
 CDCl3, 8 sc, 
 14.11.2019
##JCAMPDX= 6.0         $$ Bruker NMR JCAMP-DX V2.0
##DATA TYPE= NMR FID
##DATA CLASS= NTUPLES
##ORIGIN= UXNMR, Bruker Analytische Messtechnik GmbH
##OWNER= root
$$ XWIN-NMR		Version 3.5
$$ Thu Nov 14 13:56:13 2019 Russian Standard Time (UT+4h)  she@DPX200
##.OBSERVE FREQUENCY= 200.1315
##.OBSERVE NUCLEUS= ^1H
##.DELAY= (6, 6)
##.ACQUISITION MODE= SIMULTANEOUS
##.ACQUISITION SCHEME= undefined
##.AVERAGES= 8
##.DIGITISER RES= 18
##SPECTROMETER/DATA SYSTEM= spect
##.PULSE SEQUENCE= zg30
##.SOLVENT NAME= D2O
##.SHIFT REFERENCE= (INTERNAL, D2O, 0, 15.7039)
##AUDIT TRAIL= $$ (NUMBER, WHEN, WHO, WHERE, WHAT)
$$ ##TITLE= Audit trail, XWIN-NMR		Version 3.5
$$ ##JCAMPDX= 5.01
$$ ##ORIGIN= Bruker BioSpin GmbH
$$ ##OWNER= she
$$ F:/spectra/data/she/nmr/H-F/1/audita.txt
$$ ##AUDIT TRAIL=  $$ (NUMBER, WHEN, WHO, WHERE, WHAT)
(   1,<2019-11-14 13:54:38.48 +0400>,<she>,<DPX200>,
      <created by zg, POWCHK disabled, PULCHK disabled
       configuration hash MD5:
       00 E9 B6 7A A2 85 ED C7 34 08 36 98 17 FE 4E 26
       data hash MD5: 16K
       52 E6 42 A8 F0 BB C6 44 5D D3 19 6B 64 38 19 8F>)
$$ ##END=
$$ 
$$ hash MD5
$$ 0B 93 71 35 D5 AA 48 25 E1 F7 D2 40 BA AE 1F 73
##$RELAX= 
##$RELAX= 
##$RELAX= 
##$RELAX= 
##$RELAX= 
##$RELAX= 
$$ Bruker specific parameters
$$ --------------------------
##$DU= <F:/spectra>
##$EXPNO= 1
##$NAME= <H-F>
##$PROCNO= 1
##$TYPE= <nmr>
##$USER= <she>
##$AMP= (0..31)
100 100 100 100 100 100 100 100 100 100 100 100 100 100 100 100 100 100 
100 100 100 100 100 100 100 100 100 100 100 100 100 100 
##$AQSEQ= 0
##$AQ_mod= 1
##$AUNM= <au_zg>
##$AUTOPOS= <>
##$BF1= 200.13
##$BF2= 200.13
##$BF3= 200.13
##$BF4= 200.13
##$BF5= 200.13
##$BF6= 200.13
##$BF7= 200.13
##$BF8= 200.13
##$BYTORDA= 1
##$CFDGTYP= 0
##$CFRGTYP= 5
##$CHEMSTR= <none>
##$CNST= (0..31)
1 1 145 1 1 1 1 1 1 1 1 1 1 1 1 1 1 1 1 1 1 1 1 1 1 1 1 1 1 1 1 1 
##$CPDPRG= <>
##$CPDPRG1= <>
##$CPDPRG2= <>
##$CPDPRG3= <>
##$CPDPRG4= <mlev>
##$CPDPRG5= <mlev>
##$CPDPRG6= <mlev>
##$CPDPRG7= <mlev>
##$CPDPRG8= <mlev>
##$CPDPRGB= <>
##$CPDPRGT= <>
##$D= (0..31)
0 1.2 0 0 0 0 0 0 0 0.06 0 0.03 0 0 0 0 0.0002 0 0 0 0 0 0 0 0 0 0 0 0 
0 0 0 
##$DATE= 1573725277
##$DBL= (0..7)
120 120 120 120 120 120 120 120 
##$DBP= (0..7)
150 150 150 150 150 150 150 150 
##$DBP07= 0
##$DBPNAM0= <>
##$DBPNAM1= <>
##$DBPNAM2= <>
##$DBPNAM3= <>
##$DBPNAM4= <>
##$DBPNAM5= <>
##$DBPNAM6= <>
##$DBPNAM7= <>
##$DBPOAL= (0..7)
0.5 0.5 0.5 0.5 0.5 0.5 0.5 0.5 
##$DBPOFFS= (0..7)
0 0 0 0 0 0 0 0 
##$DE= 6
##$DECBNUC= <off>
##$DECIM= 24
##$DECNUC= <off>
##$DECSTAT= 4
##$DIGMOD= 1
##$DIGTYP= 9
##$DL= (0..7)
0 120 120 120 120 120 120 120 
##$DP= (0..7)
150 150 150 150 150 150 150 150 
##$DP07= 0
##$DPNAME0= <>
##$DPNAME1= <>
##$DPNAME2= <>
##$DPNAME3= <>
##$DPNAME4= <>
##$DPNAME5= <>
##$DPNAME6= <>
##$DPNAME7= <>
##$DPOAL= (0..7)
0.5 0.5 0.5 0.5 0.5 0.5 0.5 0.5 
##$DPOFFS= (0..7)
0 0 0 0 0 0 0 0 
##$DQDMODE= 0
##$DR= 18
##$DS= 0
##$DSLIST= <SSSSSSSSSSSSSSS>
$$ [...]
##$SUBNAM2= <"">
##$SUBNAM3= <"">
##$SUBNAM4= <"">
##$SUBNAM5= <"">
##$SUBNAM6= <"">
##$SUBNAM7= <"">
##$SUBNAM8= <"">
##$SUBNAM9= <"">
##$SW= 24.0689530833862
##$SWIBOX= (0..15)
0 0 2 0 0 0 0 0 0 0 0 0 0 0 0 0 
##$SW_h= 4816.95568400771
##$TD= 16384
##$TD0= 1
##$TE= 0
##$TE2= 300
##$TE3= 300
##$TEG= 300
##$TL= (0..7)
0 120 120 120 120 120 120 120 
##$TP= (0..7)
150 150 150 150 150 150 150 150 
##$TP07= 0
##$TPNAME0= <>
##$TPNAME1= <>
##$TPNAME2= <>
##$TPNAME3= <>
##$TPNAME4= <>
##$TPNAME5= <>
##$TPNAME6= <>
##$TPNAME7= <>
##$TPOAL= (0..7)
0.5 0.5 0.5 0.5 0.5 0.5 0.5 0.5 
##$TPOFFS= (0..7)
0 0 0 0 0 0 0 0 
##$TUNHIN= 0
##$TUNHOUT= 0
##$TUNXOUT= 0
##$USERA1= <user>
##$USERA2= <user>
##$USERA3= <user>
##$USERA4= <user>
##$USERA5= <user>
##$V9= 5
##$VALIST= <valist>
##$VCLIST= <CCCCCCCCCCCCCCC>
##$VD= 0
##$VDLIST= <DDDDDDDDDDDDDDD>
##$VPLIST= <PPPPPPPPPPPPPPP>
##$VTLIST= <TTTTTTTTTTTTTTT>
##$WBST= 1024
##$WBSW= 4
##$XGAIN= (0..3)
0 0 0 0 
##$XL= 0
##$YL= 0
##$YMAX_a= 325352
##$YMIN_a= -200305
##$ZGOPTNS= <>
##$ZL1= 120
##$ZL2= 120
##$ZL3= 120
##$ZL4= 120
##$ABSF1= 10
##$ABSF2= 0
##$ABSG= 5
##$ABSL= 3
##$ALPHA= 0
##$AQORDER= 0
##$ASSFAC= 0
##$ASSFACI= 0
##$ASSFACX= 0
##$ASSWID= 0
##$AUNMP= <proc_1d>
##$AZFE= 0.1
##$AZFW= 0.1
##$BCFW= 1
##$BC_mod= 2
##$BYTORDP= 1
##$COROFFS= 0
##$CY= 11.3945322036743
##$DATMOD= 1
##$DC= 2
##$DFILT= <>
##$DTYPP= 0
##$F1P= 16.9975609425685
##$F2P= -3.02152046262296
##$FCOR= 0.5
##$FTSIZE= 0
##$FT_mod= 4
##$GAMMA= 1
##$GB= 0.15
##$INTBC= 1
##$INTSCL= 1
##$ISEN= 128
##$LB= 0.24
##$LEV0= 0
##$LPBIN= 0
##$MAXI= 10000
##$MC2= 0
##$MEAN= 0
##$ME_mod= 0
##$MI= 1.114404
##$NCOEF= 0
##$NC_proc= 0
##$NLEV= 6
##$NOISF1= 3.799351
##$NOISF2= 2.8
##$NSP= 1
##$NTH_PI= 0
##$NZP= 0
##$OFFSET= 15.70392
##$PC= 1
##$PHC0= -9457.53
##$PHC1= 21.60088
##$PH_mod= 1
##$PKNL= yes
##$PPARMOD= 0
##$PSCAL= 0
##$PSIGN= 0
##$REVERSE= no
##$SF= 200.130013532006
##$SI= 16384
##$SIGF1= 3
##$SIGF2= 2
##$SINO= 400
##$SIOLD= 16384
##$SREGLST= <1H.CDCl3>
##$SSB= 0
##$STSI= 0
##$STSR= 0
##$SW_p= 3612.71676300578
##$SYMM= 0
##$S_DEV= 0
##$TDeff= 0
##$TDoff= 0
##$TI= <>
##$TILT= no
##$TM1= 0
##$TM2= 0
##$TOPLEV= 0
##$USERP1= <user>
##$USERP2= <user>
##$USERP3= <user>
##$USERP4= <user>
##$USERP5= <user>
##$WDW= 1
##$XDIM= 8192
##$YMAX_p= 0
##$YMIN_p= 0
$$ End of Bruker specific parameters
$$ ---------------------------------
##NTUPLES= NMR FID
##VAR_NAME=  TIME,          FID/REAL,        FID/IMAG
##SYMBOL=    X,             R,               I
##VAR_TYPE=  INDEPENDENT,   DEPENDENT,       DEPENDENT
##VAR_FORM=  AFFN,          ASDF,            ASDF
##VAR_DIM=   8192,          8192,            8192
##UNITS=     SECONDS,       ARBITRARY UNITS, ARBITRARY UNITS
##FACTOR=    0.0002076,     1,               1
##FIRST=     0,             0,               0
##LAST=      1.7004516,     0,               0
##MIN=       0,             -200305,         0
##MAX=       1.7004516,     325352,          0
$$ Real data points
##PAGE= N=1
##DATA TABLE= (X++(R..R)), XYDATA
$$ [...]
2837A309Q93m581K711M412n216j942M784j516k162M122j957m406N124K888n647
2852a184N16K437l304J841L763m805l069O057j50l969K094K15k884M073J906o708
2868c171j4O732k427k741K454k462j360N922p31o486L151L595l918K05K402l133
2884a982o8M637l477l376N029Q75m648K392J452l907K373L089m834m22N013k629
2900d83k656M394p95l417L975O39m881K145L745l923m67L596l386r28N437j609
2916A386m909L649J571l376K492J182n024J660N379m073k822M407r84j426L203
2931B315j620m592N247L578o065q91L429j914L92L580l973k806N896J83m989K192
2947c8K047l177J929K353m595J58N341l331l003L975j24l422M173N99n026K104
$$ plain form
2837 1309 2202 -2379 332 4744 -472 -2414 2370 854 -1308 2814 857 -3549 1575 4463 -1184
2852 -1184 -668 1769 -1535 306 4069 -736 -3805 2252 2102 -1867 227 442 -2442 1631 3537 -3171
2868 -3171 -3185 3547 1120 -1621 833 -1629 -2989 2933 2202 -4284 -1133 2462 -1456 -1251 1151 -1982
2884 -1982 -2050 2587 -890 -4266 763 1638 -3010 -618 834 -3073 -700 2389 -2445 -2867 2146 -483
2900 -483 -3139 1255 460 -2957 1018 1657 -3224 -1079 2666 -1257 -1724 1872 -1514 -2442 2995 1386
2916 1386 -3523 126 1697 -1679 813 1995 -3029 -1369 4010 -63 -2885 1522 538 -888 2315
2931 2315 695 -3897 1350 4928 -1137 -2028 1401 -513 -121 3459 -514 -3320 2576 2759 -2230 -38
2947 -38 2009 -1168 761 3114 -1481 -1323 4018 687 -2316 1659 1535 -1887 2286 2885 -2141 -37
2963c7L174l717m3L838l097j620M129j495l457L714J184m599K014K557l868J412
2979H9L577m361k497N436r03l020L165j113l442M234J891n842Q56M377k457j875
2995a885L103k566j078N596k138n762L322L541l047O29R82l964J221N320m132
3010h58l130M426P39l297K392N49m093L033K890m989m28M914k414j340L127k085
3026e64k890M422J072m784J953K277l604J304L620m424j289M736j346k870L313
3041I26Q7l261K998J336n178J389N082l304k127L576k139r11M255j875m240M172
3057G86K572m649L31K617k311M27L142l820j935N644L29n076J957J240k478K620
3073A396J518m889P99M949l116k433L557q74k324L732l85m669L403K541l767k09
$$ plain form
2963 -37 3137 -580 -623 3215 118 -1502 2627 1132 -2325 1389 2573 -2026 -12 2545 -1323 89
2979 89 3666 -695 -3192 2244 1341 -1679 1486 373 -3069 1165 3056 -2786 -1930 2447 -10 -1885
2995 -1885 1218 -1348 -2426 3170 1032 -4730 -1408 2133 -914 -285 697 -3267 -2046 3274 -858
3010 -858 -3988 438 1177 -2120 272 821 -3272 -239 2651 -2338 -2766 2148 -266 -1606 1521 -564
3026 -564 -3454 968 2040 -2744 -791 1486 -2118 -814 2806 -1618 -2907 1829 483 -2387 926
3041 926 1013 -2248 750 2086 -3092 -1703 3379 75 -2052 1524 -615 -1526 2729 854 -3386 786
3057 786 3358 -1291 -960 1657 -654 -227 2915 -905 -2840 2804 3133 -1943 14 1254 -1224 1396
3073 1396 2914 -1975 -1176 3773 657 -1776 1781 907 -1417 2315 1930 -2739 664 3205 -562 -771
3089g71K887k985l99M763k358l698L722R60l820K863P08m097J968M044m286j506
3105b005L721j546j589L184j397l354M389J784n639M40L667k310L3K771l741j068
3121b660N227j257m901L406J238l094K381J373m197J369L928l633k601M291l95
3136D75k106K793r05l563L143K454m843P08L486k168j046L364k517k416M337J81
3152A377m376K506K010l090J608K208m449k07M390j487k747L422p52k720L642
3167A335N89n020J791M002l010p99K744k341o36M059k125m329L924K551l438R50
3183B47J227l406J813L492l918k265M741j9k798K042K70l242L121J427m653P95
3199a126M307k659j282K672k217j669M231o60l670K768K075l910R66K302k871
$$ plain form
3089 -771 2116 -869 -1268 3495 1137 -2561 1161 2121 -1699 1164 1872 -2225 -257 3787 -499 -2005
3105 -2005 1716 170 -1419 1765 368 -2986 1403 3187 -2452 -2012 1655 -655 -622 2149 -1592 -2660
3121 -2660 2567 1310 -3591 -185 1053 -2041 340 1713 -2484 -1115 2813 -820 -3421 870 475
3136 475 -1631 1162 257 -3306 -163 2291 -2552 -1844 1642 -526 -1572 1792 -725 -3141 1196 1377
3152 1377 -2999 -493 1517 -1573 35 2243 -2206 -2413 1977 490 -2257 1165 413 -2307 1335
3167 1335 1924 -3096 -1305 2697 -313 -1112 1632 -709 -1345 2714 589 -3740 184 2735 -703 247
3183 247 1474 -1932 -119 3373 -545 -2810 1931 1912 -886 1156 1426 -1816 1305 2732 -1921 -1126
3199 -1126 3181 522 -760 1912 -305 -1974 2257 1597 -2073 695 2770 -1140 -174 2128 -743
3214g43m38M217k615k585M073k40l249K203N64l681K818L111m254n41L097j733
3230Dj189K844j357l013M238J081m841J346K268k479P48J748l099n73N493j869
3246A350m222K346Q22j952K248R28m036J476L817l331k159L023n74j731L434q16
3262F23l448K911J910l958L78K472k532N57L425k778k629L762k25k985K495Q71
3278H49k810J980K451m298n32M304k122j825K814p80j646L405k59n002K244L317
3294B090l024L21K505k774j31L639k533l227M386J042l579J298J234k289J410
3309C68K195m110r01M404m64k122K183q12k674K779J563m018Q58L687k680o65
3325d09K629k712j280L909l83l499K346J794k933J040J217l570L54M567k151k035
$$ plain form
3214 -743 -1181 3036 421 -2164 1909 1669 -1580 623 1187 -2494 324 3435 -819 -1360 1737 4
3230 4 -1185 1659 302 -2711 1527 2608 -2233 -887 1381 -1098 -350 1398 -1701 -2274 3219 1350
3246 1350 -2872 -526 296 -1656 592 1520 -2516 -1040 2777 -554 -2713 310 -264 -1995 1439 623
3262 623 -2825 86 1996 -1962 -1584 888 -1644 -1087 2338 -440 -3069 693 468 -2517 -22 849
3278 849 -1961 19 2470 -1828 -2360 1944 -178 -2003 811 31 -1615 1790 1531 -3471 -1227 2090
3294 2090 -934 -613 1892 -882 -1013 2626 93 -3134 1252 2294 -1285 13 1247 -1042 368
3309 368 2563 -1547 -2448 1956 1492 -630 1553 741 -1933 846 2409 -1609 -751 2936 256 -409
3325 -409 2220 -492 -1772 2137 1754 -1745 601 2395 -538 502 1719 -1851 -1497 3070 919 -1116
3341a116K735m05k592K646j60l584K736K887l777l01K887k144p24K742k668k088
3357b926M671P61m111J250J320k229P94K036l316M50L989j835l233K463L29k294
3373a881K370L56l186K233K918l839j475L175j194j408L447j115k733K861J165
3388A694m209J288K387k788M48K849k327j319L175j231k509K737l8k330K683K421
3404B931m147p05K580j640l88K807j792j419L491j84m378J621K251j791L71J836
3420A444k532M44L408k640l027L292J028k088J415L50k676K194K028m547j10M068
3436B051q68j943K198q64j870K550M32l951J906L265k844j61K622k597j442K695
3452A179q22j442K463Q94l306J748J909l960J15L117j646q29K411j374j713L294
$$ plain form
3341 -1116 1619 1214 -1378 1268 1108 -2476 260 3147 -630 -931 1956 -188 -912 1830 -838 -2926
3357 -2926 1745 2506 -1605 -355 965 -1264 -470 1566 -1750 -1300 2689 854 -2379 84 413 -1881
3373 -1881 489 845 -2341 -108 2810 -1029 -2504 671 -523 -1931 1516 401 -2332 529 1694
3388 1694 -2515 -1227 1160 -1628 -1180 1669 -658 -1977 1198 -33 -2542 195 157 -2173 510 2931
3404 2931 -1216 -1921 659 -981 -1369 1438 -354 -1773 1718 1534 -2844 -1223 1028 -763 -392 1444
3420 1444 -1088 -644 2764 124 -2903 389 1417 -671 744 1094 -1582 612 2640 -1907 -2017 2051
3436 2051 1183 -760 1438 574 -1296 1254 1686 -2265 -359 2906 62 -99 2523 -74 -1516 1179
3452 1179 357 -1085 1378 2272 -1034 714 2623 -1337 -1222 1895 249 -580 1831 457 -1256 2038
3468B038j177l809K863K576k800K4J707k238K82K249k525j923M016P59l032N47
3484d43O98j575J780R87l658M40M512j504k886J524l91j366K926j86l498K298
3500c42L080l753q87K224j538p3K933j637k199L027P36l813J394J450k534J077
3516h55K480k155j107K803j458k010K547J60k440K233J546l196M98J705j838l42
3532a429L019j944j648L423l7l288J322J145k294J708J658k928O20L230k262k840
3548b545K803J94j396K153k78k770K419K452m004p04K496k23l70J854j862j828
3564a609L266K57m138J665K522j608K85J605l092k43L093j239k619L263J7k209
3580g84K061O48l221O81K524k396j05K796j670j507K774j199k507K176J172k120
$$ plain form
3468 2038 861 -2948 -85 2491 -309 -285 1422 -816 -534 1715 -810 -2733 1283 2042 -990 -443
3484 -443 255 -1320 460 1447 -2211 -1771 2741 1237 -1649 -125 -516 -1882 1044 858 -2640 -342
3500 -342 2738 -1015 -1902 322 -1216 -1289 1644 7 -2192 835 1571 -2242 -848 602 -1932 -855
3516 -855 1625 -530 -1637 1166 -292 -2302 245 405 -2035 198 1744 -1452 -954 751 -1087 -1429
3532 -1429 1590 -354 -2002 1421 1384 -1904 -582 563 -1731 -23 1635 -1293 -673 2557 295 -2545
3548 -2545 258 452 -944 1209 931 -1839 580 3032 -972 -1676 820 597 227 2081 219 -1609
3564 -1609 1657 1914 -2224 -559 1963 355 640 2245 -847 -1090 2003 764 -1855 1408 1425 -784
3580 -784 1277 1925 -1296 -615 1909 -487 -592 2204 534 -973 1801 602 -1905 271 1443 -677
3596f77J053J656k964M17K574k511j725K918L33j789J621j20k660J753J798l370
3612a693J92L398j438j453J754j371j325K887k03l213K337K063k392m6J058j977
3628a422j67K989j518j823K504Q95k895J144N60k671K020K419l321l99K790j216
3644a11j355J847r21j895L248R74l049N43J642j897l7J616j778m51L672j024k430
3661a406J291P94j912J079J548k986Q49L299k517j613K242p65j126K584r5k655
3677a389K101J663l117j26J807j397o7K737j943j878K968P7k678J228Q74j751
3693h91J712J758l199k45K600j054k189K099K77j299K194R2l584J259K553k498
3709d15l16K060j501O8K535k124k482K458J040k047O55J543j882L85K000k953
$$ plain form
3596 -677 376 2032 -932 -515 2059 -452 -2177 741 1074 -715 906 786 -1874 -121 1677 -1693
3612 -1693 -1501 1897 459 -994 760 -611 -1936 951 748 -2465 -128 1935 -457 -503 555 -1422
3628 -1422 -1589 1400 -118 -1941 563 1458 -1437 -293 267 -2404 -384 2035 -1286 -1685 1105 -111
3644 -111 -1466 381 -540 -2435 813 1787 -1262 -719 923 -974 -1011 605 -1173 -1624 2048 1024 -1406
3661 -1406 -115 679 -1233 -154 1394 -1592 -743 2556 39 -1574 668 -97 -1223 1361 1266 -1389
3677 -1389 712 2375 -742 -868 939 -458 -525 2212 269 -1609 1359 1436 -1242 -14 860 -891
3693 -891 821 2579 -620 -865 1735 681 -1508 591 868 -431 1763 1855 -1729 -470 2083 -415
3709 -415 -731 1329 -172 -104 2431 307 -2175 283 1323 -724 -69 1474 -408 -23 1977 -976
3725i76j241L216r0j878J620N2k062J897P02l156O44K812j855l35J904j521j720
3742a987K887n81k687K290J759k480M86J424k328k50K718j581j490K753n86j437
3758a090J412Q7k602J052K567k179o2J874j630o90J758j059k366L211J253k568
3774a032L65J538k057N64J304k391p7L637n46k792J553K38j503J239L43k368K131
3791A46K641k729j839K568o04j393J982n29j375K251R71l488P44J966j870K43
3807c15J726j168q06K516j152k251J788N69k004J332K113k586k88J705j332q87
3823a040K278j090j865L246N32k387o6J089j349O94J512k128j89L178j243k825
3839a653J503O64j362J571N11k141J130K337k860j805K940l13q81J514q00j411
$$ plain form
3725 -976 -2217 999 909 -969 651 703 -1359 538 1240 -1916 -1272 1540 -315 -650 1254 -267 -1987
3742 -1987 900 319 -2368 -78 1681 -799 -313 1111 -1217 -1467 1251 -330 -1820 933 347 -1090
3758 -1090 322 409 -2193 -1141 1426 -753 -815 1059 -571 -1261 497 -562 -2928 283 1536 -1032
3774 -1032 -667 871 -1186 -622 682 -1709 -1786 1851 1305 -1487 66 304 -1199 40 383 -1985 146
3791 146 2787 58 -1781 787 183 -1210 772 243 -1132 1119 2090 -1398 -654 1312 -558 -315
3807 -315 1411 243 -563 1953 801 -1450 338 907 -1097 235 2348 -238 -526 1179 -153 -1040
3823 -1040 1238 148 -1717 1529 2061 -326 -392 697 -652 42 1554 -574 -763 2415 1172 -1653
3839 -1653 -150 514 -848 723 1234 -907 223 2560 -300 -2105 835 522 -359 1155 355 -1056
3855a056K265K09l364Q12K452j157n37J570j836n84K456j104k711K609J503k215
3871f88O03R83k047k5K121j971m47K471o90j327J362L6k642J906J213k176Q24
3888d94J744j989p35K781j687k109K270R88j565Q43J10k027J656J767l277n92
3904b316L393k20j328J066j284q85K193N48l621J734K821j550j109J127j266j20
3920h17K288j425k180L245J159l082J16J285j064M21J527k039n01L248j123k672
3936a614J719O98j414J381P23k322P73K360k526j127K477r26j373K510J09j866
3952d18J097L86k269R10K089k254j67K793j451j784J347k55j046K107Mk434J412
3969F7J995k306j180J778p73nK142j644j832K720N32l247O01J669p98L54J281
$$ plain form
3855 -1056 1209 1418 -1946 -1134 1318 161 -376 1194 -642 -1226 1230 126 -2585 24 1527 -688
3871 -688 -85 898 -1149 -1174 947 -1024 -1471 1000 310 -1017 345 381 -2261 -355 858 -1318 -494
3888 -494 1250 -739 -1474 1307 -380 -2489 -219 769 -796 47 157 -1870 -214 1553 -1724 -2316
3904 -2316 1077 857 -471 595 -689 -1574 619 1167 -2454 -720 2101 551 -558 569 -697 -817
3920 -817 1471 46 -2134 1111 2270 -812 -696 589 -475 -54 1473 -566 -1067 2181 1058 -1614
3936 -1614 105 803 -611 770 1493 -829 -56 2304 -222 -1349 1128 202 -1171 1339 1448 -418
3952 -418 679 1065 -1204 -294 1795 -459 -626 2167 716 -1068 279 24 -1022 1085 1089 -1345 67
3969 67 2062 -244 -1424 354 -419 -424 1718 74 -1758 962 1494 -1753 -1152 517 -281 73 1354
3986A354k192l24K749j311k551J906R65j195O89P28k494J007K016k488o20K461
4002G00j73j820J740j21k208J863P63k052P63J809j986j56K200j774j203K159
4018E04l97j174J475N14k382J205J067k049M6K136r30n33J682j076j564K125J86
4035H35k576J512J863j586l56J527k063j72K711j440j981K294J108j945O67K6
4051D24k053J407K297k506p66K738n22j460J065q85j043K113J090k652O28J872
4067A747j576q10J840j970k68K619m54k270J662O85j985O04J271j826L92K452
4083B113j750j072J582n32j320J967j27k034J473J712k791k0J759j609j80K159
4099A330j277j326K262r8k354Q54R26j319Q11J685k568k51K795j472j846J855
$$ plain form
3986 1354 -838 -1162 1587 276 -2275 -369 596 -599 90 818 -1676 -669 1347 -1141 -1761 700
4002 700 527 -1293 447 326 -1882 -19 744 -1308 -545 1264 -722 -878 1322 -452 -1655 504
4018 504 107 -1067 408 922 -1460 -255 812 -1237 -1191 945 15 -518 1164 88 -1476 649 835
4035 835 -1741 -229 1634 48 -308 1219 -844 -1016 1695 255 -1726 568 1676 -269 398 424
4051 424 -1629 -222 2075 -431 -1197 1541 1019 -441 624 -261 -1304 809 1899 -753 -125 1747
4067 1747 171 -639 1201 -769 -1037 1582 1128 -1142 520 1205 -780 -176 1095 -731 -339 2113
4083 2113 363 -709 873 341 -979 988 861 -1173 300 2012 -779 -799 960 -649 -829 1330
4099 1330 53 -1273 989 891 -1463 -609 317 -1002 -191 1494 -1074 -1325 1470 -2 -1848 7
4115Gq0q00J726Q0k637J125J775k097o06K038j085j46K112j379k072K043Q82k067
4133a181M90J151j789J017J800k390j002K312j51j606J886j98j430J512O61k473
4149a391Q3K213q92n68J516j298n76J903n14k425J903J039j606M83J212j701j34
4166g53J906j366j132K399l61j406J169O02k019N18J555j806K22K236j544q89
4182f69J923j054j634K007Q35k013R52J291j685J48Q01j611n14K637q5k071J338
4199E96M02j591J341N66k703P57K713j564j171J330r70m75J913n32k390K409J220
4216A851k292m10J654j414K4J695j569j104K647j62j989P74O25j455J071J261
4232A207j715j58K026j659q57J567m83j307J787N20k056O81J452k233L33J635
$$ plain form
4115 7 -73 -873 853 933 -1704 -579 1196 -901 -1507 531 -554 -700 1412 33 -2039 4 886 -1181
4133 -1181 -691 460 -1329 -312 1488 -902 -1904 408 257 -1349 537 339 -1091 421 1082 -1391
4149 -1391 -1308 905 13 -555 961 -337 -913 990 476 -1949 -46 993 -613 -130 1082 -619 -753
4166 -753 1153 -213 -1345 1054 693 -713 456 1058 -961 -443 1112 -694 -472 1764 220 -669
4182 -669 1254 200 -1434 573 1408 -605 347 1638 -47 101 902 -709 -1223 1414 1329 -742 596
4199 596 998 -593 748 1314 -1389 -632 2081 517 -654 676 -294 -769 1144 612 -1778 631 1851
4216 1851 -441 -851 803 -611 -587 1108 -461 -1565 1082 920 -1069 -295 330 -1125 -54 1207
4232 1207 -508 -666 1360 -299 -1156 411 -72 -1379 408 928 -1128 -447 1005 -1228 -895 740
4248G40j358k36K052p45j659J252R8j477J218M40j906J127K172k222j231J480
4264b55L8m40J110k49j750K236P00k926L32J845o98k67J203j408n40K531r81k586
4282b105J646J318j291K42J147j679K14K034j854j268K265M12j430J159l02j500
4298i92J523O40k286N58K201j501q09J814p37j646J957K17j778J545O51j892P12
4315A77J215j968m87K161q05p33J361J3j733J507M49k076L28J793r89k72J238
4332A179j505m13K403j414j872J715J755k180K78P94j342K56J698j746p92K387
4348A201k22j926J089J37j369J491N02k116P33K209j937r99J503m14r86J841k70
4365D67j842J453J143k478M94J392j492j54K103j062j372J836n46j430J612Q19
$$ plain form
4248 740 -618 -854 1198 453 -1206 46 144 -1333 -115 325 -1581 -454 1718 -504 -1735 -255
4264 -255 -217 -657 453 204 -1546 690 1390 -1536 -1204 641 -57 -324 879 -529 -1069 1462 481 -2105
4282 -2105 -459 859 -432 -190 957 -722 -508 1526 -328 -1596 669 1081 -349 810 508 -992
4298 -992 531 1171 -1115 -557 1644 143 -666 1148 411 -1235 722 939 -839 706 1357 -535 177
4315 177 1392 -576 -1063 1098 293 -440 921 934 -799 708 1157 -919 -591 1202 213 -59 1179
4332 1179 -326 -739 1664 250 -1622 93 1848 -332 -54 740 -602 -346 1352 -394 -1186 1201
4348 1201 979 -947 142 279 -1090 401 903 -1213 -480 1729 -208 -1207 296 -118 -1104 737 467
4365 467 -1375 78 1221 -1257 -763 629 -863 -1017 1086 24 -1348 488 -58 -1488 124 943
4381I43k001O24J337j478m54J517j122l57J929q81j529J588J163k544O92P91j011
4398g93P12J415k014o39K386l56k086J142L39q83J267K48j593M68J733j648q37
4415a139J919o27p39J600m61j455J386R24k633M03J995j070k05R43j161j013K188
4432H55k66j445J571K47j319P53J041k245q8K014p29j008J691o94r83J322M13
4449A130k267R24J182r54j55J260j169p14K481j296j771J844Q99k053J135K6j609
4466a107Q85J742k233k53K064n22j143J194k37j730J900O73k120J91J861j095
4482G0r17J727j467m94K026o41j678J382Q63j893M59J172j500L10J589j503n91
4499a086J477k3j343J291J40j982J612Q75j971m1J350q69l24J567j048j111K070
$$ plain form
4381 943 -1058 -434 903 -575 -1029 488 -634 -991 938 57 -1472 116 1279 -1265 -573 218 -793
4398 -793 -81 1334 -680 -1319 1067 711 -1375 -233 106 -777 490 738 -855 -387 1346 -302 -1139
4415 -1139 780 153 -586 1014 553 -902 484 1408 -1225 -822 1173 103 -102 841 -320 -1333 855
4432 855 589 -856 715 962 -357 396 1437 -808 -896 1118 389 -619 1072 378 -605 717 1130
4449 1130 -1137 -213 969 15 -140 1120 -49 -763 1718 422 -1349 495 1394 -659 476 502 -1107
4466 -1107 -222 1520 -713 -966 1098 576 -567 627 390 -1340 560 1233 -887 -696 1165 70
4482 70 -847 880 -587 -1081 945 304 -1374 8 871 -1022 -563 609 -891 -581 1008 -495 -1086
4499 -1086 391 368 -975 316 456 -1526 86 961 -1010 -1051 299 -570 -894 673 -375 -1486 584
4516E84L02k083O75R66j326O19J152j650k77J953o44j582J233J77j053J420L6
4533E02j668P85J743j743k70J195o15p58J953o84j552J457Q51j925N12J184j225
4550b58j8J627j630p78K050n45j483J743Pj300J230P84k118J60J904j430m90J356
4568H11n02q00J475j00j738Q24J046j371N14J037j608J41J563j362j131J859L09
4585I67j039M52K70j588J202N77j493j95J638p86o76J412n64j270J641R1j518
4602h79N42R94j069Q1J054j352n25J917n03j515J502M53j762R94O99j830L41J645
4620G87j056o13J198k38j198J467j18j634J261J095j509r4Q84p99j96J531j400
4637f32q38K022L70j615K88O04q10N05J098j875j84K160r21j163J270k22p22J251
$$ plain form
4516 584 886 -1197 -522 444 -882 -263 889 -761 -1038 915 271 -1311 -78 99 -954 466 502
4533 502 -1166 -381 1362 -381 -651 544 -71 -829 1124 440 -1112 345 1196 -729 -217 967 -258
4550 -258 -276 1351 -279 -1057 993 448 -1035 708 715 -585 645 1429 -689 -529 1375 -55 -545 811
4568 811 309 -491 984 884 -854 -30 1016 -355 159 1196 -412 -271 1292 -70 -1201 658 967
4585 967 -72 380 650 -938 264 841 -652 -847 791 5 -671 741 177 -1093 548 639 -879
4602 -879 -337 657 -412 -331 723 -629 -1154 763 260 -1255 247 700 -1062 -68 631 -1199 -858 787
4620 787 -269 -882 316 78 -1120 347 229 -1405 -144 951 -558 -652 232 -567 -763 768 -632
4637 -632 -1470 552 922 -693 -405 199 -611 -106 992 -883 -1067 1093 172 -991 279 57 -665 586
4655E86l35j320J042J041j337k49Q79n15l0J238j015q47J281J41j274M84J001
4672G71j388Q10J016j419o47J685l73r15J148k7j352J022R80j895O30J011j346
4689b89J59J276j420o89K384o61j819J100M08o96P40M36j586M38J583j307j153
4706a096J697k08q36R28l83q70Q30J445k087K4J283q14j92J133j130l78Q95L71
4724F12j561O94J176j383J93O58j163j19J562p74j098J462j19q51Q71M75j687
4741a052O44R73j055l38J103n83o11J536n78j548J479P53j459L60Q48j278M84
4758c22J272j629n95J647j3j059O26J4j090J524P38k012L5J795p89q41R41l68
4776a26p86J687l64j744J477R37j548J83N96q50M12J183q92j007J269L72j517
$$ plain form
4655 586 251 -1069 -27 1014 -323 -572 307 -208 -238 1000 -15 -862 419 560 -714 -230 771
4672 771 -617 193 1209 -210 -857 828 455 -460 688 661 -691 331 1311 -584 46 1057 -289
4689 -289 -130 1146 -274 -963 1421 760 -1059 41 449 -247 493 929 -657 -219 1364 57 -1096
4706 -1096 601 393 -443 485 102 -768 62 1507 -580 -556 727 -87 -279 854 -276 -654 241 612
4724 612 -949 -255 921 -462 -269 389 -774 -893 669 -105 -1203 259 140 -711 160 635 -1052
4741 -1052 -408 565 -490 -828 275 -308 -919 617 39 -1509 -30 723 -736 -376 472 -806 -322
4758 -322 950 -679 -1274 373 360 -699 -73 -59 -1149 375 1113 -899 -864 931 142 -699 242 -126
4776 -126 -912 775 411 -1333 144 1081 -467 -284 312 -538 -126 1057 165 -842 427 799 -718
4793g18N58R68j396N55J106j549K29J226o21q83J107j70j093J181N34j575L67
4810a74J068p37k30J240j252m27J686n03j074M52N04p48O73L70j372N12J248j134
4828A02j089J241K53o31J077j000r05J099R38j571n4J145n80j50Q29q40p54J701
4846H11k31j479Q52N62j013N93N20j404P1J746j304n34R56n4r07J017N66j808
4864a040R13P90j201l8R87r58j43J190l02r51O11O07j286P60L87q47J11J225j276
4883d61o13J369j08q61P49p5j035J533P8j409J37J431p38n30O26m26r8J295o45
4902B19j391J340L46p68K21O52j252N72J212j258o57J446p9j055P45K26j283Q76
4920A12P37j123R5J023j021k29J186m22r10Q12O53j619O61N24o25N10N31r84m41
$$ plain form
4793 -718 -160 808 -588 -33 1073 -476 -247 979 358 -525 582 412 -681 500 1034 -541 -174
4810 -174 894 157 -73 1167 -85 -512 1174 671 -403 49 553 -195 478 848 -524 -12 1236 102
4828 102 -987 254 507 -124 953 -47 -952 147 1085 -486 -540 605 25 -125 704 -136 -890 811
4846 811 580 -899 -47 515 -498 95 615 -789 -718 1028 -276 -810 146 92 -815 202 768 -1040
4864 -1040 -127 663 -538 -576 411 -547 -690 500 198 -753 -142 465 -821 -61 326 -521 -410 815 -461
4883 -461 -1074 295 187 -674 75 0 -1035 498 576 -833 -696 735 -3 -533 93 -333 -431 864 219
4902 219 -1172 168 514 -254 -33 619 -633 -61 1151 -107 -764 682 603 -452 293 519 -764 112
4920 112 849 -274 -179 844 -177 -406 780 358 -552 260 913 -706 -45 479 -146 364 895 -89 -530
4939e30J392m60p77P87P6n82Q36N3j659O11J377j176m47Q23j44m15Q26m15p15
4958e39J126L01r83k31J020n29k48P50j051n45J842n51p72L35N09p82O09J43j256
4977h52N64Q21m69l78O59o88m67Q39K49r42O96M34j101L68L44n42l6J327r61p77
4997i12Q05J52o36O63r0r79J040P89j511k92J574l86l36K21l64r01J404O86j746
5016h19M10J021r24k80O30n55j5J459r11p18R19J35j085Q57L27q23K91J012r50
5035a9n26J275m85p20Q32J35r37P45L64j302L64J034q74k52J408j125o80J616
5053H53l72r98M17N43m48M43O36j507Q9J349o38r67J005k36j66O26o3j311N55
5072a90J345j054m67Q82n13R7N96p03r83J301M64j145K13P69r71K53Q11p97l93
$$ plain form
4939 -530 862 402 -375 412 488 -94 742 795 -864 -253 1124 -52 -499 324 180 -235 591 176 -539
4958 -539 587 888 -95 -326 694 165 -83 667 -384 -929 913 362 -410 -75 434 -348 261 404 -852
4977 -852 -288 533 64 -314 345 -343 -810 29 278 -664 32 466 -635 -267 77 -465 -501 826 -135 -912
4997 -912 -107 45 -591 72 -18 -997 43 832 -679 -971 603 217 -119 102 -262 -1163 241 927 -819
5016 -819 -409 612 -312 -592 38 -517 -532 927 16 -702 217 352 -733 124 451 -372 -81 931 -19
5035 -19 -545 730 245 -475 357 492 -445 300 664 -638 -274 760 -114 -366 1042 -83 -763 853
5053 853 481 -517 -100 443 -5 438 1074 -433 -344 1005 367 -600 405 169 3 629 566 -745 -190
5072 -190 1155 101 -366 516 3 100 696 -7 -990 311 775 -370 -157 612 -359 -106 705 -92 -485
5091d85J183l61r34Q55J92j110Q19L52j371K93J240o93l22Q19p10l67Q48q0j131
5110i63R81N16j076L41N42j133J25J229o29r43Q24J11m47Q32n52p75R87Q97j452
5129e85j00J058l70k22O07r90l34J790l83j306L17R45q98N54K59q94J98J418q02
5148B62j038Q43K00n95N01k9q20P13J147j300l33O70l7p00Q36k54l97O87K81r42
5168c05J18P45p88K41Q17r46l08R98k50q28N53K43q64J165L82j280j51J271p21
5187I2l54N61m85J72J169k69j508N45Q60j070K17L97l97L83O52j021p36J227K97
5206G32j277M27J91q4J90K77j059K2J458n10r96J088k83m58O25Q9r41L59O25p52
5226b77r4J037r21o14J015M0q17N83N53r77O24j9q71R9R57p48j37P76k69o13J151
$$ plain form
5091 -485 698 337 -597 258 450 -660 159 511 -860 -567 673 -20 -342 477 -233 -600 248 168 -963
5110 -963 18 534 -542 -201 341 -792 -667 562 -67 -1010 -186 -75 -522 310 -242 -1017 -30 867 -585
5129 -585 -685 373 3 -219 388 -602 -936 854 471 -835 -518 427 -471 83 342 -552 -354 1064 262
5148 262 -776 67 267 -328 173 144 -676 37 1184 -116 -449 221 184 -516 320 66 -331 356 637 -305
5168 -305 -187 558 -230 11 828 -118 -426 572 322 -506 47 290 -574 591 973 -307 -458 813 92
5187 92 -262 299 -186 -14 1155 886 -622 -77 783 -287 -70 327 -70 313 965 -56 -792 435 732
5206 732 -545 -118 73 -11 179 456 -603 -581 877 367 -629 459 176 -282 343 432 -509 -150 475 -277
5226 -277 -371 666 -255 -869 146 186 -631 -48 505 -472 152 133 -738 -639 318 -430 -567 209 -60 -673 478
5247D78n50j304J164O03q36J9O96q49K20O43o29n77J261L34j197L60N53r84N71
5266b4M05j133J01J261m18r89J126l98o56P33l0n67O64O73r59l65R56n04j42P93
5286E27p13o14J320K98j127J18P26o31QR02q21j21Q99p38m95R78L7r06P48N63
5306I58j313K80P93m26m32P23q32l81J542l04r59M89L47p64J81M25o03N03O11
5325H38p99r32J165K3n82M76J29p37J081O5j333L1J165l80m75O18m17j68P34N1
5345E53j347P02M89q75K95N59q12l4R26p47l37O25J21n88O65k46p34M96P30o78
5365b37l33O71l8o14Q04m15q05R18N59j252L56O83m46J20N63p65o11J176k14o57
5385e37O57qm79K17L71q45Q6J233r37j44O51j7p37J002l74j107J057N44r51J06
$$ plain form
5247 478 -72 -1376 -212 391 -445 -426 270 -579 -359 284 -345 -922 339 673 -524 -164 389 -595 -24
5266 -24 381 -752 -651 610 192 -797 329 -69 -725 8 -22 -589 75 748 -211 -576 380 -124 -266 527
5286 527 -186 -800 520 818 -309 -191 535 -96 -88 814 -7 -128 771 33 -462 516 553 -353 395 958
5306 958 -355 -75 718 292 -140 583 -249 -630 912 608 -351 138 485 -279 -98 327 -276 227 838
5325 838 39 -893 272 295 -287 189 318 -419 662 727 -606 -575 590 210 -265 353 -64 -232 502 553
5345 553 -794 -92 397 -478 -183 376 -436 -470 456 -291 -628 -3 118 -470 195 -51 -785 -289 441 -237
5365 -237 -570 101 63 -551 253 -162 -967 -49 510 -742 -386 297 -149 -29 534 -231 -842 334 120 -537
5385 -537 120 112 -367 -150 221 -624 -538 695 -242 -386 265 248 -489 513 139 -968 89 633 -318 -212
5405b12N49m13j72P07l57o37R75p1p00K27L63r67P75N19q13j50R95k56p81R48
5425E29m39l81R33L4q45L8R60o06l4N40q79k53J098J19j326J260q9q74M0L75q28
5446f28O59R20q11n49Q96l92n61P29L17r74P91M74j365K23M98j89k21R93o76m66
5466c32O96j70r97P59J88n25M31N62j121Q6O98l68n82Q13l56l51R50p7j441P42
5486c95Q51j091O3O96m05j35J018r56m80O67M09q78M47K81l79L57jq27j78J428
5506D92k59j015Q17K85q14P62k5r96M20O21m34LO05k69l66O95n70o56J179j98
5526B77n49L17P60r29j54R00r86kN59J15o14R40l09j050J002O33j173Q1N10k72
5546E6k78Q16q29n86J328L90j061R4R14n84p7N16j115r0J512o82o89Q09k1o11
$$ plain form
5405 -212 337 -76 -248 459 102 -535 440 369 -331 -104 259 -708 67 586 -227 -377 618 362 -419 529
5425 529 90 -291 642 676 -169 -131 829 223 189 729 -150 -403 695 814 -512 748 659 -215 -175 200 -628
5446 -628 31 951 140 -409 487 95 -466 263 580 -394 397 871 -494 -271 227 38 -183 810 134 -332
5466 -332 364 194 -803 -44 144 -381 50 612 -509 -423 275 -93 -675 138 -218 -569 381 304 -1137 -395
5486 -395 456 -635 -572 124 -281 -416 602 -354 -834 -167 242 -636 -189 92 -287 70 69 -758 -936 492
5506 492 233 -782 35 320 -494 268 243 -753 -333 288 -146 -143 462 193 -173 522 -48 -704 475 277
5526 277 -272 45 805 -124 -278 622 -364 -366 193 308 -306 634 325 -725 277 910 -263 -182 328 56
5546 56 -222 594 -235 -821 507 897 -164 -70 844 260 183 699 -416 -506 1006 324 -365 444 423 -188
5566a88m8M56n47N07P80j259j77P38K0n56M69l13k36Q43M06j504K65J046q03j86
5586b87M65k88m01Q62k08o77O61J53j125P97M80q12L50N24o09o04J027p35k61
5605f88Q95m65m81N89L39n09MN87n19j96J132r34o16Q30M50n66j43M06o49Q86
5625C52L17j212q2Q36k19m54L16J78o45J198m94j027N45Q03l22p87Q26j88k40
5644b99O98o20l87P47L44q09K96L12n04K4N82n88m66J360m66p84J119J21o91k6
5664c7N27r51K59O65m99k76O58l26n92J113kp89M44K53p13O03K4q34K53J025k94
5685E11p57L06L26n25N12o4o48L39L99l78l57N40m14J77M20p43l68J102L80j066
5705c08Q1P49o57l62Q59p97K48J110p47n69L94j60k50N62M8o70K88Q55q06k60
$$ plain form
5566 -188 -236 220 -327 180 960 -299 -476 262 282 -274 195 -118 -354 489 895 -609 -344 702 -101 -287
5586 -287 178 -110 -511 351 143 -534 127 280 -845 -48 432 -380 -30 494 -115 -719 308 -427 -688
5605 -688 207 -258 -739 -150 189 -320 -316 271 -248 -444 688 -246 -862 -32 418 -148 -291 115 -534 352
5625 352 669 -543 -625 211 -8 -462 -146 32 -613 585 91 -936 -391 412 90 -697 129 -59 -299
5644 -299 399 -221 -608 139 483 -326 -30 282 -222 -198 384 -204 -670 690 224 -560 559 680 -11 -37
5664 -37 490 -461 -202 463 -36 -312 346 20 -572 541 539 -250 194 447 -266 337 361 -473 -220 805 511
5685 511 -246 60 386 -139 373 309 -339 0 399 21 -336 204 -210 -33 387 -356 -724 378 758 -308
5705 -308 -227 522 -135 -497 362 -435 -187 923 176 -393 1 -159 -409 153 201 -469 -181 674 -132 -392
5725c92P16n52k91J020m53n81P16K24r35L19K52n31J68Q98n35n46O12k1p26O75
5745C7P6o47P83N02j283j75J215p24j47K57k13k78J055l95p86N27M87n51j20Q32
5765D52q77J76N92o35m52N31O39r25M65L92p33M78M84r64L4J016o97l26Q14k40
5785B24n76O80P5o22K39N03p64J60P68r49j94O18on59N90L78m71N6M46j091M12
5806h3R44r58m36J066k85l45Q34m25p13N95L93n31K0M50o18j11Q59q02k66Q50
5826D38R4p01N72j86n76K23N81p66q1R17j91m46M58m39q25J174J10j095J054K78
5846E93q58j58P01m22m11Q86k56n47N16L14p27O95k02n33O2J000o98n63R60l00
5866E2o45L01N63r97J242J84j398K89P16n48j63J60L07n46R35m19q04Q66Pl05
$$ plain form
5725 -392 324 -228 -519 501 48 -533 183 407 -528 -209 43 -488 -320 578 43 -503 109 88 -638 37
5745 37 113 -534 249 751 -532 -707 508 -216 -363 -106 -319 -597 458 63 -723 -196 291 -260 -380 452
5765 452 -425 -249 343 -292 -744 -213 426 -499 -34 358 -375 103 587 -377 -343 673 -24 -350 464 224
5785 224 -352 328 403 -219 20 523 -241 -81 687 -262 -456 162 156 -403 187 565 94 150 596 -495 -83
5806 -83 861 -97 -533 533 248 -97 737 312 -401 194 587 56 76 526 -92 -203 656 -146 -412 438
5826 438 532 -169 403 217 -359 -136 445 -321 -402 515 324 -122 336 -103 -928 246 356 -739 315 593
5846 593 -265 -423 278 -144 -555 331 75 -472 44 358 -369 326 124 -409 -347 653 -45 -608 352 52
5866 52 -593 -292 271 -726 516 700 -698 -409 307 -241 -404 -244 63 -483 452 33 -771 95 102 -203
5886b03J80K33o84K28P23o65m63Q63k98l72J084j22p29M31L60p10j65M45j37l16
5906c17Q44l14o85R79j48o34K88M2l45P92M98j070m02J158j46q50N12L96n66M47
5926D79J1r15L06N95l35k98O45o74p4Q02m39o58R21L95q40O7P61q80M85J58p64
5947b52j75J079l6j043M99J47m56L97k4n84J80P89o56l5P45p65n51J100j98p31
5967e70M98O31r72L83k3o64J68J336q66p49J131k30n38M69j45q88Q59O08m84q38
5987h84J197l26m86M97j30m41P82L56j237N40O17q27M7N13q11J42P65r2r18M86
6007b10P13j101M36L05m37K80N51q36j68J139m20p32O41J5p04M42M89o67J71N60
6027D67n40k72R67l22l29O72m12l88M50J8q06N04Q04q78k54O39j17j03L75k98
$$ plain form
5886 -203 -23 210 -474 -246 477 -188 -651 212 -86 -458 626 504 -225 206 566 -144 -309 136 -1 -317
5906 -317 527 213 -472 507 359 -275 13 55 -290 502 1000 -70 -472 686 540 -310 202 598 32 479
5926 479 490 -425 -119 476 141 -157 488 -186 -260 542 103 -555 366 761 -79 -12 749 -131 354 512 -252
5947 -252 -427 652 616 -427 72 219 -237 160 136 -448 -268 521 -135 -170 575 -190 -741 359 161 -570
5967 -570 -72 559 -413 -30 -53 -717 -549 787 -79 -828 303 73 -465 4 -141 -1029 -170 438 -46 -884
5987 -884 313 -13 -499 -2 -132 -573 209 565 -672 -132 485 -342 -295 218 -593 -451 314 222 -696 -210
6007 -210 503 -598 -162 143 -294 -14 537 -299 -467 672 252 -480 161 176 -528 -86 403 -264 -93 467
6027 467 -73 -345 622 300 -29 643 231 -157 293 311 -495 9 813 -65 -319 320 203 100 475 177
6047A77o24Q43J61q66J14J252j013J8K93k52j7O29o89p73R24O10p89J94q6n33
6067d27P76M52j277n5J063m23p28R40j9o47O30k7n08K4P80o90j34R56q52n47O84
6088b9J47p44R02j10m99M31K96o40j08O99l02k46M82m47q9M67k56o53K39Q50l73
6109A7k32K57j94J96L16p52l76R63j03n99L14L32j31k51P10j221L45Q22k20n51
6129c58K93K65k34K86j18n20J87R13r17n10R63l01l91O72j25o34R82K65j055L10
6149b7K97p53L87Q46q01j26K94M8n99O87K12q48P39N69j223L8P31m50jL43q30
6170d67L72Q04n5j088L91M72o32K93M62o03l2J066j060n19P53J82o45K16K80j46
6190D4N15J91j003k57J182l09p28O34j96m34O81j26p65L65P80q59J87K27k08k76
$$ plain form
6047 177 -447 396 557 -309 -195 1057 44 62 355 103 86 715 26 -747 177 787 -2 192 106 -427
6067 -427 349 801 -476 -531 532 109 -619 321 302 -345 285 258 -250 -226 554 -136 -270 686 -166 -713 -29
6088 -29 118 -626 276 166 -333 98 394 -246 -354 345 43 -203 279 -168 -257 210 -46 -699 -460 390 17
6109 17 -215 42 -152 44 360 -392 -768 195 92 -507 -193 139 8 -243 467 -754 -409 413 193 -358
6129 -358 -65 200 -34 252 134 -386 -199 714 -203 -713 250 -51 -442 230 105 -529 453 718 -337 -27
6149 -27 270 -483 -96 750 -51 -177 117 165 -434 253 465 -383 356 925 -298 -260 471 21 20 363 -467
6170 -467 -95 709 654 -434 -43 429 -203 90 552 -51 -83 983 -77 -596 157 339 -306 -90 190 44
6190 44 559 750 -253 -510 672 363 -365 269 73 -361 320 194 -571 -206 574 -285 -98 129 -79 -355
6210c55Q70n08q07J185m65m10O17L38o42k0M43k77k16M05j61l87P22k32p53O80
6230B7J2n68M04K35m65K1N68m54l55P30o0r28R17N9q18N98O1m29L58K74l05n78
6252f96J134l97l88L04K32p57L34N31p18L07L92n05j73O07p8o11Q77l44k24J76
6272CK24m91J46N83m27l59M79j75j17K85J24p81O54L94p26J01P07q55J43L55l88
6293a21j45P94J23j025P75N1l95j5O30q99J61M63j70o30O61j9m21N88j02l97M13
6314C20L57j133N42k6k9l29N90j69r27J476k53o89L23J17n19K70O06o85j3O34
6334D63m45l27M28jl31M21J52q95l1J062o76o2M27m30L3Q88j007k97N34M81o46
6355b59o4N15n62M48M28q94j61O13r9j85p3L99p32J047n36m76J99M28j48l91P37
$$ plain form
6210 -355 515 7 -800 385 -80 -490 127 465 -177 -197 246 -31 -247 158 -3 -390 332 100 -653 27
6230 27 39 -529 -125 110 -355 -334 234 -220 -575 155 95 -833 84 143 -675 -77 -16 -445 -87 187 -118 -696
6252 -696 438 41 -347 -43 189 -568 -234 297 -421 -114 278 -227 -400 207 129 -482 395 51 -173 3
6272 3 227 -264 -118 465 38 -321 158 -17 -134 151 275 -506 148 542 -184 -83 624 -231 -88 267 -121
6293 -121 -266 528 651 -374 401 452 57 42 672 -227 -66 397 227 -403 258 239 -182 406 304 -93 320
6314 320 677 -456 86 60 31 -298 292 123 -804 672 419 -270 53 170 -349 -79 527 -158 -171 463
6334 463 18 -309 119 118 -213 208 360 -535 -566 496 -180 -242 185 -245 -212 676 -331 -628 -94 387 -259
6355 -259 -323 192 -370 78 506 -388 -549 64 -35 -220 -293 106 -626 421 -115 -591 -392 36 -112 -503 234
6376B34l23j47N38j54p34L92K24k84R1O56m04l51N09j36m02N92j99k75N06k26
6396A07m91M87K68m53k26O99l90k13N85k84n26P01N2n94L61J09m35J43N24n70
6416a46q8Q54k25m33J90R2n92L33L86q17P82M88o16l64L63P3l94M67j26l57N12
6437C82Kq15L08N19m87n6M99n13NM75m5n31M50o6o15K84K01j46P7J55l0n33N72
6460I2k35l24L52K67p24K56M84m96L94O4l52j71Q26m28o80O79J33l13J39R9o54
6481e92O42K56m15o65R26l4k88J66J25n24P19l70l22J69M81j82m93O56n74kO52
6502C31n71l82M67O48r47K88N90n60J28K35n09P2M10L6n22L48N2p41P46J19n04
6523b66j05P84k74k95M67j0r44R07Q7n94J16K07o2J17N91r90r5P98j23p08L60
$$ plain form
6376 234 -89 -236 302 148 -586 -194 30 -254 -163 493 89 -262 247 111 -291 301 102 -173 333 107
6396 107 -384 103 371 -82 -308 391 1 -212 373 89 -437 264 316 -278 83 192 -243 -100 424 -146
6416 -146 -234 620 395 -38 152 244 -348 -15 371 -446 336 824 208 -156 207 280 -114 353 227 -130 382
6437 382 384 -431 -123 396 -91 -147 352 -161 -156 319 274 -257 193 127 -488 -204 -3 -149 -72 83 53 -480 92
6460 92 -143 -467 -115 152 -572 -316 168 -328 66 130 -222 -393 433 5 -675 4 137 -176 -37 62 -592
6481 -592 50 306 -109 -774 152 118 -170 -4 121 -403 316 -54 -376 -207 274 92 -401 255 -319 -321 331
6502 331 -240 -622 -155 493 -454 -166 424 -136 -8 227 -282 -210 200 236 -286 62 114 -627 119 238 -266
6523 -266 -371 413 139 -156 311 301 -643 264 351 -243 -127 80 18 135 726 -264 -359 439 316 -392 -32
6544c2Q5p2J67K23p87K71P01l35n51O40j26k20L54j27m73R50k64p94M58M98n29
6565C7J38M90j194M03M66j72o30O73K0k23J16l7k28o9O58n79k58O98o05K54KL38
6587B98p15L79L61o81J89J17q19L44J008o23k80N09N27r24l1L01m17L73M77q51
6607d58K23Q42n42k05K77r1l65O09l9q14K53N81p85L14M06n52N7N06m27k91P77
6628B76j89m63M48J15j44k43N77p01J80M46k34k33L50J33l49mJ96j60L4K62k92
6649Ek68O42l88k50N05k37l38N49l25K39k65N95o24q8Q58k58m17L82J1m32L72
6670B68L98j266O47N90m82r0P9P8l42O04k65o47O08K32l88K00j36l85K38N74p89
6691b74L51K34r3m52L11K41o21M82L10p93J42N96o21K88J83l18l10Q33k26l91
$$ plain form
6544 -32 53 -19 148 371 -416 -145 556 221 -330 310 184 -36 318 191 -282 668 404 -390 68 566 37
6565 37 175 665 -529 -126 340 168 -462 211 231 8 124 87 -141 -210 448 -131 -389 309 -296 -42 -40 298
6587 298 -417 -38 323 -358 -169 -52 -871 -527 481 -142 -422 87 614 -310 -341 -40 -457 -84 393 -458
6607 -458 -235 607 65 -140 137 46 -319 290 251 -563 -310 271 -514 -200 206 -346 -289 217 -210 -501 276
6628 276 87 -376 72 187 43 -200 377 -324 -144 302 68 -165 185 318 -31 -35 161 1 35 297 5
6649 5 -263 379 -9 -259 246 9 -329 220 -105 134 -131 464 -160 -248 610 352 -65 317 328 -104 268
6670 268 666 -600 47 637 155 65 144 222 -120 484 219 -428 180 412 24 224 88 -297 -59 515 -274
6691 -274 77 311 218 -234 77 318 -303 179 489 -304 -162 434 -187 101 284 -34 -344 489 263 -128
6711a28K60o7k43J32K51m43J73K04m2o08O61j85m10O30k7m66J67O46q25j98O77
6732A59M9n57L68j01l42M26nn62J56M50r0L3K57r22O08M26m19j43M33l0p05O02
6754I1J45p66L11P76o78j25N69l17n29J183o76l83P92k1m90p3P70o13n2O44l71
6775A87l90O32k33n74N21Rm22N41L47r42K00O66l74m02K94O5m12O18j14q59Q80
6796B38L81q12jL83l37K69L67l60m98N56N1o42P06L4l70O6L10r31N40M32k79l55
6818b52K60j26o6N94j43q06O09J73k18p3K06j78l31Q24j82p61M61J47n17N87L7
6839B45o51P1P40m48k90L99k6k77M99l19m44O04J29o56J43M82n26J82K21k68n26
6860g16R64l19n29M03K28l24O5M84n83M7N83q5o20N00K91p06O72r0n60J68L94
$$ plain form
6711 -128 132 65 -178 -46 205 -238 -65 139 97 -511 150 -35 -445 185 158 -308 -141 505 -320 -518 159
6732 159 208 -349 19 -82 -424 2 -3 -565 -409 41 -49 -16 241 -681 -73 353 -66 -209 224 194 -511 91
6754 91 236 -530 -219 557 -121 -246 323 6 -523 660 -16 -399 393 372 -118 -191 579 -34 -86 558 187
6775 187 -203 429 196 -378 143 152 -270 271 618 -324 -124 542 168 -234 60 125 -287 331 217 -642 238
6796 238 619 -193 -194 189 -148 121 488 128 -370 186 237 -405 301 335 -35 31 341 -590 -50 382 103 -252
6818 -252 8 -118 -184 410 267 -539 70 243 25 -48 158 -20 -351 473 291 -470 -9 138 -379 208 245
6839 245 -406 -335 405 -43 -333 66 40 -237 262 -57 -501 103 232 -424 -281 201 -325 -143 78 -190 -716
6860 -716 248 -71 -600 -197 31 -293 -228 256 -327 -280 303 218 -402 98 389 -317 355 265 -295 -127 267
6881B67q02L48L36m05N5N33j14n91K43L25k48p9N44n31J74M96o98o7L05K12l91
6902h8L39l32k59O87Q4p25J43P90k62n83N42m98k83J014j72m79K70L43o25J58
6922F4K85n57l1N68l08m34J116k13p14O26j18m05K06K91m26K70J36l44j87N84
6942D09k16m92Q41k20k02j51O37o89k13Q97l28p88Q83l49l77N62j12m50L72n7
6962d3k78J89O56n81l16N71n06O8P0L62p71O95L33o48p4L43k97J70L27p86J25
6983c91Q86m22n68K19N14j57m0N0m70nN37k66k78O76m09j33L14k31l8K40L39p10
7005c43P0N73l13k3L48Lp21O74j27l59J97J84k74K32K45n21J21M54j8n27O63l48
7027A90l63K45K58n88MO81m99N2M48j98k25K70j03o02P36J82m44K72k19l14J81
$$ plain form
6881 267 -535 -187 149 -256 -201 332 218 -373 -130 195 -53 -132 412 -119 55 551 -147 -214 91 303 -88
6902 -88 251 -81 -340 347 431 -294 -151 639 377 -206 336 -162 -445 569 397 -82 188 531 -94 64
6922 64 349 -208 -239 329 21 -413 703 490 -224 402 284 -121 85 376 -50 220 356 12 -175 409
6942 409 193 -299 542 322 120 -31 606 -83 -296 601 273 -515 368 19 -358 204 92 -358 14 -43
6962 -43 -321 -132 524 -57 -373 198 -308 -240 -170 192 -579 116 449 -199 -273 70 -227 -57 270 -516 -391
6983 -391 495 73 -495 -276 238 81 41 91 -379 -384 153 -113 -391 285 -124 -257 57 -174 -212 28 367 -343
7005 -343 -273 300 -13 -36 312 315 -406 268 141 -218 -21 163 -111 121 366 -155 -34 420 402 -125 538 190
7027 190 -173 72 330 -258 -254 427 -72 -20 428 230 5 275 172 -430 306 488 44 316 97 -217 -36
7048c6M28n12k20O51p5l59M17j86k90N2M95o37L32N89r31K04K65j77k40M35k8
7069A77l48K19K88m87N0N93n95j62O77m03j21K93pn87M59L57q41L27K19l82J35
7090a39m2J86j38M43k01j049P14P35q71K47K71m99K74N54o46j52O72k68l26K27
7110hO7o06O09K33m25oQ45j010K0J58K82o12P04J54q77N01J14j39q9L33l55j5
7132a22L28k99k81O76j85k74O49k48o69N36L54q27r9P96k26j64K12m24K8O82r6
7153C47o17L63K62l91n4N40n80J1P86p45l14N09N14q87M35L57n76N3N33o14j49
7174b17N61k39k07M21j23n28N70R6l45j78O99p01R2N70p00l6N47j51l85L58n8
7195D6k69K0K99o29M38M48m41k74M97m73k22Q12n1o19L90J47k83k99O05l13q9
$$ plain form
7048 -36 392 -120 -340 311 236 -123 294 108 -182 -130 365 -272 60 649 -282 -78 187 10 -230 205 177
7069 177 -171 48 336 -151 -101 492 -103 -265 412 9 -112 181 174 -413 46 403 -438 -111 108 -274 -139
7090 -139 -181 5 -133 310 109 -940 -226 509 -362 -115 156 -343 -69 485 -161 -313 359 91 -235 -8
7110 -8 59 -547 62 295 -130 -136 709 -301 -281 -123 159 -453 251 405 -472 29 143 4 -85 248 -107 -122
7132 -122 206 -93 -374 302 117 -157 492 244 -425 111 465 -362 -461 335 109 -55 157 -267 -239 443 347
7153 347 -270 93 355 -36 -90 450 -130 -119 667 -78 -392 117 631 -256 179 536 -40 13 546 -68 -217
7174 -217 344 105 -102 319 196 -332 238 334 -11 -189 510 -191 -99 471 -229 -265 282 131 -254 104 46
7195 46 -223 -203 96 -533 -95 353 -88 -362 135 -338 -560 252 201 -418 -28 119 -164 -463 142 -171 -260
7216b60M22n19l3P36j6r80N40K66n55L27J68n53J04O30k97k82M51q2o59P68j6
7237A60n98P3M12j95k05K82J68l28L90k53l86N33Rn14M62M04m69j56P91n04n33
7258d57M77km20P56q4p11O65l63R5K04J35km10N32n99j23P49k55o69P01L7l88
7280a32J69L10o41J21O30m56p9J28N24o77J09J70n98L99O03q37J74M17l3o04N31
7301B28k49j72M83J75p86K51L92n68M09O7k67k70L85P2m05N52j96o96N89L32m54
7322a28J64O5k41j58O14l74k41M89qn43K88K05j43j12L62m84j66N30m37k50R10
7343C42l9n26N2M44n22L46N78q99k09O02j70l82Q8L85n12N00k7m42P5O66m47j66
7365b63L39l10O1M50j84o03N21K21n31K42O00p51k2O27n79k06M89k15l14P21j86
$$ plain form
7216 -260 162 -357 -390 346 330 -650 -110 156 -399 -72 96 -457 -353 277 -20 -302 149 67 -592 176 160
7237 160 -438 -365 47 -148 -353 -71 97 -231 159 -94 -480 53 62 -452 10 414 -55 -211 580 76 -457
7258 -457 20 18 -402 354 270 -441 224 -139 -44 160 295 293 -117 415 -184 -307 442 187 -482 219 256 -132
7280 -132 37 347 -294 -173 457 1 -78 50 574 -103 6 176 -422 -23 580 -257 -83 334 301 -303 228
7301 228 -21 -193 290 465 -321 -70 322 -246 163 230 -37 -307 78 150 -255 297 101 -595 -6 326 -128
7322 -128 36 101 -140 -298 316 -58 -299 190 182 -361 -73 132 -11 -123 239 -245 -411 119 -318 -568 342
7343 342 303 -223 -171 273 -249 97 675 -224 -433 169 -1 -383 -295 90 -422 78 51 -391 -316 350 -97 -263
7365 -263 76 -234 -173 277 93 -510 11 232 -299 -57 543 -208 -230 397 -182 -388 101 -114 -428 293 107
7386A07m83L31J38k37p3O49o89L29K29k29n81J031j12q76K77N32o25M61J64p51
7406d08M03N89m67j3K35n1j27M32n23k10K07L31m58n04O58j43J93R7k54j64K39
7427F2M11p22J35N47m85J06M36p19J32Q62p55m60P11J3n56L90N8m17r4O87m08
7448f6j56O07o51PN3J73k80J52L24k99P1K84l62k95N99J43q58O17Q7o42O73p7
7470A04p19O38M49n18l48O75l57l13P48p03j10P82j70n33L20L01o15K10L48k58
7490f9j17L83l66r3L47M9m18K64L31o52L08M59o51M0M89k80q2L56l26m42P97J1
7512C38m18L36q1l15L23K72m39k51O05j53p18L95M25p86L97M62p08Q7P76j97m24
7533g4L45j77l43O04j76k43J41K34n06o6N71k24O2L31k93n96M36J22k72K48Q6
$$ plain form
7386 107 -376 -45 93 -144 -217 432 -257 72 301 72 -509 522 410 -466 -189 343 -282 179 343 -408
7406 -408 -5 584 117 104 339 288 161 593 70 -140 67 398 -60 -564 94 -49 144 241 -13 -177 62
7427 62 473 -249 -114 433 -52 54 490 -229 -97 765 10 -450 261 274 -282 108 166 -251 -345 342 -66
7448 -66 -222 385 -266 -259 -206 -33 -313 -161 163 -136 -65 219 -143 -438 161 304 -554 63 150 -492 181 104
7470 104 -615 23 472 -46 -394 281 -76 -389 359 -344 -454 328 158 -375 -55 246 -369 -159 189 -69
7490 -69 -186 197 -169 -262 85 134 -284 -20 311 -341 -33 426 -225 -185 304 24 -58 298 -28 -470 327 338
7512 338 -80 256 175 -140 183 455 16 -235 370 217 -501 -106 319 -467 -70 392 -316 -229 547 350 -74
7533 -74 271 94 -249 355 179 -64 77 311 -195 -261 310 86 148 479 186 -410 26 148 -124 124 210
7554B10l40J81M46o83k44Q43l59j67M28r4p48P94K49o98J20L00k73o5M93p53R5
7575b65M32J0p02P93L7n67M27k0l90M45J18p03j29Q28n09o2L49j10m78Q29l07
7596B6l44K46L12l45k53N60l32j61L37J7k00J88L0m01K00N04n43o1N23l79k90
7617c66L84r4j64K64J69l55K50P8k30m6M45k93k07O33n26m04P52j78j62Q8N7k9
7639F6N2K80n67l86J029n22l83P04J03l68M2L19n47L3K94p0j32L22j84k18P43
7660F10p41o3P57k37o96L19M39m53K42K15n72K57M20o13R2L30P6o85N31J58n18
7681a32k74O82n91J81N29m30k06O88j24o08P0N04n13J73K68j06n22Q41m66k31
7701b67K30Q0j5K50q6l92j63O34m82j71O02j84m16O84l34m22O22j3m55L1M76k23
$$ plain form
7554 210 -130 51 497 -186 -430 413 54 -113 315 221 -527 267 516 -182 -62 238 -35 -100 393 -360 -265
7575 -265 167 177 -525 268 305 -262 165 145 -245 200 318 -385 -514 314 -195 -257 92 -18 -496 333 26
7596 26 -318 -72 240 -105 -358 202 -130 -291 46 63 -137 51 81 -320 -120 384 -159 -220 303 -76 -366
7617 -366 18 -76 -240 24 193 -162 88 166 -64 -110 335 42 -165 468 -58 -462 290 112 -50 38 95 66
7639 66 118 398 -169 -555 474 -48 -431 273 376 8 50 369 -178 -145 149 79 -53 269 85 -133 610
7660 610 -131 -194 563 326 -370 -51 388 -65 177 392 -180 77 497 -116 -24 306 382 -303 228 386 -132
7681 -132 -406 276 -315 -134 395 -35 -241 447 323 -285 -215 289 -224 -51 217 111 -411 430 -36 -267
7701 -267 -37 43 28 278 192 -200 -363 271 -211 -382 220 36 -380 304 -30 -452 170 157 -298 -267 209 -14
7723a4l46K63k69J85M46k99m07P04K4q23O14k0m98K48N96o44J36J53k12k60Q45
7744D22m54m61M29K67o51L19N40m85n7M93k85l97M51kj76J44J14m99N11J95p52
7765c34k06R36p3l66L06m7j43L03K1o70K28Q03p09m17O42J75n19M57l74l23O61
7786C51J25q33L50k13J35K42M51o01j82O23j48m90K08M03o79K61L48n30K39K38
7806B98m83j36O08J61q56O52j67j10K58N4o52K90L22k33J8J52k59k05K48j35j5
7827a90K54j35k90J99N65p32R6L27j78j73L94j60o67Q96K8r16N72J22m28L73K98
7848B55m02rM26l98m39N91J08n23M38pn53L64M71n42l70P97k45k23K31K6k34j49
7870c87N57j36l44M25k61Q4M70n31j53N51j04l30K24J80l67K26L84p19J16L32
$$ plain form
7723 -14 -360 -97 -366 -181 265 -34 -441 263 287 -536 78 58 -440 -192 404 -240 -104 49 -163 -423 422
7744 422 -32 -493 -64 203 -448 -129 411 -74 -131 362 77 -320 131 129 -47 97 211 -288 223 418 -334
7765 -334 -540 396 323 -43 263 216 73 376 397 -273 -45 758 49 -368 274 449 -70 387 13 -310 351
7786 351 476 -357 -7 -220 -85 157 608 7 -175 448 300 -190 18 421 -258 3 351 -179 60 298
7806 298 -185 -321 287 448 -408 244 77 -33 225 279 -373 -83 239 6 24 176 -83 -288 -40 -175 -190
7827 -190 64 -71 -361 -162 403 -329 -233 94 -84 -257 137 -23 -690 206 234 -682 -110 12 -416 -43 255
7848 255 -147 -156 270 -128 -567 24 132 -391 47 40 -513 -149 322 -220 -590 207 -38 -261 -30 -4 -238 -387
7870 -387 170 34 -310 115 -146 -62 408 -123 -276 275 171 -159 65 245 -122 104 488 -231 -115 217
7890B17o1m54M47l55j90P44O1q29N02M02o77K28J48m51J05O26j59m59l2L61k71
7911i7K35m4j72M0M58m91j1L93k33l6J92k67n8k3J52m18K14N06j25k67K92k90
7933e0j75P31m34l32M34j2o28M35M21p44K21L63j48k65K15j42J1L56l87m4L88
7954B14P7o36J61L74j16k00K28k30l46N29J01p51N01L0m03K70O05m41q7K62K3
7975A65l76L30l81p0P4K84m01L53p7r5m1K28L1k55L56n8k05P1K28j69j01M84q15
7998d40M84J13k82r2L33J9k85L30m07l69N89N0n83M78L26k18m14Q07n39J11O1
8019G2K03l78M7M60k83j94K94j83mL14l91l57Q22k32m64M08J27k03Q2K07m89k50
8041c92P79m49k21Q39n77j88M32K67m72K16N0o69J53O51n61k18N89pn43N36J25
$$ plain form
7890 217 156 -298 149 -206 -396 348 409 -420 82 484 -193 35 183 -268 -163 463 304 -155 -187 174 -97
7911 -97 138 94 -78 -38 420 -71 -82 311 78 42 234 -33 -91 -114 38 -380 -166 340 215 -52 240 -50
7933 -50 -225 506 72 -260 174 162 -466 -31 390 -354 -133 230 82 -183 32 -110 -99 257 -130 -174 214
7954 214 291 -345 -184 190 74 -126 102 -128 -474 55 156 -595 -94 -64 -467 -197 408 -33 -120 142 165
7975 165 -211 119 -262 -332 -258 26 -375 -22 -99 -194 -235 -7 24 -231 125 67 -138 -67 161 -8 -109 375 -440
7998 -440 44 157 -125 -217 116 135 -150 180 -227 -596 -7 43 -540 -62 264 46 -368 439 -100 11 72
8019 72 275 -103 -56 404 121 -73 221 38 34 348 -43 -400 422 190 -274 134 261 58 140 347 -142 -392
8041 -392 387 -62 -283 556 -21 -209 223 490 18 234 284 -385 -232 419 -142 -360 229 222 -321 215 340
8062C40l01r8L89q04K82M49n50j66P25j90l21K24o5l93M28J20l68J74K71k41J70
8083G5J1m57K28L47m71j26O02K16o23JK99l37K98q1j49m22O10L37o69N13N9o14
8105c53Q9Q57p81J82J65m73J3K61J48n70N44k45k06M46J24p22N19K54p03J79O33
8126C61l93j84L40J29p92P47N25j122L07L41k18j88K68k17l0O89k07n13J60L57
8146C60k95p9K46m12J86M62l65m20M35M2j41k0L1k16K67J80n07K11O56k80m31
8167i0O48n84l05N30l30k55M30K65l97J4R6N9l42L79l25o1L65j37l12L92L34n44
8189a70Q5K31
$$ plain form
8062 340 39 -59 330 -474 -192 257 -293 -459 266 76 -245 -21 -86 -479 -51 69 -299 -125 146 -95 75
8083 75 86 -371 -143 204 -267 -393 209 425 -198 -197 102 -235 63 -18 -167 -589 21 358 -311 202 261 -353
8105 -353 -264 593 -188 -6 159 -314 -301 -40 108 -462 82 -163 -369 77 201 -521 -2 252 -451 -272 361
8126 361 -32 -216 124 253 -539 208 733 -389 -82 259 41 -147 121 -96 -126 563 356 -157 3 360
8146 360 65 -14 232 -180 6 468 103 -317 118 160 19 -1 30 -186 81 261 -246 -35 621 341 -90
8167 -90 558 -26 -331 199 -131 -386 44 309 -88 -74 22 81 -261 118 -207 -268 97 -40 -352 40 374 -170
8189 -170 -85 146
8191A46
$$ Imaginary data points
##PAGE= N=2
##DATA TABLE= (X++(I..I)), XYDATA
0@%%%jRj6J6j6K4l2M0n6O4p3R7j20J39j65J97k33K73l19L73m32M97n69O48p38
28c93Q37r47J070j203J352j513J688j884K095k328K586k867L176l517L895m312
44b265M775n296N880o542P301q178R207j0432J1926j3789J6184j9409K4009l1140
58a7769M3811p3085K60424J11971m72185j6404K02731K03510o3881k09898j02970
69a33745K40088J58224j62626j97898M9630J04979N2406n5391j16530J1020J76368
80A26525N296j78404o4775P2891M1647M1332L514o8381n707N1024o4896n6830
92i6764Q5016M8757n9495j7427J2065J0342O4570m957j44042l7782J30460O9042
104E9785k4056k6301o1353j6720R1253N851j09747J1426J09338J9461l5642m9837
$$ plain form
0 0 0 0 0 -1 8 -8 8 -8 16 -16 24 -32 32 -41 56 -64 75 -90 107 -126 147 -172 201 -231 266 -303 345 -393
28 -393 444 -503 567 -636 716 -797 891 -993 1102 -1226 1360 -1507 1669 -1848 2047 -2265
44 -2265 2510 -2786 3094 -3448 3853 -4325 4882 -5550 6376 -7413 8771 -10638 13371 -17769
58 -17769 26042 -47043 213381 325352 -146833 -163237 39494 243004 179123 -30775 -133745
69 -133745 106343 264567 101941 -95957 -46327 58652 111058 55667 -60863 -49843 126525
80 126525 131821 -46583 -111358 -38467 3180 44512 48026 -20355 -26062 24962 -39934 -96764
92 -96764 -11748 37009 -22486 -39913 -27848 -17506 47064 42107 -101935 -139717 -9257 59785
104 59785 35729 9428 -51925 -68645 22608 28459 -81288 -69862 39476 58937 23295 -26542
116b6542p1943M5609J36114l0595j44777k801R8830O2313J4215r1869j33056M8155
128i6347J49601M19p5653o943O84J3180M0622m9774p1506P2919P6305n2960l1975
141c1428K4520j5567Q234L4569n0962l6734P2192L0982l0703K4870n359p8763
153e4149M023O6679R636J2752J0039p3559k1506R6361J9474p6390q303K6302O508
166A7867M3656K654p6594N174O9339l4015n4860M1136L6423M533J5391n1741p0770
179e1807N2198O4222m0353j6863L1924k5145j5273L4320j7200k4355L3004k1577
191C095m8592O3241O1131o0737n2726N202j78L9341M0717o4843m4436P8819L2322
204E2356p0046l1436J0252J8370O2084K005j04742j3049J07679K4367o5071m2010
$$ plain form
116 -26542 -98485 -52876 83238 52643 -92134 -94935 3895 66208 80423 -11446 -144502 -96347
128 -96347 53254 53673 -21980 -28923 -28239 -15059 25563 -24211 -95717 -22798 53507 547 -31428
141 -31428 -6908 -22475 -14241 20328 -30634 -67368 4824 35806 5103 29973 24614 -54149
153 -54149 -50126 16553 26189 38941 48980 -24579 -46085 50276 69750 -6640 -14943 11359 17867
166 17867 61523 64177 -12417 -7243 62096 28081 -26779 14357 50780 55313 70704 18963 -51807
179 -51807 391 64613 24260 7397 39321 14176 -1097 33223 16023 -8332 24672 3095
191 3095 -45497 17744 78875 18138 -34588 -29386 -29564 9777 50494 -14349 -58785 20034 52356
204 52356 -17690 -49126 -38874 -20504 41580 43585 -61157 -74206 33473 57840 -7231 -49241
216d9241k5168L6537J11215M131j20623l0426O4516J9825k7r661m7609K2986Q7450
229F3905k7291r1396J3980M9769K904M463k6437m8275N5986Q1608n4933p8863
241e4580J8004K4949J3610L2251k5134m3569M3928K2955o5643p943N7778L83j7903
254i14K522k4439J3747O4734l3216r2432K2436P4438P768j0307k1533l8056L6828
267A576N3711o4793o4032O7371O6454j6012l5981m8436j0590R2155M4745j02971
279a6803o3525O7199O2085J1627k5657p9731k1803R1433L0778p2208j0320M8360
291B1435O183n516k0939n5720K0634Q6328j3633p1236J1069L2328J814J3693k5215
304A225o0067K9649O6697j9464k5182K3129j5952k4422K1525p427j6890N0329
$$ plain form
216 -49241 -74409 -37872 73343 77474 -43149 -73575 -9059 10766 10739 1078 -46531 -23545 63905
229 63905 36614 -54782 -40802 8967 11871 16334 -10103 -58378 -2392 79216 24283 -54580
241 -54580 -36576 -11627 1983 34234 9100 -34469 9459 32414 -33229 -41172 16606 16989 -914
254 -914 1608 -22831 -9084 55650 22434 -69998 -47562 26876 34644 24337 2804 -35252 1576
267 1576 55287 -9506 -73538 -6167 60287 44275 8294 -40142 -50732 41423 86168 -16803
279 -16803 -80328 -13129 48956 60583 34926 -44805 -66608 24825 55603 -16605 -26925 21435
291 21435 27618 22102 1163 -54557 -33923 52405 38772 -32464 -21395 10933 12747 26440 1225
304 1225 -58842 -29193 37504 18040 -7142 15987 35 -24387 -2862 -10289 -27179 23150
316B3150J7298n8357o285L7418r521n526R604l5370k122O4446L369m9615Q256
329c255J1106k7604R511J6387j7930K8283M1587n1814n4503L1942K8865K198J4186
342B8959k8127l9234M8731M7235m5130l4779J2096n478J6691M0952k3250l2252
354a3586L2723L274m3800P135K2666j0003K1808J9663m7831j9397M1479m63j9942
367f274J5393j4477k3119M6427K9339m4265k1937L904j8201K5632M9058k7500
379A3980l7297K4994K459k5422J4081J792k0391L2767K3618m9809j4228M3118
391I662l66k1027J7k3495J509O6418J1674o5419j6437K3456l859J3472J7517k6852
405a3730J420L6930k7336l9815L5911K4962k7661o084M865j476L8059J4824o8495
$$ plain form
316 23150 40448 -17909 -24194 13224 3703 -1823 7781 -27589 -29711 34735 38104 -11511 -3255
329 -3255 7851 -19753 -10242 6145 -11785 16498 58085 6271 -48232 -16290 12575 14773 28959
342 28959 832 -38402 10329 57564 12434 -22345 -10249 -15727 964 41916 18666 -13586
354 -13586 19137 22411 -21389 -14254 8412 -1591 20217 39880 -7951 -27348 14131 13668 -6274
367 -6274 9119 -5358 -28477 17950 47289 3024 -18913 -15009 -33210 -7578 41480 13980
379 13980 -23317 1677 4136 -21286 -7205 -5413 -25804 6963 30581 -19228 -33456 9662
391 9662 9296 -11731 -11714 -35209 -33700 32718 44392 -21027 -37464 -14008 -17867 -4395 13122 -13730
405 -13730 -12310 24620 -2716 -42531 -6620 18342 -9319 -15403 -10538 -12014 26045 40869 -27626
418b7626k8818N8431K2731k2493j176n150K311L4215k0709o7357K4412P7719l642
431D2848m6132j8875j567M0896M6681n3766p7205L7777P2041J149k3591k7405
443g149k5219L7396L9713m8097l6427N2176L3470k2869k0054k6036n800N7877
455B8981K2656o4333k2466M8634J8679p760j0261m0674o877N9514J0764m5149
467h292Q246K8040j9261j2765q85j5392K6576M2961l7432m6569L4944L2489j8431
480A4229j4960j9848j0696N0666L1554n5086k8523M1871R054k6563r233r785J8385
493h935N6573j3723q0652m998N8744J2829j6652j9462k6421K6338N7734k5935
505A5440o3007J2076L3258m034J311m209j7392K8192K6581m7649l3549L6731K0759
$$ plain form
418 -27626 -56444 1987 24718 2225 1049 -4101 -1790 32425 11716 -55641 -31229 46490 42848
431 42848 -3284 -22159 -23726 17170 63851 10085 -67120 -29343 42698 43847 20256 -7149
443 -7149 -32368 5028 44741 -3356 -39783 12393 45863 22994 2940 -23096 -28896 28981
455 28981 51637 -12696 -35162 13472 32151 24391 14130 -26544 -33421 26093 36857 -8292
467 -8292 -46 27994 8733 -4032 -4917 -20309 6267 49228 11796 -34773 171 32660 14229
480 14229 -731 -20579 -31275 19391 50945 -4141 -32664 9207 18261 -8302 -17535 -27320 -8935
493 -8935 47638 33915 -46737 -51735 7009 19838 3186 -16276 -42697 -16359 41375 15440
505 15440 -47567 -35491 -2233 -6267 -4956 -9165 -26557 1635 28216 -19433 -52982 -16251 4508
518D508o265R076j4527k2582L0008J7659l5121m618K3884j0813K082K8224j2613
531H902k1884J4489o593j9254K9777J9632k4169L230J3815k7001n345K6537r803
544B333j0545K5521n034k2102K2141P273l0453L929J6199j8256N686K8468j3395
557A1765j3568J4261j9239k2752L3832K1233k0744J583K332k2492J3092K4810
569B4113k7336j8509K9032P318q547J4161j1468k7547K0834J7652k6755J035K7294
582B1277n273m648M431l0293j0622M5303J2733l3912l976J0041j729J8318q6m6886
596b5322m027M8044L795k4375L611j873m126J7405j5453l7897K7133M6365j8818
609A4462l0224j642l538J5890K5153k9880l2451L6298K7499k5630j1253L405q761
$$ plain form
518 4508 -1757 7319 -7208 -29790 218 17877 -17244 -21862 2022 -8791 -6709 21515 8902
531 8902 -12982 1507 -5086 -24340 5437 25069 900 4130 17945 -9056 -14401 12136 2333
544 2333 -8212 17309 12275 -9827 12314 19587 -10866 -6937 9262 -8994 -3308 25160 11765
557 11765 -1803 12458 -6781 -29533 4299 25532 4788 6371 8703 -13789 -697 24113
569 24113 -3223 -21732 7300 14618 6071 20232 8764 -18783 2051 19703 -7052 -6017 21277
582 21277 16004 11356 15787 -14506 -25128 20175 32908 -1004 -4980 5061 3332 21650 21564 -25322
596 -25322 -29349 18695 22490 -1885 1726 -147 -4273 13132 -2321 -40218 -13085 33280 14462
609 14462 -15762 -17404 -20942 -5052 20101 -9779 -42230 -5932 21567 -4063 -15316 -11911 -20672
622b0672J4863J2821l1145j508M7128n60m0619o045P785Q917K8354p010m3669
635c1360J2291M4158j2219k7352K706q05J1038K7150k0106l2235L0416K7529l1785
648e74k1479R324Q704K5977J5351m5381k8423L9749K1159k3760q183j0q65K7173
662A8762M606m3039m077L9089l508k4436L226K677R067K6910j9856m7785J4355
675b4009M0640m772j1747m2j2741J0011K6408k1600k9022K5261J8209j5740J371
688B227L431j1114J6718J1387l5129j0346L8231R181j5331Q34j2210j1786K8366
701A4459J0155l1412K267K4611r559q493R037j2532l247K3763j1764k6746K2133
714B672K1807j5776n506l474j9815J3701L0029j8154k0212J8717J040j4303J0259
$$ plain form
622 -20672 -5809 7012 -24133 -25641 21487 20927 -19692 -25737 -17952 -9035 19319 12309 -31360
635 -31360 -19069 25089 12870 -14482 -11776 -12581 -1543 25607 5501 -26734 3682 31211 -574
648 -574 -22053 -12729 -4025 21952 37303 -8078 -36501 3248 24407 647 -7536 -7546 -8411 18762
662 18762 23368 -19671 -23748 15341 11833 -12603 -9377 -6700 2367 29277 9421 -38364 -24009
675 -24009 16631 11859 112 70 -12671 -2660 23748 2148 -26874 -1613 16596 856 2227
688 2227 5658 -5456 11262 22649 -12480 -22826 15405 24586 9255 10089 -2121 -13907 14459
701 14459 24614 -6798 -4531 20080 10521 2028 11065 -1467 -4714 19049 7285 -19461 2672
714 2672 24479 8703 3197 -277 -20092 -6391 23638 5484 -14728 3989 5029 -9274 985
727I85j324j5504J7470J2220k6467j685K4061q511j1000Q459j1614n904L0176
740A1362M135k7108K583R189j3680R146J6194j9283p367K1354m859j1640J4971
753D997m087j8104J6374J0583k0548L904J7854j1814n114Q017j6676l037L3236
766A5585M43k8613K086Q890n276J2848K729k8035L831K9903j0308j8954J3759
779a112K009p479J1395q658j8713K3853K1616k7242j4859J5418O48M628J1636
792A3140k0664j3664L1108P995k7686R38J3383n999N377M010k1834O514L4134
805B6752j1095l1533O642J3211L871J2978j2840l1170J7974L4304j5580k1716
817h202O819K358P452J5042k2299k3517L1368K2648k7281j6988O514N902K0941
$$ plain form
727 985 -339 -15843 1627 13847 -12620 -14305 9756 1245 -9755 -1296 -12910 -18814 11362
740 11362 15497 -11611 -9028 161 -13519 -4373 11821 -7462 -14829 6525 1666 -9974 4997
753 4997 910 -17194 -820 9763 -10785 -6881 10973 -841 -5955 2062 -14614 -17651 15585
766 15585 16028 -12585 -10499 -1609 -6885 5963 8692 -19343 -15512 14391 4083 -14871 -1112
779 -1112 897 -6582 4813 -3845 -22558 1295 22911 -4331 -19190 -3772 -3124 1504 13140
792 13140 -7524 -21188 9920 17915 -9771 -8833 4550 -1449 3928 7938 -13896 -7382 26752
805 26752 15657 -15876 -9234 3977 7848 20826 7986 -23184 -5210 29094 13514 -8202
817 -8202 -1383 975 8427 23469 1170 -22347 9021 31669 4388 -12600 -6086 -184 20757
830B0757P877l9141j6677L8462J4830k4769q683N09L183K2738k295l6984M320
843a5873L7013p577k6041K098N886J1016J6428k3963l3019K6500L3684j9892k0951
856a4691N016M246J4580Q601l2279j5652L8462J3718l1611r944J2386Q674J5514
869A7020q414m0381M620M6061J008l0248m660L974O842J9270j3164l1901J7388
882a2585L2660j4893j9337N102l5R101J5246k3348k3051K8337K2016j7825q574
895g186l76p624J5849J6176k4702j1812K5265L586j6064M662n45o877J7633L602
909A1587k5988N099K5702r425j4233N187m127K241K1782q098k4253J5009J5144
922A5627j7491l652J0219n679O058J1338k0329j0398K7269M373k2464J869O070
$$ plain form
830 20757 28634 -10507 -27184 11278 26108 1339 -7344 -6835 -3652 19086 16791 -20193 -15873
843 -15873 21140 13563 -12478 -10380 -4494 6522 22950 -1013 -34032 -7532 26152 6260 -14691
856 -14691 -9675 -5429 9151 17752 -14527 -30179 8283 22001 -9610 -19554 -7168 1506 17020
869 17020 8606 -31775 -27155 18906 19914 -10334 -14994 -11020 -4178 15092 1928 -29973 -12585
882 -12585 20075 5182 -14155 -9053 -9088 13 15259 -8089 -31140 -2803 19213 1388 -7186
895 -7186 -7562 -15186 663 16839 -7863 -19675 5590 9176 -6888 -2226 -2771 -9648 7985 11587
909 11587 -14401 -9302 16400 6975 -7258 -2071 -6198 -3957 17825 9727 -14526 483 15627
922 15627 -1864 -5516 4703 -976 5082 16420 -3909 -14307 12962 17335 -5129 -3260 2810
935B810m753J3623N620k4926q53K1441r286j0897J5467l34j0318J1589k069j7500
949a0386J2096J1579j7734P80J6649j1594q319J5121l713j0849J1275l758j3072
962a1925J9960J1481k6095q082J5850j404J729P588j6929p345K6638J293k6044
975a3285K379J3102m906M874J650j9611O514K6329j2518k3447J0690Q085j686
988a830J0982o878k2232J2936J9247j6660q278J4585k208k834J0799j2238j1754
1001a6363K1599O457k3152P38J4761m060M335L834k1727j120K8679l444k2986
1014a2449O803R264k553P590p266k2027J6327K8627j8370k2657J0694R210N474
1027H667N718k2776j9062L2189K3428k5787j7328R244N236J0410L274k8074n230
$$ plain form
935 2810 -1943 11680 17300 -7626 -8479 12962 3676 -7221 8246 7912 -2406 9183 7114 -10386
949 -10386 1710 13289 -4445 -3665 12984 1390 -6929 8192 4479 -6370 4905 1147 -11925
962 -11925 8035 19516 -6579 -14661 1189 -215 1514 9102 -7827 -15172 11466 12759 -13285
975 -13285 -10906 2196 -2710 2164 3814 -15797 -9283 17046 4528 -18919 -8229 -144 -1830
988 -1830 9152 2274 -19958 -7022 12225 -4435 -12713 1872 -336 -3170 7629 -4609 -16363
1001 -16363 5236 11693 -11459 -10721 4040 -20 4315 8149 -13578 -14698 13981 10537 -12449
1014 -12449 -5646 3618 1065 8655 1389 -20638 -4311 24316 5946 -16711 -6017 3193 8667
1027 8667 14385 -8391 -27453 4736 28164 2377 -14951 -5707 -471 9939 13213 -14861 -20091
1040b0091L6670N244l1099m746J1685N435J1754o790k8912R171L3416r287k4595
1053a2145N039O409K665J1325j1525k0172J9384J9859k1824j2521J3335K610L108
1066E547O600j9186j0313K7105P538k3802k409J0807j852Q088L047k3526o17K7094
1080A4121m235k0124N776O241j653J1162p036k4491J2179K6274j1702j5185N572
1093c101j890M220J5020j4682k0517K0574J6167j7011n447O044n075Q597R181
1106A2080k1306p945K6572M401j8608J219K031n478J3671L754k1724L827K0795
1119A3289r549j1418J0344k412n508J3048l400j5072J3551R953j7969j764J2674
1132E767q442j101J3886r024r230J3570k264j4766J2106Q761j5593K258J0507
$$ plain form
1040 -20091 16579 21823 -9276 -14022 -2337 3098 14852 8062 -20850 -11679 21737 12450 -12145
1053 -12145 -7106 -697 1968 13293 1768 -18404 980 20839 -985 -13506 -171 2439 5547
1066 5547 12147 -7039 -17352 9753 17291 -6511 -8920 1887 35 8123 11170 -12356 -12973 14121
1080 14121 9886 -10238 -4462 1779 126 11288 4252 -20239 -8060 18214 6512 -8673 -3101
1093 -3101 -4991 -771 14249 -433 -20950 -376 15791 -1220 -6667 -623 -5698 2899 12080
1106 12080 -9226 -17171 9401 13802 -4806 -3587 -1556 -7034 6637 10391 -11333 -7506 13289
1119 13289 3740 -7678 2666 254 -5254 7794 4394 -10678 2873 12826 -5143 -6907 5767
1132 5767 -2675 -3776 10110 1086 -8144 5426 3162 -11604 502 9263 -6330 -4072 6435
1145F435j0664j92J2566j1926q568J7049n10j2862R875N170j4120L545P454j2308
1159i056M368J6065j1999j0599J4660p10j0849R029P70j1336J1810Q654j8222
1172g415r46J5777p680o823J0151n750m124J8300k257k2874N838J4270p317J954
1186A104M169j4395L161K1129j0353j9176J1225P655n184P175l815j5462J4557
1199A790J7166k1085j4417J4969O887J725N595j7458j2820K4478J1561k2958n768
1212a0335J2977J577N054J515k1305j932K7333k095k2476N013J1644j317N177
1225A0830o599k0753J1398K4218j2958j6647J1365N479l251M498j0830j2813K1205
1238E142J2001k2154o233J6198M61l106J89j6030p28K8066J445k5752J20J1950
$$ plain form
1145 6435 -4229 -4421 8145 -3781 -12349 4700 4190 -8672 1203 6373 -7747 -4202 3252 -9056
1159 -9056 -4688 11377 -622 -11221 3439 2729 -8120 909 1679 -9657 2153 10807 -7415
1172 -7415 -8361 7416 -264 -7087 3064 -2686 -6810 11490 9233 -13641 -7803 6467 -850 1104
1186 1104 5273 -9122 -5961 15168 4815 -14361 -3136 4519 -665 6510 2695 -12767 1790
1199 1790 18956 -2129 -16546 -1577 5310 7035 12630 -4828 -17648 6830 18391 -4567 -10335
1212 -10335 2642 4219 9273 10788 -10517 -12449 14884 12789 -9687 -4674 6970 5653 10830
1225 10830 4231 -16522 -5124 19094 6136 -10511 854 6333 3082 7580 -3250 -16063 5142
1238 5142 17143 -5011 -11244 4954 5415 2309 2498 -13532 -14260 13806 15251 -10501 -10381 1569
1252A569k142L574j804j8569Q696K6402j0397k1970O145P407o5P878j0094j8132
1266b1502J8723K2840j7091j6720N434J496P261J1926j6853j5002K2574J2494
1278A5580j9303o229N665j713J1115P072k0578m716K3808j349j8873L542M629
1291a350j361J2218r35k0234O519J7809j3046j0315J2026J738k560Q194q831j2303
1305a2431J7164Q574k0080k293J4125j529Q72N161j5345n592K0840p58j6584O855
1319a021P937o645N867K459j8126K055J8708n999r142R472k838o530J2921j110
1333H008j8098O903J3147p196L40N997j3491k437J7737n737j3878J0542M880p653
1347i36P484R76j7446N251J4871j0497o024J1596m087n199J1810n675j5402J1001
$$ plain form
1252 1569 -573 3001 1197 -17372 -8676 17726 7329 -14641 -8496 -1089 -1154 6724 -3370 -21502
1266 -21502 -2779 20061 2970 -13750 -8316 -6820 441 12367 -4486 -19488 3086 15580
1278 15580 -3723 -9952 -4287 -6000 5115 12187 -8391 -13107 10701 9352 -9521 -5979 -1350
1291 -1350 -2711 9507 8572 -11662 -5143 12666 -380 -10695 1331 3069 509 8703 -128 -12431
1305 -12431 4733 13307 -6773 -9066 5059 3530 4402 9563 -5782 -11374 9466 8708 -7876 -1021
1319 -1021 6916 271 6138 8597 -9529 -7474 11234 5235 -3907 5565 2727 -3803 9118 8008
1333 8008 -10090 -3187 9960 2764 3104 9101 -4390 -6827 10910 5173 -8705 1837 6717 -936
1347 -936 6548 7524 -9922 -4671 10200 -297 -6321 5275 1188 -4011 7799 2124 -13278 -2277
1361b277R493j1249K888P445j2186m71J2781j0149q366J4543J006r293P766Oj3756
1376a1819Q599R640j4006j931J4188m633m572Q654p394r381J4831L128j5816O021
1390d491J1622q079j693M232j1685K468J8045p465j5200J2394Q436r211J74k180
1404b633r560J3584J4467j8147r973J7449K881r076P87o630k137K1697L547k5192
1418h936k140J8366j208m810K65j0443M342K2532o551k2967O708J1627n540J086
1432B331nj0525J0413J7404j6205j5744J2186N097m149O017m534j1100J4134J0086
1446A5406j8703n304J2040k154J3Q465r909p375J6307j81j8286M250J0978m692
1460H55L684L069j4241J070J7369q598j5463J0268O558m168N832l871j3703J0688
$$ plain form
1361 -2277 7216 -4033 -1145 6300 -5886 -6357 6424 -3725 -12091 2452 3458 -5835 1931 1937 -11819
1376 -11819 -3220 6420 -7586 -9517 4671 38 -4534 4120 -3274 -12655 2176 5304 -10512 -4491
1390 -4491 7131 -948 -2641 1591 -10094 -7626 10419 2954 -12246 148 8584 -627 -453 -2633
1404 -2633 -12193 1391 15858 -2289 -12262 5187 8068 -1008 -221 -6851 -8988 12709 16256 -8936
1418 -8936 -11076 7290 6082 1272 1537 -8906 -4564 17968 11417 -11550 -4842 6785 1245 2331
1432 2331 2326 -8199 2214 19618 3413 -12331 -145 4952 803 6820 2286 -8814 5320 15406
1446 15406 -3297 -8601 3439 1285 1298 9763 -146 -7521 8786 8605 -9681 -5431 5547 855
1460 855 4539 7608 -6633 -5563 11806 3208 -12255 -1987 4571 403 6235 2364 -11339 -651
1474f51J2589j6388q329J5073L254l581L072j2228q294J9447P209j8691j566J1876
1488B792j900J223K715j5883k312K0129j345j4503O856N137o451N202K03j5136
1502a3273O122J6727q292q098Q945l283n269J0436l342j2903J0845J0324j0804
1515a865J32O635j0011j565J1973o914o283J3947P78j1887O320K800j1259N423
1529a776R700j0643p77J1632o895n814J0108l940j0250J1133N351j0378M565N958
1543G974j1670K47R889q889l648J4581j915j0418P345J030q987O103M103j2834
1557g089M889J4749q277q710P164k931l608J0300k821j1782J1835R171j4689m263
1571f062P485l967K826Q943j1330p256J7025L122j5532o28L717l538J0463N644
$$ plain form
1474 -651 11938 -4450 -12779 2294 5548 1967 5039 -7189 -15483 3964 11173 -7518 -9084 2792
1488 2792 892 2115 4830 -11053 -13365 6764 5419 -9084 -2228 2909 -3542 1660 1863 -13273
1502 -13273 -7151 9576 1284 -6814 2131 -1152 -6421 4015 673 -12230 -1385 8939 -1865
1515 -1865 -1733 4902 -5109 -6674 5299 -1615 -7898 6049 6827 -5060 1260 4060 -7199 -1776
1529 -1776 7924 -2719 -3496 8136 1241 -4573 5535 1595 -8655 2478 7829 -2549 2016 7974
1543 7974 -3696 -3449 6440 -2449 -6097 8484 6569 -3849 3496 4526 -4461 1642 5745 -7089
1557 -7089 -2200 12549 4272 -4438 2726 -205 -3813 6487 3666 -8116 3719 12890 -1799 -6062
1571 -6062 1423 -2544 282 9225 -2105 -9361 7664 10786 -4746 -5374 -1657 -5195 5268 10912
1585A0912j7086k195J6349l309j0760L998j611j337J4931j174j9763L848J3240
1598F043o314l512L626o353L235J5793q242j7309Q282P396o371M274J468r551
1612g535O887J1536j3790q871J2327J001n933O990k099o612J1437J714j8380J112
1626a0216J5564k337m008L861o941J18J3267p575j8092J0936J5249n285l170j891
1640e20p564Q836J2032j5996j3255J7234J0567o689k724o379n727J5046P517j8976
1654f598l662J7314K005o529k87q719k529J7004J175j5911N018J0884o919j712
1668E34K267j0035J179J5678l662r722Q416K79r386N207K796j0264N669J1193
1682A0149q112m449Q076o402n772R510j653p407J1033N179j3309k90O615p122
$$ plain form
1585 10912 -6174 -8369 7980 4671 -6089 -2091 -3702 -5039 9892 8718 -11045 -7197 6043
1598 6043 -271 -3783 -157 -6510 -3275 12518 4276 -13033 -4751 2645 -3726 548 2016 -7535
1612 -7535 -648 10888 -2902 -11773 554 1555 -4378 2612 513 -6099 5338 7052 -11328 -10216
1626 -10216 5348 3011 -997 2864 -4077 -3959 9308 1733 -16359 -5423 9826 4541 1371 -520
1640 -520 -8084 752 12784 -3212 -16467 767 11334 4645 1921 -4458 -10185 4861 12378 -6598
1654 -6598 -10260 7054 9059 2530 2243 -6476 -9005 7999 9174 -6737 -1719 9165 2246 534
1668 534 2801 -7234 -6055 9623 5961 -3761 4655 4934 -4452 755 3551 -6713 -1044 10149
1682 10149 2037 -2412 5664 -738 -6510 3000 1347 -6060 4973 10152 -3157 -3447 3168 -3954
1696c954J126P287q557q59J5219k533j5318K545M863l622O357J996j1527N244
1710a733J3392j0731j2101P842K804n90P692l852j1099R497P544j4121l221R057
1724C80j975J374Q804p799q501R731J04r973O198O114p622L694P555j0584m028
1739f528P957m005k736J1113j746j0219Q462M452j1662j267N065l872O262J0074
1753A1350j1779q649J1739R48r929L748K582m035R167L784j5223o11J2580n637
1767C5p128P186J341p96P950n855j3933Q583R943r811j893Q719j817PM400j0880
1783c949o363J4573K392j1673L969P521m536J007R52j3147K060J5842k579r050
1797b981N909k5n865O205r73j1402O558J2203o934m132M313n695j519J0335n919
$$ plain form
1696 -3954 -2828 4459 -4098 -4957 10262 7729 -7589 -5044 -181 -3803 2554 4550 -6977 -1733
1710 -1733 11659 928 -11173 -3331 -527 -1117 6575 2723 -8376 1121 8665 -5456 -8677 380
1724 380 -1595 -221 8583 784 -7717 2014 2118 -7855 -1657 4457 -3165 529 8084 -2500 -6528
1739 -6528 1429 -2576 -5312 5801 4055 -6164 2298 6750 -4912 -6179 -1114 -4986 1276 11350
1753 11350 -429 -9078 2661 3609 -6320 -2572 10 -4025 5142 8926 -6297 -6908 5672 35
1767 35 -7093 93 1434 638 8588 2733 -11200 -2617 7326 -2485 -4378 4341 2524 2531 6931 -3949
1783 -3949 -10312 4261 6653 -5020 -1051 6470 1934 2941 3893 -9254 -7194 8648 6069 -2981
1797 -2981 2928 2903 -2962 3243 2270 -9132 -2574 9629 2695 -1437 2876 -2819 -4338 5997 78
1812G8j0336J0662R396o935k508k183p956P877J2385j1003q818J2145M298o319
1826G83k95n859m744J4735O007j5681j858J3529j837o853l12n306K936J5573l154
1841G664j6118N328J0023o804l629J934l777O210J0017j0964r249J2009L191j0274
1855d439L37L030j557Q991K779j5257k669J2982k337p293N336J26j942R034l086
1870D035j4188M411J0317n969j340N095m367Q25Q902p510j1625Q161P060m454
1884f47L338L78r244M400R163r400o594Q838J453j571O287n020r620Q211O077
1899F049j0222l05P761k360Q37N132r347o719J0937J985q092N393L228o247L442
1914A472L944j0709p24R985l891l445Q521j328p330N118O5q057N571O427p243
$$ plain form
1812 78 -10258 404 9800 2865 357 -1826 -9782 -1905 10480 -523 -9341 2804 7102 783
1826 783 488 -5371 -10115 4620 10627 -5054 -6912 6617 4780 -2073 -2385 -7691 -4755 10818 7664
1841 7664 -8454 -3126 6897 93 -3536 -1602 -5379 831 10848 -116 -9365 2644 5835 -4439
1855 -4439 -4102 -1072 -2629 6362 9141 -6116 -8785 4197 1860 -5433 -97 29 -1913 7121 4035
1870 4035 -10153 -5742 4575 -1394 -2734 2361 -2006 -1181 7721 211 -11414 -3253 3807 -647
1884 -647 2691 3069 -6175 -1775 7388 -2012 -8606 232 1685 114 6401 1381 -8239 -28 6049
1899 6049 -4173 -4478 3283 923 1760 6892 -2455 -9174 1763 3748 -4344 1049 4277 -1970 1472
1914 1472 5416 -5293 -6017 3968 77 -3368 5153 3825 -3505 1613 1678 -6379 -808 5619 -1624
1929a624O95P648o652m404O660k757m761R106Q94p989M819M421q705m19O013n566
1945b621l62J0108l158o258N115j981p359P731M633r210J692P804m152k066L108
1960C024p566k883J3117P58j0238L069M128m411K489m3j0097L578J4114l871r136
1975c968L685k37k098O248l061j0452Q241J0985p393n376K086l259J822Q272o622
1990a127p534J1361M851r081j567J310m664O258O595r938k709J1746j700q561
2004d760K291M02k729Q207R96j0408M123R037p682o556N202J41J297P242o048
2019G55q731R539N020j0760k140N785n64M851L947j1619m339J1975Q55r148K132
2034b442K707j530P774P35j3789p84J1425j348m190L656k558o79R130l376j3318
$$ plain form
1929 -1624 -929 6719 67 -4337 2323 -434 -5195 3911 4805 -3184 1635 6056 -2649 -3068 2945 -2621
1945 -2621 -2983 7125 3967 -2291 2824 843 -6516 1215 5848 -3362 -1670 6134 1982 -84 3024
1960 3024 -4542 -7425 5692 6450 -3788 -719 3409 -1002 1487 1444 -8653 -5075 9039 5168 -3968
1975 -3968 -283 -520 -2618 3630 569 -9883 -1642 9343 1950 -3426 -1340 -4599 -2777 5495 -1127
1990 -1127 -8661 2700 7551 -1530 -3097 -1787 -6451 -193 6402 -3536 -6245 5501 3801 -4760
2004 -4760 -2469 -2067 -4796 3411 4407 -6001 -1878 7159 -523 -7079 -1877 -1736 -439 6803 755
2019 755 -7976 1563 6583 -4177 -6317 -532 -1096 3755 7702 -3917 -8256 3719 4574 -4574 -2442
2034 -2442 265 -1265 6509 7244 -6545 -7329 4096 2748 -1442 2214 -344 -1023 8107 4731 -8587
2049h587M238R733k840n30J323o139K820R137q064j0525Q733O574k958Q36j652
2064B099o989O476N761j0991k763J1178J395n278J191l503k860Q884k61j1132
2078f793M085J0342m152m074J433m978Q19Q338m622p189R709M849q306k054J386
2093a207l997M949O862q558l585R531o21p443K869r31m178P675M343q211J34N396
2109C028n946k207O118l170k802Q746K22p758K232J937n610L464N526p512p47
2124d479R289k531o035K554k110k666Q467K332r524L174O886o668l154L623k792
2139c634J495Q270m101p683O969L150q007N34L342l044M286N920p771l754P365
2154C337k601o113N882K868l826M247J084q192J903N661o174j309P887k095l345
$$ plain form
2049 -8587 -4349 5384 2544 2014 3337 -2802 18 9155 1091 -9434 -701 5873 2915 3751 2099
2064 2099 -4890 1586 7347 -3644 -6407 4771 6166 888 2079 -1424 -4284 4600 4339 -6793
2078 -6793 -2708 7634 3482 -592 841 -4137 -3318 5020 398 -6791 2918 7767 -539 -2593 -1207
2093 -1207 -5204 -255 6607 -1951 -5536 3995 3374 -4069 -1200 -2131 -6309 1366 5709 -2502 -2368 3028
2109 3028 -2918 -5125 993 -2177 -4979 3767 3989 -3769 -1537 400 -5210 -1746 3780 -3732 -4479
2124 -4479 4810 2279 -3756 -1202 -3312 -5978 2489 4821 -4703 -1529 5357 -1311 -4465 -842 -3634
2139 -3634 -2139 6131 2030 -5653 1316 4466 -3541 -3007 335 -2709 1577 7497 -274 -4028 3337
2154 3337 736 -5377 505 3373 -453 3794 4878 -3314 -1411 4250 -1924 -3233 4654 2559 -786
2169g86O462j629p990K846K611m140M717N605p896j979P410l933n368M299P30
2184I59j783O917j290r862L892P405o804m217N614L08J795N029q115p774R502
2199A576L776q731P5N818m20J623N84r960n64J1375j399r107L706M610j441K180
2215C701l281r425N153R810m905m895N452o09l095L238l625n373Q015N253p372
2230a958l71M691m584j51M087n921k818R442J271o058K268J45n976M034M582o460
2246c777j83Q465k864m066K577k975k785Q070R30q199L328P128n252k105J288
2261d20m198J978Q838m057p177O745L239o373l57R32k885O423N181r558l419R016
2277C908k38n989J184k3n70Q125K66j0946R48P393l456k691L566k084M10O913
$$ plain form
2169 -786 5676 4047 -3943 -1097 1514 -2626 2091 7696 -200 -2179 5231 1298 -4070 229 959
2184 959 -824 6093 4803 -5059 -1167 6238 -566 -4783 831 1139 2934 7963 -152 -7926 1576
2199 1576 5352 -3379 -3304 2514 2094 3717 4301 -5659 -6223 5152 3753 -5354 -1648 2962 1521 3701
2215 3701 420 -9005 -3852 5958 1053 -3842 1610 1001 -2094 1144 -2481 -7854 161 5414 -1958
2230 -1958 -2329 2362 -2222 -2373 1714 -4207 -7025 2417 3688 -2370 -102 43 -5933 -1899 2683 -3777
2246 -3777 -3960 4505 1641 -2425 152 -2823 -5608 2462 3392 -4807 -1479 5649 397 -1708 -420
2261 -420 -4618 -2640 6198 2141 -5036 1709 4948 -1425 -1782 -850 -3735 2688 7869 -1689 -5108 3908
2277 3908 3670 -2319 -1135 -1158 -1728 6397 6663 -4283 -3335 4058 602 -2089 1477 -607 -197 6716
2293F716l637q242N053L734n325J827L920m399P03N329n813l770O163j216l149
2308b106N765J222o867K454L009n957K70N523l535o63O466l693o073N541J247
2323B603o043L164K835l828K856L218p392k125P214k153m115N088O53l479L837
2338B333o47q697L541P439m751k510N129k110j514M691m200o598O823M699n336
2353a708R63K532n065J091M958n742l051P863R39m472L157j064n604M275M225
2368C297o716n9O628k064j222L054m723m090P677J263o323K786M163m408M87K057
2384A807n899O05Q498l284n304M788R08l855K623l28o004M654O665n367l119M940
2400B328j909k150L426l010l783Q509K886q233n38M370k593R30K813n287q57Q930
$$ plain form
2293 6716 3079 -5163 -110 3624 -1701 126 4046 -353 350 5679 -134 -3904 2259 1043 -2106
2308 -2106 3659 4881 -1986 468 3477 -2480 -2210 3313 -222 -885 5581 1888 -4185 1356 2603
2323 2603 -3440 -276 2559 -1269 1587 4805 -2587 -4712 2502 349 -3766 1322 1975 -1504 2333
2338 2333 1686 -7011 -3470 3969 -782 -3292 1837 -273 -1787 2904 -1296 -7894 -1071 3628 -1708
2353 -1708 -745 1787 -3278 -2187 2771 -2971 -6022 1841 2780 -1692 1465 401 -5203 -928 3297
2368 3297 -3419 -3478 3150 1086 -136 2918 -1805 -5895 1782 3045 -3278 -492 3671 -737 -250 1807
2384 1807 -4092 -3487 5011 1727 -3577 1211 2119 -1736 887 559 -5445 -791 5874 507 -2612 2328
2400 2328 419 -1731 1695 -1315 -5098 3411 6297 -1936 -2474 1896 -697 233 3046 -2241 -3098 5832
2416E832r84q011K184K111k659L820R62o553L194P462n473n986M138M78m19M817
2432D913k774o628O183M753o798k831M222j720J106M880n598l791P265J25o993
2447c686J711L752k474K931K043p762n13P412k480m919L878L47j913M778r67p138
2463e000K584N716n134r36M660k450r65M971l773n743N711L319m799J450K137
2478A748m412K466M327o304l012O545J46l485L928r48m605M671J413p084J142
2493c464O910k640j966K985m063j726O857j126p118M160M359m112Q58J396n149
2508c839J420N995m503l754O599Q81m648K040k80m369M708M254o627n25N748k459
2524F41k552M240k924l224N705J290n448K419L112n011O89L979m550j040P092
$$ plain form
2416 5832 4848 -3163 -979 1132 -1527 2293 3255 -3298 -104 7358 1885 -4101 37 515 96 4913
2432 4913 2139 -4489 1694 6447 -351 -3182 1040 -680 426 5306 -292 -4083 3182 3307 -3686
2447 -3686 -1975 1777 -697 2234 4277 -3485 -3998 3414 934 -3985 -107 240 -1673 3105 2138 -5000
2463 -5000 -2416 3300 -1834 -2770 1890 -560 -1525 3446 -327 -6070 -359 2960 -1839 -389 1748
2478 1748 -2664 -198 4129 -2175 -5187 1358 1504 -1981 1947 999 -3606 1065 2478 -4606 -3464
2493 -3464 3446 806 -1160 1825 -2238 -3964 2893 1767 -5351 -1191 3168 -944 -86 1310 -3839
2508 -3839 -2419 3576 -927 -4681 1918 2799 -1849 191 -89 -4458 250 4504 -2123 -2648 3100 641
2524 641 -1911 2329 -595 -3819 1886 3176 -2272 147 3259 -1752 -1063 2916 -1634 -2674 4418
2539D418j318m635L068m55l839M539K166o624J022O498l440k044K580l138j555
2554b757O488j094o355M693L758n222n83K009l335K292N525n474m130O824N03
2569C142n282J782P16l163M693K552o901J50O301l069m181L624p32j447N562j145
2585B602o960L151M482m591m25L779l544j07N783l503n260M949J403m482L025
2600C02J262m483K367M950o519k734N300m71j179L954l116m817N899K909p008
2615c384l05M547k049J192L233n508k167O888q81o602L471L404k664K272P05o686
2631d534J463P255m543l859M837O06k528L137j846m937M848L905o346n9N622k294
2647G27j462K742l793k428P464L69o341K858K950m363J290K411m912OO866k789
$$ plain form
2539 4418 3100 -1535 1533 1078 -2761 1778 3944 -2680 -1658 4840 1400 -644 1936 -1202 -2757
2554 -2757 3731 2637 -3718 975 4733 -489 -1072 937 -2398 -106 5419 -55 -4185 2639 3142
2569 3142 -2140 -358 358 -2805 1888 4440 -2461 -2311 3990 921 -3260 364 -368 -1815 3747 2602
2585 2602 -4358 -1207 3275 -1316 -1741 2038 -1506 -1613 4170 667 -4593 356 1759 -2723 302
2600 302 1564 -2919 -552 4398 -2121 -4855 445 -26 -1205 2749 -367 -5184 715 3624 -3384
2615 -3384 -3689 858 -1191 1 3234 -2274 -4441 2447 1566 -5036 -1565 1839 -825 1447 2152 -4534
2631 -4534 -3071 4184 -359 -4218 619 1225 -1303 1834 -12 -4949 -101 3804 -2542 -2601 3021 727
2647 727 -735 2007 -1786 -4214 3250 3619 -2722 136 3086 -1277 13 2424 -2488 -2482 4384 1595
2663A595m137M588l16l851L689O65n903L568N421m492j817L138l381o97O105k202
2679A973n347M415L235m832J030J335m491K088N157m613k933O421q53m282K297
2694F00k76l038M878K484o657mN308l268k274L751k154j721N537j011n646L396
2710i5L137m802n6L482l250L35N356m194l983M654M01m025L424J307m881K550
2726f40L711n269j221M958k538j714M937j614m681N055J802n836N91L276l078
2741b261J858L864n805k213O367m85m771K950N40k646M062J217o784J597N497
2756B987l801k369M014p40j919M610k001n844M730L657m925K35L510l554K31M356
2772C177m081k961O129L99m991K640J811l763K672K163n648k28O404j927k735
$$ plain form
2663 1595 -2542 2046 1730 -2121 1568 2233 -3670 -102 5319 827 -990 2148 -1233 -1930 4175 1973
2679 1973 -3374 1041 4276 -556 474 1809 -2682 -594 4563 -50 -2983 3438 2585 -1697 600
2694 600 324 -2714 2164 4648 -2009 -2013 3295 27 -2247 1504 -650 -2371 3166 2155 -3491 -95
2710 -95 3042 -1760 -1816 1666 -1584 -1249 4107 -87 -4070 584 985 -3040 384 1691 -3190 -640
2726 -640 3071 -2198 -3419 1539 -999 -2713 2224 610 -4071 984 2786 -3050 -2459 817 -2261
2741 -2261 -403 3461 -2344 -4557 1810 1325 -3446 -496 44 -2602 1460 2677 -4107 -2510 2987
2756 2987 -814 -3183 831 91 -1828 2782 781 -5063 -333 3324 -1601 -1366 2144 -1410 -1179 3177
2772 3177 -904 -3865 2264 2663 -2328 312 2123 -1640 1032 3195 -2453 -2681 3723 1796 -939
2787i39K505j407k835N612N46o307K041M670l777p9K803m392k3O499l162n579
2803c824M439K975l620J113J36m721L596N279n176l189N178m44k966L099j490
2818C85l611N136K138o558P73M922l220j182L067l076j053N634j422n608L579
2833i6K528m304J349K491m506J364M767m317l316N178M06l735L199l75m631M059
2849F1L924n717j445M458k070n39L659l254m046N943J482n549J329K683k964K027
2865a8K283n716r11P066j158m657K230M74k237M363N62o324J698N267l736j788
2881b602L905j908j353M316k156m325M959K239n258R53L374l623O32L596l835
2896a086j912N489r44m158L605J133m203K843K135m633P51M578l650j672M013
$$ plain form
2787 -939 1566 159 -2676 2936 3482 -2825 -784 3886 109 30 2833 -1559 -1582 4917 1755 -3824
2803 -3824 615 3590 -30 1083 1219 -3502 94 5373 197 -2992 2186 1742 -1224 1875 385
2818 385 -3226 1910 4048 -2510 -1737 3185 -35 -1217 1850 -1226 -2279 3355 1933 -3675 -96
2833 -96 2432 -1872 -523 1968 -2538 -1174 3593 -724 -4040 1138 1544 -2191 1008 633 -3998 61
2849 61 3985 -1732 -3177 1281 -789 -1328 2331 -923 -4969 974 2456 -3093 -1764 919 -2045 -18
2865 -18 2265 -3451 -4362 2704 1546 -3111 -881 -407 -2644 1719 2281 -4043 -2345 2922 -814 -2602
2881 -2602 1303 -605 -1958 2358 202 -4123 836 3075 -2183 -1230 2144 -1479 -847 2749 -1086
2896 -1086 -2998 2491 1547 -2611 994 2127 -2076 767 2902 -1731 -980 3598 -52 -1724 2289
2911B289j423k491M537m5n570K481L499l806M45K766l988N3N551k753m612M678
2927A611R43l277J705O56m395L349M039n364k357M966n53j522K931k672l521N130
2943A669K062n760N40L761k884J33L234l627j558N532j645m638L448K054m281
2958a960K562J683m631Q96M400l495k100M609k208k158M029j31m912L180K341
2973B105m368N47L458k944o75L993l168l329N273O59l841J960M51k942K605K650
2989B434n070o73N493j889l424L486n46k493M141k17n648K996M773l511j547K207
3005E12k292K45M807k614m943M820K423m638J538J815l598J505L650m354j401
3020b525M943q32l537L160k48l487L660K272n231P96L455k977o51L965k689k575
$$ plain form
2911 2289 866 -1625 2912 2867 -2703 -222 3277 -529 -84 2682 -1306 -1253 4298 1545 -3067 1611
2927 1611 2554 -723 982 1638 -2757 592 4631 -733 -3090 1876 1323 -199 2732 60 -3461 1669
2943 1669 3731 -2029 -1489 2272 -612 -479 2755 -872 -2430 3102 1457 -3181 267 2321 -1960
2958 -1960 602 2285 -2346 -1450 2950 -545 -2645 1964 -244 -2402 1627 1496 -3416 -236 2105
2973 2105 -2263 -1716 1742 -1202 -1877 2116 -1052 -4381 892 1551 -2290 -330 121 -2821 -216 2434
2989 2434 -2636 -3309 2184 295 -3129 357 -189 -2682 1459 1242 -4406 -1410 3363 -148 -1695 512
3005 512 -1780 -1535 3272 658 -4285 535 2958 -1680 -142 1673 -1925 -420 3230 -1124 -2525
3020 -2525 2418 1586 -1951 1209 961 -2526 1134 3406 -1825 -1029 2426 -551 -1202 2763 74 -2501
3036b501M713k21l840K388J710l763J713K611m518L42N297k715l568L476j44k347
3052a367L453k41m912L267M159n277j037M014j421j621L384k271k392N000N24
3067C262n860J323L527k513O56K060m076k36N178k206l995L261R32l221K673J041
3083A806m485J868L603l944j243L755j593j732M390j589m510L299K241l845J082
3098h97K412l836M41M616l059l057L963K06l294K909N6l250K884K564n137q96
3114c375N132j686j494K616j933k261M942m85m842K048L123k785o1K798l087m34
3130a784M472k712l757M284J616l551J644J173l682J888L575m184j429M938j822
3145F69k395L343j019l225L703J427m660J375L843l354l53L068l212j633N052
$$ plain form
3036 -2501 2212 1991 -1849 539 2249 -1514 199 2810 -1708 -1366 3931 1216 -2352 1124 980 -1367
3052 -1367 2086 1845 -3067 200 4359 -918 -1955 2059 638 -983 2401 130 -2262 2738 3262
3067 3262 -2598 -1275 2252 -261 395 2455 -1621 -1857 3321 1115 -2880 381 1313 -1908 765 1806
3083 1806 -2679 -811 2792 -1152 -2395 1360 -233 -1965 2425 836 -3674 -375 1866 -1979 -897
3098 -897 1515 -2321 -1880 2736 -323 -3380 583 789 -2505 404 460 -2790 94 2658 -2479 -3375
3114 -3375 1757 71 -1423 1193 -740 -3001 1941 1456 -3386 -1338 1785 -1000 -1061 1737 -1350 -1784
3130 -1784 2688 -24 -3781 503 2119 -1432 212 1385 -2297 -409 3166 -1018 -2447 2491 669
3145 669 -1726 1617 598 -2627 1076 2503 -2157 -782 3061 -293 -646 2422 -790 -2423 2629
3160B629n58m356K788J467l304K242J599m577P67M798k507k808L418j014j552
3175i68L302p71m512L186L873l669j407K564k384N07L478k991l256M921P19m227
3191a635J534J585k969J965K233m234j57M591j775l341K913m50k042L164Q41m451
3207b228J965K699l479q61L504k409q86L564j142l610L497J090l710J271K059
3222A324l253J236L361l378k393M126q49k443K583q8k700L158J830n130K31L478
3238A093j146j600K852k300j161M318q21m930K430K909k523P66J601l642M37M396
3254B679k928l094L749O47k736K535M96m131K403K916l987p48L878j536p88K993
3270B348j915l383L531J586l606J221K445l099N79K742l566r11M175p21l153K729
$$ plain form
3160 2629 2071 -2285 503 1970 -1334 908 2507 -2070 -1303 3495 988 -1820 1598 584 -968
3175 -968 2334 1563 -2949 237 4110 441 -966 1598 -786 -279 3199 208 -3048 1873 2592 -1635
3191 -1635 -101 1484 -1485 480 2713 -1521 -1678 2913 1138 -2203 710 260 -1782 1382 2223 -2228
3207 -2228 -263 2436 -1043 -1904 1600 -809 -1695 1869 727 -2883 614 1704 -2006 -735 1324
3222 1324 -1929 -693 2668 -710 -3103 1023 174 -2269 314 226 -2474 684 2514 -2616 -2385 1093
3238 1093 -53 -1653 1199 -1101 -2262 2056 1235 -3695 -1265 1644 -879 -113 1488 -2154 -1717 2679
3254 2679 -249 -3343 406 1053 -1683 852 1348 -2783 -380 2536 -1451 -2199 1679 143 -645 2348
3270 2348 433 -2950 581 2167 -1439 -218 2227 -872 -293 2449 -1117 -2028 2147 1426 -1727 1002
3286A002O65k435K063P48m689J530M170k394j533K888j304j577K983j088l669
3301b640L767K185m130M9K290k063K51K788l261j703N021K95l930J393O19k758
3317a827K048K436m008Q2L961k160k280K643o43k471L432M28l863K013K813l496
3333h92O1J757k477m45M571j403l628K862M55k973J860J064l167J627L690l866
3349i04j411L120p41k062K627j063k009L520J424m889J39L299k153j67K382j999
3365h87j197M094j459l918K584J738k128J193J391l513J415L390l064k880L766
3380E25%k180K862l9l130K095J345l738O84L699k244j018L051j533k313K666K90
3397A022k781J773J801k692J340K505l988j030L819q64j999K739n98k204K740
$$ plain form
3286 1002 1667 -768 1295 2043 -2646 -1116 3054 660 -873 2015 711 -866 2117 1029 -2640
3301 -2640 1127 3312 -818 -769 1521 -542 -291 2497 -764 -2467 2554 2849 -1081 312 931 -1827
3317 -1827 221 2657 -1351 -1269 2692 532 -1748 895 252 -2219 1213 1641 -2222 -209 2604 -892
3333 -892 -831 926 -1551 -1996 2575 1172 -2456 406 861 -2112 -252 812 -2355 -728 2962 -904
3349 -904 -2315 805 64 -1998 629 -434 -2443 1077 2501 -2388 -2249 1050 -1103 -1270 1112 -887
3365 -887 -2084 2010 551 -3367 -783 955 -1173 20 1411 -2102 -687 2703 -361 -3241 525
3380 525 525 -1655 1207 1168 -1962 133 1478 -2260 -1576 2123 -121 -1139 1912 379 -1934 732 1022
3397 1022 -1759 14 1815 -877 463 2968 -1020 -2050 1769 905 -1094 1645 1047 -1157 1583
3412A583O05m460J438L243j820j004K330j744m69L133k059l990L502K455k764
3427b1J95J217k364Q59K382l152j245M523l28k978J772P8k150J534J204k962Q40
3444e96L317k373j647K954j704k320L008N46k482J914J043l196Q19K423l012p10
3460b016L624j058j694K077n54k357K441L94l533J764L508l056j323K358j271
3475f96j143K894j613k256L718J611m196r9K305j905R96J641l143k56M586j220
3491A224l851K002Q90j590J606R32l139R26L389k997k176L032l60j166K713q37
3507E98k976K361J707l435L50K356j533p1K786j594k408K543r5k707K601J217
3523A700k895J126K414k979r28K915j312j070L310j360k234K637Q38l800O78K443
$$ plain form
3412 1583 2188 -2272 -834 2409 589 -415 1915 171 -298 2835 776 -3214 288 2743 -21
3427 -21 174 1391 -973 -114 2268 -884 -2129 2394 2066 -912 860 938 -1212 322 1526 -1436 -596
3444 -596 2721 348 -1299 1655 -49 -2369 639 1185 -1297 617 1660 -1536 -717 1706 -1306 -2016
3460 -2016 1608 550 -1144 933 379 -1978 463 857 -2676 -912 2596 -460 -1783 575 -696
3475 -696 -1839 1055 -558 -2814 904 2515 -1681 -1780 525 -1380 -384 1257 -1886 -2142 2444 1224
3491 1224 -2627 -625 265 -1325 281 1213 -1926 -1000 2389 -608 -2784 248 -112 -1278 1435 598
3507 598 -2378 -17 1690 -1745 -1395 961 -572 -643 2143 549 -1859 684 589 -2118 483 1700
3523 1700 -1195 -69 2345 -634 -1562 1353 41 -1029 2281 921 -1313 1324 2162 -1638 -960 1483
3539A483j615K91K108k453r42L563j625l052K540K185k558R17N51k786J610K468
3555B685l421j339L348L99j740J091r02k260K913J192l489M91L569j837r44J327
3571A083j691j334L479o58l015K372J701k937P31J346k420J23K494j253j216K656
3587A461r66k499K356L79l183J532K604k337l04K120k267o72L011j593k427L185
3603D00R04k293O38O54k243R81K334k498o21L527j045k747J923j54j554K006P98
3620A010l125J385L217k631j625J986j045o59K748o13k622K503J310l343N27J374
3636C97j556R14K657k512j656K892K08k475J383Kj807K168J944l278n76K800j824
3653c19o91K256o16j752L238m76l556J460J882j923N07J815k371O7K888j816k361
$$ plain form
3539 1483 -132 159 2267 -186 -1128 2435 810 -2242 298 2483 -75 842 1393 -1393 217 2685
3555 2685 -736 -2075 1273 1672 -68 1023 121 -2139 774 1966 -1523 -1032 2537 700 -244 1083
3571 1083 -608 -1942 1537 879 -2136 236 1937 -1000 -269 1077 -1343 -1220 1274 21 -1195 1461
3587 1461 495 -2004 352 731 -2452 -920 1684 -653 -957 1163 -1104 -1776 1235 -358 -2785 400
3603 400 1304 -989 -351 303 -1940 -959 1375 -1123 -1744 1783 738 -2009 -86 -240 -1794 212 1010
3620 1010 -2115 -730 2487 -144 -1769 217 -828 -1487 1261 648 -1974 529 1839 -1504 -977 397
3636 397 -1159 -245 2412 -100 -1756 1136 1344 -1131 252 254 -1553 615 2559 -719 -1295 1505 -319
3653 -319 -1010 1246 630 -1122 2116 1640 -1916 -456 1426 -497 10 1825 -546 -479 2409 593 -1768
3670a768K176M10j506J700Q15k707R02J907k621o43K708r00q11K197q53k729K269
3687E46J074k743L44K105j743N58J641k496j267L020l41k301J832P56j739J204
3703D50P73l179L13L569j813j543K183k67j291J457o17k884K466K218k434l67
3719i66K178j979J69J557k044j215L305L32k740J014R43j757P83J405k806J32
3735a689L516j141k356K031n65j709J863O39k429J730J802k365n00J724j427q99
3751a775K961o73j770J834O85k732J217J292k552R31K353j527j366K040o56j708
3767a446K165k55k229K565J697l142l34J956j241m59J948j523p62K919R7l524
3783a568J413J617k030R03J279k063O16K787k650k174K412M86j759J444L88j956
$$ plain form
3670 -1768 408 818 -688 1012 1827 -880 22 1929 -692 -1335 1373 473 -338 1859 1006 -1723 546
3687 546 1620 -1123 -779 1326 -417 141 1782 -714 -1981 1039 698 -1603 229 985 -754 450
3703 450 1223 -1956 -1643 1926 113 -1430 753 486 -805 652 35 -2849 -383 1835 -599 -966
3719 -966 1212 -767 -598 959 -1085 -2300 1005 1337 -1403 -389 554 -1203 -420 985 -1821 -1689
3735 -1689 1827 686 -1670 361 -204 -1913 -50 589 -1840 -110 1692 -673 -1173 551 -876 -1775
3751 -1775 1186 513 -1257 577 1262 -1470 -253 1039 -1513 -582 1771 244 -1122 918 262 -1446
3767 -1446 719 464 -1765 800 2497 -645 -979 977 -264 -723 1225 -298 -1060 1859 1956 -1568
3783 -1568 -155 1462 -568 335 1614 -449 167 2954 304 -1870 542 1028 -731 713 1101 -855
3799h55J613J310k999m55L009j575q96K187n76j523J846M1k925J756J405j880
3815e17N06J951j815j423K380j067j277K065m61j936K626Q15l365o8K183p53l19
3832d75J598j583j116L014m62l519J474K155j649L44J082j991M21K474k570j812
3848b615L142P46k291R93K39j683J616O44l004N77L515j354j282J139r71q89J806
3865C28q5k607K029J985k058o61J780j735m62K329j017j169K372K84k300Q15O73
3882E01k081J189J951j688o50K407j657j089K393j253j929K107J832k342k5J007
3898F73j683N58K444k610j075L712M5k694Q55J99j509J774P43k500O07L350k012
3915H77j832J174J04j049K175n76j958K220J445l126o35J911m45m76J720j366
$$ plain form
3799 -855 758 2068 -931 -1386 1623 48 -848 1339 763 -760 1086 1127 -1798 -42 1363 -517
3815 -517 -11 1940 125 -1298 1082 15 -1262 803 342 -1594 1032 1847 -1518 -1586 597 -156 -475
3832 -475 1123 -460 -1576 1438 976 -2543 -1069 1086 -563 -219 863 -1128 -707 1767 -803 -2615
3848 -2615 527 1273 -1018 -25 214 -1469 147 791 -2213 -1636 1879 525 -757 382 -589 -1478 328
3865 328 243 -2364 -335 1650 -408 -1069 711 -1024 -1486 843 -174 -1343 1029 1313 -987 -172 501
3882 501 -1580 -391 1560 -128 -778 1629 -28 -1117 1276 23 -1906 201 2033 -309 -334 673
3898 673 -1010 -452 1992 -618 -1693 2019 2064 -630 225 424 -1085 689 1432 -1068 -461 2889 877
3915 877 -955 219 323 -726 1449 873 -1085 1135 2580 -546 -1181 730 285 -191 1529 163
3931A63j144K660n47l228J810J805j576L15J076j864j54K430j988j589K413M29
3947A011j601J280N81k325M65J544j874J28K218j561q85J953p29j961J259R82
3963D85j685J418Q32k540N91K517k235j793K427M69j174J437p71k078K336J299
3979A535l461M26K018m11o98J269j356r77K748r38k326J840J917j729j42R06k018
3996a397J68K283j447j158K566J23k012J233M56k095P42J872j851j2K115j353
4012B33j334K036p36j688K230M16j714Q34J244k484N08J844j650q17K745o91j611
4029f35J419l25j857J874R95k244N17K253j598q50Q88m50q41K576o36k538J802
4046C50J585k171l33J358j681P60K243k105j494L021n0k626J075L60j133J477
$$ plain form
3931 163 -981 1679 1132 -2096 -286 1519 -57 258 1334 -530 -684 1746 -242 -1831 582 1011
3947 1011 -590 690 1271 -1054 -589 955 -919 -791 1427 -134 -1019 934 205 -1756 -497 485
3963 485 -1200 218 1050 -1490 -899 1618 -617 -2410 17 486 -688 749 -22 -2100 236 1535
3979 1535 -1926 -1500 518 107 -591 678 -678 -1655 1093 155 -2171 -331 1586 -143 -285 621 -1397
3996 -1397 -1229 1054 -393 -1551 1015 1138 -874 359 815 -1280 -538 1334 -517 -529 1586 233
4012 233 -1101 935 199 -1489 741 1157 -557 277 1521 -963 -455 1389 -261 -1078 1667 976 -635
4029 -635 784 459 -1398 476 1471 -773 -256 1997 399 -451 437 -13 -854 1722 1086 -1452 350
4046 350 1935 -236 -569 789 -892 -132 2111 6 -1488 1533 1483 -1143 -68 292 -841 636
4062F36J199k485k19K470j376j564K159r96o42J933r6k297P08J623k093K58J682
4079I00j605l20K371j164k003J676N65j729J376J140k295O88J899k234r54J915
4095B26m36r88K136p47j796J877P47k895M56K144j548K82J699j577j089K032J
4112E24k348J337J217j354O73R63k445L48K529j889r92K190k90j026J495n68k256
4129a892J704J530j751k98J659q56l93J744j531j930K507N88j502M46P08j245
4145e12O85J029k177k15K847q45j468J645k25j545J316K99k175J328J595j469
4161A13n91J878j311j053K020n53j626K460L15k305L67J402k028P33J586j344
4177F3p16K018n28j829J481Lj708J592J102j722k64J848j393p88J629r35j203
$$ plain form
4062 636 1835 -650 -869 1601 225 -1339 820 -176 -818 1115 1019 -1278 -570 1053 -1040 -782 900
4079 900 -705 -1025 1346 182 -1821 -145 420 -1309 67 1207 -1088 -400 1499 -735 -1689 226
4095 226 -210 -1198 938 191 -1605 272 1019 -1876 -1420 724 -824 -542 1157 -420 -1509 523 524
4112 524 -1824 -487 730 -624 49 1012 -1433 -1085 1444 -445 -1437 753 463 -563 932 364 -1892
4129 -1892 -188 1342 -409 -707 952 96 -297 1447 -84 -2014 493 1081 -421 25 733 -512
4145 -512 173 1202 -975 -1190 1657 812 -656 989 764 -781 535 834 -1341 -13 1582 113
4161 113 -478 1400 89 -964 1056 503 -1123 1337 1652 -653 -286 1116 -912 -179 1407 63
4177 63 -653 1365 837 -992 489 492 -1216 376 1478 -244 -508 1340 -53 -841 788 -147 -1350
4194a350K438L92k538P67J192j723M20J120j989L64K774j366k411J844L21j332
4210a077J332N3j858J499J718k342r69J892n13n46J662q80j470K002L26k540P28
4227i83J656j409o0J673j304o63K000q44k087K338K04j550J320J006k337N25J338
4244H23j689j89K324j068j359K084n4k367J297J115j946Q29J445j787m5K053j387
4261G9j793J936Q13j461J068K02j533J063J219k654l23K460n89o63J400q87j072
4278g35J830j9k465J046K005j239n99J626j894j32K286j767j169K111P46k307
4294f76P54Q03j771P61J480j746k86K303q49j575J288m6j503J185J399k186P06
4311D1J205j759l10J917r68j689K263J64j506J014J2j580J137J108k303J73K465
$$ plain form
4194 -1350 1088 1480 -1058 -291 901 -822 -402 718 -1271 -907 1867 501 -1910 -66 255 -1077
4210 -1077 255 308 -1550 -51 1667 -675 -1644 248 -265 -811 851 -29 -1499 503 829 -1711 -983
4227 -983 673 -736 -796 877 -427 -1090 910 66 -2021 317 521 -1029 291 1297 -1040 -515 823
4244 823 -866 -1055 1269 201 -1158 926 872 -1495 -198 917 -1029 -200 1245 -542 -587 1466 79
4261 79 -1714 222 1035 -426 642 844 -689 374 1593 -1061 -1384 1076 487 -176 1224 337 -735
4278 -735 1095 1076 -1389 -343 1662 423 -176 1450 -444 -576 1710 -57 -1226 885 1631 -676
4294 -676 78 881 -890 -129 1351 -395 -681 1622 773 -802 486 440 -1063 122 1521 -665 41
4311 41 1246 -513 -823 1094 126 -1563 700 864 -642 372 384 -1196 -59 1049 -1254 -1081 1384
4328A384r33j401J215o41j196K480m41j814J069J798k030n90J492p77m38J405
4344E82j220p97K058N39k485N50J059j291P89J096j792l77K624j289j885J807
4360c2J90j060J544J99j944P84J611j785o51K022j159o56K175m32k147J481L83
4377E23j604J085J205j776M36J398j478j016J975n80j042J474L12j744R78J728
4393A874k513k60J681p33j12J483j285j274K497k66k251P00J807j405M85P61j922
$$ plain form
4328 1384 451 -950 265 -376 -1572 908 467 -1347 -278 1520 -510 -1100 392 -385 -823 582
4344 582 -638 -1435 623 1162 -1323 -773 286 -1005 -216 880 -912 -1289 1335 46 -1839 -32
4360 -32 158 -902 642 841 -1103 -319 1292 -493 -1144 878 -281 -937 1238 806 -1341 140 523
4377 523 -1081 4 1209 -567 -131 1267 -211 -1227 748 168 -874 600 912 -832 146 1874
4393 1874 -639 -899 782 49 -63 1420 135 -1139 1358 1092 -1159 -459 1348 -57 428 1189 -733
$$ [...]
8191C4
##END NTUPLES=NMR FID
##END=
