##TITLE=1H_EC-3208(II-32)
 CDCl3, 8 sc, 
 11.11.2019
##JCAMPDX= 6.0         $$ Bruker NMR JCAMP-DX V2.0
##DATA TYPE= NMR FID
##DATA CLASS= NTUPLES
##ORIGIN= UXNMR, Bruker Analytische Messtechnik GmbH
##OWNER= root
$$ XWIN-NMR		Version 3.5
$$ Mon Nov 11 14:14:30 2019 Russian Standard Time (UT+4h)  she@DPX200
##.OBSERVE FREQUENCY= 200.1315
##.OBSERVE NUCLEUS= ^1H
##.DELAY= (6, 6)
##.ACQUISITION MODE= SIMULTANEOUS
##.ACQUISITION SCHEME= undefined
##.AVERAGES= 8
##.DIGITISER RES= 18
##SPECTROMETER/DATA SYSTEM= spect
##.PULSE SEQUENCE= zg30
##.SOLVENT NAME= CDCl3
##.SHIFT REFERENCE= (INTERNAL, CDCl3, 0, 15.7039)
##AUDIT TRAIL= $$ (NUMBER, WHEN, WHO, WHERE, WHAT)
$$ ##TITLE= Audit trail, XWIN-NMR		Version 3.5
$$ ##JCAMPDX= 5.01
$$ ##ORIGIN= Bruker BioSpin GmbH
$$ ##OWNER= she
$$ F:/spectra/data/she/nmr/H-F/1/audita.txt
$$ ##AUDIT TRAIL=  $$ (NUMBER, WHEN, WHO, WHERE, WHAT)
(   1,<2019-11-11 14:13:26.59 +0400>,<she>,<DPX200>,
      <created by zg, POWCHK disabled, PULCHK disabled
       configuration hash MD5:
       00 E9 B6 7A A2 85 ED C7 34 08 36 98 17 FE 4E 26
       data hash MD5: 16K
       4F D1 76 DC 73 5C B9 ED 8C E8 1D 2C 75 A1 21 95>)
$$ ##END=
$$ 
$$ hash MD5
$$ 80 31 AA 32 F8 F6 0D 64 9E 92 16 69 A5 6F 51 92
##$RELAX= 
##$RELAX= 
##$RELAX= 
##$RELAX= 
##$RELAX= 
##$RELAX= 
$$ Bruker specific parameters
$$ --------------------------
##$DU= <F:/spectra>
##$EXPNO= 1
##$NAME= <H-F>
##$PROCNO= 1
##$TYPE= <nmr>
##$USER= <she>
##$AMP= (0..31)
100 100 100 100 100 100 100 100 100 100 100 100 100 100 100 100 100 100 
100 100 100 100 100 100 100 100 100 100 100 100 100 100 
##$AQSEQ= 0
##$AQ_mod= 1
##$AUNM= <au_zg>
##$AUTOPOS= <>
##$BF1= 200.13
##$BF2= 200.13
##$BF3= 200.13
##$BF4= 200.13
##$BF5= 200.13
##$BF6= 200.13
##$BF7= 200.13
##$BF8= 200.13
##$BYTORDA= 1
##$CFDGTYP= 0
##$CFRGTYP= 5
##$CHEMSTR= <none>
##$CNST= (0..31)
1 1 145 1 1 1 1 1 1 1 1 1 1 1 1 1 1 1 1 1 1 1 1 1 1 1 1 1 1 1 1 1 
##$CPDPRG= <>
##$CPDPRG1= <>
##$CPDPRG2= <>
##$CPDPRG3= <>
##$CPDPRG4= <mlev>
##$CPDPRG5= <mlev>
##$CPDPRG6= <mlev>
##$CPDPRG7= <mlev>
##$CPDPRG8= <mlev>
##$CPDPRGB= <>
##$CPDPRGT= <>
##$D= (0..31)
0 1.2 0 0 0 0 0 0 0 0.06 0 0.03 0 0 0 0 0.0002 0 0 0 0 0 0 0 0 0 0 0 0 
0 0 0 
##$DATE= 1573467206
##$DBL= (0..7)
120 120 120 120 120 120 120 120 
##$DBP= (0..7)
150 150 150 150 150 150 150 150 
##$DBP07= 0
##$DBPNAM0= <>
##$DBPNAM1= <>
##$DBPNAM2= <>
##$DBPNAM3= <>
##$DBPNAM4= <>
##$DBPNAM5= <>
##$DBPNAM6= <>
##$DBPNAM7= <>
##$DBPOAL= (0..7)
0.5 0.5 0.5 0.5 0.5 0.5 0.5 0.5 
##$DBPOFFS= (0..7)
0 0 0 0 0 0 0 0 
##$DE= 6
##$DECBNUC= <off>
##$DECIM= 24
##$DECNUC= <off>
##$DECSTAT= 4
##$DIGMOD= 1
##$DIGTYP= 9
##$DL= (0..7)
0 120 120 120 120 120 120 120 
##$DP= (0..7)
150 150 150 150 150 150 150 150 
##$DP07= 0
##$DPNAME0= <>
##$DPNAME1= <>
##$DPNAME2= <>
##$DPNAME3= <>
##$DPNAME4= <>
##$DPNAME5= <>
##$DPNAME6= <>
##$DPNAME7= <>
##$DPOAL= (0..7)
0.5 0.5 0.5 0.5 0.5 0.5 0.5 0.5 
##$DPOFFS= (0..7)
0 0 0 0 0 0 0 0 
##$DQDMODE= 0
##$DR= 18
##$DS= 0
##$DSLIST= <SSSSSSSSSSSSSSS>
$$ [...]
##$SUBNAM2= <"">
##$SUBNAM3= <"">
##$SUBNAM4= <"">
##$SUBNAM5= <"">
##$SUBNAM6= <"">
##$SUBNAM7= <"">
##$SUBNAM8= <"">
##$SUBNAM9= <"">
##$SW= 24.0689530833862
##$SWIBOX= (0..15)
0 0 2 0 0 0 0 0 0 0 0 0 0 0 0 0 
##$SW_h= 4816.95568400771
##$TD= 16384
##$TD0= 1
##$TE= 0
##$TE2= 300
##$TE3= 300
##$TEG= 300
##$TL= (0..7)
0 120 120 120 120 120 120 120 
##$TP= (0..7)
150 150 150 150 150 150 150 150 
##$TP07= 0
##$TPNAME0= <>
##$TPNAME1= <>
##$TPNAME2= <>
##$TPNAME3= <>
##$TPNAME4= <>
##$TPNAME5= <>
##$TPNAME6= <>
##$TPNAME7= <>
##$TPOAL= (0..7)
0.5 0.5 0.5 0.5 0.5 0.5 0.5 0.5 
##$TPOFFS= (0..7)
0 0 0 0 0 0 0 0 
##$TUNHIN= 0
##$TUNHOUT= 0
##$TUNXOUT= 0
##$USERA1= <user>
##$USERA2= <user>
##$USERA3= <user>
##$USERA4= <user>
##$USERA5= <user>
##$V9= 5
##$VALIST= <valist>
##$VCLIST= <CCCCCCCCCCCCCCC>
##$VD= 0
##$VDLIST= <DDDDDDDDDDDDDDD>
##$VPLIST= <PPPPPPPPPPPPPPP>
##$VTLIST= <TTTTTTTTTTTTTTT>
##$WBST= 1024
##$WBSW= 4
##$XGAIN= (0..3)
0 0 0 0 
##$XL= 0
##$YL= 0
##$YMAX_a= 249146
##$YMIN_a= -170890
##$ZGOPTNS= <>
##$ZL1= 120
##$ZL2= 120
##$ZL3= 120
##$ZL4= 120
##$ABSF1= 10
##$ABSF2= 0
##$ABSG= 5
##$ABSL= 3
##$ALPHA= 0
##$AQORDER= 0
##$ASSFAC= 0
##$ASSFACI= 0
##$ASSFACX= 0
##$ASSWID= 0
##$AUNMP= <proc_1d>
##$AZFE= 0.1
##$AZFW= 0.1
##$BCFW= 1
##$BC_mod= 2
##$BYTORDP= 1
##$COROFFS= 0
##$CY= 11.3945322036743
##$DATMOD= 1
##$DC= 2
##$DFILT= <>
##$DTYPP= 0
##$F1P= 19.5091578491511
##$F2P= -0.509923556040331
##$FCOR= 0.5
##$FTSIZE= 0
##$FT_mod= 4
##$GAMMA= 1
##$GB= 0.15
##$INTBC= 1
##$INTSCL= 1
##$ISEN= 128
##$LB= 0.24
##$LEV0= 0
##$LPBIN= 0
##$MAXI= 10000
##$MC2= 0
##$MEAN= 0
##$ME_mod= 0
##$MI= 1.114404
##$NCOEF= 0
##$NC_proc= 0
##$NLEV= 6
##$NOISF1= 3.799351
##$NOISF2= 2.8
##$NSP= 1
##$NTH_PI= 0
##$NZP= 0
##$OFFSET= 15.70392
##$PC= 1
##$PHC0= -9458.666
##$PHC1= 17.60088
##$PH_mod= 1
##$PKNL= yes
##$PPARMOD= 0
##$PSCAL= 0
##$PSIGN= 0
##$REVERSE= no
##$SF= 200.130013532006
##$SI= 16384
##$SIGF1= 3
##$SIGF2= 2
##$SINO= 400
##$SIOLD= 16384
##$SREGLST= <1H.CDCl3>
##$SSB= 0
##$STSI= 0
##$STSR= 0
##$SW_p= 3612.71676300578
##$SYMM= 0
##$S_DEV= 0
##$TDeff= 0
##$TDoff= 0
##$TI= <>
##$TILT= no
##$TM1= 0
##$TM2= 0
##$TOPLEV= 0
##$USERP1= <user>
##$USERP2= <user>
##$USERP3= <user>
##$USERP4= <user>
##$USERP5= <user>
##$WDW= 1
##$XDIM= 8192
##$YMAX_p= 0
##$YMIN_p= 0
$$ End of Bruker specific parameters
$$ ---------------------------------
##NTUPLES= NMR FID
##VAR_NAME=  TIME,          FID/REAL,        FID/IMAG
##SYMBOL=    X,             R,               I
##VAR_TYPE=  INDEPENDENT,   DEPENDENT,       DEPENDENT
##VAR_FORM=  AFFN,          ASDF,            ASDF
##VAR_DIM=   8192,          8192,            8192
##UNITS=     SECONDS,       ARBITRARY UNITS, ARBITRARY UNITS
##FACTOR=    0.0002076,     1,               1
##FIRST=     0,             0,               0
##LAST=      1.7004516,     0,               0
##MIN=       0,             -170890,         0
##MAX=       1.7004516,     249146,          0
$$ Real data points
##PAGE= N=1
##DATA TABLE= (X++(R..R)), XYDATA
0@%%%%%%%%%%%%%%%Qj4J4j6J6j6K0k8L2l6M4n2N7o5P4q3R6j09J23j37J53j71J91
$$ 0 0 0 0 0 0 0 0 0 0 0 0 0 0 0 0 8 -6 8 -8 8 -8 12 -16 16 -20 24 -28 29 -36 38 -45 51 -58 65 -72 81 -90 101
38A01k12K36k64K91l22L57l94M35m82N35n91O52p25Q09r02J008j128J262j401
$$ 101 -111 125 -139 152 -170 187 -207 228 -254 281 -310 342 -383 426 -476 532 -596 666 -735
57g35J503j380l4J9816K18516k8082k73347j07147J32324J78510j2437j77090
$$ -735 768 -612 -646 19170 237686 209604 -63743 -170890 -38566 139944 127507 -49583
69d9583p3568J56701J35045o9235j28704r847Q2778O1425n0578r3845K7404J20994
$$ -49583 -123151 33550 168595 99360 -29344 -39191 43587 105012 54434 -39411 -12007 108987
81A08987J7278r3920n6262J4191L2621K7761r009k0318K7302J6324n8871l8112
$$ 108987 126265 32345 -23917 -9726 22895 50656 41647 21329 48631 64955 6084 -32028
93c2028M2559L5071k0479l5014j8807L7123P3230j3627j06937m4063N8933O0405
$$ -32028 10531 45602 25123 -9891 -28698 8425 81655 68028 -38909 -82972 -24039 36366
105C6366J3216l2495n1047J2814O1810j4264p5411n582O2175M3344l643n6433
$$ 36366 49582 17087 -33960 -21146 40664 26400 -49011 -54593 7582 50926 47283 -9150
117i150n5300M2494Q4510j7194q6865k6208M9317O9699K7318o4664q0534J7770
$$ -9150 -64450 -21956 62554 45360 -41505 -67713 -18396 51303 78621 13957 -66577 -48807
129d8807O6033J0506k4244j5257m353K3347J7146m1094l4065L5097K9316j8114
$$ -48807 17226 27732 3488 -11769 -16122 7225 24371 -16723 -50788 -15691 13625 -4489
141d489r877K505n421J2643L899l5261j3823K8092J0412J82J7703r937l6383n364
$$ -4489 -14366 -11861 -17282 -4639 -740 -36001 -49824 -21732 -11320 -11138 6565 -3372 -39755 -45119
155d5119J3260J1805K7947M79m8548j0232M7337J6442k4290j5700o107J3827L6856
$$ -45119 -31859 -20054 7893 8372 -40176 -50408 -3071 13371 -10919 -26619 -32726 -18899 17957
168A7957j263l6976N468K8636j3271k2762N621J7292K7303J4715l7696l5287K6388
$$ 17957 16694 -20282 -14814 13822 551 -22211 -16590 702 28005 42720 5024 -30263 -3875
181c875K6954j1040l341N351p425O074R749j3910o5J4916k1780k0171L5888L1364
$$ -3875 23079 12039 8698 14049 6624 12698 22447 8537 8472 23388 1608 -18563 17325 48689
195D8689j9177k7632j5669K863L5867J4325m2796j8220M2678K1975k4989k8614
$$ 48689 29512 1880 -13789 -10926 24941 39266 -3530 -21750 20928 42903 17914 -10700
207a0700j3633K1839M6180r248o0438m765N4168K3143k3596l9994k9865K9799
$$ -10700 -24333 -2494 43686 34438 -26000 -30765 23403 46546 22950 -17044 -46909 -17110
219a7110O6636J059n7970k0341K1527J8902O957k0150k9647K3452M5745j4244
$$ -17110 49526 50585 -7385 -27726 -6199 12703 19660 -490 -30137 -6685 39060 24816
231B4816m1029l460J6564J5462P628l0041k8402L6030M3053j9983l5811o970N991
$$ 24816 -16213 -19673 -3109 12353 19981 -10060 -38462 -2432 40621 20638 -15173 -22143 -16152
244a6152J9625J5633k2197j5817K7023Q912k9163p082J6023N940L034q087j9549
$$ -16152 3473 19106 -3091 -18908 8115 17027 -12136 -19218 -3195 2745 5779 -2308 -21857
257b1857J8647L7527k0377m8103Q66K9653J9121K715k4900k0364L2478K8210l9364
$$ -21857 -3210 34317 13940 -34163 -33297 -3644 15477 18192 -6708 -27072 5406 33616 -5748
270e748l8673K2851L8946J3114k0619m5493k890O1598K5334n5055m2829J9674
$$ -5748 -44421 -21570 17376 30490 9871 -35622 -38512 23086 48420 -6635 -49464 -29790
282b9790M2883K8214j7905n3404n971M9023J0550l6939r415K1940K0204Q246k5787
$$ -29790 13093 41307 23402 -30002 -35973 13050 23600 -13339 -22754 -814 19390 27636 1849
295A849l7376J7862M4709q110l3222k540J5076J9168J2462k7892l5738J6813L0865
$$ 1849 -35527 -17665 27044 18934 -14288 -16828 -1752 17416 29878 1986 -33752 -16939 13926
308A3926m591p098L260o464K543O507j9943r918K8241J1770k0193o536O191L256
$$ 13926 9335 2237 5497 -967 1576 8083 -11860 -21778 6463 18233 -1960 -8496 -2305 951
322I51J2599m773l3549k384L5883J0081j3577k424m149n172P598q437j3501K7407
$$ 951 13550 8777 -24772 -27156 8727 18808 5231 2807 -1342 -6514 1084 -7353 -20854 6553
336F553K9371k3229l1824K409J5863J8947L692l3601j8442L8678L0869k0538k5023
$$ 6553 35924 12695 -19129 -16720 -857 18090 21782 -11819 -30261 8417 39286 18748 -6275
349f275p228K642J9254J0330k1428k916K7806J006k5869p656M097P724J9971k562
$$ -6275 -13503 -10861 8393 18723 -2705 -5621 22185 23191 -2678 -10334 -6237 1487 21458 18896
363A8896k7898N73K4299M60r451m203j5782o39L1081J3106j7249j0130r143j0044
$$ 18896 -9002 -8429 15870 16330 6879 2676 -13106 -13745 17336 30442 13193 3063 -6080 -16124
377a6124J7446J9673j3799q790J2484j246p743K205r071n115K1871M932k3990
$$ -16124 1322 20995 7196 -1594 10890 9644 1901 4106 -4965 -10080 11791 16723 -7267
390g267j837J9559M088m884j2681k4904O438M0100R541k5885j2849k382J55J4849
$$ -7267 -9104 10455 14543 9659 -3022 -27926 -21488 18612 28153 2268 -10581 -12963 -12808 2041
404B041L388j7805L739J6630j0232r984J2913L71j3342k603j335N582K6443K539
$$ 2041 5429 -12376 -8637 7993 -2239 -12223 690 1061 -12281 -14884 -16219 -10637 15806 18345
418A8345l5279j1618K1080P988m919k578m421J1768J9756k0256l6130J4028L7548
$$ 18345 -16934 -28552 -7472 516 -4403 -6981 -11402 366 20122 -134 -36264 -22236 15312
431A5312K954k1561k1033k80L9427K8193l8653m9265J3015M1368J8187r328k9913
$$ 15312 18266 -3295 -24328 -24608 14819 43012 4359 -44906 -31891 9477 27664 18336 -11577
444a1577j3988L1737K1104l2182k4533K2073K6719M832j6317k9177P93M0623R115
$$ -11577 -25565 6172 27276 -4906 -29439 -7366 19353 24185 7868 -21309 -20516 20107 29222
457B9222l8519j6678K2545K3604R709j6248l4249M96L4152L862j9976M239J3141
$$ 29222 -9297 -25975 -3430 20174 29883 13635 -20614 -20118 14034 17896 -2080 2159 15300
470A5300k109m869j1533q254K2509J7716k5087j9621K1734K1554k396j6719k4776
$$ 15300 13191 8322 -3211 -11465 11044 28760 3673 -15948 5786 27340 24944 8225 -16551
483a6551m16L6671J3939k9256j1761K0526Q473j0469j7369j3629K1772L8612j0979
$$ -16551 -16967 19704 33643 4387 -7374 13152 21625 11156 -6213 -19842 1930 40542 29563
496B9563m4818n421K8957J6542o990k6757k0064K7764L9148j3943l7400m787J4462
$$ 29563 -15255 -20676 8281 24823 17833 -8924 -28988 -1224 37924 23981 -13419 -18206 -3744
509c744J0009J918j6507r493K5928J6857k6612k2384R274J1863O993l67j7941
$$ -3744 6265 8183 -8324 -17817 8111 24968 -1644 -24028 -14754 -2891 4102 3735 -14206
522a4206m941K5148P237k2476r766M539J414J0581Q910j0164l667O506j1118r837
$$ -14206 -19147 6001 13238 -9238 -19004 -14465 -13051 -2470 6440 -3724 -7391 -885 -12003 -21840
536b1840J4582Q475n101M293m53j0979O098Q556j2816m995J2312R25j095J0028
$$ -21840 -7258 1217 -3884 409 -44 -11023 -4925 3631 -9185 -14180 -1868 -943 -2038 7990
550G990l771j2414N276K379j0068N523J1299j653K439L120j7835r912J6891Q834
$$ 7990 4219 -8195 -2919 -540 -10608 -5085 6214 4561 7000 10120 -7715 -17627 -736 8098
564H098n875O07l796m148J4645N513k3061j0264J4801R208L847K454j3408p701
$$ 8098 2223 2830 -966 -5114 9531 15044 -8017 -18281 -3480 5728 9575 12029 -1379 -9080
578i080J5103J981j6184R84J4106M843K902o209j8957L048K3642j131j7459o9
$$ -9080 6023 8004 -8180 -7196 6910 11753 14655 8446 -10511 -7463 16179 15048 -2411 -2480
592b480Q199Q663J0983j0946k6274M889K2949o79r345K299J628M361N228j7470
$$ -2480 5719 14382 25365 14419 -11855 -6966 15983 15304 5959 8258 9886 14247 19475 2005
606B005j6130J8276J9885q872j2019l264k9J2198M564k3036j0572K3014J1756
$$ 2005 -14125 4151 24036 15164 3145 -119 -148 12050 16614 -6422 -16994 6020 17776
619A7776j1834o832l665j244R348k273j8752O130K5435j168j9179q930P35J2288
$$ 17776 5942 -890 -4555 -5799 3549 1276 -17476 -11346 14089 12921 -6258 -15188 -14453 -2165
633b165J3545j4769k2033J5473K4344n843j6295p761j64J5866J1596j7753j1850
$$ -2165 11380 -3389 -25422 -9949 14395 8552 -7743 -15504 -15668 198 11794 -5959 -17809
646a7809K2182J2457j8206j5874K34J2099K1587l32k8796o314K5218P628j5685
$$ -17809 4373 16830 -1376 -17250 -17016 -4917 16670 16338 -12458 -18772 6446 14074 -1611
659a611r835m16J1289J6908q817k3635O229K0267m967j4962k582M148J5535J1784
$$ -1611 -11446 -11862 -573 16335 7518 -16117 -9888 10379 5412 -9550 -12132 -7984 7551 19335
673A9335k0358k3710J2149J9235k799p352m851k402J4088J0150j7641j3645J1230
$$ 19335 -1023 -24733 -12584 6651 3852 -3500 -8351 -10753 3335 13485 -4156 -17801 -6571
686f571P568j851J390l964k336J3680O79k1512k523J8534O771j854l209j2278
$$ -6571 997 -854 536 -3428 -5764 7916 8595 -12917 -15440 3094 9865 8011 4802 -7476
700g476o12J8142J050j6445J763J1217O87K21j663q251N695R866j2744j0778J5312
$$ -7476 -8088 10054 11104 -5341 -3578 7639 8326 8547 6884 -1367 4328 14194 1450 -9328 5984
715E984J1923m106n313r145o149J5042J0684j5269p696J2084L321m905j487p004
$$ 5984 17907 13801 8488 -657 -6806 8236 18920 3651 -4045 8039 11360 6455 4968 -2036
729b036n96J4356o37j6023L273J2429k113n586m739r367O712J9325l361j6040
$$ -2036 -2632 11724 11087 -4936 -1663 10766 8653 3067 -1672 -11039 -4327 14998 11637 -4403
743d403l55L089l71Q203k58j4596P34J2053j456k904K874p104l631J1101k10j0323
$$ -4403 -4758 -1669 -2040 6163 5905 -8691 -7957 4096 2640 -264 2610 -4494 -8125 2976 2766 -7557
759g557M931P882l763j467k683r965O521J6850m999j3258J832K434J959P846m853
$$ -7557 -2626 5256 1493 26 -2657 -12622 -6101 10749 5750 -7508 -5676 -3242 -1283 6563 1710
774A710j4292N671J2314o267m896N120k555j761N163m759m525J1257K110j2709
$$ 1710 -12582 -6911 5403 -864 -5760 -640 -3195 -4956 207 -4552 -9077 2180 4290 -8419
788h419r12O153j256K992K384j0891p84J3781k034j0182M541M014l786J719k055
$$ -8419 -9331 -3178 -4434 -1442 942 -9949 -10733 3048 1014 -9168 -4627 -613 -4399 -2680 -4735
803d735p752J0102J3793j0901j4176M473Q871P670K894j6303j3880J7248J8360
$$ -4735 -12487 -2385 11408 507 -13669 -9196 -325 7345 10239 -6064 -19944 -2696 15664
816A5664q612j2975j485M356J2542M403j9775r067K1123J2310j3075j2273j723
$$ 15664 7052 -5923 -7408 -3052 9490 13893 -5882 -14949 6174 18484 5409 -6864 -8587
829h587R077J7658k702k5265l488K4252Q209j2621j0653l805R400J5733o781j9620
$$ -8587 490 18148 15446 -9819 -13307 10945 19154 6533 -4120 -7925 1475 17208 10427 -9193
843i193O937J7232m707j2054k104L751J1599N024j8919j1696J9881J4446j3718
$$ -9193 -2256 14976 10269 -1785 -3889 -138 11461 16485 -2434 -14130 5751 20197 6479
856F479j3559J96Q769J4230k146k2679k057K2584L745j8683q098N823J4642J1038
$$ 6479 -7080 -6884 1885 16115 13969 -8710 -10767 11817 15562 -3121 -11219 -5396 9246 20284
870B0284j6058k4938R669K7280j055j8934r180M204J6263J0275j9519k0755J4770
$$ 20284 4226 -20712 -11043 16237 15182 -3752 -12932 -8728 7535 17810 -1709 -22464 -7694
883g694K0962n613j3871n000M349J5234L749k2764j1675J9462J4107p323r892
$$ -7694 13268 7655 -6216 -11216 -6867 8367 12116 -10648 -22323 -2861 11246 3923 -5969
896e969o558L607J6160R65k0429l986J6530M765o203l766m683L414J0487n456
$$ -5969 -12527 -8920 7240 8205 -12224 -16210 320 5085 -1118 -4884 -9567 -6153 4334 -1122
910a122j3613Q685J4251m999r351l511o15R416Q707j2049r661J3191Q499r212
$$ -1122 -14735 -6050 8201 3202 -6149 -9660 -10275 -859 7848 -4201 -13862 -671 7828 -1384
924a384n239K3K004R386J95j5102L42J7982R05j2749m429J318O934J2140n582
$$ -1384 -6623 -6600 -4596 4790 4985 -10117 -9775 8207 9112 -3637 -8066 -6748 186 12326 6744
939F744j6560M277J3603l343o880J57r02N595R046p494j0454P779N167o194K59
$$ 6744 -9816 -5539 8064 4721 -2159 -2002 -2904 2691 11737 4243 -6211 1568 6735 541 800
954H00K507l827M773O663q708n881N735p29n89Q805o35j0934J296N468k018J160
$$ 800 3307 -520 4253 10916 2208 -3673 2062 1333 744 9549 8914 -2020 -724 4744 2726 3886
970C886M32q518K359J2818k352j0184J627J359j402M935k096q261O684J0097p937
$$ 3886 4318 -4200 -1841 10977 8625 -1559 68 1427 25 4960 2864 -5397 1287 11384 3447
985C447q499K872R66L356N843o879q679Q479N403q338k174L093j899L791M754
$$ 3447 -5052 -2180 -1214 2142 7985 1106 -7573 906 6309 -2029 -4203 -1110 -3009 782 5536
1000E536p949k944Q744k054r820L371N213P0L212l303j0611N350J2114o099r812
$$ 5536 -2413 -5357 3387 1333 -8487 -5116 97 167 3379 76 -10535 -5185 6929 830 -8982
1015h982L946M127K550K854r288q114J2180J0380j2365q360O725O809N105l258
$$ -8982 -5036 -909 1641 4495 -4793 -12907 -727 9653 -2712 -11072 -4347 2462 7567 4309
1029D309j7190l300K1185Q025j4599q630M320P186P327o214j7325M313K1134m39
$$ 4309 -12881 -16181 5004 13029 -1570 -10200 -5880 1306 8633 2419 -14906 -10593 10541 10102
1043A0102j6246l687N982P683M944j2047j3563J3245J8446q308j4964j121O122
$$ 10102 -6144 -9831 -3849 3834 8778 -3269 -16832 -3587 14859 6551 -8413 -9534 -3412
1056c412R083L293j4781q237J6353J0579j1828r157K557N489P848j515j4658m02
$$ -3412 5671 8964 -5817 -14054 2299 12878 1050 -8107 -5550 -61 7787 6272 -8386 -8788
1070h788J7612J762j3914m153L839O260Q118m847j4695M405J4313m194j0091J185
$$ -8788 8824 10586 -3328 -7481 -3642 2618 10736 5889 -8806 -4401 9912 5718 -4373 -3188
1084c188L453N413M189j0195j0036J2044J0451r414q048K513L911P128O70j4907
$$ -3188 265 5678 9867 -328 -10364 1680 12131 2717 -5331 -2818 1093 8221 8891 -6016
1098f016m989J6128O257j1353m992K386M375P510m694j6314K768J8092R37j1804
$$ -6016 -11005 5123 11380 27 -4965 -2579 1796 9306 4612 -11702 -8934 9158 10095 -1709
1112a709l984J485O534Q339q659j5315P521J5539k685p804l185j997O742P716
$$ -1709 -5693 -4208 2326 10665 2006 -13309 -5788 9751 7066 -738 -3923 -5920 822 8538
1126H538r106q793R744P436o340l246j200k407P151N303q981l918Q347m38m393
$$ 8538 -568 -9361 383 7819 1479 -1767 -2967 -5374 1777 7080 -1901 -5819 2528 2090 -2303
1141b303K899j136l867N263J597n752L251M724p708l358O404n41r15M300l500
$$ -2303 596 -540 -4407 856 2453 -3299 -48 4676 -3032 -6390 14 -527 -1442 2858 -642
1156f42n066O665K018q320L35N375j984J440L299o660k715P694p46n881L436J862
$$ -642 -5708 957 2975 -5345 -5010 365 -1619 -179 3120 -3540 -6255 1439 693 -5188 -1752 110
1172A10k844N034J232r379j443P366p06J85M282n715m866P550K839p070q6J454
$$ 110 -2734 2300 3532 -5847 -7290 76 -630 -445 3837 -1878 -6744 806 3645 -3425 -3511 -2057
1188b057j819O770M420j0416m877Q158K335l667N17l228k99J1455J892j4688m645
$$ -2057 -3876 2894 7314 -3102 -7979 179 2514 -1153 -636 -3864 -4163 7292 9184 -5504 -10149
1203a0149Q781M676K096j469j0379q1J4183Q61j2726k280M753M299O038k578j2286
$$ -10149 -1368 3308 5404 3935 -6444 -6525 7658 8519 -4207 -6487 -1734 2565 8603 6025 -6261
1218f261K048J2035l006q383J396L573L300N178o878j0403P007R470o595m321
$$ -6261 -4213 7822 4816 -3567 -2171 1402 4702 9880 3002 -7401 -394 9076 2481 -1840
1232a840L749J158K077K584q311m181J0154J408j0005J346Q016R10j496n427r214
$$ -1840 1909 3067 5144 7728 -583 -4764 5390 6798 -3207 -1861 6155 7065 5569 142 -9072
1247i072O614J4665m856j3577K299P614K374j148r788p671J2806J3124j0021j2552
$$ -9072 -2458 12207 7351 -6226 -3927 3687 6061 4913 -4875 -12546 260 13384 3363 -9189
1261i189L632P544L437k224j3604m193J8075J0245j3020j0726J825N434P875n83
$$ -9189 -5557 1987 5424 3200 -10404 -14597 3478 13723 703 -10023 -8198 -2764 5111 4528
1275D528j4959k359J6813N244j0927n808m4L358Q623k012j1843L291J3182l269
$$ 4528 -10431 -12790 4023 9267 -1660 -7468 -7512 -4154 4469 2457 -9386 -6095 7087 3818
1289C818r742j161J380M825P136n968r452P660Q244p586n833K763K279M309J961
$$ 3818 -5924 -7085 -5705 -880 6256 288 -9164 -1504 6740 -846 -6679 -3916 -1637 2672 4633
1304D633r246k554J1817J781j1765k797N880M267N312l537j2420J878J3659j763
$$ 4633 -4613 -7167 4650 6431 -5334 -8131 -2251 2016 7328 3791 -8629 -6751 6908 5145
1318E145j0474m9M075M743N362o954j1569O360J1261m681o409J600J572M673M387
$$ 5145 -5329 -5378 -1303 3440 8802 1848 -9721 -3361 7900 3219 -3190 -1590 -18 4655 9042
1333I042r933q831R777Q267m236l093m42k226O172M020r824m520Q899L264l129
$$ 9042 -891 -9722 55 8322 4086 993 551 -1675 4497 8517 -1307 -5827 3072 6336 3207
1348C207Q93k422k691O372N71r273M51Q918m66k296O22n245r67P925r38p442L143
$$ 3207 4100 1678 -1013 5359 5930 -3343 -2892 6026 5560 3264 3886 -1359 -2326 5599 4661 -2781 362
1365C62M191k428R62q0p310Q83P866k555m048M712k21m183K629r69n555M438N058
$$ 362 4553 2125 3087 3007 -4303 -3420 4446 1891 -2157 2555 2334 -1849 780 -189 -5744 -1306 3752
1382C752n146j281L948l177j662M209l253l877O098K235m983J694J496n214N76
$$ 3752 -1394 -2675 1273 -1904 -3566 643 -2610 -6487 -389 1846 -3137 -1443 53 -5161 -4585
1397d585M156l602l99P068j555n227J788o73k367N252J023p570K656Q143k430
$$ -4585 -429 -4031 -4430 2638 1083 -4144 -2356 -3029 -5396 -144 879 -6691 -4035 4108 1678
1412A678n145l09k498K937R071l604r971M180Q010k812m103k034k159Q312Q150
$$ 1678 -3467 -3776 -6274 -3337 5734 2130 -7841 -3661 4349 1537 -2566 -4600 -6759 1553 9703
1427I703r589q880P542O188l396l183m251j51J1907M658j2366n685P623L343j501
$$ 9703 114 -8766 -1224 4964 1568 -1615 -5866 -6017 5890 10548 -1818 -7503 120 3463 1962
1442A962j346m857J528J0770n1j2161m50O288N28J076j57n277K077Q532m188q660
$$ 1962 616 -4241 -2713 8057 8006 -4155 -4605 1683 2211 3287 3130 -2147 -70 8462 4274 -4386
1458d386K889L796l73K216j066m923M816N339q122m786N876K352q42J525m019
$$ -4386 -1497 2299 1926 4142 3076 -1847 2969 8308 186 -4600 1276 3628 2786 4311 292
1473B92k272Q187O62j1042p41Q214K100k83k479p340J543J0502k666j0562K023
$$ 292 -1980 6207 6869 -4173 -4914 3300 5400 5117 2638 -4702 -3159 7343 4677 -5885 -3862
1488c862O984J757J74n096p765N733R786o004q655L782N568J418j03p708o075
$$ -3862 3122 4879 5053 -43 -7808 -2075 7711 1707 -6948 -3166 2402 3820 3717 -3991 -10066
1503a0066R680P769q042n420L245K592K684O29r315m135J1121M534o851j939K049
$$ -10066 -386 7383 -659 -6079 -2834 -242 2442 3071 -6244 -10379 742 5276 -1575 -3514 -1465
1518a465r30K736K24p472R19Q775j033m931J775j35k241M037Q9n773L354M518
$$ -1465 -2395 341 565 -6907 -5988 2787 1754 -3177 -1402 -1537 -3778 259 348 -5425 -2071 2447
1534B447m595m90M308k928l317L883K95j699M671J8o873K317L696l522k57L461
$$ 2447 -2148 -2638 1670 -1258 -4575 -692 -397 -2096 2575 2593 -4280 -1963 1733 -1789 -2046 1415
1550A415l214l54O308j505m668J412r8k715N508K488o314m28N836j736k663R66
$$ 1415 -1799 -2153 4155 2650 -2018 -606 -704 -3419 2089 4577 -1737 -2165 3671 1935 -728 238
1566B38k852J836Q396k460j0044J609O917J26j241k818m888N475J0343m577r591
$$ 238 -2614 -778 7618 5158 -4886 -3277 3640 3766 2525 -293 -5181 294 10637 6060 -3531
1581c531J113L123J320K885k800o367N155P060m823n220J320m35K407N995m680
$$ -3531 -2418 705 2025 4910 2110 -4257 898 7958 3135 -2085 -765 -1200 1207 7202 2522
1596B522o771M909M347l455j644j194k724N613O993o221n975L168Q44j459K614
$$ 2522 -4249 660 5007 1552 -92 -1286 -4010 1603 8596 2375 -3600 -432 412 -1047 1567
1611A567j437l446N114K759o536K0M315k769l213K790L34Q98M834m791q550M788
$$ 1567 130 -3316 1798 4557 -1979 -1959 2356 -413 -3626 -836 -502 396 5230 439 -8111 -3323
1627c323O730l527k523J115K15M292K253r815o285R404O336m400l634n93J884
$$ -3323 3407 -120 -2643 -1528 -1313 2979 5232 -4583 -10868 -1464 4872 472 -3162 -3755 -1871
1642a871P724j018j3585k354J1874N036l758m164m024K860Q568l055j1474K311
$$ -1871 5853 4835 -8750 -11104 770 5806 2048 -2116 -6140 -3280 5288 2233 -9241 -6930
1656f930J0249J130l416l120l708L866O553n669p180O556O690j660j908l415m412
$$ -6930 3319 4449 1033 -2087 -5795 -1929 4624 -1045 -8225 -1669 5021 3361 1453 -1962 -6374
1671f374M581N952m896k394N636N77k865O83k684k679O099K751n560L51M866j661
$$ -6374 -1793 4159 -737 -3131 2505 3082 217 900 -1784 -4463 1636 4387 -1173 -822 4044 2383
1687B383k223n62m297J490R316K03q056Q27L420r55K8k203m898N441R053m240
$$ 2383 160 -402 -4699 -3209 6107 6310 -1746 -919 2501 1546 1574 -629 -5527 -86 8967 4727
1703D727q005K138K951n01J30l899j572Q982N365r670o446L994L032O68J81m303
$$ 4727 -3278 -1140 1811 1310 1440 -2459 -4031 4951 10316 646 -5800 -1806 1226 1894 2075 -2228
1719b228O54Q584n50j0152r81M557R95J044J26m242K649O400m918p585K515L823
$$ -2228 -1574 7010 6460 -3692 -4673 -116 879 1923 2049 -2193 456 6856 1938 -5647 -3132 691
1735F91M21K709j263n427J982M322m212l040L321K18Q49M533l052o127K199J789
$$ 691 1112 3821 2558 -2869 -887 3435 -777 -3817 -496 -278 571 5104 2052 -4075 -1876 -87
1751h7k740J813K577k706J845L456n389m606L691J235p51L037n95l967L382K568
$$ -87 -2827 -1014 1563 -1143 702 4158 -1231 -5837 -2146 -911 -1662 1375 780 -3187 195 2763
1767B763o727j948M436Q54Q70K805m051l548M857l9n762J641M756k23Q24J10n503
$$ 2763 -3964 -5912 -1476 -622 248 3053 -998 -4546 311 272 -5490 -3849 907 684 1508 1618 -3885
1784c885L36N346l109m487N172L887j644j51k535m137M026M290m886j456N979
$$ -3885 -3549 1797 -1312 -5799 -627 3260 1616 1465 -1070 -5207 -1181 3109 -1777 -3233 2746
1799B746J142k640j164l823j101P189K574o234k72M443p67o82m33n661J00Q490
$$ 2746 3888 1248 84 -3739 -4840 2349 4923 -1311 -1583 2860 2093 1411 978 -4683 -4583 3907
1815C907J815n098p58k91r55L948k43o996J567Q931J18n095k248k216K137O352
$$ 3907 5722 624 -134 -425 -1380 2568 2325 -4671 -3104 5827 5945 850 -1398 -3614 -1477 4875
1831D875k492p776M676Q181k588m924l462j387N852O088n722n838N943M684m375
$$ 4875 2383 -5393 -717 7464 4876 -48 -3510 -4897 955 7043 1321 -4517 1426 6110 1735
1846A735l591j342P96O333J667p468m84P219r03o531m69J164K942N296l226p714
$$ 1735 -1856 -3198 -2402 3931 5598 -1870 -2354 4865 3962 -2569 -3038 -1874 1068 6364 3138 -4576
1862d576L435O141m416m552J317K055M019K834o970n914O409M460n131k772J260
$$ -4576 -1141 5000 584 -3968 -2651 -596 3423 6257 -713 -6627 -218 4242 -889 -3661 -2401
1877b401K193N361N60j0061m327Q164M202l210j768j735Q55O569l56r500j707
$$ -2401 -208 5153 5713 -4348 -8675 -511 3691 481 -1287 -3022 -2167 4402 4046 -5454 -7161
1892g161O657K287r88n37l067Q12N729k740p684J871O028N57K38j633n202K113
$$ -7161 -504 1783 795 258 -2809 -1997 3732 992 -6692 -4821 1207 1764 2002 369 -4833 -2720
1908b720N659l364m958L825K817n49J172k230l883K746K902m229o47N436O94k494
$$ -2720 2939 -425 -5383 -1558 1259 710 1882 -348 -4231 -1485 1417 -2812 -3459 1977 2671 177
1924A77m26l155l83O156j34o218J925N476j026k086j316k971K747N602l376m818
$$ 177 -249 -3404 -3787 2369 2235 -3983 -2058 3418 2392 306 -1010 -3981 -1234 4368 992 -3826
1940c826M580L760k559k281k193j707N927N171n512l906L697Q32r18J120k606
$$ -3826 754 4514 1955 -326 -2519 -4226 1701 6872 1360 -2546 1151 1983 1065 2185 -421
1955d21k582N159L385l858q62P61k697P34L702k733j552M152O35l135P07j266
$$ -421 -3003 2156 5541 1683 821 1582 -1115 -381 3321 588 -964 3188 3823 688 1395 129
1971A29k741L945L022m184j534L789k99q02L95l326j921N500J989l989J70J801
$$ 129 -2612 1333 4355 171 -1363 2426 2127 1325 1720 -1606 -3527 1973 3962 -27 143 1944
1987A944k820o1J918k641N70M810j895l963K074R65k541J323k0k842L052M106
$$ 1944 -876 -937 981 -1660 -1090 3720 1825 -2138 -64 901 -1640 -317 -337 -3179 -127 3979
2003C979l675k784K515r60j180K345j184j761M870J252o387j176L306M43N06M07
$$ 3979 304 -2480 35 -925 -2105 240 -944 -2705 2165 3417 -2970 -4146 -840 -397 109 516
2019E16l915R6O823l65p088j161K760J099L442p28n635J047N603k097m895J251
$$ 516 -3399 -3303 3520 3155 -3933 -5094 -2334 -1235 2207 1479 -4156 -3109 2494 397 -4498 -3247
2035c247J611J368L296k810n270L062M575l142k748R70R15K902K964n438m621
$$ -3247 -1636 -268 3028 218 -5052 -1990 2585 -557 -3305 -2335 -1420 1482 4446 -992 -5613
2050e613M301L556l172n51P22L42L354Q16o728k064O690J854l705n02J30J822
$$ -5613 -1312 2244 -928 -1479 -757 -415 2939 3755 -2973 -5037 1653 3507 -198 -700 -570 1252
2066A252M220l043q218K618P943k08l894r08l03K902K973n884m984O038O304l303
$$ 1252 5472 2429 -5789 -3171 4772 4564 670 -238 -541 2361 5334 -550 -5534 504 6808 3505
2082C505l344o42lL974P32p047j826Q122L107m401k369j076J74M549q6n875O35
$$ 3505 161 -481 -484 3490 4222 -2825 -4651 3471 6578 2177 -192 -1268 -1094 3455 3369 -2506 -1871
2099a871O631m44l793j249j854J357M948j168n041K433M269k738k366p34j751
$$ -1871 4760 4316 523 -726 -2580 -1223 3725 2557 -2484 -51 4218 1480 -886 -1620 -3371
2114c371L041M590l091l715L327J514k996q32q61q53M720K967n358k952L923N21
$$ -3371 -330 4260 1169 -2546 781 2295 -701 -1533 -2394 -3247 1473 4440 -918 -3870 53 574
2130E74k368J10j481L98N730P28o506j253K731l49M72O87k536J240N462k269o001
$$ 574 -1794 -1684 -3165 -2767 2963 3691 -2815 -4068 -1337 -1686 -1214 -527 -3063 -1823 3639 1370 -4631
2147d631Q23K444p7J725m98l184K808M062m703m456K891K224P94J813k875k293
$$ -4631 -3808 -1364 -1441 284 -214 -3398 -590 3472 -1231 -5687 -2796 -572 222 2035 -840 -3133
2163c133L954J428n543j349L925J019J123J622l833j692L597o90l705K341K752
$$ -3133 821 2249 -3294 -4643 -718 301 1424 3046 -787 -2479 1118 428 -3277 -936 1816
2178A816q95Q89N47l899l9L182j918r42L258K20j640K318p63m706J004L426o79
$$ 1816 921 1810 2357 -1542 -1581 1601 -317 -1259 1999 2219 579 2897 2134 -2572 -1568 1858 1179
2195A179L09J524k450m3L431k948m469K987L166m74P29j220k910K295L069m748
$$ 1179 1488 3012 562 519 3950 1002 -3467 -480 2686 2212 2941 1721 -1189 1106 4175 -573
2211e73k686M467K508m21p03l203k066M518J782n042M5M201P6r65p81l308p6M621
$$ -573 -3259 1208 3716 3295 2592 -611 -2677 1841 3623 -1419 -1374 2827 2903 1938 1157 -2151 -2227 2394
2229B394o81m123K146L655j407j524j402l062K828M767k912k910K485P99j616
$$ 2394 1713 -2410 -264 3391 1984 460 -942 -4004 -1176 3591 679 -2231 254 1053 -563
2244e63N02j685k351M078L204l725j775K329l00j197P58k398o74N559J935n094
$$ -563 -61 -1746 -4097 -19 3185 -540 -2315 14 -286 -1483 -725 -3123 -3797 1762 3697 -1397
2260a397j319P89j99K015R17m390M08N818l55m566n55L00O33L914j136m969K022
$$ -1397 -2716 -1927 -2126 -111 806 -3584 -3176 2642 2287 -2279 -2834 -2534 -1901 2013 877 -4092 -2070
2277b070N436k105m299m92L57L238M206l878m892L775L737l428k101N03K75L263
$$ -2070 3366 1261 -3038 -3530 -3173 65 4271 393 -4499 -724 3013 -415 -2516 -2013 -1738 1525
2293A525J911m647j770M650K77m408m4K294J458K467j922n585J454N392j519l605
$$ 1525 3436 -1211 -2981 1669 1946 -2462 -2506 -212 1246 3713 1791 -3794 -2340 3052 1533 -2072
2309b072J749J520J103J426l258m075L516L620k881j480J789M72J273J404m540
$$ -2072 -323 1197 2300 3726 468 -3607 -91 3529 648 -832 957 1429 2702 4106 -434
2324d34l490M691L029j785r2p35k139K571K122m026k461L765J678m54M48k916
$$ -434 -3924 767 3796 2011 1919 1184 -955 1616 3738 -288 -2749 1016 2694 2240 2688 -228
2340b28j916L654J199m396r3L602M87l2o85m113k39M861k73l433J259J820j234
$$ -228 -2144 1510 2709 -1687 -1780 1822 2309 2277 1592 -2521 -2760 2101 1828 -1605 -346 1474 240
2357B40N96q34k839J448L379k645j187L545J98k720l31j177o68L923J912m300
$$ 240 836 2 -2837 -1389 1990 -655 -1842 1703 1901 -819 -1150 -2327 -2995 928 2840 -1460
2373a460m83L237q86j487M04j936Q2M801k50m456R34J858j359L12O63l144J641
$$ -1460 -1943 1294 408 -1079 -675 -2611 -2529 2272 2022 -2434 -1500 358 -1001 -689 -26 -3170 -1529
2390a529M415j285l777J81K05k56L353l89m134J378L780j504j645j73j980R75
$$ -1529 2886 1601 -2176 -1995 -1790 -2046 1307 918 -3216 -1838 1942 438 -1207 -1380 -3360 -2385
2406b385M308r67l709J980K008j998k07m61j874L087L809l434l373K649R97j044
$$ -2385 1923 956 -2753 -773 1235 -763 -970 -1431 -3305 -218 3591 157 -3216 -567 430 -614
2422f14O05r67j107M121J446m423j072L151n73j034P57p04P44L943k073m867J714
$$ -614 -9 -976 -2083 2038 3484 -939 -2011 1140 567 -467 290 -414 330 4273 2200 -2667 -953
2439i53L255j224o59M16j388K137K819m031l351L601K133j321l22n62j283L121
$$ -953 2302 1078 419 835 -553 1584 4403 372 -2979 622 2755 1434 1112 550 -733 2388
2455B388J481n048j937M081J145n00O10l040j241M298R58m730k80K748Q3J074
$$ 2388 3869 -1179 -3116 965 2110 1610 2220 -820 -2061 2237 3195 -1535 -1815 933 1016 2090
2471B090j73l859k82M680m94l708Q96J396L17J746j870m453K241M518k073k613
$$ 2090 1917 -1942 -2224 2456 1962 -1746 -850 546 863 2609 739 -3714 -1473 3045 972 -1641
2487a641J508L08O55J327k787l257L952L061l316j616J712j95J001N80l794j011
$$ -1641 -133 175 830 2157 -630 -3887 65 3126 -190 -1806 -94 -289 712 1292 -2502 -3513
2503c513N137O94l579m85J059l48J801o83l910J591M715j500l218Q49L37R8J918
$$ -3513 1624 2318 -1261 -1746 -687 -1035 766 83 -3827 -2236 2479 979 -2239 -1390 -1053 -955 963
2520I63k139l098L138L809k883k207J065o11J345K265k765k426L854J537k873
$$ 963 -1176 -4274 -1136 2673 -210 -2417 -1352 -1963 -618 1647 -1118 -3544 310 1847 -1026
2535a026l73J20n45K274J609l580r41L807O3k200J50o93m65L749J004m577L92
$$ -1026 -1399 -1279 -1824 450 2059 -1521 -2462 1345 1408 -792 -642 -1335 -1800 1949 2953 -1624 -1232
2552a232K626o41o98L39j815M14M216j427l647J481K138j390M2j21j857K421L422
$$ -1232 1394 753 55 394 -1421 -1007 3209 1782 -1865 -384 1754 364 406 285 -1572 849 4271
2569D271l418l035K301J042n40J105j610j550L449J683l940j610L089k33r5J102
$$ 4271 853 -2182 119 1161 621 1726 116 -1434 2015 3698 -242 -1852 1237 1004 909 2011
2585B011k305m71L803l3m694N49K278n00J392K24l152J47L322j244k774J509R38
$$ 2011 -294 -765 3038 3005 -1689 -1140 1138 638 2030 2254 -898 -751 2571 1327 -1447 62 1000
2602A000q37K009p03l398J674K486k393j705K103K13J90J646k645k847L021K155
$$ 1000 163 2172 1469 -1929 -255 2231 -162 -1867 236 449 639 2285 -360 -3207 -186 1969
2618A969k645n38J038n70J467O73l679r90L999N74k835K17J79K26K478r97m842
$$ 1969 -676 -1214 -176 -746 721 1394 -2285 -3275 724 1298 -1537 -1320 -1141 -915 1563 566 -4276
2635d276O47N008Jk276m8j012M83L037j453m455K561L654j611j210k61j587J763
$$ -4276 -3629 1379 1380 -896 -944 -1956 -1473 1564 111 -4344 -1783 1871 260 -950 -1211 -2798 -1035
2652a035K862k998k761L501K239j691j03j747j438L082K301l311j031K936k31
$$ -1035 1827 -1171 -3932 -431 1808 117 14 -1733 -3171 -89 2212 -1099 -2130 806 575
2667E75j124M95j221q61L372L59l203R87K548j512j104P91j874J077L839j549
$$ 575 -549 -54 -1275 -2136 1236 1595 -1608 -621 1927 415 -689 102 -1772 -695 3144 1595
2683A595l272K229J332j807J96K1j483K610K714l613k559L074J006j422N25j627
$$ 1595 -1677 552 1884 77 273 294 -1189 1421 4135 522 -2037 1037 2043 621 1146 -481
2699d81q96M347J757n061j670K630L88P16K94k868n64M820K38m739l16K025K24
$$ -481 -1377 2970 4727 -334 -2004 626 1014 1730 2024 -844 -1408 3412 3650 -1089 -1405 620 844
2716H44J632j38m096Q48M165j487l029P77P53L28K145j199l652J570K718k427
$$ 844 2476 2338 -1758 -910 3255 1768 -1261 -484 269 597 2742 1543 -2109 -539 2179 -248
2732b48p98J774q27N5J966k312j838K674O83k468M77J449j191P80J053k983l86
$$ -248 -1046 728 -99 -44 1922 -390 -2228 446 1129 -1339 -862 587 -604 176 1229 -1754 -2140
2749b140L403j051k269J805M95j222J198m56k932J716L065k292j300J315l56n6
$$ -2140 1263 212 -2057 -252 243 -979 219 -237 -3169 -1453 1612 -680 -1980 -665 -1021 -1077
2765a077K323k345k995L269K649k111r66K57j395J669K330l015k181L498J243
$$ -1077 1246 -1099 -4094 -825 1824 -287 -1253 -996 -2391 -722 1608 -1407 -3588 -90 1153
2780A153j540j7j129j458L492J769l829r04K834j75m6M87k209j074L910N81k870
$$ 1153 -387 -404 -1533 -2991 501 2270 -1559 -2463 371 196 150 637 -1572 -2646 1264 1845 -1025
2797a025N36J104j400J244O81k332J76L475r44k479J248M43p87J191J74k514J691
$$ -1025 -489 615 -785 459 1140 -1192 -1016 2459 1515 -964 284 727 -60 1131 1305 -1209 482
2814D82K510k119j638J718k82o76J960j029j940K784J032l254o0J972p83N29J172
$$ 482 2992 873 -765 953 671 -5 1955 926 -1014 1770 2802 -452 -512 1460 677 1206 2378
2831B378l023m36L833m61k979N88N73l07K108l52l390P78L592j585k402J052L77
$$ 2378 -645 -1081 2752 2291 -688 -100 473 166 2274 1922 -1468 -690 2902 1317 -1085 -33 344
2848C44J89J847j730l094K197K709j702j314M12q58J311K466k873k828K998J492
$$ 344 533 2380 650 -2444 -247 2462 760 -554 -142 -1000 311 2777 -96 -2924 74 1566
2864A566k088J28M0j245J832J542l505r09L233O4j551M21q54o59K956L63m160
$$ 1566 -522 -394 -354 -1599 233 1775 -1730 -2639 594 658 -893 -472 -1326 -1985 971 1334 -2826
2881b826M49K722n75m97L36j805K78L279j161l244J842J714j153k72k15j664K194
$$ -2826 -2377 345 -230 -727 -391 -2196 -1918 1361 200 -3044 -1202 512 -641 -913 -1128 -2792 -598
2898e98K583k922k052K792O02j037O62r62j303K714J368l324k81K514q31l35R86
$$ -598 1985 -937 -2989 -197 405 -632 30 -932 -2235 479 1847 -1477 -1758 756 -75 -410 576
2915E76j437k90L106p29l257J225J745j006J000l4k584R04L720k003k407J649
$$ 576 -861 -1151 1955 1226 -2031 -806 939 -67 933 899 -1685 -781 2939 936 -1471 178
2931A78P16o15J250q76k406K270K484k845j494J961J10N58J175k626k015L574
$$ 178 894 279 1529 653 -1753 517 3001 156 -1338 623 733 1291 2466 -160 -2175 1399
2947A399J572k903o16J299o58J539Q31k947r27L664j76k366N96K84p36K449l98
$$ 1399 2971 68 -548 751 93 1632 2463 -484 -1411 2253 2077 -289 307 591 -145 2304 1906
2964A906l532Q38L281j298j125Q11r99j85K486q60k964J778J888k084n8J379k025
$$ 1906 -1626 -788 2493 1195 70 881 -118 -303 2183 1323 -1641 137 2025 -59 -117 1262 -763
2981g63M89K048k525j333K933P52k625P80r2j308J974Q67l053j59L005q91j470
$$ -763 -274 1774 -751 -2084 849 1601 -1024 -244 -336 -1644 330 1197 -1856 -2015 990 99 -1371
2998a371O41o92k84K887n72l406J325K605j106p65p2j744J221L348j981l086J592
$$ -1371 -730 -1422 -1706 1181 609 -2797 -1472 1133 27 -738 -810 -2554 -1333 2015 34 -3052 -1460
3015a460J940r59L84r65j769K369K873l006k124K204P44m32O42j540j564L471
$$ -1460 480 -479 -95 -1060 -2829 -460 2413 -593 -2717 -513 231 -201 441 -1099 -2663 808
3031H08J503l501o73J577j13O20Q07k525k14K939j12k418Q33P26j078J325O08
$$ 808 2311 -1190 -1863 -286 -399 221 1028 -1497 -1711 1228 1116 -1302 -469 257 -821 504 1112
3048A112k383O28K304j340j724J707J92o21J499n53k376K077J534k402n38J764
$$ 1112 -1271 -643 1661 321 -1403 304 496 -125 1374 821 -1555 522 2056 -346 -884 880
3064H80m44K01J568k351j442L281Q11l056l9J018O0J472L10l425j55L678j58k486
$$ 880 436 637 2205 -146 -1588 1693 2504 -552 -591 427 487 1959 2269 -1156 -1311 2367 2209 -277
3082b77P08j64L80J831j009l645J534L226j245j770N77m91O58K395k116k936K130
$$ -277 431 267 647 2478 1469 -2176 -642 2584 1339 -431 146 -345 313 2708 592 -2344 -214
3099b14K129j524P0j76j571J242K022k647j284K727L58j641R03n52j508K089R10
$$ -214 1915 391 461 285 -1286 -44 1978 -669 -1953 774 1132 -509 394 -158 -1666 423 1333
3116A333k943r6K564p30n55Q54j473r03K527k69k483J455J485j605K49M43j567
$$ 1333 -1610 -1706 858 128 -427 427 -1046 -1949 578 309 -2174 -719 766 -839 -590 -147 -1714
3133a714Q00K280j912k136K242Q32p74M4n38j580K378J863k689j246J758J83m54
$$ -1714 -914 1366 -546 -2682 -440 392 -382 -338 -876 -2456 -78 1785 -904 -2150 -392 -209 -663
3150f63O61j310j000L404N83l375J33J453k14O85K90k638L01L588m18k787M01
$$ -663 -2 -1312 -2312 1092 1675 -1700 -1567 -114 -328 357 647 -1991 -1690 1898 1480 -1307 -906
3167i06Q27n57J879l75k501J188K326j543j754J702k50j32J550r60j888J922J671
$$ -906 -79 -636 1243 868 -1633 -445 1881 338 -1416 286 36 -96 1454 494 -1394 528 2199
3184B199k477J04P66q73N68J950j827j373K354L0j566P80K47j238J502J035k676
$$ 2199 -278 -174 592 -281 287 2237 410 -963 1391 1421 -145 635 882 -356 1146 2181 -495
3201d95j03K486q23j455J096o92J3K423m99l582J026K346j015m98M64j068L96
$$ -495 -598 1888 1065 -390 706 14 27 2450 1951 -1631 -605 1741 726 228 692 -376 20
3218B0K370j668k562K124J321j455L73n23r13J506J618l084j261K698J06o92Q64
$$ 20 2390 722 -1840 284 1605 150 523 0 -913 593 2211 -873 -2134 564 670 -22 842
3235H42j106j290K178O05k818J60J978p49l65R51j038p79K316o92k202J364J165
$$ 842 -264 -1554 624 1229 -1589 -1429 549 -200 -565 386 -652 -1431 885 193 -2009 -645 520
3252E20j060N43O0k097O19K314j382j663K109j29p45J071p25j694J864J514k029
$$ 520 -540 3 63 -2034 -1415 899 -483 -2146 -37 -166 -911 160 -565 -2259 -395 1119 -910
3269i10q87J857k33k29R37k109r01K978Q40k295M4R03j052J154P60k379l12K934
$$ -910 -1797 60 -173 -402 535 -1574 -2475 503 1343 -952 -908 -5 -1057 97 857 -1522 -1834 1100
3287A100m10j676P09Q5n48J645Pk751P92K767j010j230M69p22K40K361j320j993
$$ 1100 690 -986 -277 -192 -740 905 912 -1839 -1047 1720 710 -520 -51 -773 -533 1828 508 -1485
3305a485K072J318j725k26O98r99R21J289j998o34K651k25k165O37L22q15J804
$$ -1485 587 1905 180 -46 652 -347 574 1863 -135 -769 1882 1657 -508 129 451 -364 1440
3322A440P54k734M46K084j293j076J250o94k70K262n31k578Q07J642j124j97Q04
$$ 1440 2194 -540 -94 1990 697 -379 871 177 -93 2169 1638 -940 -133 1509 385 188 992
3339I92j731J045K343j420k667J252J091o58R19n00j910J602J837k588j086J372
$$ 992 -739 306 2649 1229 -1438 -186 905 247 1166 666 -1244 358 2195 -393 -1479 -107
3355a07O2K54J118j813r34K458O29l019j7J589l82M76N70k003m58K431q17j985
$$ -107 -45 209 1327 -486 -1420 1038 1667 -1352 -1369 220 -162 314 884 -1119 -1577 854 37 -1948
3373a948R02J377p98P11J09k395R75K099j610j497J641M53o02J048j361j859K349
$$ -1948 -1046 331 -467 244 353 -2042 -1067 1032 -578 -2075 -434 19 -583 465 -896 -2755 -406
3390d06J392k280l51J748o85L53O95k382n93L052O11k518O74O70o55Q93L67k398
$$ -406 986 -1294 -1645 103 -582 -229 466 -1916 -2509 543 1154 -1364 -690 -20 -675 218 585 -1813
3408a813P4K907o73j037Q39p43m53J570j78k210J048K062r27m20K31j126M3K463
$$ -1813 -1739 1168 495 -542 297 -446 -899 671 493 -1717 -669 1393 466 46 277 -849 -806 1657
3426A657j016k061J795J380j189p3k33j525J837J523j721r96K265j90j607M22
$$ 1657 641 -1420 375 1755 566 493 260 -1265 572 2095 374 -622 1643 1453 -154 268
3442B68k99n11K567K19k843M57K227r45j369L24m48M99K303j098k426J263J246
$$ 268 -31 -542 2025 2244 -599 -142 2085 1140 -229 95 -353 146 2449 1351 -1075 188 1434
3459A434j298l38P46q59R75J673j863j707J315O24r37R07J22j642J532J283k041
$$ 1434 136 -202 544 -315 660 2333 470 -1237 78 702 -235 672 794 -848 684 1967 -74
3476g4j007J247n76p9J647j043j136K030k4k391J81J214m57Q27O72k320j46K188
$$ -74 -1081 166 -410 -489 1158 115 -1021 1009 985 -1406 -1225 -11 -468 359 1031 -1289 -1435 753
3494G53m31j752P11K74j28J351m23k420J067J798j354j290J566M3m2J068j712
$$ 753 322 -1430 -719 -445 -573 778 355 -2065 -998 800 -554 -1844 -278 -235 -277 791 -921
3511i21j924K267J487k008j5Q37k22O79N13k191j176K710M70j234K62L66o59R46
$$ -921 -2845 -578 909 -1099 -1114 -277 -499 180 693 -1498 -2674 36 506 -728 -466 -100 -759 187
3529A87M32k885P75K610m99j113M73l19n18J647p05k038J670J681j210l00P52
$$ 187 619 -2266 -1491 1119 620 -493 -20 -339 -857 790 85 -1953 -283 1398 188 -112 640
3546F40j161l63J659o38q74J469N73j385N27Oj236J026J504j529n85J578j95j151
$$ 640 -521 -884 775 137 -737 732 1305 -80 447 453 -783 243 1747 218 -367 1211 1016 -135
3564a35J046j001r75K141Q97k165p7J764o80n25K90j243L13K903q69k786Q55J396
$$ -135 911 -90 -1065 1076 1973 -192 -269 1495 815 290 580 -663 -350 2553 1684 -1102 -247 1149
3582A149n92r4k13j441J736K115j873j947J285M00o09P48m86j086K107P27k318
$$ 1149 557 463 250 -1191 545 2660 787 -1160 125 525 -84 664 178 -908 1199 1926 -392
3599c92o00J417l93k00Q93r10p67J827N9j917M79L89q05P45J232j734r0J471q78
$$ -392 -992 425 32 -168 725 -185 -952 875 934 -983 -504 -115 -920 -175 1057 -677 -767 704 -174
3618a74j201J059qn35J063L39k124Q69J475j605m63J053l88j5J581j101j600J360
$$ -174 -1375 -316 -324 -859 204 543 -1581 -712 763 -842 -1305 -252 -640 -655 926 -175 -1775 -415
3636d15O31j507M15Q15o79O98R87k221r32K354J75j099L91k1p59K076r4k688J48
$$ -415 216 -1291 -876 -61 -740 -42 945 -1276 -2208 146 321 -778 -387 -408 -1167 909 815 -1873 -1725
3655a725K193r6o34M63r08R4J931j010k186J223K103j113Mo7j168P32J754j709
$$ -1725 468 372 -262 201 -707 -613 1318 308 -1878 -655 1448 335 339 272 -896 -164 1590 -119
3673a19j045J566O64j084Q69l10j350J058Q92j638K90J846r24j030J175o06r03
$$ -119 -1164 402 1066 -18 851 541 -809 249 1141 -497 -207 1639 715 -315 860 254 -649
3690f49J445N26j730R53Q78j492M87P20j209n68J880q0j252Q34j54j001J124J80
$$ -649 796 1322 -408 545 1423 -69 418 1138 -71 -639 1241 1161 -91 743 589 -412 712 892
3708H92j644N55K118j023j108P44l63k15J280j172j378K039J383j838j022O13
$$ 892 -752 -197 1921 898 -210 534 171 -44 1236 64 -1314 725 2108 270 -752 -139
3724a39j95N05R50j645p28K414J01j939j22M38m26J168M70k096L94K093q49j357
$$ -139 -334 171 1121 -524 -1252 1162 1263 -676 -798 -360 -786 382 852 -1244 -850 1243 394 -963
3742i63M70k83j50J663k33j889J041J111j607l76R36n73J34J718j167j580J574
$$ -963 -493 -776 -926 737 504 -1385 -344 767 -840 -1216 -280 -853 -719 999 -168 -1748 -174
3759a74K43j005L16P6p52J337J002k007j076J871j04q03J057k18p32J373N67k218
$$ -174 69 -936 -620 -544 -1296 41 1043 -964 -2040 -169 -273 -1076 -19 -237 -969 404 971 -1247
3777a247k75J509l94J43R72j406j79K084o95k196P61J413l56M26L5j739R14J889
$$ -1247 -1522 -13 -407 -264 708 -698 -877 1207 512 -1684 -923 490 134 560 595 -1144 -230 1659
3795A659j766j559J535R98n0J98r78j252J898J119k429o40K200K12k20K64j593
$$ 1659 -107 -1666 -131 867 817 1015 37 -1215 683 1802 -627 -1267 933 1145 925 1189 -404
3812d04k63K018j44k170Q52J569o22k39Q6j308O19K033j519j100J378O06j042
$$ -404 -667 1351 1207 -963 -111 1458 836 597 683 -625 -6 2027 508 -592 786 1392 350
3829C50M1m8r70Q65J480j566l32J079m36o42J070p68j382J761Q95j293Q0M8j100
$$ 350 391 343 -627 238 1718 152 -180 899 463 -179 891 123 -1259 502 1397 104 184 232 -868
3848h68O85J229j175j064J885K66j006J40n72q32J445P33j731J81J943q84j066
$$ -868 -183 1046 -129 -1193 692 958 -48 92 -480 -1312 133 866 -865 -684 1259 375 -691
3865f91J63l39j67J956l16k248J199J255j366q47R36n92M84J585j318j216J659
$$ -691 -528 -867 -1034 922 606 -1642 -443 812 -554 -1401 -465 -1057 -573 1012 -306 -1522 137
3882A37J90j603K73M88m15J109Q86k065m31J790m58j182R62l05j45J666m21j998
$$ 137 327 -1276 -1003 -515 -930 179 1065 -1000 -1431 359 -99 -1281 -319 -624 -769 897 476 -1522
3900a522N41J292p77k94J143q84o9J722j046j718J127P09o30J156K26j690L09
$$ -1522 -981 311 -466 -760 383 -501 -570 1152 106 -1612 -485 224 -406 750 976 -714 -405
3917d05J514j091r11J147m09Q1J761p66k063Q14J428j183k23P84k56M78R62j742
$$ -405 1109 18 -893 254 -155 -74 1687 921 -1142 -328 1100 -83 -306 478 222 700 1662 -80
3935h0j205K141M75j419J85N99l08Q17j14k271Q39K074p24j664J300K98k43M73
$$ -80 -1285 856 1331 -88 97 696 388 1205 1091 -1180 -341 1733 1009 -655 645 943 700 1173
3953A173j171j128J513J825j930o32J233l53k61M10j152l58J793M77j744N76M00
$$ 1173 2 -1126 387 2212 282 -350 883 530 269 679 -473 -831 962 1439 -305 271 671
3970F71j069M47M27j502J42J873k92j047N25m44p72J118P97j791K73J315m26k55
$$ 671 -398 49 476 -1026 -884 989 697 -350 175 -269 -1041 77 874 -917 -644 671 245 -10
3988a0R5j122m94K006L33j899P60O27p76N7K23j680R41K356j702r81Q83M39r61
$$ -10 85 -1037 -1531 475 808 -1091 -331 296 -480 -423 -200 -1880 -939 1417 -285 -1266 -383 56 -905
4007i05P60o31r52J690J064j860l65J204k61p29O03p53O7K182k69k423O43J258
$$ -905 -145 -776 -1728 -38 1026 -834 -1199 5 -256 -985 -382 -1135 -1068 1114 845 -1578 -935 323
4025C23r29J35M14q11R35J651j836j354J195P24r52R02j2r27Q27J015j770p34
$$ 323 -606 -471 -57 -868 67 1718 -118 -1472 -277 447 -505 397 385 -542 285 1300 -470 -1204
4043a204J537m0l81J143n47q88R36K37j371N44Q03p51N74J128j559r05J410J86
$$ -1204 333 293 -88 1055 508 -380 556 793 -578 -34 769 18 592 1720 161 -744 666 852
4061H52j283R77L47q27P62P09j949j80J772m33n28O76n00l85J709r06k040R34
$$ 852 -431 546 893 66 828 1537 -412 -592 1180 747 219 895 395 10 1719 813 -1227 -293
4079b93J458o94l72M92l40L1J124j691j340K231Q08j309r6K23n94R19K88j868
$$ -293 1165 471 99 591 251 282 1406 -285 -1625 606 1414 105 9 232 -362 557 845 -1023
4097a023n3K153m51j105N28j55m17J007j42j699R07J578j400k26P46q84n38J533
$$ -1023 -1076 1077 626 -479 49 -106 -523 484 342 -1357 -450 1128 -272 -498 248 -636 -1174 359
4115C59o13j060J471K40j233L57N22j338K47J621j003l48O76k22o11J272p49j341
$$ 359 -254 -1314 157 397 -836 -479 43 -1295 -1048 573 -430 -778 -102 -324 -935 337 -412 -1753
4133a753J445J128j412N0O57p99P2R53j124o14K007K19j743L8Q31p70Q77K00j492
$$ -1753 -308 820 -592 -542 115 -684 -612 341 -783 -1397 610 829 -914 -876 -45 -815 62 262 -1230
4152a230M41K152q76j478O96J56k73J098l71j410J073J483j475q42R07j06J73
$$ -1230 -789 1363 487 -991 -295 -139 -412 686 315 -1095 -22 1461 -14 -856 51 -55 118
4169A18J011q96j117J824M27j682m9J036o92N39J165j935l41J630l61j177J183
$$ 118 1129 233 -884 940 1367 -315 -364 672 -20 519 1684 -251 -592 1038 677 -500 683
4186F83j79n26J215k54j462L38J501j102k40Q54n61m26J776p02j753R47R22p87
$$ 683 504 -22 1193 939 -523 -185 1316 214 -26 828 267 -159 1617 915 -838 109 1031 244
4204B44m4P09j083P8J314j092j150J305N61p86O06j66j270J423N12j708o27J921
$$ 244 200 909 -174 -96 1218 126 -1024 281 842 56 662 496 -774 649 1161 -547 -1174 747
4222G47k71o37Q45j182l03J483j00k051O84J489q91J92J5j188L28J709q86j462
$$ 747 476 -161 684 -498 -801 682 582 -1469 -785 704 -187 5 20 -1168 -840 869 -17 -1479
4240a479J386Q54j174J55k1r23P83R83j434k35J326j62p92O58m84j045J459P06
$$ -1479 -93 761 -413 -258 -279 -1202 -419 564 -870 -1105 221 59 -733 -75 -559 -1604 -145 561
4258E61j574L35J065j066j27R58r91l66J756o8j337P43K94r55O58L42j291J43
$$ 561 -1013 -678 387 -679 -806 152 -839 -1205 551 483 -854 -111 183 -772 -114 228 -1063 -920
4276i20J899q69o47N43j70p34J576n15j171J173J106j222n88R08q64K06J842j401
$$ -920 979 110 -537 6 -164 -898 678 163 -1008 165 1271 49 -539 369 -495 -289 1553 152
4294A52r95J331N57j348O6N17p32J098R02j942l84J804M3j413M83j53j94J598
$$ 152 -843 488 1045 -303 -237 280 -452 646 1548 -394 -778 1026 1069 -344 139 -14 -208 1390
4312A390l49j721P02J258r09n46P40j76k26J313q34j382J130N99j227R8Q85o04
$$ 1390 1041 -680 22 1280 371 -175 565 389 163 1476 642 -740 390 989 -238 -140 745 141
4330A41R4J057j300q78J627l68p98J169m01r06J172M75j718q7J176k88j57Q63
$$ 141 235 1292 -8 -886 741 373 -425 744 343 -563 609 1084 -634 -721 455 167 10 873
4348H73j248l04J367r7j729N73R87o80J47P03j423j67J840j052j007J270J99p36
$$ 873 -375 -679 688 591 -1138 -565 422 -258 -111 592 -831 -998 842 -210 -1217 53 252 -484
4366d84Q92m93j619Q72J575j289n22J084l76k8R24j237q60J663O05j597K85P12
$$ -484 408 -85 -1704 -832 743 -546 -1068 16 -360 -388 536 -701 -1561 102 707 -890 -605 107
4384A07n49K6O84j514O4J734k16j322R84J37q76P32P2j374N53J871j413n30J054
$$ 107 -442 -416 268 -1246 -1182 552 336 -986 -2 135 -741 -9 63 -1311 -758 1113 -300 -830 224
4403B24n96l67J353n81r83J048Q11j166k95R52r95L10J291q87p22J199M62j270
$$ 224 -372 -739 614 33 -950 98 909 -257 -552 400 -595 -285 1006 119 -603 596 1058 -212
4421b12L26J67r71J096R50j452m34J519l94n55P84p29n73J555J07j385R2R45p21
$$ -212 114 281 -690 406 1356 -96 -530 989 595 40 824 95 -478 1077 1184 -201 -109 836 115
4440A15j44Q57j043K19J650j148j285J200O22j164N26K11p66P73R88j725n32J394
$$ 115 -29 828 -215 4 1654 506 -779 421 1043 -121 405 616 -150 623 1611 -114 -646 748
4458G48o1q90P11l26q07J414M59k036J21J407o26kP54j038m34J285k98j707J205
$$ 748 687 -203 508 182 -625 789 1248 -788 -667 740 114 112 866 -172 -606 679 381 -1326 -121
4477a21O07n49K90J90j193jJ418o42j012J008j10l14R16j83j526O25J150j081
$$ -121 486 -63 227 417 -776 -777 641 -1 -1013 -5 -115 -429 487 304 -1222 -597 553 -528
4495e28j56O83n72K75J113j405j078J496M28r38J06P12q52O01N54j491j91J522
$$ -528 -684 -1 -573 -298 815 -590 -1668 -172 256 -682 -576 136 -716 -115 439 -1052 -1243 279
4513B79k5r02M84j37p14J190k60j300N87J692r59p23J010m02m18J272p59j284
$$ 279 254 -648 -164 -301 -1015 175 -85 -1385 -798 894 -65 -788 222 -180 -598 674 -85 -1369
4531a369J515R77j238k24N54p69M38J303j450p87J656R6j173Q61j69o38J108L90
$$ -1369 146 1123 -115 -339 215 -554 -116 1187 -263 -1050 606 702 -471 390 221 -417 691 1081
4549A081j415N3J128l18m72N81p11k95J512j07j441N76O92p67L14M29q65k4J552
$$ 1081 -334 -281 847 529 57 638 -73 -368 1144 1037 -404 172 864 97 411 840 -25 -49 1503
4568A503n77j393Q59K60m43M95m7j420R88J355j451o88P43K7j57P23n56j079J785
$$ 1503 926 -467 392 652 209 704 657 -763 225 1580 129 -559 184 211 54 777 221 -858 927
4587I27Oj510J45J043o38l0N23j055j07J619m75j401O54M13o01N84K36j352P82
$$ 927 933 -577 -432 611 -27 -57 466 -589 -696 923 448 -953 -299 114 -487 97 333 -1019 -237
4606b37J051j029q91J120j52m42O87k34j070Q97Q70j228q6Q16o57K1Q20p81q96
$$ -237 814 -215 -1106 14 -138 -580 107 -127 -1197 -300 570 -658 -744 72 -585 -564 256 -525 -1421
4625a421J534L0j076N83J91p15Q21O40j762k0J614m68p26P86j72o83J236j26j491
$$ -1421 113 143 -933 -350 -159 -874 -53 587 -1175 -1195 419 -49 -775 11 -161 -844 392 266 -1225
4644a225N53J348p91r9L89n76k34J505q69j288J215P30j081P87j08r77Q48Q40
$$ -1225 -672 676 -115 -214 175 -401 -635 870 1 -1287 -72 658 -423 364 256 -721 127 967
4662I67j155o35J643p8r21M26m2r67J343M44j529K38J016m98j16K84m42l16J342
$$ 967 -188 -823 820 742 -179 247 205 -762 581 1025 -504 -266 750 252 136 420 -22 -338 1004
4681A004j58j400J002N48j065M90K45r97N97J026p70j057J249K15r89N31J71j135
$$ 1004 846 -554 448 996 -69 421 666 -331 266 1292 522 -535 714 929 -60 471 642 -493
4699d93R71P81j437o1Q97m91j04J006j042r14J642J85j240K38M45o39L13J069
$$ -493 478 1259 -178 -239 658 167 63 1069 27 -887 755 940 -300 -62 383 -256 57 1126
4717A126j660q1J441j17j288M72p8n38J249j12j372L08J572j113l53K88j72l14
$$ 1126 -534 -615 826 709 -579 -107 -185 -723 526 414 -958 -650 922 -191 -544 -256 -428 -742
4735g42J258n04j216R68O63r52j62N96n93J66J029j065l93J398l74j199Q33K23
$$ -742 516 12 -1204 -236 427 -525 -687 -91 -684 -518 511 -554 -947 451 77 -1122 -289 -66
4753f6o92P54M53j482J80J153l51q54R40n00k40J044k99j184N35J203p28j63K86
$$ -66 -758 -4 449 -1033 -853 300 -51 -905 35 -465 -705 339 40 -1144 -609 594 -134 -297 -11
4772a1n12K90J128r12q78J021K46m57M01j75q94O85J244j534k22J089k19l20P74
$$ -11 -523 -233 895 -17 -895 126 372 -85 316 141 -753 -68 1176 -358 -580 509 290 -30 744
4791G44n60r32J200O09j286j27J263p09K29M52j127J41J168l27j184O73L07m99
$$ 744 184 -748 452 1061 -225 -352 911 202 431 883 -244 -103 1065 738 -446 227 534 35
4809C5O35O8r77J31J371j099o68R18Q7n20Q61k63r86O30Q03j084J92O61o81r7
$$ 35 670 738 -239 -108 1263 164 -504 414 501 -19 842 579 -407 223 1026 -58 134 795 114 17
4829A7O18m57o05J183J8j256L26P47q80N87L62j310K94J240o15j051Q73q7l51
$$ 17 635 178 -427 756 774 -482 -156 591 -289 298 660 -650 -356 884 269 -782 91 4 -347
4848c47N50o0j079O31J059p77l98M80k63j67R97p53j227J023Q96j008l9J09m02
$$ -347 203 143 -936 -305 754 -23 -421 59 -204 -371 626 -127 -1354 -331 565 -443 -482 -373 -775
4867g75N60J096j405o10J296J32p97M8J02p65R03O39j552K62J158m14k16M82p53
$$ -775 -215 881 -524 -1134 162 294 -503 -455 -353 -1118 -215 424 -1128 -866 292 -122 -338 144 -609
4886f09k18J368l59j128N79O53p08J47N97p29l3J069p84r50J307J4n75L99Lo28
$$ -609 -827 541 182 -946 -367 286 -422 -275 322 -407 -440 629 -155 -1105 202 216 -359 40 43 -585
4906e85O49O72j055n16J326o3o25P78o15n89J306O4j088K90P04o31L86J26r06
$$ -585 64 736 -319 -835 491 428 -197 581 -34 -623 683 747 -341 -51 653 22 408 534 -372
4925c72R2J168j73j228P66J5l41Q00o1r47M50J222j200k93N31j56j85Q79m72j070
$$ -372 -280 888 715 -513 253 268 -73 727 666 -281 169 1391 191 -102 429 273 88 967 495 -575
4945e75J013O06j201N4M01l04J72R37j087n16J250O9j150O19K40p20O51J89r48
$$ -575 438 1044 -157 -103 298 -6 166 1103 16 -500 750 819 -331 288 528 -192 459 648 -300
4964c00k9J007m84p60R87j68q70J056k48j131Q57O95j187Q2P72n18j99R64o53
$$ -300 -329 678 194 -566 421 253 -617 439 191 -940 -83 612 -575 -493 279 -239 -438 526 -127
4983a27o93Q12J64q82L50L32p27N63Q19j044o57J281j57m55K00k17m31Q62L72
$$ -127 -820 -8 156 -726 -376 -44 -771 -208 611 -433 -1090 191 34 -421 -221 -438 -869 -7 365
5002C65j415J96J148l81m37L80n84r4R88j10j318J015N53m71P4J45j050O17J099
$$ 365 -1050 -854 294 -87 -524 -144 -728 -822 166 56 -1262 -247 306 -165 -91 54 -996 -379 720
5021G20r09o90J157j99m15P20m54p71O48J006r74l28O85j54q0Q19q53n55J252
$$ 720 -189 -879 278 79 -336 384 -70 -841 -193 813 -161 -489 196 42 -38 781 -72 -627 625
5040F25O2r93K73M80m63L79L41r64K72Q64p9j239J003j25m82O43J39j131O34Q34
$$ 625 687 -306 -33 447 -16 363 704 -260 12 876 797 -442 561 436 -46 597 736 -395 239 1073
5060A073p20m77P64m62k56J203o07j103J207M09j220J41N73q20L46R51r17n63
$$ 1073 353 -124 640 178 -78 1125 518 -585 622 1031 -189 -48 525 -295 51 1002 85 -478
5078d78J286q7o41J4J45m76R05J07j195J31J025l19n82L32k74j42Q87r2j342N49
$$ -478 808 721 80 94 239 -237 668 775 -420 -289 736 417 -165 167 -107 -249 638 546 -796 -247
5098b47P09n65n9L20n40K0J135r90p38J061L9n31L45K1q88O03Q53j158k68R13
$$ -247 462 -103 -162 158 -382 -362 773 -217 -955 106 145 -386 -41 -20 -908 -305 548 -610 -878 35
5118C5r2l60O46m30m59O08J59j026L63Q02o94N7O02r97k20J285m88n49N27O32
$$ 35 -57 -417 229 -201 -660 -52 107 -919 -556 246 -448 -391 211 -786 -1006 279 -209 -758 -231 401
5138D01p09J81J46r85Q06Q64r52m32R51k11k17P12p48n72J008L73q73J09N01m14
$$ 401 -308 -127 19 -966 -160 704 -248 -680 271 60 -157 555 -193 -765 243 616 -257 -148 353 -61
5158f1j10O30p35k53R98M99j056J26M20n97N32L15j366M17J405p18o40O90l3o03
$$ -61 -171 459 -276 -529 469 968 -88 38 458 -139 393 708 -658 -241 1164 446 -194 496 463 -140
5178a40R13j49r75P65O52j187J08M94k69k49P12l59o16P52K35j020L28O76q68
$$ -140 773 624 -351 414 1066 -121 -13 481 212 -37 675 316 -300 452 687 -333 -5 671 -197
5197a97K84P42p69l64J056p20m29R44k49q02N57O37j102K94P02m61k74M87m42
$$ -197 87 829 60 -304 752 32 -397 547 298 -504 53 690 -412 -118 584 123 -151 336 -106
5216a06l65J119k79j067M04O15n14J89J06n56K51R35q88q69J073K85p66L56l0
$$ -106 -471 648 369 -698 -294 321 -193 -4 102 -454 -203 732 -156 -1025 48 333 -433 -77 -107
5235a07q54R22P32j265j46P54l7m58O48n79m91R70r2r64L79P99p07L85J65o00
$$ -107 -961 -39 693 -572 -718 36 -1 -459 189 -390 -881 89 -3 -967 -588 211 -496 -111 54 -546
5255e46j32R45k98p44N80J06l70L91M06j268N94N88o47k88Q39l49k83N45k18o39
$$ -546 -678 267 -31 -775 -195 -89 -459 -68 338 -930 -336 252 -395 -683 156 -193 -476 69 -149 -788
5275g88N94N67m88j71P14p56K58N36o61q0Q53j27p63P80m18l56L94N39j124J23
$$ -788 -194 373 -115 -286 428 -328 -70 466 -195 -275 578 451 -312 468 50 -306 88 627 -497 -374
5295c74J190m23n71O16l04j51O64j27j001P47P60q48j75P9o5N4J042p11j143J299
$$ -374 816 393 -178 438 134 -17 647 520 -481 266 1026 178 3 82 17 71 1113 402 -741 558
5315E58L91p74QJ45n19P14M25j156j3R80k34o10L34l48l21Q21L64j095L07O96
$$ 558 949 175 183 328 -191 523 948 -208 -221 759 525 -85 249 -99 -420 401 765 -330 -23 673
5335F73p71j2L55n06j47R13o5r38N06K39m75J70M02o99p3J222r29o03R22l35n51
$$ 673 -98 -110 245 -261 -408 505 440 -498 8 247 -228 -58 344 -355 -428 794 -135 -738 184 -151 -702
5356g02R73k87n50O33L36q97q1O80l62j02M68o72j94J125k73q76K40O39m92J01
$$ -702 271 -16 -566 67 403 -494 -575 105 -257 -359 109 -563 -757 368 95 -781 -541 98 -394 -293
5376b93J66q02M37O76l84r51R03K01l36N29j74j030N65R05j034o3Q32m46K89L34
$$ -293 -127 -929 -492 184 -200 -1151 -248 -47 -383 146 -28 -1058 -493 412 -622 -685 147 -299 -10 324
5396C24m51o14R49N7m65J62L74n02Q3O78p96k72Q18j63m13N22P3o99M93J66n50
$$ 324 -127 -741 208 265 -200 -38 336 -166 -83 595 -201 -473 345 182 -231 291 364 -335 158 324 -226
5417b26o7Q48m33j50O09l84m11R77j13j128O18M94n06K9N95p60M9P02m58o44R01
$$ -226 -293 555 122 -28 581 197 -214 763 650 -478 140 634 128 157 752 -8 41 743 285 -359 542
5438E42rn12M68k12p78R33P02j198k62R48Qn63L34o38l33J288J28j163K00O95
$$ 542 533 21 489 277 -501 432 1134 -64 -326 622 630 67 401 -237 -570 718 846 -317 -117 578
5458E78n63P4J79p61M26O66n67o94N66M78n08k3Q3n01K40R14n56o75L51K05o96
$$ 578 15 89 268 -493 -67 599 32 -662 -96 382 -126 -149 -66 -567 -327 587 31 -644 -293 -88 -784
5479g84Q47j28p55Q50K42r03P9M18k62j11P16o66j18P43p7p25N10J27q30P93K67
$$ -784 63 -65 -820 30 272 -631 -552 -134 -396 -507 209 -457 -575 168 91 -634 -124 3 -827 -34 233
5500B33r84R6R34q02l00O26q4j92N48j0p49M60O66r28j15L80pL39L28n69p55P87
$$ 233 -751 -655 279 -523 -823 -197 -281 -473 75 65 -684 -224 442 -486 -601 -221 -228 111 439 -130 -885 -98
5522i8P59r09m6J49q7N80J24j033O6J192j58q39N27j7l45P61k79q39K89R34n14
$$ -98 661 -248 -294 -145 -232 348 472 -561 -495 697 539 -300 227 210 -135 626 347 -492 -203 731 217
5543B17k54N91m38r5R30q52p75J156K99o55M4O31o99K7M99o15k26P60o4m38L83
$$ 217 -37 554 116 21 951 99 -676 480 779 124 168 799 100 127 626 11 -215 545 481 43 426
5564D26n0p37N64O07r26K49N68q78j03R15n58o57Q69L46j032N26J87q63M90L24
$$ 426 376 -361 203 810 -116 133 701 -177 -280 635 77 -580 289 635 -397 129 316 -547 -57 267
5584B67r04J31R68k52p36N06K32m24M46j47p37O42O45r05l24N05qk31L84n05n33
$$ 267 -637 -506 462 210 -526 -20 212 -212 234 87 -650 -8 637 -268 -592 -87 -95 -326 58 -447 -980
5605i80J198L06j300N03L00l55JM03o60o2R99k76q28M04M31n91N41J24p56K91
$$ -980 218 524 -776 -273 27 -328 -327 76 -584 -646 353 77 -751 -347 84 -507 34 158 -598 -307
5625c07P01p32n18Q18n6m56Q86j44q73O14L04m04j98N48q49M23Q40o95m97N93
$$ -307 394 -338 -856 -38 -94 -550 336 192 -681 -67 237 -167 -365 183 -666 -243 597 -98 -595 -2
5645bL1m69N55J21p46N75O38q62j18N32j12l19M23l16l09Q79Q6q61l2O70l08M4
$$ -2 29 -440 115 236 -510 65 703 -159 -277 255 143 -176 247 -69 -378 501 587 -274 -306 364 56 100
5667A00L96l62k30R13m63j125J015L83m44j37L78o58M24O70p34n79Q05J55m71
$$ 100 496 134 -96 817 354 -771 244 627 183 46 424 -234 190 860 126 -453 352 507 36
5686C6M69k34o52Q78Qq92K41R13m19k45M75p62j14N82J48o21N14J19n47J11N46
$$ 36 505 271 -381 497 505 -387 -146 767 348 103 578 -184 -298 284 432 -189 325 444 -103 8 554
5707E54r90J20Q63n61m5M83j57o79Q96k40j101N95P02l85k05J64k74K53N67j005
$$ 554 -436 -316 547 -14 -59 424 267 -412 484 244 -857 -262 440 55 -150 14 -260 -7 560 -445
5727d45k88Q69J86o02j15L67m31L16K10o77m7J004K8j324Q36O5m48N78j04r29
$$ -445 -733 136 322 -280 -395 -28 -459 -143 67 -610 -657 347 375 -949 -113 -48 -496 82 -22 -951
5747i51R05O79r30n46M39L02j57L42m76n44J132J14r34J62O42n81K40O51r14l0
$$ -951 -46 633 -297 -843 -404 -102 -259 83 -393 -937 195 309 -625 -463 179 -402 -162 489 -425 -455
5767d55R05m10n75M79K44n80N29K72r84L73O63p54j51Q17k55n05O95mn42L84M9
$$ -455 450 40 -535 -56 188 -392 137 409 -575 -202 461 -293 -444 373 118 -387 308 304 -238 146 195
5788A95m59K30P47q82n7Q45l96o84P51P4l67N01N5p65K34O95q49J3N51j32k85
$$ 195 -264 -34 713 -169 -226 619 223 -461 290 364 -3 498 553 -212 22 717 -132 -119 432 300 15
5809A5O72j51p91O80K81j126L07R07o05k21M04m06P4O96m82r33J015J37o23L00
$$ 15 687 536 -255 425 706 -420 -113 794 189 -32 372 -34 40 736 254 -679 336 473 -150 150
5829A50J71q58K45P39m39j78M52J62n20L68k08p91Q16K17n57K19L54o83R6O93
$$ 150 321 -537 -292 447 8 -170 282 444 -76 292 84 -707 109 326 -231 -12 342 -341 -245 448
5849D48p20m48Q02P3n38L58o9o51O01N71q07k82P65j70l60L87k25n18O84L82r22
$$ 448 -272 -720 82 155 -383 -25 -94 -745 -144 427 -380 -662 103 -67 -427 -40 -265 -783 -99 283 -639
5870f39j18R27m26q0N89q65J4N64L4q18P99J92o62L34J16n54L53P50p26n92P67
$$ -639 -757 170 -256 -336 253 -612 -598 -34 0 -818 -19 173 -489 -155 -39 -593 -240 510 -216 -808 -41
5891d1J23o30O15j65m36P57K31q87QQ45n12k26N21l94J44P21n72n26L86M53m32
$$ -41 82 -548 67 -98 -534 223 454 -433 -425 420 -92 -318 203 -191 -47 674 102 -424 -38 415 -17
5912a7L1N39q73J75O90m30o84R45j28m28O69n8p69N26K64o52J52N09l33k24P67
$$ -17 14 553 -320 -145 545 115 -569 376 248 -180 489 431 -338 188 452 -200 -48 461 128 -96 671
5933F71n14m71Q13N6m93j36N05j80j50Q03j082k28Q18J4q53P10J09o60P67P7q65
$$ 671 157 -314 499 555 62 -74 431 251 101 904 -178 -406 412 426 -427 283 392 -268 499 576 -289
5954b89J02P80l74o88O58j42l97P96n56p07Q86M96j183K91M85k94Q4J86n20k47
$$ -289 -187 593 219 -469 189 47 -350 446 -110 -817 69 565 -618 -327 158 -136 -52 134 -386 -633
5974f33P88j76p25N24L89m16J62M6n20P4Q29l42n59M54n1l73N55k94l45M46M32
$$ -633 155 -21 -746 -222 167 -249 -87 -41 -561 -487 342 0 -559 -105 -156 -529 26 -268 -613 -167 265
5995B65m33k75O68o68j03Q52n79l72J86N55m02L51np03L91O19m41l92O63Jl98
$$ 265 -168 -443 225 -443 -546 306 -273 -645 -459 96 -306 45 40 -663 -272 347 -94 -486 177 178 -220
6016b20M05k68m36P86L92r98L11L09p22L82L96m87o3Q05r3r20P16J57p52L46R8
$$ -220 185 -83 -519 267 659 -339 -28 281 -441 -59 337 -150 -213 592 499 -421 295 452 -300 46 144
6037A44l35N5P32l23o18O57J19o22O16O1o16M79M34q17k35P62k23k78L96j68k47
$$ 144 -191 -136 596 273 -345 312 431 -191 425 486 -130 349 783 -34 -269 493 270 -8 388 220 -27
6058b7M46kr86O61L89m80Q8M38p86l9Q32l48m25M22J48o45P75O0p72q9O86l37
$$ -27 419 417 -569 92 481 1 89 527 -259 -298 534 186 -239 183 331 -314 461 521 -251 -340 346 9
6080Ij71N91q00%J083l62r16L57L85n23L38K62o32L17O05o85o33P06O8m06N13
$$ 9 -162 429 -371 -371 712 350 -566 -209 176 -347 -9 253 -379 -62 543 -142 -775 -69 -1 -407 106
6101A06m54k54M71K33p12PQ18m62j99M46m15j13O58j08p02O43K40n26j07M07k28
$$ 106 -348 -602 -131 102 -610 -603 215 -247 -446 0 -415 -528 130 22 -680 -37 203 -323 -430 -23 -251
6122b51j7M98p26j27P40R0o10J35L71o88M63M07n98j37Q01l82j27K78l66j06O12
$$ -251 -268 230 -496 -623 117 207 -403 -268 103 -585 -122 285 -313 -450 351 -31 -158 120 -246 -352 260
6143B60Q7m85j2M89l76J56J03m93%Q70m07m15K42J89l26N66K1r28K60P81o33J97
$$ 260 347 -138 -150 339 -37 119 222 -271 -271 599 192 -223 19 208 -118 448 469 -459 -199 582 -51 146
6165A46J34l20N8K22Nn15N23K56m85j85P99m98J08M58q07mQ88m48n29K71M48m49
$$ 146 280 -40 18 240 245 -270 253 509 24 -161 638 140 248 706 -101 -105 783 335 -194 77 525 76
6187G6n3L10l12K00L58m90o49Q82N4n89O63j52n15L26L83o81j56O99l68k59Q54
$$ 76 23 333 21 221 579 89 -560 322 376 -213 450 298 -217 109 492 -189 -345 354 -14 -273 581
6208E81k82q19P47m8l26J67K77m15J27K86m04j52L08j83j45L23Q6q27O82M46p93
$$ 581 299 -520 227 179 -147 20 297 -118 9 295 -109 -261 47 -136 -281 42 128 -699 -17 429 -364
6229c64K8L42l93J48P26p23q9M52j57o18L44L92n20K59K98q00L74N61n35m41R22
$$ -364 -336 6 -387 -239 487 -236 -325 127 -30 -648 -304 88 -432 -173 125 -675 -301 260 -275 -716 206
6250B06n7l43J50L6m14J19M57m65j38P07n38jM78m41k66N48L35o69Q5N66p51L64
$$ 206 149 -194 -44 -8 -422 -303 154 -311 -449 258 -280 -281 197 -244 -510 38 373 -296 -211 355 -396 -32
6272c2J62j99j5N98l44l49N08o7l12L37J17r66M22Q31n24J61M6k65k03M80n8q10
$$ -32 130 -69 -84 514 170 -179 329 262 -50 287 404 -562 -140 691 167 328 374 109 -94 386 328 -482
6294d82M28P19m55j3L43o25K70N23o77m02P58l3j04P3L4p20Q05J06o67Q3O62l27
$$ -482 -54 665 210 197 540 -85 185 708 31 -371 387 354 250 323 357 -363 442 548 -119 -36 626 299
6316B99j74R1j73k64N61R2r48O75M93o57K7J72k49K31L80q29l47Q76o8k64K90
$$ 299 125 216 43 -221 340 432 -516 159 652 -5 22 194 -55 176 556 -273 -620 256 188 -76 214
6337B14n1l14K94L45q90J49N21l24n16M98J78m21L68lm47J92L93m76n2K18l00
$$ 214 163 -151 143 488 -402 -253 268 -56 -572 -74 104 -317 51 48 -399 -207 186 -290 -342 -124 -424
6358d24K18M75k59o50N23J86o31N30O5n42J87N83o62j81N99L6k10J92Ln01O06
$$ -424 -206 269 10 -640 -117 69 -562 -32 33 -509 -322 261 -401 -582 17 53 -157 35 38 -463 143
6379A43J07n52J70Q5mr6L52m80m29J133l19k15j5N76n62l1L32m27l2P72l85j86
$$ 143 250 -302 -132 -47 -51 -147 205 -275 -704 429 110 -105 -120 456 -106 -137 195 -232 -264 508 123 -63
6401f3J26J46m33N16J51n76J67L01k41k93M23j08j6K72k81q4L54J73m48J98J3
$$ -63 63 209 -224 292 443 -133 34 335 94 -199 224 116 100 372 91 7 361 534 86 284 297
6422B97l66L82L72n37k66O98n02k27N07j80j66J67N13r31M83L70p30q3N74l37
$$ 297 -69 313 685 148 -118 580 78 -149 358 178 12 179 692 -239 244 614 -116 -199 375 38
6442C8j63O72j99o35M19K50l05J15P2m61N8O43j65n75K58M8j21M67l74n24L49
$$ 38 -125 547 348 -287 132 382 77 192 264 -197 -139 504 339 -236 22 70 -51 416 42 -482 -133
6463a33N58o62k30N18jj54M27j90n89L00M81p32J98K15k66O4J12j38j6M74l05
$$ -133 425 -237 -467 51 50 -104 323 133 -456 -156 325 -407 -209 6 -260 -196 -84 -222 -238 236 -69
6484f9l50M63k11k30N52M9o89M66L7m35J22M25k63l22M13j65l42K63O83p65J52
$$ -69 -419 44 -167 -397 155 204 -485 -19 18 -417 -295 130 -133 -455 -42 -207 -549 -286 397 -368 -216
6505b16N29m89J31K66m07M3M06l47j45K04n3k98O45j04n29J18O60k89k74L74k92
$$ -216 313 -176 -45 221 -186 -143 263 -84 -229 -25 -78 -376 269 165 -364 -246 414 125 -149 225 -67
6526f7J43L05p0p34M69N20n79J98L0k76MM81k98n31P74q8n8n8R1l74J21N89m55
$$ -67 76 381 311 -423 46 566 -13 185 215 -61 -57 424 126 -405 369 281 223 165 256 -118 3 592 137
6549A37k78N59ok19J85p7l93J80Q5l32Q9P52o00j76O90n26L5J32j86l34M79K91
$$ 137 -141 418 412 193 378 301 -92 88 173 -159 -70 682 82 -94 596 70 105 237 51 -283 196 487
6571D87m55j25M89n82OM33m08k23P51q9n14K92L3m77P03k8n59p3L45O1k69M36
$$ 487 32 -93 396 -186 -180 253 -155 -378 373 284 -230 62 95 -382 321 293 -266 -339 6 67 -202 234
6593B34l43l32N33J54p31K65M68n24K91J57n75j21P41j99n21N62o3m08N32M0q39
$$ 234 -109 -441 92 246 -485 -220 248 -276 15 172 -403 -524 217 18 -503 59 -4 -412 120 160 -679
6614f79M78J78J31j92N0j69m85Q25j2m86K81J59m89L31K15l98J18J94j2m59N19
$$ -679 -201 -23 108 -84 -34 -203 -688 137 125 -361 -80 79 -410 -79 136 -262 -144 50 38 -421 98
6635I8j28l24M67n8l41J94L71p64L65K63j47l06O45j74k27M02jn39K15K65n28
$$ 98 -30 -354 113 55 -286 -92 279 -485 -120 143 -4 -310 335 161 -66 336 335 -204 11 276 -252
6656b52M86n4k53j3M45m38m18P77N4l73J14K89p16P09L15q13j56M93K75l20P0
$$ -252 234 180 -73 -86 359 -79 -497 280 334 -39 75 364 -352 357 672 -141 -297 196 471 151 221
6677B21k63k16O12P0n34j9O78m09m4K55n77K05M80k72n12N68j33k53K61p4l07
$$ 221 -42 -258 354 424 -110 -129 549 140 96 351 -226 -21 459 187 -325 243 110 -143 118 44 -263
6698b63M7O10l46l02O44m34j06L31l10k9L13K42m79k90N74l86LM45k35n54P70
$$ -263 -216 394 48 -254 390 -44 -150 181 -129 -158 155 397 -82 -372 202 -184 -181 264 29 -525 245
6719B45j69m77M27J32l69N1N69q40J98N26n10l88N12j75k41L92J08n22M88L84
$$ 245 76 -401 26 158 -211 -160 409 -431 -233 293 -217 -605 -93 -268 -509 -117 -9 -531 -43 341
6739C41n15k35M10n6j04N32n65k59K99L10n57R3L60n57L20O07p53K6N53l51j09
$$ 341 -174 -409 1 -55 -159 373 -192 -451 -152 158 -399 -306 54 -503 -183 424 -329 -303 250 -101 -210
6760b10J27K06o74O16J33j57k30N54m10J1K42k33j30N22l61j96N77m3l94J30R1
$$ -210 -83 123 -551 65 198 41 -189 365 -45 -34 208 -25 -155 367 6 -190 387 344 -50 80 171
6781A71k33l6M94m16j94N10M3m47L26M9m16L32J21l12P7M66l82K3K37j04m36M45
$$ 171 -62 -98 396 -20 -214 296 339 -108 218 267 -149 183 304 -8 69 535 153 176 413 309 -127 318
6803C18P9m93L16K87p13M42J90m41k57R29l94p21P00K5l13L17r0n29L58N66o50
$$ 318 397 -96 220 507 -206 236 426 -15 -272 657 263 -458 242 267 -46 271 181 -348 10 576 -74
6824g4k07M23j28j67M94k48m66N74n2l24K1K37j73J20K01p20J85M79k64l99M81
$$ -74 -281 142 14 -153 341 93 -373 201 149 -175 -154 83 -90 30 231 -489 -304 175 -89 -488 -7
6845gK7n89L21M10m79j27M81k56j45O36m33l13P13j93m81K99J71l25K74K11p10
$$ -7 20 -569 -248 162 -317 -444 37 -219 -364 272 -161 -474 239 46 -435 -136 35 -290 -16 195 -515
6866e15K16N46m28k96N86J34n72K06J93k78J93K70m36j91N60j23k95K34k57k96
$$ -515 -299 247 -181 -477 109 243 -329 -123 70 -208 -15 255 -181 -372 188 65 -230 4 -253 -549
6886e49Q32j43n66N14J37j30k10K43k05j16O30m45l72O78m9j45J66j11l57K57
$$ -549 283 140 -426 88 225 95 -115 128 -77 -193 437 -8 -380 298 249 104 270 159 -198 59
6906E9O06m14l67N4K88k04K92l41j29L32M02p15R0L60l35P9M05n14n3M45j45l03
$$ 59 665 251 -116 -62 226 22 314 -27 -156 176 578 -137 -47 313 -22 57 462 -52 -105 340 195 -108
6928a08L24K53m67K50R0n48M10J84l08r7L85j61m00M14O8o14M11J78l86l5M31
$$ -108 216 469 2 252 342 -206 204 388 80 -17 368 207 -193 221 289 -325 86 264 -122 -157 274
6949B74l30nM03m50j64K98L38n47k0K08j56L19J07m47q9L91K14n84J67Qj64M30
$$ 274 -56 -61 342 -108 -272 26 364 -183 -203 5 -151 168 275 -172 -261 130 344 -240 -73 -65 -229 201
6971B01l46l00J68N48m05m67N21l5j36N33l89n20L58L60l01j48P01p66J23N24
$$ 201 -145 -445 -277 271 -134 -601 -80 -115 -251 282 -107 -627 -269 91 -210 -358 343 -423 -300 224
6991B24l80k14M66k07k11M15J57n02L07%m75M96j13l5p8K40q2l13L71rm57N50
$$ 224 -156 -370 96 -111 -322 93 250 -252 55 55 -420 76 -37 -72 -150 90 8 -305 66 57 -400 150
7013A50P0o62K71M02l13p8K92j38l25N80m1m56L16J97n67L67L72m13lN32n03j37
$$ 150 220 -442 -171 231 -82 -160 132 -6 -331 249 208 -248 68 265 -302 65 437 24 21 553 50 -87
7035h7K72l4m35N65J89n65J34L15m78M37J35n49k05P53J47o61J99R3l07L13J58
$$ -87 185 151 -284 281 470 -95 39 354 -124 313 448 -101 -306 447 594 -67 132 225 -82 231 389
7056C89m81j6L39k29j68M50k44r4L89n6k83K10O3l55K5K45k78K2M03k93l05L48
$$ 389 -92 -108 231 2 -166 284 40 -54 335 279 -4 206 269 -86 -61 184 -94 -72 331 38 -267 81
7078H1Lj86K87o9m84N09N2k60l97M73p8k42L68o8l14L68K00q92L86O19n47N2K50
$$ 81 84 -102 185 116 -368 141 193 -67 -464 9 -69 -311 57 -11 -325 43 243 -649 -263 356 -191 -139 111
7101A11l66k07M68n0n34L35L87j88k40L15l72J37O01n18k71M31l9k62K06J66m60
$$ 111 -255 -462 6 -44 -578 -243 144 -44 -284 31 -341 -204 397 -121 -392 39 0 -262 -56 110 -350
7122c50L65K96n59j97P71l06k47K62j39o6L16Q4m64k1M95p07M97L81p36M2O12
$$ -350 15 311 -248 -445 326 20 -227 35 -104 -170 146 230 -234 -255 240 -467 30 411 -325 -283 329
7143C29l01l09M99m6k66N35k62k07L51J25k77k71N68m37l3L47l24l27O32k5m72
$$ 329 28 -281 218 172 -94 441 179 -28 323 448 171 -100 468 31 -2 345 21 -306 326 301 -171
7164a71L29J18l07O9K36k63O3M15j61l50J88J28l00M18l18j95K33K73n16J0N24
$$ -171 158 276 -31 38 274 11 74 489 328 -22 166 294 -6 412 94 -101 132 405 -111 -101 423
7185D23m60j12L43j57l84O38J88p65K05K09j20m2K52l63m19Q68l23k04J41L0j3
$$ 423 -37 -149 194 37 -347 291 479 -286 -81 128 8 -34 218 -145 -564 304 -19 -223 -82 -52 -65
7206f5J41p1l89L16M55k59n43K14J08m04O45j09l51K37L14m38M2K58n60m9P94
$$ -65 76 5 -384 -68 387 128 -415 -201 -93 -497 148 39 -312 -75 239 -199 -157 101 -459 -508 286
7227B86l81k73M35l12l0M66o1o47L44L31j93l41M18k18k72N95j48m57L78No99
$$ 286 -95 -368 67 -245 -275 191 130 -517 -173 158 -35 -376 42 -176 -448 147 -1 -458 -80 -75 -774
7248g74N05L11n06P3N08m39nM19p0m86M73J05l43K03j22m8L54J61k69m03O10j68
$$ -774 -269 42 -464 -391 117 -322 -327 92 22 -464 9 114 -229 -26 -148 -196 158 319 50 -353 257 89
7270H9p3J87K5n42O18J93o48K92p3k09K59L87l77k70K49J33m02M22K7n21N05L23
$$ 89 16 203 228 -314 304 497 -151 141 68 -141 118 505 128 -142 107 240 -162 260 287 -234 271 594
7292E94o55j83Q99m20j86J67k33j14L34K54n31J92J50k61O4L10l50j43K54j65
$$ 594 -61 -244 655 235 49 216 -17 -131 203 457 -74 118 268 7 71 381 31 -112 142 -23
7312b3j28J53K77l48J27j4k62K72L74n72q2N12r7m17L50k1k52M21k37n27K97N62
$$ -23 -151 2 279 -69 58 44 -218 54 428 -144 -226 286 189 -228 122 101 -151 270 33 -494 -197 365
7334C65m53k04L90j75j67N08l21m07M17K48k57l08M20m85J74L73L9n54L60K10
$$ 365 -88 -292 98 -77 -244 264 -57 -464 -47 201 -56 -364 56 -429 -255 118 157 -397 -37 173
7354A73m05K88j15m71L54M43m43N9L40k05l66L44k8n33M75J66j73j45K84k13N4
$$ 173 -232 56 -59 -530 -176 267 -176 -117 223 18 -348 -4 -32 -565 -90 76 -97 -242 42 -171 -117
7375a17N06n00m90P32j74k69M43m1m36N62N6n91K37L96n76R9J75k18J75M82l47
$$ -117 389 -111 -601 131 -43 -312 131 90 -346 216 272 -319 -82 314 -262 -163 12 -206 -31 451 104
7396A04m18N00m4l92O3L54k11K05J66l60Q7M36j38n56J45K39j88L79k09j69K22
$$ 104 -314 186 142 -250 -187 167 -44 161 327 -33 54 490 352 -204 -59 180 -8 371 162 -7 215
7417B15M5k40JK91q4l28M60j75j75K16n2j80j69L83j89j37O28l30k20K06r8k81
$$ 215 260 20 21 312 228 -100 360 185 10 226 174 -6 -175 208 19 -118 510 180 -40 166 68 -213
7439b13J84L56n36L32KKj92L58l32N7J60j16m68K66O02o25L31j21j70k07L71o32
$$ -213 -29 327 -209 123 125 127 -65 293 -39 18 178 62 -406 -140 462 -163 168 47 -123 -330 41 -591
7461e91L23M48r3o75M33L0oK4K02n06K89M63o21m46Q99j39m77M35k03k51M45J54
$$ -591 -268 180 87 -588 -155 -125 -131 -107 95 -411 -122 341 -280 -726 173 34 -443 -8 -211 -462 -17 137
7483A37m10j04L26n7l16O49n48n8L32Q5m27K45J89l94L6N75n26p1N84l72j09J54
$$ 137 -273 -377 -51 -108 -424 225 -323 -381 -49 36 -391 -146 43 -351 -315 260 -266 -337 247 -125 -234 -80
7505h0J2j24M74n1m68L19K6k03M4M8%m3M96j17o58N17k4k00J37N7j61J61K03m72
$$ -80 -68 -192 282 231 -237 82 108 -95 -51 -3 -3 -46 450 333 -325 192 168 -32 105 162 1 162 365 -107
7529a07k22P01k34j62K02j92j16M96R3o52L54M12l77k31K99n7j46M06k87n39M70
$$ -107 -329 372 138 -24 178 -14 -130 366 459 -193 161 573 196 -35 264 207 61 467 180 -359 111
7550A11J37J7k78R9q4j29N37m26k50N72R5p16K26J76k87L25Lk14j62N30k24m05
$$ 111 248 265 -13 86 2 -127 410 -16 -266 306 401 -315 -89 87 -200 125 128 -86 -248 282 58 -347
7572c47N65j35l17K97J63o21J90L11m41L32L43o60J78J58J24m59M27j21j66L43
$$ -347 218 83 -234 63 226 -395 -205 106 -335 -3 340 -320 -142 16 140 -319 108 -13 -179 164
7592A64j56l13k6K21j18n1K96l08p7L42p8l80M15K46m83K84k0j11j59M55k57j37
$$ 164 8 -305 -331 -110 -228 -279 17 -291 -368 -26 -104 -484 -69 177 -306 -22 -42 -153 -312 143 -114 -251
7614b51M17l8n26M51j32j42K00n3kJ6M81m68j91L08n4O6K4k37oJ90J71m36Q1N20
$$ -251 166 128 -398 53 -79 -221 -21 -74 -76 -60 421 -47 -238 70 16 82 106 -131 -137 53 224 -212 -131 389
7638C89m63K10j7j15l19P09j86m13M14n7k38K67J25m99J20L06L7n47M79j12k70
$$ 389 -74 136 119 4 -315 394 208 -205 209 152 -86 181 306 -193 -73 233 270 -277 202 90 -180
7659a80K45L33n40K38J11Oj41K64l24n3M48l48j0N1K0j29L32j56k87N0M68k84
$$ -180 65 398 -142 96 207 213 72 336 12 -41 407 59 49 100 120 -9 323 167 -120 -70 398 114
7681A14k89M74j62k70K72pl31K27K38m62J66M60m08l28M98k51j56M85j25k65M1
$$ 114 -175 299 137 -133 139 132 -199 28 266 -196 -30 430 22 -306 192 -59 -215 270 145 -120 -79
7702g9L50n28J17L94m11M0J68Pm73M28p8k10J77k25j53K19M46k45m18N78k77o
$$ -79 271 -257 -140 254 -157 -117 51 58 -415 13 -65 -275 -98 -323 -476 -257 189 -56 -474 104 -173 -179
7724a79L25k06l14J96M58n25k6K59o7o4M73o84PN93k9l50pN4m82N49K16k69o1
$$ -179 146 -60 -374 -178 280 -245 -271 -12 -79 -143 330 -354 -347 246 217 -133 -140 -86 -568 -19 197 -72 -133
7747a33K70l0j02L4m69L7P94l08l50M14j91j61L16K2k84K42L0om37O04J9m56K28
$$ -133 137 107 5 39 -430 -393 401 93 -257 157 -34 -195 121 143 -141 101 131 125 -312 292 311 -145 83
7770H3R1l67L16Q0k21Q7J46Nl54K77K46o54N53l1n08L15J15k10pN72n92q5K97
$$ 83 174 -193 123 203 -18 69 215 220 -134 143 389 -265 288 257 -251 64 179 -31 -38 534 -58 -143 154
7793A54O8n27N07M5l47K60L4l82Q8M99j95l25O7J01n1M88l92l84L69K59k03k83
$$ 154 222 -305 202 247 -100 160 194 -188 -100 399 204 -121 -54 47 -4 484 92 -292 77 336 133 -150
7815a50K75m79M01R4j69j72R3L60l63R0j02J2K07k22q5j26P51n95j76O77m22k66
$$ -150 125 -354 47 141 -28 -200 -107 253 -110 -20 -122 -110 97 -125 -210 -336 415 -180 -356 321 -101 -367
7837c67L58P4p28M52K67k91J0L86l73j74O76o20L3L95n0l95K04J27q8k4K08m56
$$ -367 -9 65 -663 -211 56 -235 -225 161 -212 -386 290 -330 -297 98 48 -347 -143 -16 -104 -128 80 -376
7859c76L3L36j01j28L32j54l03L82J78l57N8J83j35j83M14l46l2M14j06l24J56
$$ -376 -343 -7 -108 -236 96 -58 -361 21 199 -158 -100 83 -52 -235 179 -167 -199 215 109 -215 -59
7880e9m5p6K27j36l52M57L45l84%J12N2j39M5o6j40K96K69n05o6M21k25j94M37
$$ -59 -104 -180 47 -89 -441 16 361 -23 -23 89 141 2 47 -19 -159 137 406 -99 -165 256 31 -163 274
7903B74k15n2L56J08o78K42K98l40p0J93k34K9N10j71j67K74j84k09M91m56n3
$$ 274 59 7 363 471 -207 35 333 -7 -77 116 -118 -89 421 250 83 357 173 -36 455 -1 -54
7924e4J2K46l13K02K11n0m67L85J32l71L5K17m53L23J8j24pN85n83l12N22j73
$$ -54 -42 204 -109 93 304 254 -213 172 304 -67 -32 185 -268 55 73 -51 -58 527 -56 -368 154 -19
7946a9n0n5L9mQ6Rn7j99J62n5OJ50j95L4K27l8n01L21K93k29j91K07p9J4J78k07
$$ -19 -69 -124 -85 -89 -3 6 -51 -250 -88 -143 -137 13 -182 -148 79 41 -460 -139 154 -75 -266 -59 -138 -124 54 -153
7972a53n69O77J86l34j8J22k29K59J72m66j6K38K13l85K04L3k43L35j09k16J42
$$ -153 -722 -45 141 -193 -211 -89 -318 -59 113 -353 -369 -131 82 -303 -99 -66 -309 26 -83 -299 -157
7993a57J46j37o0N51l73j30K17R5j14K45j98l12J32L64k36r7L81n46N7L56q7l30
$$ -157 -11 -148 -208 343 -30 -160 57 152 38 283 85 -227 -95 269 33 -64 317 -229 -172 184 97 -233
8015b33M72j71k57L36K89n93K14R7m9l06N62m73K66K5nm04K83L28m48K57j5J32
$$ -233 239 68 -189 147 436 -157 57 154 105 -201 361 -112 154 179 174 -230 53 381 -67 190 175 307
8037C07l90J83L0k27L8P9R0J88n6m20L10K85k53j91J60j2j69K10L6m71L49N1m24
$$ 307 -83 100 130 -97 -59 20 110 298 242 -178 132 417 164 -27 133 121 -48 162 198 -273 76 127 -297
8060b97L18L82p15K15L13m2l81K88j80k9K16J34n97N55J7l19J29J20k04j51M61
$$ -297 21 403 -312 -97 216 174 -207 81 -99 -128 88 222 -375 180 197 -122 7 127 -77 -228 233
8081B33r3n39L58J21n41O20n0m69K06j9Q3P6K6j03j38M4O5O3J46j25o0R2K02m86
$$ 233 140 -399 -41 80 -461 159 109 -360 -154 -173 -90 -14 12 -91 -229 -185 -120 -57 89 -36 -96 -4 198 -288
8105b88j29M60J22l77N6J70l65M16m2m03L60K06k42j5J34k30L90K52l40k79O0
$$ -288 -417 43 165 -212 -156 14 -351 65 23 -380 -20 186 -56 -71 63 -167 223 475 135 -144 -84
8126h4N6k11L85O0n13K76L97m76k8M67l50j47M20j6k28K29p9m31J66M95k80l24
$$ -84 -28 -239 146 206 -307 -31 366 -110 -138 329 -21 -168 252 236 8 237 158 -273 -107 388 108 -216
8148b16M85l00q2M59j45k14P1L03m37K9K63n72L38M50k83p1L03j1l17J34J13k72
$$ -216 269 -31 -113 346 201 -13 58 361 -76 -47 216 -356 -18 432 149 78 381 370 53 187 300 28
8170B8K72j14k22m9K20o1m3L21l97l99O92O4m35K76J19l47K30J50k27j38L60
$$ 28 300 186 -36 -85 135 74 31 352 -45 -444 248 312 -123 153 272 -75 155 305 78 -60 300
8191C00
$$ Imaginary data points
##PAGE= N=2
##DATA TABLE= (X++(I..I)), XYDATA
0@%%%%QqQj6J6k4L2m0M8n6P2q8J04j28J53j77K09k48K88l30L80m37N01n72O49
$$ 0 0 0 0 0 8 0 8 -8 8 -16 16 -24 24 -32 40 -48 56 -72 81 -96 113 -135 153 -177 203 -234 267 -305 344
29C44p31Q23r28J042j165J301j452J618j798J996k213K451k714L006l328L685
$$ 344 -387 436 -492 550 -615 686 -766 852 -946 1050 -1163 1288 -1426 1580 -1748 1937
45A937m088M541n052N637o315P107q051R202j0634J2482j4967J8505k3989L3725
$$ 1937 -2151 2390 -2662 2975 -3340 3767 -4284 4918 -5716 6766 -8201 10304 -13685 20040
59B0040n6206J98823Q6489l64673j8228J77613J69824q4733j70471m5555J80902
$$ 20040 -36166 162657 249146 -115527 -133755 43858 213682 128949 -41522 -87077 93825
70I3825R9078j13798j50878K7871R7984M0143p0966p6162L4293J11266j3227j16895
$$ 93825 192903 79105 -71773 -43902 54082 94225 23259 -52903 -18610 92656 79429 -37466
82c7466m7340N4761M6784J4684j9236k7060J0305J4059m8581k7307N4026L9435
$$ -37466 -84806 -30045 16739 31423 12187 -14873 -4568 9491 -39090 -66397 -12371 27064
94B7064l2513l2417K755L7584M4615l0681r8390j4584R2288O0581k0228m8840
$$ 27064 -5449 -37866 -35111 2473 47088 16407 -81983 -96567 -4279 56302 36074 -12766
106a2766l7809J8850N7300j3196o9218R373P4720K5246l6716n4738k9255N1091
$$ -12766 -50575 -31725 25575 12379 -56839 -47466 27254 52500 15784 -38954 -68209 -17118
118a7118P3473l1670q9604k285P3922N1254j3693p5261o1777M2099Q0805M69m4811
$$ -17118 56355 24685 -64919 -67204 6718 57972 44279 -30982 -92759 -50660 30145 30614 -14197
131a4197j3924P238J7114J1096l3093k6152M2333L5292k6486j9718J0397L98M466
$$ -14197 -28121 -20883 -3769 7327 -25766 -51918 -9585 25707 -779 -20497 -10100 -9702 -5236
144e236N390k4280p606L7763J6857j3267K826q391l0357M362L0271J2674R149
$$ -5236 154 -24126 -31732 6031 22888 9621 12447 4056 -26301 -21939 8332 21006 30155
157C0155o007m0739n552N1531J4934l7123j5720J0829J6786K4465o916m0062J250
$$ 30155 24148 -16591 -22143 29388 44322 7199 -8521 2308 19094 43559 36643 -3419 -2169
170b169L3139r729k4571J3668K2737J0559l325l7013k8688L3072L4376j8140j5183
$$ -2169 30970 21241 -3330 10338 33075 43634 40309 3296 -25392 7680 42056 23916 8733
183H733P636m790o81Q895j1749p573J4072j0960j7112L0920K5290l2412l3522
$$ 8733 16369 11579 10898 19793 8044 471 14543 3583 -13529 17391 42681 10269 -23253
196b3253P61J5421K7655P263m0855j7453M2877J8832l7505k6926O854K6415L1624
$$ -23253 -22492 -7071 20584 27847 -13008 -30461 12416 31248 -6257 -33183 -26329 86 31710
209C1710j5562n5884K407N9962J2731m2372l3417j965L8803N3178j4663o7922
$$ 31710 16148 -39736 -37329 22633 35364 -7008 -40425 -42390 -3587 49591 34928 -32994
221c2994j3615M0498K1002n500j8360j8292K2691L9480k0460m6807N187K9848
$$ -32994 -46609 -6111 14891 9391 -8969 -27261 -4570 34910 14450 -32357 -27170 2678
233B678R892l841k2495j8194L5170L7265l1367m3268O395K2116J5485P047k1105
$$ 2678 12570 8729 -13766 -31960 3210 40475 9108 -34160 -27765 -5649 9836 16883 -4222
246d222j8001K4027J2122k9683p473K4501O813o168n656j1223J3078K8565k2074
$$ -4222 -22223 1804 13926 -15757 -23230 1271 8084 1916 -3740 -14963 -1885 26680 4606
259D606m4993J2653M2953J1700j2581k2775j3720K8340K4330l7524l2765L4575
$$ 4606 -40387 -27734 15219 26919 14338 -8437 -22157 6183 30513 -7011 -39776 -5201
271e201M1449n319l1469l1022R518N5425J4378o1635l5271M0839M5999N064l2829
$$ -5201 36248 30929 -540 -31562 -22044 33381 47759 -13876 -49147 -8308 37691 42755 9926
284I926m5042L666N3528J0228m2978q643L0341J3486q508k4819k4797K2871M4110
$$ 9926 -35116 -31450 22078 32306 -10672 -19315 11026 24512 16004 -8815 -33612 -10741 33369
297C3369j2657m0552L482K5348J0655k403k6120k6338K4309L7868r665j9170L097
$$ 33369 20712 -19840 -16358 8990 19645 17242 -8878 -35216 -10907 26961 17296 -1874 1223
310A223j851j981O919j0656p583K6825J1730k5595r680J3482L996K340m169k3841
$$ 1223 -628 -2609 4310 -6346 -13929 12896 24626 -969 -10649 2833 6829 9169 5000 -18841
324a8841K405L8351P444k5979p917K302l100O661Q64q795J9594K1095k8653l3116
$$ -18841 -16436 21915 29359 3380 -4537 -2235 -5335 1326 2190 -6605 12989 34084 5431 -27685
338b7685J3436K5137R605n714k7065j1209L8617K5676l2509l1251O296J4137J6056
$$ -27685 -14249 10888 20493 14779 -12286 -23495 15122 40798 8289 -22962 -16666 -2529 13527
351A3527O938k0574p618K3950M55k9729m077J6535Q780R449n384k5990L59K7162
$$ 13527 20465 -109 -7727 16223 16678 -13051 -17128 -593 8187 17636 12252 -13738 -13379 13783
365A3783j012j8760l012k903L248K5872O972k7867j5061K787M56J5619J7534j5892
$$ 13783 12771 -5989 -9001 -11904 -8656 17216 24188 -3679 -18740 -15953 -15497 122 17656 1764
379A764j5857J2233K383j2020K321k6l658J6438N948k3987l303K2769J252j4146
$$ 1764 -14093 -1860 523 -11497 -9176 -9202 -12860 3578 9526 -14461 -17764 5005 6257 -7889
393g889r012r457J1993L6254K068l6277j3973J1092P620J0790L759j6425l17J7669
$$ -7889 -16901 -26358 -14365 21889 23957 -12320 -26293 -15201 -7581 3209 6968 -9457 -9774 7895
407G895p383j3963J1879M549j3966L67Q485N364J4367k465l4030q092L0182J1448
$$ 7895 512 -13451 -1572 2977 -10989 -10622 -2137 3227 17594 15129 -18901 -26993 3189 14637
421A4637j1789l085M11N544J1551j7289k8513J9668L9238n454l0408j1622J1818
$$ 14637 2848 -237 174 5718 17269 -20 -28533 -8865 30373 24919 -5489 -17111 -5293
434e293L1118J3942m2037m1175K8562M9615M012k5754k6539m694L1044J8787l2262
$$ -5293 25825 39767 -2270 -43445 -14883 34732 38744 12990 -13549 -18243 12801 31588 -674
447f74k2271K9023K6684r876k3416j8556Q254L6571M653m1152j2682L2590K0819
$$ -674 -22945 6078 32762 22886 -530 -19086 -10832 25739 30392 -10760 -23442 9148 29967
460B9967p632k2279k4863Q004L7094M000k7290J8J5421n356r564m755j474J7707
$$ 29967 22335 56 -24807 -16803 20291 24291 -2999 -2981 12440 7084 -2480 -7235 -8709 8998
474H998J4329k4629j9361K4490K0522j4483k0924j1902Q780L3426Q777l4829j4467
$$ 8998 23327 -1302 -20663 3827 24349 9866 -11058 -22960 -14180 19246 28023 -6806 -21273
487b1273K4111Q339j6712j2444o44K0614K7083j8284m5304J958L8738J0630j8756
$$ -21273 2838 11177 -5535 -17979 -18623 1991 29074 10790 -34514 -32556 6182 16812 -1944
500a944k2015o946K8534L1416k2961m1909L603K6810Q792m523j2579o215K1757
$$ -1944 -23959 -30905 -2371 29045 6084 -35825 -32222 -5412 3380 -1143 -13722 -19937 1820
513A820J2828k8934k0576J9695J8800R2m761j2418k773K2609O193k5189q967J5194
$$ 1820 14648 -14286 -34862 -15167 3633 3725 -1036 -13454 -16227 6382 12575 -12614 -21581 -6387
527f387P702N362M969j1672q050Q260l653p729J5552J0938j0025k341K070q990
$$ -6387 1315 6677 11646 -26 -8076 184 -3469 -11198 4354 15292 5267 2926 4996 -3994
541c994L070J0104r710n768J3704M191p155M666k597j3028M278Q089p109K796
$$ -3994 -924 9180 -530 -6298 7406 11597 4442 9108 6511 -6517 -2239 5850 -1259 1537
555A537J2559m263o115J369j1487o619J9693J0819j1392m165P26l063R337M256
$$ 1537 14096 9833 3718 5087 -6400 -13019 6674 17493 6101 1936 2662 -401 8936 13192
569A3192k0050p673K1054J1690n380l550j0498o719J4899N747j5859M66J6914
$$ 13192 -6858 -14531 6523 18213 12833 9283 -1215 -7934 6965 12712 -3147 -2681 14233
582A4233J343o870o809j2186M820K2603k120k1175J326J3480L299J55j1716k0674
$$ 14233 15576 8706 1897 -10289 -5469 17134 15014 -6161 -4835 8645 11944 12099 383 -20291
596b0291Q077K6450k220j6514J521L929r72O05j1558j0975J9379J9229j4668j7254
$$ -20291 -12214 14236 12016 -4498 -2977 952 -20 585 -10973 -21948 -2569 16660 1992 -15262
610a5262J746N054P404K708j8237p556K4777J1376j8140j0694L433K226P157Q05
$$ -15262 -13516 -8462 -1058 1650 -16587 -24143 634 12010 -6130 -16824 -13391 -11165 -4008 -3203
624c203j3398N224K3339m621k4119m185J1075J1150P877j2798j8143J6013K4665
$$ -3203 -16601 -11377 11962 7341 -16778 -20963 -9888 1262 9139 -3659 -21802 -5789 18876
637A8876j1370k1833p47Q924J3093P372j6368j2221K0050J1761k1619j4380J1219
$$ 18876 7506 -14327 -15074 -6150 6943 14315 -2053 -14274 5776 17537 -4082 -18462 -7243
650g243J5206J1699o193k6946m353K8055P031k1403q663Q332J0953R413j0285
$$ -7243 7963 19662 13469 -13477 -17830 10225 17256 -4147 -12810 -4478 6475 15888 5603
663E603k2353O904K2895n814j7964K603J0116R303L351j9741j9486J7387K3569
$$ 5603 -16750 -9846 13049 7235 -10729 -8126 1990 11293 14644 -5097 -24583 -7196 16373
676A6373o920j3086q91K396R670O795j6870j2944J5462J2419o007k304p38k452
$$ 16373 9453 -3633 -4524 -2128 7542 14337 -2533 -15477 -15 12404 6397 4093 3355 903
690I03Q503J463j7833p02K2031N306j0970o012n951R19J6316J497j7939L33J4572
$$ 903 9406 10869 -6964 -7666 14365 19671 8701 2689 -3262 -2343 13973 15470 -2469 -2136 12436
705A2436j101o069j488n580K762R168r178j0334J4817J1617j1438j0112l891o86
$$ 12436 11335 5266 3778 -1802 960 10128 950 -9384 5433 17050 5612 -4500 -8391 -9077
719i077J3047Q919j6163r841J3830M778r349k527j411M51J1143L22j5721J711
$$ -9077 3970 12889 -3274 -13115 715 5493 -3856 -6383 -7794 -7343 3800 4122 -11599 -9888
733i888J4834l798r920j317j703P008J5498n056j9473J039J0105L22K948M11j2239
$$ -9888 4946 1148 -8772 -10089 -11792 -4784 10714 5658 -13815 -12776 -2671 -2349 599 1010 -11229
748a1229P99J4491j288p909K146k359l760J0077K472j1121K593R787n277n528
$$ -11229 -10430 4061 2773 -5136 -2990 -5349 -9109 968 3440 -7681 -5088 4699 -578 -6106
762f106L16l714N098J4643o123j5952L017Q477J36K850l556j1649N690J3909n680
$$ -6106 -5790 -9504 -4406 10237 4114 -11838 -8821 -344 -208 2642 -914 -12563 -6873 7036 1356
777A356q712N860P45l730N136j129n234Q289L538j2791j268J0457r8j452K477
$$ 1356 -7356 -1496 -751 -4481 655 -474 -5708 2581 6119 -6672 -7940 2517 2419 967 3444
792C444p143j747J3221k39j2683L864P386m776q61J596m571P176J0878j1759j4502
$$ 3444 -3699 -5446 7775 7536 -5147 -1283 6103 1327 466 2062 -2509 4667 15545 3786 -10716
807a0716Q880J2453J425l389j2918q644J8293J7562j3891j6356L937Q279P387
$$ -10716 -1836 10617 12042 8653 -4265 -12909 5384 22946 9055 -7301 -3364 4915 12302
820A2302K69j6794p380K1991J0666j8482j3074O515J1060R880o040k2763r59K5856
$$ 12302 12571 -4223 -11603 10388 21054 2572 -10502 -3987 7073 16953 10913 -11850 -12809 13047
834A3047N844j9839r742M029J0023J0844q249j8861O349J8825o313j5543J736
$$ 13047 18891 -948 -10690 -6661 3362 14206 5957 -12904 -6555 12270 5957 -9586 -7850
847g850Q444N964L41j5730q819K0251J3332j7848j4629P444J1287P549n489j9706
$$ -7850 594 6558 6899 -8831 -17650 2601 15933 -1915 -16544 -9100 2187 9736 4247 -15459
861a5459n40K3347K681k1259n565J3231J1488J992j5847j9162J3427K7670n518
$$ -15459 -15999 7348 10029 -11230 -16795 -3564 7924 9916 -5931 -25093 -11666 16004 10486
874A0486k4725l973J2173J3033L207j8610j6385J7900K2158j0412j7629N5Q897
$$ 10486 -14239 -18212 -6039 6994 10201 -8409 -24794 -6894 15264 4852 -12777 -12722 -3825
887c825J0092p7j9811p914K3238J3717j4067j2416J55O533J1996n36j9068k647
$$ -3825 6267 6190 -13621 -21535 1703 15420 1353 -11063 -10908 -4375 7621 7085 -11983 -14630
901a4630K0044M954j1746m116M05L321Q915m111j2222P712J4493p617j2562J312
$$ -14630 5414 10368 -1378 -5494 -5089 -1768 7147 3036 -9186 -1474 13019 5402 -7160 -5848
915e848M644P156N719j0860r520J3085R133j1807o999M845L964M775m87j2442
$$ -5848 -1204 5952 11671 811 -8709 4376 13509 1702 -5297 -452 3512 8287 7800 -4642
929d642P6J7082k40j6223k783Q023O092O035o699j5648M712J5853m260j0380K452
$$ -4642 -4566 12516 12276 -3947 -6730 1293 7385 13420 6721 -8927 -4215 11638 7378 -3002 -550
944e50L195K420N495p336j0497P477Q434p472k475N026k429J034N195p545o946
$$ -550 2645 5065 10560 3224 -7273 204 8638 1166 -1309 3717 1288 2322 7517 -28 -6974
959f974P608K775k879M775j53j1356R23Q344j996k471J628n248R81J1305k851
$$ -6974 634 3409 530 5305 5152 -6204 -5281 3063 1067 -1404 224 -5024 -4043 7262 4411
974D411j2648J597N708j680K443N6p187M383R267q233j0051O035N348L48K954
$$ 4411 -8237 -6640 -932 -2612 -169 -113 -7300 -2917 6350 -1883 -11934 -5899 -551 -203 2751
989B751n386q590P875P547q798l416O250J89N38L737o316m251Q500L31r650L667
$$ 2751 -2635 -11225 -3350 4197 -4601 -8017 -1767 -1578 -1040 2697 -3619 -7870 630 961 -8689 -5022
1005e022Q609j975j438j710p075M292J1932n696j1209N736P271j138p16n846n986
$$ -5022 3587 1612 174 -1536 -8611 -4319 7613 1917 -9292 -3556 3715 2577 1861 -3985 -9971
1020i971J1490R997j2864r216R955P781j240n569j1542N58K0537O239j9080q472
$$ -9971 1519 11516 -1348 -10564 -609 7172 5932 363 -11179 -10621 9916 16155 -2925 -11397
1034a1397R923P478J829o786j2633N848K0153k995j9539j323J1282N846l42j0087
$$ -11397 -1474 6004 7833 1047 -11586 -5738 14415 11420 -8119 -9442 1840 7686 7344 -2743
1048b743r474J3208J6905j1675j7603L606J1052N488j053j2349o097J6130R921
$$ -2743 -12217 991 17896 6221 -11382 -7776 3276 8764 7711 -4638 -10735 5395 15316
1061A5316j5175r809P747P234K606l114j1613K02J6928Q74j6482k998R335N637
$$ 15316 141 -9668 -1921 5313 7919 4805 -6808 -6606 10322 11196 -5286 -8284 1051 6688
1075F688K571o077j2479M776J4977m547j2520K941P240J763K46q312p675J1479
$$ 6688 9259 3182 -9297 -4521 10456 5909 -6611 -3670 3570 5333 5579 -2733 -10408 1071
1089A071J0986j1594r406O096O107J857j596j1521l233J6470N770j4234n904P325
$$ 1071 12057 463 -8943 -2847 3260 5117 3521 -8000 -11233 5237 11007 -3227 -9131 -1806
1103a806M256K389m832j2214M223J8115j016j5672k432O483N171L824q090j2234
$$ -1806 2450 4839 7 -12207 -7984 10131 9115 -6557 -8989 -2506 2665 6489 -1601 -13835
1117a3835R040J6538n775j2104n62K988M977N226p906q672R980Q386q584n613
$$ -13835 -4795 11743 5968 -6136 -6698 -3710 1267 6493 -1413 -10085 -105 8281 -303 -5916
1131e916K511L01M804M501q879m807R081J087o515J802J835l585L643L126o095
$$ -5916 -3405 -3104 1700 6201 -2678 -7485 1596 2683 -3832 -2030 -195 -3780 -137 2989 -3106
1146c106N57N487n985m123P679J905l902K484j205n318N091L859p562r90P820
$$ -3106 -2549 2938 -3047 -7170 509 2414 -1488 996 -209 -5527 -436 3423 -4139 -5129 2691
1161B691j237j999K729m642l045P686J333o892K573L999l385J646K093p869j163
$$ 2691 1454 -545 2184 -2458 -5503 2183 3516 -3376 -803 3196 -189 1457 3550 -4319 -5482
1176e482R196N87l595K616l383n280P447M035p953j142M645o24K684L333r341
$$ -5482 3714 4301 706 3322 -61 -5341 2106 6141 -1812 -2954 1691 1067 3751 7084 -2257
1191b257n436J0016L534n630m28N67o83P592R29j4323l153J2871M901l172l115
$$ -2257 -7693 2323 5857 227 -201 366 -317 7275 8204 -6119 -9272 3599 8500 5328 2213
1206B213o704K63J2909M83j4218j467R502L540N82l425j0277K293J2733k644j0336
$$ 2213 -4491 -4228 8681 9164 -5054 -6521 2981 6521 7103 3678 -6599 -4306 8427 5783 -4553
1221d553K541O218N08R20n766q824P425J0402o979p209N383K679j497O50n693
$$ -4553 -2012 4206 4714 5634 -132 -8956 -1531 8871 1892 -5317 66 2745 1248 1898 -3795
1236c795l976R358L157r915n2R214q94n473l695l778O688J2556o003j5129L884
$$ -3795 -7771 1587 4744 -5171 -5223 3991 3097 -2376 -6071 -9849 -3161 9395 3392 -11737 -7853
1251g853J0821l47m893o089l259J2099J1370j2169j3588P024R738J52m797q616
$$ -7853 2968 2621 -2272 -8361 -11620 479 11849 -320 -13908 -6884 2854 3006 -1791 -10407
1265a0407n58J7012P550j6557j1271P485Q636L684k740j2053n26J6783M160j4886
$$ -10407 -10965 6047 13597 -2960 -14231 -6746 1890 5574 2834 -9219 -9745 7038 11198 -3688
1279c688o180N915N134M623j630j0643K466J2680l703j2044J393O316L566L442
$$ -3688 -9868 -3953 1181 5804 4174 -6469 -4003 8677 4974 -7070 -5677 639 4205 7647
1293G647n582r036O875R279q128p132N825M180R84K6p020k718J0817K018j2279
$$ 7647 2065 -6971 -96 9183 1055 -6077 -252 3928 4912 4938 -2082 -4800 6017 8035 -4244
1308d244j796R797L616n46m291r596K781J3576k033j2073J238P891K559K59o167
$$ -4244 -6040 3757 7373 6827 2536 -7060 -4279 9297 7264 -4809 -3571 4320 6879 7138 971
1323I71r296O684J2251n311r110L436L930J217J304p948o700J0527R267o919o343
$$ 971 -8325 -1641 10610 5299 -3811 -375 3555 4772 6076 -1872 -8572 1955 11222 4303 -2040
1338b040J504J17L417L071q210m640J0093M146o223j540M3k519M289J566q020
$$ -2040 -536 -419 2998 6069 -2141 -6781 3312 7458 1235 -305 -262 -2781 1508 3074 -4946
1353d946Q3R598n16o116P5k191q71P046L92q201K023O172l704j987J327m585Q60
$$ -4946 -4863 4735 4219 -1897 -1822 -4013 -4884 2162 2554 -5647 -3624 2548 -1156 -3143 -1816 -6401 -5541
1370e541Q124j818o025L665J475m947J699J475l890K994O302n259l512M510o53
$$ -5541 2583 765 -5260 -1595 -120 -5067 -3368 -1893 -5783 -2789 3513 -1746 -5258 -748 -1401
1385a401l120L951n08m293N290L791o333j16L231l787q0N365j956j901N810j025
$$ -1401 -4521 -570 -1078 -5371 -81 3710 -2623 -2739 492 -3295 -3375 1990 34 -1867 3943 2918
1401B918o686J466K780j769L091K171o352Q58P985l039p042J307J797J820O423
$$ 2918 -3768 -2302 478 -1291 1800 3971 -2381 -1523 6462 3423 -3619 -2312 -515 1305 7728
1416G728l474r876M189Q824m099n488N45J055N811N642r660r258Q982P851o073
$$ 7728 4254 -5622 -1433 7391 3292 -2196 -1651 -596 5215 10857 1197 -8061 921 8772 2699
1431B699m740M5J622Q768K943j3182o344J0485M739m498j979j674J004Q046q31
$$ 2699 -2041 -1996 -374 8394 11337 -1845 -8189 2296 7035 2537 558 -1116 -112 7934 7103
1446G103j2057n16R568O33k511P2l650N73P156l871r159M232P007k035n48j62
$$ 7103 -4954 -5470 4098 4731 2220 2292 -1358 -785 6371 2500 -6659 -2427 4580 2545 1997 1835
1462A835m202K461M965o705n308P472L920l788l76j473k593N813J533r793q78
$$ 1835 -2367 94 5059 -1646 -6954 518 4438 650 274 -1199 -3792 2021 3554 -6239 -7117
1477g117J0193J959n205k632l970J973Q979j906j0886K968R586q12l949l656m597
$$ -7117 3076 5035 -170 -2802 -6772 -4799 4180 2274 -8612 -5644 3942 3130 -819 -4475 -9072
1492i072N643R685o009r534N246P416j670k841m759l158R086P498q973p079O228
$$ -9072 -3429 6256 247 -9287 -4041 3375 1705 -1136 -5895 -9053 33 7531 -1442 -8521 -2293
1507b293M167n77j075o123k200J0919M701q907l319M458PJ30J129n244N97R015
$$ -2293 1874 1297 222 -5901 -8101 2818 7519 -1388 -4707 -249 -242 -112 1017 -4227 -3630 5385
1523E385n81p489J356K574k378K442J059m718J764N590l833l107M653j342m080
$$ 5385 4804 -2685 -1329 1245 -1133 1309 2368 -2350 -586 5004 1171 -1936 2717 1375 -2705
1538b705M151K234l018K680J07o267J601N474k878j842M040j926k075N320q04
$$ -2705 1446 3680 662 3342 3449 -2818 -1217 4257 1379 -463 3577 1651 -424 4896 4092
1553D092o508J645K569j868L173K945o533j705O348q39m594J619N2M09N773k182
$$ 4092 -2416 -771 1798 -70 3103 6048 -485 -2190 4158 3319 -1275 344 396 805 6578 4396
1569D396r841J791Q843j053m422j099j808M199Q253n505j0884K542O662N02r3
$$ 4396 -5445 -3654 5189 4136 -286 -1385 -3193 1006 9259 3754 -7130 -4588 2074 2576 2483
1584B483j931n448M387P202n820o573L132K332R19L255l467o849M446N607m613
$$ 2483 552 -4896 -509 6693 873 -5700 -2568 -236 683 3938 471 -6378 -1932 3675 -938
1599i38l021J630m35L749N066o706p126M789L680k541J269L38l122L413L125o470
$$ -938 -3959 -2329 -2764 985 6051 -655 -7781 -2992 688 -1853 -584 -246 -3368 45 3170 -3300
1615c300j700N843j786l788L885J692j172K383l551o738N104P820l814m242K471
$$ -3300 -5000 843 -943 -4731 -846 846 -326 2057 -1494 -8232 -3128 4692 878 -3364 -893
1630h93J102J375P45p355m339J0389O932p302m673J890K350M137j512j0847q41
$$ -893 209 1584 2329 -5026 -9365 1024 7956 654 -4019 -2129 221 4358 2846 -8001 -8842
1645h842J3960M216q185m993m7L224O736k754j0149K811J1670p69p148k505n56
$$ -8842 5118 9334 1149 -3844 -3891 -667 6069 3315 -6834 -4023 7647 6878 -270 -2775 -3331
1660c331L331O021m411o940O400P257m253n021j336j394M315O064m553m383N353
$$ -3331 0 6021 1610 -5330 1070 8327 4074 -947 -2283 -3677 638 6702 2149 -2234 3119
1675C119J126m629j17J97j758M963L394o544j107N572j990m446J045q90J668P377
$$ 3119 4245 -384 -501 -304 -2062 2901 6295 -249 -1356 4216 2226 -2220 -1175 -2065 -397 6980
$$ [...]
8191E3
##END NTUPLES=NMR FID
##END=
