##TITLE=1H_EC-3207-x
 DMSO, 8 sc, 
 27.9.2019
##JCAMPDX= 6.0         $$ Bruker NMR JCAMP-DX V2.0
##DATA TYPE= NMR FID
##DATA CLASS= NTUPLES
##ORIGIN= UXNMR, Bruker Analytische Messtechnik GmbH
##OWNER= root
$$ XWIN-NMR		Version 3.5
$$ Fri Sep 27 14:48:38 2019 Russian Standard Time (UT+4h)  she@DPX200
##.OBSERVE FREQUENCY= 200.1315
##.OBSERVE NUCLEUS= ^1H
##.DELAY= (6, 6)
##.ACQUISITION MODE= SIMULTANEOUS
##.ACQUISITION SCHEME= undefined
##.AVERAGES= 8
##.DIGITISER RES= 18
##SPECTROMETER/DATA SYSTEM= spect
##.PULSE SEQUENCE= zg30
##.SOLVENT NAME= Acetone
##.SHIFT REFERENCE= (INTERNAL, Acetone, 0, 15.7039)
##AUDIT TRAIL= $$ (NUMBER, WHEN, WHO, WHERE, WHAT)
$$ ##TITLE= Audit trail, XWIN-NMR		Version 3.5
$$ ##JCAMPDX= 5.01
$$ ##ORIGIN= Bruker BioSpin GmbH
$$ ##OWNER= she
$$ F:/spectra/data/she/nmr/H-F/1/audita.txt
$$ ##AUDIT TRAIL=  $$ (NUMBER, WHEN, WHO, WHERE, WHAT)
(   1,<2019-09-27 14:47:31.79 +0400>,<she>,<DPX200>,
      <created by zg, POWCHK disabled, PULCHK disabled
       configuration hash MD5:
       00 E9 B6 7A A2 85 ED C7 34 08 36 98 17 FE 4E 26
       data hash MD5: 16K
       D8 A1 F0 40 21 76 80 22 4E 92 AB BB 3D 9F F9 EF>)
$$ ##END=
$$ 
$$ hash MD5
$$ 72 1B EA 50 48 56 60 93 7D AD C9 B2 6A 4C 20 91
##$RELAX= 
##$RELAX= 
##$RELAX= 
##$RELAX= 
##$RELAX= 
##$RELAX= 
$$ Bruker specific parameters
$$ --------------------------
##$DU= <F:/spectra>
##$EXPNO= 1
##$NAME= <H-F>
##$PROCNO= 1
##$TYPE= <nmr>
##$USER= <she>
##$AMP= (0..31)
100 100 100 100 100 100 100 100 100 100 100 100 100 100 100 100 100 100 
100 100 100 100 100 100 100 100 100 100 100 100 100 100 
##$AQSEQ= 0
##$AQ_mod= 1
##$AUNM= <au_zg>
##$AUTOPOS= <>
##$BF1= 200.13
##$BF2= 200.13
##$BF3= 200.13
##$BF4= 200.13
##$BF5= 200.13
##$BF6= 200.13
##$BF7= 200.13
##$BF8= 200.13
##$BYTORDA= 1
##$CFDGTYP= 0
##$CFRGTYP= 5
##$CHEMSTR= <none>
##$CNST= (0..31)
1 1 145 1 1 1 1 1 1 1 1 1 1 1 1 1 1 1 1 1 1 1 1 1 1 1 1 1 1 1 1 1 
##$CPDPRG= <>
##$CPDPRG1= <>
##$CPDPRG2= <>
##$CPDPRG3= <>
##$CPDPRG4= <mlev>
##$CPDPRG5= <mlev>
##$CPDPRG6= <mlev>
##$CPDPRG7= <mlev>
##$CPDPRG8= <mlev>
##$CPDPRGB= <>
##$CPDPRGT= <>
##$D= (0..31)
0 1.2 0 0 0 0 0 0 0 0.06 0 0.03 0 0 0 0 0.0002 0 0 0 0 0 0 0 0 0 0 0 0 
0 0 0 
##$DATE= 1569581251
##$DBL= (0..7)
120 120 120 120 120 120 120 120 
##$DBP= (0..7)
150 150 150 150 150 150 150 150 
##$DBP07= 0
##$DBPNAM0= <>
##$DBPNAM1= <>
##$DBPNAM2= <>
##$DBPNAM3= <>
##$DBPNAM4= <>
##$DBPNAM5= <>
##$DBPNAM6= <>
##$DBPNAM7= <>
##$DBPOAL= (0..7)
0.5 0.5 0.5 0.5 0.5 0.5 0.5 0.5 
##$DBPOFFS= (0..7)
0 0 0 0 0 0 0 0 
##$DE= 6
##$DECBNUC= <off>
##$DECIM= 24
##$DECNUC= <off>
##$DECSTAT= 4
##$DIGMOD= 1
##$DIGTYP= 9
##$DL= (0..7)
0 120 120 120 120 120 120 120 
##$DP= (0..7)
150 150 150 150 150 150 150 150 
##$DP07= 0
##$DPNAME0= <>
##$DPNAME1= <>
##$DPNAME2= <>
##$DPNAME3= <>
##$DPNAME4= <>
##$DPNAME5= <>
##$DPNAME6= <>
##$DPNAME7= <>
##$DPOAL= (0..7)
0.5 0.5 0.5 0.5 0.5 0.5 0.5 0.5 
##$DPOFFS= (0..7)
0 0 0 0 0 0 0 0 
##$DQDMODE= 0
##$DR= 18
##$DS= 0
##$DSLIST= <SSSSSSSSSSSSSSS>
$$ [...]
##$SUBNAM2= <"">
##$SUBNAM3= <"">
##$SUBNAM4= <"">
##$SUBNAM5= <"">
##$SUBNAM6= <"">
##$SUBNAM7= <"">
##$SUBNAM8= <"">
##$SUBNAM9= <"">
##$SW= 24.0689530833862
##$SWIBOX= (0..15)
0 0 2 0 0 0 0 0 0 0 0 0 0 0 0 0 
##$SW_h= 4816.95568400771
##$TD= 16384
##$TD0= 1
##$TE= 0
##$TE2= 300
##$TE3= 300
##$TEG= 300
##$TL= (0..7)
0 120 120 120 120 120 120 120 
##$TP= (0..7)
150 150 150 150 150 150 150 150 
##$TP07= 0
##$TPNAME0= <>
##$TPNAME1= <>
##$TPNAME2= <>
##$TPNAME3= <>
##$TPNAME4= <>
##$TPNAME5= <>
##$TPNAME6= <>
##$TPNAME7= <>
##$TPOAL= (0..7)
0.5 0.5 0.5 0.5 0.5 0.5 0.5 0.5 
##$TPOFFS= (0..7)
0 0 0 0 0 0 0 0 
##$TUNHIN= 0
##$TUNHOUT= 0
##$TUNXOUT= 0
##$USERA1= <user>
##$USERA2= <user>
##$USERA3= <user>
##$USERA4= <user>
##$USERA5= <user>
##$V9= 5
##$VALIST= <valist>
##$VCLIST= <CCCCCCCCCCCCCCC>
##$VD= 0
##$VDLIST= <DDDDDDDDDDDDDDD>
##$VPLIST= <PPPPPPPPPPPPPPP>
##$VTLIST= <TTTTTTTTTTTTTTT>
##$WBST= 1024
##$WBSW= 4
##$XGAIN= (0..3)
0 0 0 0 
##$XL= 0
##$YL= 0
##$YMAX_a= 447200
##$YMIN_a= -664920
##$ZGOPTNS= <>
##$ZL1= 120
##$ZL2= 120
##$ZL3= 120
##$ZL4= 120
##$ABSF1= 10
##$ABSF2= 0
##$ABSG= 5
##$ABSL= 3
##$ALPHA= 0
##$AQORDER= 0
##$ASSFAC= 0
##$ASSFACI= 0
##$ASSFACX= 0
##$ASSWID= 0
##$AUNMP= <proc_1d>
##$AZFE= 0.1
##$AZFW= 0.1
##$BCFW= 1
##$BC_mod= 2
##$BYTORDP= 1
##$COROFFS= 0
##$CY= 11.3945322036743
##$DATMOD= 1
##$DC= 2
##$DFILT= <>
##$DTYPP= 0
##$F1P= 20.1720416913024
##$F2P= 0.152960286110954
##$FCOR= 0.5
##$FTSIZE= 0
##$FT_mod= 4
##$GAMMA= 1
##$GB= 0.15
##$INTBC= 1
##$INTSCL= 1
##$ISEN= 128
##$LB= 0.24
##$LEV0= 0
##$LPBIN= 0
##$MAXI= 10000
##$MC2= 0
##$MEAN= 0
##$ME_mod= 0
##$MI= 1.114404
##$NCOEF= 0
##$NC_proc= 0
##$NLEV= 6
##$NOISF1= 3.799351
##$NOISF2= 2.8
##$NSP= 1
##$NTH_PI= 0
##$NZP= 0
##$OFFSET= 15.70392
##$PC= 1
##$PHC0= -9565.879
##$PHC1= 1.000931
##$PH_mod= 1
##$PKNL= yes
##$PPARMOD= 0
##$PSCAL= 0
##$PSIGN= 0
##$REVERSE= no
##$SF= 200.130013532006
##$SI= 16384
##$SIGF1= 3
##$SIGF2= 2
##$SINO= 400
##$SIOLD= 16384
##$SREGLST= <1H.CDCl3>
##$SSB= 0
##$STSI= 0
##$STSR= 0
##$SW_p= 3612.71676300578
##$SYMM= 0
##$S_DEV= 0
##$TDeff= 0
##$TDoff= 0
##$TI= <>
##$TILT= no
##$TM1= 0
##$TM2= 0
##$TOPLEV= 0
##$USERP1= <user>
##$USERP2= <user>
##$USERP3= <user>
##$USERP4= <user>
##$USERP5= <user>
##$WDW= 1
##$XDIM= 8192
##$YMAX_p= 0
##$YMIN_p= 0
$$ End of Bruker specific parameters
$$ ---------------------------------
##NTUPLES= NMR FID
##VAR_NAME=  TIME,          FID/REAL,        FID/IMAG
##SYMBOL=    X,             R,               I
##VAR_TYPE=  INDEPENDENT,   DEPENDENT,       DEPENDENT
##VAR_FORM=  AFFN,          ASDF,            ASDF
##VAR_DIM=   8192,          8192,            8192
##UNITS=     SECONDS,       ARBITRARY UNITS, ARBITRARY UNITS
##FACTOR=    0.0002076,     1,               1
##FIRST=     0,             0,               0
##LAST=      1.7004516,     0,               0
##MIN=       0,             -664920,         0
##MAX=       1.7004516,     447200,          0
$$ Real data points
##PAGE= N=1
##DATA TABLE= (X++(R..R)), XYDATA
0@%%%qJ6j6J6k4M0m8N6p2R5j19J37j69K08k43K88l41M00m68N45o34P31q35R54
$$ 0 0 0 0 -8 8 -8 8 -16 24 -24 32 -40 55 -64 73 -96 112 -131 157 -184 216 -252 293 -341 390 -445 509
27E09j090J237j397J577j777J994k227K491k783L095l440L821m236M692n197N755
$$ 509 -581 656 -741 836 -941 1053 -1174 1317 -1466 1629 -1811 2010 -2226 2466 -2731 3024
43C024o369P054p821Q680r654J0769j2056J3560j5348J7515k0207K3654k8253
$$ 3024 -3345 3709 -4112 4568 -5086 5683 -6373 7187 -8161 9354 -10853 12801 -15452
56a5452L4742m4661O1881j00111L29283j55983o24922M54072M82127j62728n13317
$$ -15452 19290 -25371 36510 -63601 265682 109699 -515223 -61151 420976 258248 -255069
67b55069Q6593L62473k7073l87715J0953L42219P4666k91563l5371K58300L5904
$$ -255069 -168476 193997 166924 -220791 -209838 132381 207047 -84516 -119887 138413 174317
78A74317l11727r0799K83864J77717k34999k16985J47237K13544j20166j97547
$$ 174317 -137410 -228209 55655 233372 -1627 -218612 -71375 142169 22003 -175544
88a75544J20326K61936m0476k62329q3217J68626J26254n2859q3469J2824L0379
$$ -175544 -55218 206718 166242 -96087 -179304 -10678 115576 62717 -20752 -7928 22451
99B2451k5848j2898N6267N0517n954k5402k8008l7848k884M1364J2633m4768l4103
$$ 22451 -3397 -16295 39972 90489 84535 59133 31125 -6723 -9607 31757 44390 -378 -34481
112c4481K1299L2775r443l2974P033N4751M4422P62l6564o4186l2826O7511R2952
$$ -34481 -13182 19593 10150 -22824 -15791 38960 83382 84144 47580 -16606 -49432 18079 111031
125A11031l3178j19325k1761Q9328K8842p0318p264J13196M3722j37027j02282
$$ 111031 77853 -41472 -63233 26095 54937 -15381 -22645 90551 134273 -2754 -105036
136a05036J31919J56102r6582j87156M2820J81521q311j75386l3025J52481N1103
$$ -105036 26883 182985 86403 -100753 -57933 123588 115277 -60109 -93134 59347 110450
147A10450j38597n6280J39234N1442j74612r3562J78163J48036j44277j91767
$$ 110450 -28147 -84427 54807 106249 -68363 -161925 16238 164274 19997 -171770
157a71770Q0475K01918j8308j80978n882J78322K9061j81410o4096J67641J03976
$$ -171770 -91295 110623 92315 -88663 -94545 83777 112838 -68572 -132668 34973 138949
168A38949j31947j33826P9936J48928j6312j27038j5436J08470M3689o8821l6588
$$ 138949 7002 -126824 -46888 102040 85728 -41310 -56746 51724 95413 26592 -9996
179i996M3950K1876l6270k1122K6841K6587j3710l6608j1685K5767K7002q81k2151
$$ -9996 33954 55830 19560 -1562 25279 51866 38156 1548 -10137 15630 42632 41751 19600
192A9600k3897q3K6038P167k7236o164K7557l295m1608J314N5343K0823n6942
$$ 19600 -4297 -4380 21658 28825 1589 -4575 22982 19687 -21921 -20607 34736 55559 -1383
205a383n2501L7329P3796j0893q0372j8866N9602K8169k9898j3380J7375k486
$$ -1383 -53884 -16555 57241 46348 -34024 -52890 6712 34881 4983 -8397 8978 6492
217F492j9957J2059M1528K654n5440l2335M5633M3603l2357m1740J9167K8113
$$ 6492 -13465 -1406 40122 42776 -12664 -44999 634 44237 11880 -29860 -10693 17420
229A7420j6074j6261K3023K2600j9599k9754J1846L2288q803l1324J0219K4483
$$ 17420 1346 -14915 8108 30708 11109 -18645 -6799 25489 16686 -14638 -4419 20064
241B0064k4854k6461M1622M5718l9008o6316K2431Q8378J4800r0321n2451P1155
$$ 20064 -4790 -31251 10371 56089 17081 -49235 -26804 61574 76374 -13947 -66398 4757
253D757O9812m9703p3274K9998O9034j4881o4779J380O7519K2448o3044m6881
$$ 4757 74569 24866 -48408 -18410 50624 35743 -29036 -27656 39863 62311 -733 -47614
265d7614M4604N5306k3878n2314j523K8848R620p958k397L820m776j3556M637
$$ -47614 -3010 52296 28418 -23896 -25419 3429 13049 5091 2694 6514 1738 -11818 -7181
278g181K8691P442l4155k5923J7490L1466K338k8980k1236K3487L6343j3635m1009
$$ -7181 21510 28952 -5203 -31126 -13636 17830 20168 -8812 -30048 -6561 29782 16147 -24862
291b4862Q146M7108J585n0656k0349M9441M3919m3451p4624K1689R2257J4022
$$ -24862 -16716 30392 31977 -18679 -39028 10413 54332 10881 -63743 -42054 50203 64225
303F4225q2350m0967N6264N0836k7034m5644J2513L8498j3386m2639Q924M4494
$$ 64225 -18125 -59092 -2828 48008 20974 -24670 -12157 26341 12955 -29684 -20760 23734
315B3734l812l7512K768K9504m619k3769P574K6323o487l4395N91M3194N415n5598
$$ 23734 19922 -17590 -14822 14682 10063 -13706 -6132 20191 13704 -20691 -20100 23094 28509 -27089
329b7089k1390N8871M2665l9508n1040J1863M2271P006k5301n446J9461l540k9323
$$ -27089 -48479 10392 53057 13549 -37491 -25628 16643 23649 -1652 -7098 12363 8823 -20500
342b0500J872L4601O303k5452n980J5675J119j2875K375J8743K625k5084j2646
$$ -20500 -18628 15973 22276 -3176 -9156 6519 7638 -5237 -2862 15881 18506 -6578 -19224
355a9224K8656K0236l3451l2156K8734M6685o958m7826k1057L2079L5643j2981
$$ -19224 9432 29668 -3783 -35939 -7205 39480 32522 -15304 -36361 -4282 31361 18380
367A8380l4961L373K8399n459l2247l320L3693K4657k0453m0832j368M1519J7138
$$ 18380 -16581 -13208 15191 9732 -22515 -25835 7858 32515 12062 -28770 -30138 11381 28519
380B8519l0696k1954J7307J8639q746j7681j051J2970L229p747N997J3720j4319
$$ 28519 -2177 -24131 -6824 11815 3069 -14612 -15663 -2693 536 -7211 -1214 12506 -1813
393a813k6868J1939L6729K261l2806j4027K0481J6431j5776j8917K0907L1546
$$ -1813 -28681 -16742 19987 22248 -10558 -24585 -4104 12327 -3449 -22366 -1459 30087
405C0087j7628m1721O211M4166J1496l1818k2474J8194K8926n520k9447k628K6346
$$ 30087 12459 -29262 -23051 21115 32611 793 -21681 -3487 25439 19919 -9528 -12156 14190
418A4190R534j4967o757P516J335n568l396M632Q976k830j5261n188Q140L564
$$ 14190 23724 8757 2000 9516 10851 5283 1887 6519 15495 12665 -2596 -7784 356 3920
432C920n36M254k662j2049l786R487R290l117j6467q962J5049J4293j4255j8780
$$ 3920 3384 7638 4976 -7073 -10859 -1372 7918 4801 -11666 -20628 -5579 8714 -5541 -24321
446b4321P611J6392n16r366m87R620K657j3005n985J8567J6011j5044j8893O601
$$ -24321 -16710 -318 -834 -10200 -10687 -1067 1590 -11415 -17400 1167 17178 2134 -16759 -10158
460a0158J3904J996l036m01n3k185j479O591Q930q792j6919R483K3400n164k4811
$$ -10158 3746 5742 2706 2305 2252 67 -1412 5179 14109 5317 -11602 -2119 21281 16117 -8694
475h694l371J8817R276r650j0319O791J1269j0799j7292J0332K2389l507j9595
$$ -8694 -12065 6752 16028 6378 -3941 2850 14119 3320 -13972 -3640 18749 15242 -4353
488d353o319R095R221K572n106l349L043K308n38K57k207l725N805O035q930q705
$$ -4353 -10672 -1577 7644 10216 5110 1761 4804 7112 6574 6831 4624 899 6704 12739 3809 -4896
504d896N566M818n522l311M386M944k146j1602o112R405Q773m684n694j017p321
$$ -4896 670 5488 -34 -3345 1041 5985 3839 -7763 -13875 -4470 4303 -381 -6075 -7092 -14413
519a4413l940J1428R470q115j1988J157J0738O044q519p336J1174J1510r478p885
$$ -14413 -18353 -6925 2545 -5570 -17558 -16401 -5663 381 -8138 -15474 -4300 7210 -2268 -10153
533a0153J1076P755o982n441Q202J1375N78j2872p424J1185J2553l445o800r82
$$ -10153 923 8678 1696 -3745 4457 15832 16410 3538 -3886 7299 19852 16407 9607 8625
547H625k640O1P839J990q217l963L309K777k067o922k577Q128K260j3065n257
$$ 8625 5985 6046 13885 15875 7658 3695 7004 9781 7714 792 -1785 6343 8603 -4462 -9719
562i719J0653L751j0370o029M295O851J905n244o767J767N806K416K054j601q145
$$ -9719 934 4685 -5685 -11714 -7419 -568 1337 -3907 -10674 -8907 -3101 -685 1369 -232 -8377
577h377j332J1305M194q213l819N227L836j191m775r27P383L287r587l387Q756
$$ -8377 -9709 1596 5790 -2423 -6242 -1015 2821 1630 -3145 -4072 3311 6598 -2989 -6376 2380
592B380L606o713m310M75K621M769q58o384l065K074M081M919j112r568j104J0007
$$ 2380 5986 -727 -5037 -4562 -1941 2828 1970 -4414 -7479 -5405 -1324 3595 2483 -7085 -8189 1818
608A818K821o244m21N153O38k089j313K252N574P00p146j400P773J886m087j371
$$ 1818 4639 -1605 -2026 3127 3765 1676 363 2615 8189 8889 1743 343 8116 10002 5915 4544
624D544o97j82M365J330o482l548J862K143K308j351p877k583N803P83n045l95
$$ 4544 3847 3665 8030 9360 2878 -670 1192 3335 5643 4292 -3585 -6168 -365 418 -4627 -5022
640e022K081k425k779j044R05M572R90o555k183M746K071k72J991k718l616N153
$$ -5022 -2941 -5366 -8145 -9189 -8284 -3712 -2722 -9277 -11460 -6714 -4643 -4915 -2924 -5642 -9258 -4105
656d105O047k755m652J214M520M087j212n839J68P105L83m491K148K344k724j746
$$ -4105 1942 -813 -5465 -4251 269 4356 3144 -2695 -2527 4578 4961 470 2618 4962 2238 492
672D92n3Q87L774P96o243k704L115J508p01J720j879n081J011M649j9k457k161
$$ 492 439 1326 5100 5896 -347 -3051 64 1572 871 2591 712 -4369 -3358 1291 1272 -1185 -3346
689c346l12L593J804m848j241M857n05l512K671K217k724j404Q64K33K815J395
$$ -3346 -3658 -65 1739 -3109 -4350 507 2 -3510 -839 1378 -1346 -2750 -1886 -1653 1162 2557
705B557m334k595K460J272m58J624j844l518J307K482j188L01n18k475J153L345
$$ 2557 -1777 -4372 -1912 -640 -1098 526 -1318 -4836 -3529 -1047 -2235 -1934 -2452 -4927 -3774 -429
721d29k320k120K864m00k928J744K747q82p06r85j409K898L724k190k577Q73P0
$$ -429 -2749 -4869 -2005 -2405 -5333 -3589 -842 -1724 -2430 -3415 -4824 -1926 1798 -392 -2969 -2096 -2026
738b026P43L568j792k868K174J356k000J039J930l320j306L793J513k215j487
$$ -2026 -1283 2285 493 -2375 -201 1155 -845 194 2124 -1196 -2502 1291 2804 589 -898
753h98j896K74L751P45l035k76J57k845J114L751o56j639N2k238p44L606M50k213
$$ -898 -2794 -2520 1231 1976 -1059 -1335 -1178 -4023 -2909 842 186 -1453 -1401 -3639 -4383 -777 -327 -2540
771b540J805r9l549R19L490o99k154P25P10J736K44m846j462O386K420l804j342
$$ -2540 -735 -834 -4383 -3464 26 -673 -2827 -2102 -1392 344 588 -4258 -5720 666 3086 -718 -2060
788b060Q7j603J385L595o33j652M40j748j337K701Q04n17J156p41l858M90L530
$$ -2060 -1973 -3576 -2191 1404 771 -881 -441 -2189 -3526 -825 -21 -538 618 -123 -3981 -3491 39
805C9J282j024j681k118K099L661l052m581L478L949j316j506j246j784K216L453
$$ 39 1321 297 -1384 -3502 -1403 2258 -794 -5375 -1897 2052 736 -770 -2016 -3800 -1584 1869
821A869j017j610j35j480j10K423l4r15J925m11l360J37K936J89K34Q3l174k65
$$ 1869 852 -758 -893 -2373 -2483 -60 -94 -1009 916 505 -2855 -2718 218 407 641 724 -2450 -2715
839b715M520L80l548J02J032K11J543o31k818J174J842o69m85J261j989r83K492
$$ -2715 1805 2185 -1363 -1261 -229 -18 1525 894 -1924 -750 1092 423 -62 1199 -790 -1773 719
856G19J80j785J316L20l026R71K889o26j169L64k352M24L327p19k226M54P9j068
$$ 719 899 -886 430 750 -2276 -1305 1584 958 -211 153 -2199 -1775 1552 833 -1393 -939 -860 -1928
874a928J963J146k591Q75N94k046k20L232K09k043L49p50j236L125J096k757n43
$$ -1928 35 1181 -1410 -535 59 -1987 -2207 1025 1234 -809 -460 -1210 -2446 679 1775 -982 -1525
891a525J703K73L78l90k825R98M351J1l453l61r8k8L691R11l904n26K088m55o58
$$ -1525 178 451 829 439 -2386 -1388 2963 2974 -479 -840 -938 -966 2725 3636 -268 -794 1294 839 181
910A81J136Mk05J474k583k554K778L134j237j240r54j955K344K827k745k040K350
$$ 181 1317 1321 1116 2590 7 -2547 231 3365 2128 888 -66 -2021 323 3150 405 -1635 715
927G15R38j597J63j438j302L250K444k450k238J7k85K066K007k007j594K022l72
$$ 715 1653 56 219 -1219 -2521 729 3173 723 -1515 -1498 -1783 283 2290 283 -1311 711 339
944C39k092J418J365o08J085q89l148J155L945r45j844L17k48l56J654N6k195
$$ 339 -1753 -335 1030 422 1507 618 -2530 -1375 2570 1625 -219 98 -150 -506 1148 1204 -991
961i91J351J296j043j2K15k373J080L314r92k458P67Lo49J717L05j652R94K93
$$ -991 360 1656 613 601 816 -1557 -477 2837 1845 -613 154 157 -492 1225 1530 -122 872 1165
979A165k323N74K573o23j357J43n69j71K336m88k146J342K47j722J003J669j926
$$ 1165 -1158 -584 1989 1366 9 152 -417 -588 1748 1260 -886 456 703 -1019 -16 1653 -273
996b73n97J778l02q45N33m15p01J553J37k245J418Q29k252K36K132o18o36N22
$$ -273 -870 908 606 -239 294 -121 -822 731 868 -1377 41 870 -1382 -1146 986 368 -268 254
1014B54j627K1K899k28k948Q68Q24j251J313J163j758n08J554r35n05J892j042
$$ 254 -1373 -1352 1547 1319 -1629 -761 63 -1188 125 1288 -470 -978 576 -359 -864 1028 -14
1031a4j227J803O1j894O67J373j237P0P80j092K96J176j310j711K901R48k678
$$ -14 -1241 562 623 -1271 -604 769 -468 -398 382 -710 -414 762 -548 -2259 642 1590 -1088
1048a088J82K60p58J462O18k117l9R26p45j73J604p01j526Q87N51j350Q78J006
$$ -1088 -906 -646 -1404 58 676 -1441 -1480 -554 -1299 -1472 132 -569 -2095 -1208 -657 -2007 -1129 -123
1066a23j499L80J046j517j7K269j015j740J842P38j247O14l53j120J608J404k194
$$ -123 -1622 -1242 -196 -1713 -1730 539 -476 -2216 -374 364 -883 -269 -622 -1742 -134 1270 -924
1083i24r9J601j009n88J649n56j678J319l9q83R09N12k171O61R79j639k27J966
$$ -924 -1023 578 -431 -1019 630 74 -1604 -285 -324 -1207 -298 214 -1957 -1296 -317 -1956 -2183 -217
1101b17r54j713Q97k68o1J239l80k466J018J985j467n79J515q88l08J545r05r83
$$ -217 -1171 -2884 -1987 -2255 -2316 -1077 -1457 -3923 -2905 -920 -2387 -2966 -1451 -2339 -2647 -1102 -2007 -2990
1119b990J682M54j688P18J385j599O25Q36r65K57J537j111j061J253j3r53J825
$$ -2990 -1308 -854 -2542 -1824 -439 -2038 -1413 -577 -1542 -1285 252 -859 -1920 -667 -680 -1633 192
1136A92l6k496L18J091j45qL57j493r7J661j080j240J724L19j863N49Q10j418
$$ 192 156 -2340 -2022 -931 -1076 -1084 -727 -2220 -2317 -656 -1736 -2976 -1252 -933 -2796 -2247 -1437 -2855
1154b855Q32O12j097o7J838j067j124J647J39j602J724L87j855P1J416p34K12
$$ -2855 -2023 -1411 -2508 -2575 -737 -1804 -2928 -1281 -1142 -2744 -1020 -633 -2488 -2417 -1001 -1735 -1523
1171a523J037k057m29K103q06j078Q89M64j522L21M57j110R85O70j603l36J746
$$ -1523 -486 -2543 -2972 -869 -1675 -2753 -1864 -1400 -2922 -2601 -2144 -3254 -2269 -1599 -3202 -3538 -1792
1188a792q18o22J085o59n92J535K48j470O05J322j044J60J310j250l62J706l00
$$ -1792 -2610 -3232 -2147 -2806 -3398 -1863 -1615 -3085 -2480 -1158 -2202 -2042 -732 -1982 -2344 -638 -938
1205i38r18J419n61r57J087M33j333P34J016j715o39K092o53o12O92q47j452K015
$$ -938 -1856 -437 -998 -1955 -868 -435 -1768 -1034 -18 -1733 -2372 -280 -933 -1545 -853 -1700 -3152 -1137
1223a137R9j965Q29J001j735j66J173o88j28J203n79j064J270j28j363J408N92
$$ -1137 -1038 -3003 -2174 -1173 -2908 -3074 -1901 -2589 -2717 -1514 -2093 -3157 -1887 -2015 -3378 -1970 -1378
1240a378j742R12J162j461n39J837j52r9Q49j059j383J731N29j222N74P65j413
$$ -1378 -3120 -2208 -1046 -2507 -3046 -1209 -1361 -1460 -611 -1670 -3053 -1322 -793 -2015 -1441 -676 -2089
1257b089M23O05j084R9J705j177j352J349K10q83Q77L08j421L63J115j441O3J384
$$ -2089 -1666 -1061 -2145 -2046 -341 -1518 -2870 -1521 -1311 -2194 -1317 -1009 -2430 -2067 -952 -2393 -2330 -946
1275i46n91o33R68m81r38J372K86j020J376K97k157O17J531j390N3J598q25j659
$$ -946 -1537 -2170 -1202 -1683 -2621 -1249 -963 -1983 -607 -310 -2467 -1850 -319 -1709 -1656 -58 -883 -2542
1293b542J348L82q53Q88K26j294O95R27j598J02J176m06m55Q97q03l86J187j3
$$ -2542 -1194 -812 -1665 -777 -551 -1845 -1150 -223 -1821 -1719 -543 -949 -1404 -507 -1310 -1696 -509 -522
1311e22j528J187R94j633L38R69q78l94J277o80j289J387j12m75R02j26j587R92
$$ -522 -2050 -863 131 -1502 -1164 -195 -1073 -1467 -190 -870 -2159 -772 -884 -1359 -457 -583 -2170 -1178
1329a178Q90j500J79J249j012o34J241n94q53J482k72j620O95J221q06L06N65
$$ -1178 -288 -1788 -1609 -360 -1372 -2006 -765 -1359 -2212 -730 -1002 -2622 -1927 -706 -1512 -1206 -641
1346f41j014J11J508j160m36J432k11j129J310K2j419J243J586j879o7J660j109
$$ -641 -1655 -1544 -36 -1196 -1632 -200 -411 -1540 -230 -208 -1627 -384 1202 -677 -744 916 -193
1363a93o93J328p0q80J225k29j366O57O06o08J023J96j698J27J736j022p70J229
$$ -193 -886 442 372 -508 717 488 -878 -221 385 -223 800 996 -702 -575 1161 139 -631 598
1381E98K55j359O31r7j002Q95J072j673m57J251l47l85N74p06j60J107n78j304
$$ 598 853 -506 125 28 -974 -79 993 -680 -1137 114 -233 -618 -44 -750 -910 197 -381 -1685
1399a685Q38M12j058M91P02j520l59J691n08r54J010N18r37O18r1j062J399M22
$$ -1685 -847 -435 -1493 -1002 -300 -1820 -2179 -488 -996 -1950 -940 -422 -1359 -741 -832 -1894 -495 -73
1417g3j038J83J027p41J48J501j051q21J661L98j510R90O58q23L99P98j168r3
$$ -73 -1111 -928 99 -642 -494 1007 -44 -865 796 1194 -316 674 1332 509 908 1706 538 445
1435D45J530o22q18R05O6k71Q40l63j583R70R13j526l4J205j182k26J169q26j415
$$ 445 1975 1353 535 1440 1506 1235 2075 1712 129 1099 2012 486 452 1657 475 249 1418 592 -823
1454h23J242M06j635L37M26p52J63K08j127O11R87j392r98J383l97p26J009J75
$$ -823 419 825 -810 -473 -47 -799 -636 -428 -1555 -944 43 -1349 -2347 -964 -1361 -2087 -1078 -903
1472i03j607Q64R83j298J11J297p74k89J071k38o86J709R2q35P41L15n58J247
$$ -903 -2510 -1646 -663 -1961 -1850 -553 -1327 -1616 -545 -783 -1469 240 332 -503 238 553 -5 1242
1490A242N89j475O07J827q21j141J356K44j159R70J07r70K13P51j171K37Q14j107
$$ 1242 1831 356 963 2790 1969 828 2184 2428 1269 2239 2346 1376 1589 2340 1169 1406 2220 1113
1508A113j88Q44j131o12J205n21j356R28N88j616M52O12j543K7J538o31r61J030
$$ 1113 925 1769 638 26 1231 710 -646 282 870 -746 -294 318 -1225 -1198 340 -291 -1252 -222
1526b22p37m65J168J3r89O86L26j057K01J032r68K5J421j182o76J558o65j389
$$ -222 -959 -1424 -256 -243 -1232 -546 -220 -1277 -1076 -44 -1012 -987 434 -748 -1424 134 -531 -1920
1544a920R88P62q80j5N38q94J12R27l62j72J116o54m35J032L74j011R80J127j357
$$ -1920 -932 -170 -1050 -1065 -527 -1421 -1309 -382 -744 -916 200 -454 -889 143 517 -494 486 1613 256
1563B56L00J325p24K93R84n47m77J202J48j014M86M06l84L40k41j058N94N30j180
$$ 256 556 1881 1157 1450 2434 1887 1410 2612 2760 1746 2232 2638 2254 2594 2353 1295 1889 2419 1239
1582A239l26Q77j050j505Q91J11j532M61M29j707m3J94m59K70P42j200l60J139
$$ 1239 913 1790 740 -765 126 237 -1295 -834 -405 -2112 -2155 -1961 -2420 -2150 -1408 -2608 -2968 -1829
1600a829k90o32R24J53n77Q34Q44p95K28J561o15p13J494j8l80Q60K50p16N96
$$ -1829 -2119 -2751 -1827 -1674 -2251 -1417 -573 -1368 -1140 421 -194 -907 587 569 189 1049 1299 583 1179
1619A179Q19j157M44K95p12q8J019j142l72J301l09j516R84jj247M87O26q43j46
$$ 1179 1998 841 1285 1580 868 780 1799 657 285 1586 1277 -239 745 744 -503 -16 610 -233 -379
1638c79P49n65j52M14M0l58O19J5q47J125M13q61J49O69p52J92P73q56l28R21
$$ -379 370 -195 -347 67 107 -251 368 383 -464 661 1074 213 362 1031 279 471 1244 388 60 981
1658I81k87j081Q57j10j210M97M43j032K48N13j537j33Q52m52n10Q97k93j005
$$ 981 694 -387 470 360 -850 -353 90 -942 -694 -181 -1718 -1851 -999 -1451 -1961 -1064 -1357 -2362
1676b362Q02O61j033N46P93q97K64J308m85k16J236k62m22J058L2p27R81P97n19
$$ -2362 -1560 -899 -1932 -1386 -593 -1490 -1226 82 -403 -619 617 355 -67 991 1023 296 1277 2074 1555
1695A555O0O20j053r9J209o07m98O34o72r58Q72J20r49J06N09j196k68R74j099
$$ 1555 1615 2235 1182 1083 2292 1685 1187 1821 1149 191 1063 1183 234 340 849 -347 -615 359 -740
1714g40j78Q70m91q81J069m51n18Q79K29q70K90P58o74k73J237n30m59J401m30
$$ -740 -918 -48 -539 -1420 -351 -802 -1320 -441 -212 -1082 -792 -34 -708 -981 256 -274 -733 668 238
1733B38q04J278K42j072K42R72q42j61Q02o74k48J054n68q41J055l74r78M22Q76
$$ 238 -566 712 954 -118 124 1096 254 93 895 221 -27 1027 459 -382 673 299 -679 -257 619
1752F19j207P5Q71n47l25R46r90k78J027Lj149J180J14r27Q30N90q84K83N91o41
$$ 619 -588 -513 358 -189 -514 432 -558 -836 191 194 -955 225 339 -588 242 832 -52 231 822 181
1772A81m11J000n23m26R73R6j012M86O98j398N78P61q09P2P21r57m78J140mr33
$$ 181 -230 770 247 -179 794 890 -122 364 1062 -336 242 1003 194 266 987 30 -448 692 688 -245
1792b45O16K84j380Q34P34j000K45R66r93j53J012n59m49Q59L04p26j66O32j163
$$ -245 371 655 -725 109 843 -157 88 1054 61 -92 920 361 -88 771 1075 349 183 815 -348
1811c48R54K45o69k25N14l82l32O45j81n88O09K32r98L66K80p11J86O54q10J3
$$ -348 606 851 182 -43 471 89 -243 402 221 -367 242 474 -524 -158 122 -589 -403 251 -559 -546
1831e46Q49n71q25J238o0q92Q72K68p25K07O54k67n73R42m06o54J322l24n18O54
$$ -546 303 -268 -1093 145 85 -807 65 333 -392 -185 469 202 -371 571 165 -489 833 509 -9 645
1851F45J66q07O68L78p03j36J294j222J69N44l35l17O47k7o30M23N76j044M7R58
$$ 645 811 4 672 1050 347 211 1505 283 452 996 661 344 991 964 334 757 1333 289 336 1294
1871A294p85n7P66l46o96Q80m55o23O47K09j122P10Mq98N22L41q44p5P33p95l41
$$ 1294 509 452 1218 872 176 1056 601 -22 625 834 -288 422 426 -472 50 391 -453 -528 205 -590 -931
1892i31M21k22o25O60L67j192K54O19m25l48J088n66k20Q32k3q02R92K13o15M88
$$ -931 -510 -732 -1357 -697 -330 -1522 -1268 -649 -1074 -1422 -334 -900 -1120 -288 -311 -1113 -121 92 -523 -35
1912c5K11l48J80J255q26q6R85k65m15O23k81n33J000M49j032m4N83m50j93P17
$$ -35 176 -172 8 1263 437 351 1336 1071 656 1279 998 465 1465 1914 882 838 1421 971 778 1495
1932A495o03j27O71o22p78Q81n0n41N69l70p36K52M48p84l01J011q18l90Q12n04
$$ 1495 892 765 1436 814 36 917 867 326 895 525 -211 41 489 -295 -596 415 -403 -793 19 -485
1952d85q13Q15ro01J03K13m56l3N07n12k10J025p52l49O08K61n85L38N28p45N42
$$ -485 -1298 -483 -492 -1093 -990 -777 -1233 -1266 -759 -1271 -1481 -456 -1208 -1557 -949 -688 -1273 -935 -407 -1152 -610
1973f10O91n09m92P56j30o4Q83p4o43P90K88r63P70N39p07K25M37p45J2J150o45
$$ -610 81 -428 -920 -164 -294 -358 525 451 -192 598 886 -77 693 1232 525 750 1187 442 454 1604 959
1994I59n96O45O8o15M05J90j050O01M49q53m25P86n18k70R66q49n41O55J6j065
$$ 959 363 1008 1076 461 866 1056 6 607 1056 203 -222 564 46 -224 742 -107 -648 7 23 -1042
2014a042N56O34p82k06O23r00r6J011l57q18O10J05p79K06L96p98M32J97o60O5
$$ -1042 -486 148 -634 -840 -217 -1117 -1213 -202 -559 -1377 -767 -662 -1441 -1235 -839 -1637 -1205 -1008 -1668 -1603
2034a603O52m57k02Q27m32o39J231L61j050K62J272o25K29J68m48Q5Q47K20o06
$$ -1603 -951 -1408 -1610 -783 -1215 -1854 -623 -262 -1312 -1050 222 -403 -174 -6 -454 -369 478 698 92
2053I2N37n5J09O52Rq07P99L50p88j72R10k68q72R21m95p28N03M32j472J62J29
$$ 92 629 574 683 1335 1344 537 1336 1686 898 726 1636 1368 496 1417 922 194 697 1129 -343 -181 -52
2074e2Kj24j48r35J6J047p45q28Q79m90m91Q85l89o40M50O37o81L3L91M18l86
$$ -52 -50 -174 -322 -1257 -1241 -194 -939 -1767 -888 -1378 -1869 -984 -1373 -2013 -1563 -926 -1607 -1574 -1183 -765 -1151
2095a151N88p19j38J125K59o33L69q3k96O43N54j058K07R37p74p30P67K83l74
$$ -1151 -563 -1282 -1420 -295 -36 -669 -300 -383 -679 -36 518 -540 -333 604 -170 -900 -133 150 -224
2114b24O3j85m69L82Q09n13n82O84m95M02L42q38PR55K70q92NO74p31O17Q63j070
$$ -224 -161 -346 -815 -433 376 -137 -719 -35 -530 -128 214 -624 -617 338 608 -284 -279 395 -336 281 1144 74
2136G4j9O86p0q28O60J53l99L98n76q20P57P68j244l99M54l87j20N97q37p78J077
$$ 74 55 741 671 -157 503 656 257 655 79 -741 16 784 -460 -859 -405 -792 -912 -315 -1152 -1930 -853
2157h53K27j159rO37l76L83r8m21J39J002o17l52O50K9L49N22l59q83R44J125
$$ -853 -626 -1785 -1794 -1157 -1533 -1150 -1248 -1669 -1530 -528 -1145 -1497 -847 -818 -469 53 -306 -1189 -245 880
2177H80m80n22L48J64m4Q22n74n14O74M73p63l5l9j35P27m03j129J94J239p89
$$ 880 400 -122 226 390 346 1168 594 80 754 1227 464 429 390 255 982 579 -550 -356 883 94
2197I4p49J38L51l73Q28m10j076J18J289n79o14J62M23K59J68p12k69J418m37
$$ 94 -655 -517 -166 -539 289 -121 -1197 -1079 210 -369 -983 -821 -398 -139 29 -683 -952 466 29
2216B9p53L04N13o30J061J74j399K6J470k60q91O2R3K06N00m31j075L51J102o32
$$ 29 -724 -420 93 -537 524 698 -701 -675 795 535 -356 -294 -201 5 505 74 -1001 -650 452 -180
2236a80l00K17k88R7O92q50n34R36L18n38l12N25O3K85l06n67k2J393m8o16n7
$$ -180 -480 -263 -551 -454 238 -612 -1146 -210 108 -430 -742 -217 -154 131 -175 -742 -764 629 581 -35 -92
2257i2O5K77O14l48q22L35Q90p76j74O09n48K00O57r85p58J399K35o14o78L0K99
$$ -92 -27 250 864 516 -306 29 919 143 -31 578 30 230 887 -98 -856 543 778 164 -514 -484 -185
2278a85M71J34j413K71J389k92k34k18k28k6Q56l04j105Q28P42m75l00L3J13L64
$$ -185 286 420 -993 -722 667 375 141 -77 -305 -331 525 221 -884 -56 686 211 -89 -56 57 421
2298D21M59r56o50R32Q35m88o45k15J11J010q7j594L37J230k56o44j30J35J49
$$ 421 880 -76 -726 206 1041 553 -92 -307 -196 814 727 -867 -530 700 444 -200 -330 -195 -46
2317d6Q02q35q71O73Q00r3q96N2o8N88L98p59o52R40M83o54j37k36L23P99K95
$$ -46 756 -79 -950 -277 523 430 -466 -414 -482 106 504 -255 -907 33 516 -138 -275 -511 -188 611 906
2338I06j549Q8J239l38k22l06k50O56Q49q12q43P75R33m28m05J23m20P59O78j207
$$ 906 -643 -555 684 346 124 -182 -432 224 1073 261 -582 193 1126 698 293 416 -4 755 1433 226
2358B26p32Q98Q23o82l25L5j31J153p6j538k36J560l22m63k52j11M14P18q52r67
$$ 226 -506 392 1215 533 208 243 112 1265 1189 -349 -585 975 653 190 -62 -173 241 959 107 -860
2378h60K67J199o06l21l16o4P58M11j234m10O56Q66o94J92k80M2P19p1j230M0
$$ -860 -593 606 0 -321 -637 -701 57 468 -766 -1176 -520 346 -348 -156 -436 -394 325 254 -976 -936
2398i36J279j5m96j87J6L73R84o58j050M20J269j87n60j8l27R12M15p65j225J376
$$ -936 343 328 -168 -355 -339 34 1018 360 -690 -270 999 812 252 234 -93 819 1234 469 -756 620
2418F20O25m99o14j14k76J443L21j948n3J510Ol51o47p16P60J159n04j382M19
$$ 620 1245 746 132 18 -258 1185 1506 -442 -495 1015 1021 670 23 -693 67 1226 722 -660 -241
2437b41Q92j59k27o51k76R45M05j373n43R77O31n13o8n64J92O92M25j389k26J208
$$ -241 651 492 265 -386 -662 283 688 -685 -1228 -251 380 -133 -201 -765 -573 119 544 -845 -1071 137
2457A37l2n3o60o67Q36J120o30j254M32J193j72m26j66k02J015M68j016p75J015
$$ 137 105 52 -608 -1275 -439 681 51 -1203 -771 422 250 -176 -342 -544 471 939 -77 -852 163
2476A63M53K65o25j70k34J209J05j192l15J198K80j51o15o53O65J141p77j433
$$ 163 616 881 256 86 -148 1061 1166 -26 -341 857 1137 986 371 -282 383 1524 747 -686
2494f86O06Q30m28K8j06q83J119M09j019o24O12L76p0k49o06P7Q13L42j391n8
$$ -686 -80 750 322 350 244 -639 480 889 -130 -754 -142 234 164 -85 -691 -614 199 541 -850 -908
2514i08R06M88n44k20p38L81J121o48j062N87O04L15m87m53k55R36P49j089p08
$$ -908 -2 486 -58 -278 -1016 -635 486 -162 -1224 -637 -33 282 -205 -658 -913 23 772 -317 -1025
2533a025Q35O85j10j78q76K31J249L38j291m55Q84L72k34l20o00L82J209k37j505
$$ -1025 -190 495 385 207 -669 -438 811 1149 -142 -597 287 659 425 105 -495 -113 1096 859 -646
2552f46M83R99m1k20p52j53P08R19q68j096N65O02l07j20n55l38J620o5j116m97
$$ -646 -163 836 795 575 -177 -330 378 1297 429 -667 -102 500 193 73 -482 -820 800 735 -381 -878
2572h78O47Q08m55m07p87P52R17n71r34L8Q11L67k77m25n70J044R39j289q10P99
$$ -878 -231 577 122 -285 -1072 -320 597 26 -908 -870 -59 308 31 -394 -964 80 1019 -270 -1080 -281
2592b81L78M0l52l70L9R81P44j899q1P37O77l2o06q07l8J786o00j044L64R50k19
$$ -281 97 137 -215 -585 -546 435 1179 -720 -801 -64 613 581 -25 -832 -870 916 316 -728 -364 586 367
2613C67k37j97m81P76Q43o83r99P67N77j68k93o95J06J190K66j490l17R56K23
$$ 367 130 -67 -548 228 1071 388 -611 156 733 565 272 -423 -317 873 1139 -351 -668 288 511
2632E11l9m25m64J31Q70Qj260O1N52J39K31q01n43J079N02j008n97M45N42N6j32
$$ 511 472 47 -417 -286 584 592 -668 -607 -55 84 315 -486 -1029 50 552 -456 -1053 -608 -66 -10 -142
2653a42p14k14J436J53j212l73P74N15P0j28q34L1J339j84j203K80Q12JJ69p24
$$ -142 -856 -1070 366 519 -693 -1066 -292 223 293 165 -669 -638 701 517 -686 -406 406 407 576 -148
2673a48r04J146R34o88j088M90O09R6q1p15l28P92Q67j050p30M40L38L12j90q73
$$ -148 -1052 94 1028 340 -748 -258 351 447 366 -349 -677 115 982 -68 -798 -358 -20 292 102 -771
2693g71M31R97p7j171K93K86l2N22m57r23O54J066q70l88L24K78L0M43r52n17
$$ -771 -340 657 580 -591 -298 -12 -44 478 21 -902 -248 818 -52 -440 -116 162 192 635 -317 -834
2713h34J293K04j037M5K96K36j9J73j024N2J220j5j428L06P02L1K44n55q83M86
$$ -834 459 663 -374 -329 -33 203 184 357 -667 -615 605 590 -838 -532 170 201 445 -110 -993 -507
2733e07J572j022q18M82L28L40j87k34o77J125M28r18k99L58O51k48n3j074r0
$$ -507 1065 43 -775 -293 35 375 188 -46 -723 402 830 -88 -387 -29 622 374 321 -753 -843
2752h43J577K0j110l8M55Q8M31n80q83P90R24o04p69N80R7P4L33o62m37Q88N92
$$ -843 734 754 -356 -394 61 149 580 0 -883 -93 831 227 -542 38 135 209 542 -120 -557 331 923
2773I23j242m58Q03Q9K58k38j034N36P46J06r51O7K44L70M00o27r25P94R60p18
$$ 923 -319 -777 26 115 373 135 -899 -363 383 489 -462 -395 -151 219 619 -8 -933 -139 821 103
2793A03n05L53J75J1L51o60p30J130M92q23n63M10K92L60K17j114k6R15m9o70
$$ 103 -402 -49 126 137 488 -172 -902 228 720 -103 -666 -256 36 396 613 -501 -527 388 339 -331
2813c31m8L75j93L78m8q69M17J174p14m47K41MN43J47q48m82J005J63n99N5l1
$$ -331 -379 -4 -197 181 133 -736 -319 855 141 -306 -65 -61 482 629 -219 -701 304 467 -132 -77 -108
2834a08l7O25k0r11k27J634m97p12k58J44M38K54l88m85L07P67l68o10K02M22
$$ -108 -145 480 460 -451 -678 956 459 -253 -511 -367 71 325 -63 -548 -241 526 158 -452 -250 172
2854A72J56r9m26o11J102N04q68M1j28k4L01L41q41j18Q63J11p48J52R6M5N70
$$ 172 328 229 -197 -808 294 798 -70 -29 -157 -181 120 461 -380 -498 365 476 -272 -120 -24 21 591
2875E91n61o71M46O77k58l70J1l6p2R48r25m83P45N73l77m33k02M48jL41p52J
$$ 591 30 -641 -195 482 224 -146 -135 -171 -243 705 -220 -703 42 615 238 -195 -397 51 50 391 -361 -360
2897c60R37m33n55J37K47j64P12n22o41O25N90l89m07jJ55R0K63m49m46R13l7
$$ -360 577 144 -411 -274 -27 -191 521 -1 -642 -17 573 184 -223 -224 -69 21 284 -165 -611 302 265
2918B65n49q5r5K36P57l16q05J74R69k93n05J03O6j25Q15l29j139N77J058o78
$$ 265 -284 -369 -464 -228 529 213 -592 -418 551 258 -247 -144 -78 -203 612 283 -856 -279 779 101
2938A01k05m8J57K4O81r19l02Q08K74p82J88j85P0O29J53r09l89R26K77o32R1
$$ 101 -104 -152 5 29 710 -209 -511 297 571 -211 -23 -208 -138 491 644 -265 -654 272 549 -83 8
2959Hj63j9P59o91l08K35Q41p87r7j1j46L83M34o89m26N44N19o42k14M14l80R21
$$ 8 -155 -174 585 -106 -414 -179 662 -125 -222 -233 -379 4 438 -251 -677 -133 386 -256 -470 -56 -436 485
2981D85J8q69M9R54k66m64l8j81K17M90j14q82M60N61l48j27J14m17K60M48m23
$$ 485 503 -366 -317 637 371 -93 -131 -312 -95 395 281 -601 -141 420 72 -55 59 -358 -98 350 -73
3002g3k88R18k60k88q7j17k89P27L20p00j83N11J28m68M18o70M37N05m20o54L25
$$ -73 -361 557 297 9 -78 -195 -484 243 563 -137 -320 191 319 -149 269 -401 36 541 121 -533 -208
3023b08N89j84k23J74n15M38N69o80n26N03M25l78K57n89Q6N94l7o15QM18k3k14
$$ -208 381 197 -26 148 -367 71 640 -40 -566 -63 362 -16 241 -348 -262 332 295 -320 -312 106 83 -131
3045a31M82n39j19L17M19r63L25J75K6k95J54j03N27K62r06l34Q17J01o4l34N12
$$ -131 351 -188 -307 10 429 -534 -209 -34 -8 -303 -149 -252 275 537 -369 -703 114 215 151 -183 329
3066C29o93N00K35n55p5M48l2j93L59l83p9M94J65j090N14L03k38J04o9l41K48
$$ 329 -364 136 371 -184 -259 189 157 -36 323 -60 -139 355 520 -570 -56 247 9 113 44 -297 -49
3087d9P66m64m32L97J60m68K73k72l11N21J97m16k64O27j71l76N74p87q7Q58N2
$$ -49 717 253 -179 218 378 -90 183 -89 -400 121 318 -98 -362 265 94 -282 292 -495 -582 276 328
3108C28j004P43K1l03M46k95l09L35N34l55l44K69R7k6n6K9k37L22M25p46l5O34
$$ 328 -676 67 88 -215 231 -64 -373 -38 496 141 -203 66 163 137 81 110 -127 195 620 -126 -161 473
3130D73l49J48K0k71k95P55j49n91O6P46k78j85P9m40L11O65o72j91M17j27q9
$$ 473 124 272 292 21 -274 481 332 -259 -193 553 275 90 169 -271 40 705 33 -158 259 132 43
3151D3J58l85m4M67J19m18j92N80n50K80K45l22n29R95j63p59M49N04k92k29K09
$$ 43 201 -184 -228 239 358 -60 -252 328 -222 58 303 -19 -548 447 284 -475 -26 478 186 -43 166
3172A66l89K24N72m11k57K38j33R9K69j20o64P80K35q28L31L91k73j54K13j91
$$ 166 -223 1 573 162 -95 143 10 109 378 258 -406 374 609 -219 112 503 230 76 289 98
3192I8m03N02K73m90k32N01j85J33O3m11J23N62l44k06N43l16p0L52l43k10L75
$$ 98 -305 197 470 -20 -252 249 64 197 260 -151 -28 534 190 -16 527 211 141 493 150 -60 315
3213C15J52l36lJ06j85l3R6j55J39N16l03o51L95K47j03J52l36n87N10K51l62
$$ 315 467 131 128 234 49 16 112 -43 96 612 309 -342 53 300 197 349 13 -574 -64 187 -175
3234a75oM75J43n28L88j09l58M77N7l74J55K42m09O4k1K8k70M04k3l83J94K90
$$ -175 -181 294 437 -91 297 188 -170 307 364 -10 145 387 -22 42 21 49 -221 183 160 -223 -29 261
3256B61j72J51N6n25M45J69j00l91L72j30o13Q25l88l05M19M57n44j46K81j89
$$ 261 89 240 296 -229 216 385 285 -106 266 136 -477 348 -40 -345 74 531 -13 -159 122 -67
3276f7l8K48l5k04L55j16k54L28k31j6K55Ol52J84O32o10l4K39k31j73L12J35
$$ -67 -105 143 108 -96 259 143 -111 217 -14 -30 225 231 -121 63 695 85 51 290 59 -114 198 333
3298C33m89M06K34n15j64N60m15J72P7l0J01j3k05J35K6p1J80j58L19m61q5N55
$$ 333 -156 250 484 -31 -195 365 -50 122 199 169 270 257 52 187 213 142 322 164 483 22 -63 492
3320D92n13j39M06J58n18O38m13k83N21l10l01M14K6l43J41K61l58k48N50M3n50
$$ 492 -21 -160 246 404 -114 524 111 -172 349 39 -262 152 178 -165 -24 237 -121 -369 181 224 -326
3341c26L37J28j61J74r3q4L9K22l12j3J69kk28L24J93o03K08M88l43p4J02J61
$$ -326 11 139 -22 152 59 -25 14 236 -76 -89 80 78 -150 174 367 -236 -28 460 117 43 145 306
3363C06l35N11k57m9K93n28N0L29l47R4K11j88l22L61j8k01J44L29m67L1K48k21
$$ 306 -29 482 225 176 469 -59 -9 320 -27 67 278 90 -232 129 111 -90 54 383 -84 -53 195 -26
3385b6k48K2P04m44kO2J37m75K21jj32K90p1m3L43m9k89K64k8p39L39K65m29k9
$$ -26 -274 -252 452 8 6 68 205 -270 -49 -50 -182 108 37 -6 337 288 -1 263 235 -504 -165 100 -329 -358
3409c58J76K82n12M15M1k49K27j11k31M59K06o65M20K1q4j57K21l3k45N44J81
$$ -358 -182 100 -412 3 44 -205 22 -89 -320 139 345 -320 100 121 37 -120 101 68 -177 367 548
3430E48o93M14L00k16k54K63j03j10J45j27J93J86q4p91O91m08j35L10O0l03m2
$$ 548 -145 269 569 353 99 362 259 149 294 167 360 546 462 -329 362 -46 -181 129 189 -114 -156
3451a56K40k06j86M31k13l46K19P0l32K64p5O6j17K90l90L53K76m88j52M81J83
$$ -156 84 -122 -308 123 -90 -436 -217 -147 -479 -215 -290 -224 -341 -51 -441 -88 188 -300 -452 29 212
3472B12n81N47K5n01L31J60j33l61O09m70J4K96j42k22M78j62k22K62j64m76O38
$$ 212 -369 178 203 -298 33 193 60 -301 308 -162 -148 148 6 -216 262 100 -122 140 -24 -500 138
3493A38j5l57M55K27m02k84N58j98q2J10q0L5J7L02m76L99m8j99K75M0k26l53
$$ 138 123 -234 221 448 46 -238 320 122 40 150 70 105 122 424 -52 347 299 100 375 415 189 -164
3515a64M38P2n71M46M5l10L23o3j33j81L52j25m32L65j40m96M03K74m06Q9K90
$$ -164 274 346 -225 221 266 -44 279 216 83 -98 254 129 -303 62 -78 -574 -171 103 -303 -214 76
3536G6m30K30K15l42l32O71k31l90P56k25k69K72o4k05J98M48m80K7K01j69R6
$$ 76 -354 -124 91 -251 -583 88 -143 -533 223 -2 -271 1 -63 -268 -70 378 -102 -75 126 -43 53
3557E3K60m22j32Q35m37l20K66J56l90l7N38k62O7K63p13L74r0N62o20J66J41
$$ 53 313 -109 -241 594 157 -163 103 259 -131 -168 370 108 175 438 -275 99 9 571 -49 117 258
3578B58n18L49o5k35L1K79l40M1O22m91j67J28L53j64N6l93K42j83L56k60k21
$$ 258 -260 89 24 -211 -180 99 -241 -200 422 -69 -236 -108 245 81 137 -256 -14 -197 159 -101 -322
3599c22J47K80l87K08l5r5K84l10j83L69L01l39L1L43k45l69K98k13J4L43J01
$$ -322 -175 105 -282 -74 -109 -204 80 -230 -413 -44 257 -82 -51 292 47 -322 -24 -237 -223 120 221
3620B21m17L53N1m57K97J28k17K14K8m6J6q4J50k78L25k53l23R0P25n37r4RK30
$$ 221 -196 157 208 -249 48 176 -41 173 201 155 171 87 237 -41 284 31 -292 -202 523 -14 -108 -99 131
3643A31o02N40k5j42K79k49j21M27J38p73L20L55l44j38M60m9j62j90M7O0J21
$$ 131 -471 69 44 -98 181 -68 -189 238 376 -397 -77 278 -66 -204 256 207 45 -145 -98 -38 83
3664H3J09l81J50J3j46Q3J92j10j65J34j83j06K93L37m00n9L85m49M4K28Q0l45
$$ 83 192 -189 -39 -26 -172 -89 103 -7 -172 -38 -221 -327 -34 303 -97 -156 229 -220 -176 52 132 -213
3686b13K59q7P6P2l24K70K19j50m95P96o9k63Q6J7l79K43K84n12J74r7M48k26
$$ -213 46 -41 35 107 -217 53 272 122 -373 423 354 91 177 194 -185 58 342 -170 4 -93 355 129
3708A29j51L30p24N14J58n41J34J34j19QJ92r3k64N70n08l7M54j06k66M1N80m17
$$ 129 -22 308 -416 98 256 -285 -151 -17 -136 -128 64 -29 -293 277 -231 -268 186 80 -186 -145 435 18
3730A8QL13k65j04l6L77m53L97q6o3q0J04p7qJ72j12k07K67j53o9j03N66n60N2
$$ 18 26 339 74 -30 -66 311 -142 255 169 106 26 130 53 45 217 105 -102 165 12 -57 -160 406 -154 -102
3754a02R5j58oK35j94r2K87m6l85K46L13n88L67J0j29J66K14n64L10L05l80k58
$$ -102 -7 -165 -171 64 -130 -222 65 19 -366 -120 193 -395 -28 -18 -147 19 233 -331 -21 284 -96 -354
3776c54M79k14kK7P2l47M61J07n96M25K57k59j26oJ03o2K06L1j65n5lJ21RJ75
$$ -354 125 -89 -91 -64 8 -339 122 229 -367 58 315 56 -70 -76 27 -35 171 202 37 -18 -21 100 109 284
3800B84n33K33Lk09J45M53l45l91N43k3n90M65j13J02n9J87l49j3N91l72j12J19
$$ 284 -249 -16 -13 -222 -77 376 31 -360 183 160 -430 35 -78 24 -35 152 -197 -210 381 9 -103 16
3822A6j03j24L27mm47J59L05l40N9R5J13l52L17l20K98j24J16l81O17Kk15l8K52
$$ 16 -87 -211 116 112 -335 -176 129 -211 -152 -57 56 -296 21 -299 -1 -125 -9 -390 227 229 14 -24 228
3845B28l49J72J54nm59N38j77l43k0K71r4J71L35m94L58N0l53l99N65j79k10M59
$$ 228 -121 51 205 200 -259 279 102 -241 -261 10 -84 87 422 -72 286 336 -17 -416 149 -30 -240 219
3867B19O9k92J10J49l11K08J18m62o5J04N3r8J97k67qK69J51j0j82M52l35j49
$$ 219 288 -4 106 255 -56 152 270 -192 -257 -153 -100 -198 -1 -268 -276 -7 144 134 -48 404 69 -80
3889h0J64j16n75N94j06l66L48K20k41N3J18m19K64M6K1J46j04k7k07L67j74j72
$$ -80 84 -32 -607 -13 -119 -485 -137 83 -158 -105 13 -406 -142 -96 -75 71 -33 -60 -267 100 -74 -246
3911b46K63o6q2L77R6n48K16J30j10OL50k11J8L6l13K01K30m0l88K71J16r4l06
$$ -246 17 -49 -131 246 342 -206 10 140 30 36 386 175 193 229 -84 117 347 307 -81 190 306 212 -94
3934i4J55p6o6L52k34k32L35j13l93K67L73l97J29J36j73M4K59l99J8J89j65j59
$$ -94 61 -15 -81 271 37 -195 140 27 -366 -99 274 -123 6 142 -31 13 272 -127 -109 80 -85 -244
3956b44J81mj41J19L61m22J05M2J92k67K20m32L72J09j77l34K29J28k60R5L14
$$ -244 -63 -67 -208 -89 272 -150 -45 -3 189 -78 142 -290 82 191 14 -320 -91 37 -223 -128 186
3977A86m04J20J68k48L3L58k56m30K59J95M4N8K74m97K01K42m49J80K17Mj42K18
$$ 186 -218 -98 70 -178 -145 213 -43 -473 -214 -19 25 83 357 -140 61 303 -146 34 251 255 113 331
3999C31l46k5J34J84k05j34J45j68M9K20q5k40j80J26j28L73l92NK20J23l45L34
$$ 331 -15 -40 94 278 73 -61 84 -84 -35 185 100 -140 -320 -194 -322 51 -341 -336 -116 7 -338 -4
4021dK36o65M26l3j42m4K17j07q4J06K64l44J75K1l00q4Q51p68j12O02j29l89
$$ -4 232 -433 -7 -40 -182 -226 -9 -116 -200 -94 170 -174 1 22 -278 -362 489 -279 -391 211 82 -307
4043c07N15k47k67J91K63m91L23M00m33J46J22l54L82j75p4j60L73j73J7J37q2
$$ -307 208 -39 -306 -115 148 -343 -20 380 -53 93 215 -139 243 68 -6 -166 207 34 51 188 106
4064A06j87O7L0k6m5K59k17j30K69j79jl6K50m20J74K84j05j79K14k99ML53k63
$$ 106 -81 -14 16 -10 -55 204 -13 -143 126 -53 -54 -90 160 -260 -86 198 93 -86 128 -171 -167 186 -77
4087g7l03L39K80l31k31P30m89J86J88n03j0K96m32L7M88p3l08K59N5k50L93O3
$$ -77 -380 -41 239 -92 -323 407 -82 104 292 -211 -221 75 -357 -320 168 95 -213 46 101 -149 244 307
4109C07n5l83K72k52r3M42l91J10k2Q5j28J68L73n51K96l5q2J32R5k40k96O30
$$ 307 252 -131 141 -111 -204 238 -153 -43 -65 20 -108 60 433 -118 178 143 61 193 288 48 -248 382
4131C82mn18J91J83k90j35N05l50j30K06j47k33L93R2k87K29J27n48L85M1j82
$$ 382 378 -140 51 234 -56 -191 314 -36 -166 40 -107 -340 53 145 -142 87 214 -334 51 92 -90
4152i0m4K22j04k65N49j80m86K94K06k61q4Q6j47K47n4L43o42M64l5l7J52j98
$$ -90 -134 88 -16 -281 268 88 -398 -104 102 -159 -243 -157 -304 -57 -111 232 -410 54 19 -18 134 -64
4174f4j48J94j12l48M70Q0l57N52p0k12k30M64k86N3J81l48k7M16On34K16J87
$$ -64 -212 -18 -130 -478 -8 72 -285 267 197 -15 -245 219 -67 -14 167 -181 -208 208 214 -320 -104 83
4196H3j98j28K90j34j68M33no38O62k83k8J82L3o7J2R5m26L25n1k40j41M82q0
$$ 83 -115 -243 47 -87 -255 178 173 -465 197 -86 -114 68 101 34 46 141 -285 40 -11 -251 -392 90 10
4219A0J24o2J25n24N49J1j49m49O24m57L73k73K74j10l48N81m44J99L4j01j77
$$ 10 134 72 197 -327 222 233 84 -365 259 -198 175 -98 176 66 -282 299 -145 54 88 -13 -190
4240a90J23l16L64K28l60q9L75l45J47p7L42m79J72L24j84k68K23l03K48Q5l93
$$ -190 -67 -383 -19 209 -151 -240 135 -210 -63 -140 202 -277 -105 219 35 -233 -10 -313 -65 20 -373
4261c73J76K48k8l84N34j18q3K69J79n09K3K72k74l34N65j54j93J85j35J97q3
$$ -373 -197 51 23 -361 173 55 -28 241 420 -89 -66 206 -68 -402 163 9 -184 1 -134 63 -20
4282b0j5j01k10L92j71P5J28J25k98J39k0p0N5L81l79k86N22l8l38M61n98J59
$$ -20 -35 -136 -346 46 -125 -50 78 203 -95 44 24 -46 9 390 11 -275 247 209 -129 332 -266 -107
4304a07K50j18j51K20J45m88L00L9m44L05K83m39O2K83j05j49J84j8r2m9k00L36
$$ -107 143 25 -126 94 239 -249 51 90 -354 -49 234 -205 -143 140 35 -114 70 52 -40 -89 -289 47
4326D7J21O9k21n6n9k0j7J52r2r9N01m03r3N8L07o59N25lk62K47K42k14k38j03
$$ 47 168 237 16 -40 -99 -119 -136 16 -76 -175 326 -77 -170 -112 195 -464 61 58 -204 43 285 71 -167 -270
4350b70J68r5K74j14J23j21J11o6j61K50j0l24L23o9J01j55Nmj31K52k48J23r
$$ -270 -102 -197 77 -37 86 -35 76 10 -151 99 89 -235 88 19 120 -35 -30 -34 -165 87 -161 -38 -47
4373d7j55L00k97j32M66j00j48j22J42P5j03j11K0N1K00p2l33K20R8j33J73KJ85
$$ -47 -202 98 -199 -331 135 35 -113 -235 -93 -18 -121 -232 -212 -161 39 -33 -366 -146 -48 -181 -8 -6 179
4396A79k50L13J92q09M99k71J28r7L41l54j45O73l22K0l8r2j0J58r7l55L41p9
$$ 179 -71 242 434 -375 124 -147 -19 -116 225 -129 -274 399 77 97 59 -33 -43 115 18 -337 4 -75
4418g5J23M8j98J87k16J46K85n39J67J52k91M24Q1l16l44M90r2m54L87P0r0L58
$$ -75 48 96 -102 85 -131 15 300 -239 -72 80 -211 213 294 -22 -366 124 32 -422 -35 35 -55 303
4440C03o5n04Q2L25k52k25L23j60k71N11k11K9J02J06n94M72K33k56o3K30m59
$$ 303 238 -266 -184 141 -111 -336 -13 -173 -444 67 -144 -115 -13 93 -501 -29 204 -52 -115 115 -344
4461c44K72j17L32l70K72n5n8Q9j85j09P1L29m00L28%j16N1O4j60q6K61p0j62
$$ -344 -72 -189 143 -227 45 -10 -68 21 -164 -273 -202 127 -273 55 55 -61 -10 54 -106 -192 69 -1 -163
4484a63L13L5j21J14n6j23J11L3l7k10J88j16j44RN22n41oM38n48J46J0m1j17
$$ -163 150 185 64 178 122 -1 110 143 106 -104 84 -32 -176 -167 355 -186 -192 246 -302 -156 -146 -187 -304
4507c04M75j50l66J63J69j58j25N03l13j21M99n20J42L07k96l06N08j04m89M79
$$ -304 171 21 -345 -182 -13 -171 -296 207 -106 -227 272 -248 -106 201 -95 -401 107 3 -486 -7
4527gJ9l84K71K54l67M3J89Op7J88o60M72K67J78m59L35j36k07J22J39k44r2K9
$$ -7 12 -372 -101 153 -214 -171 18 24 -53 135 -525 -53 214 392 -67 268 132 -75 47 186 -58 -150 -121
4550a21j23Q2L99l93K50j88K95m21N6O7K43L8k12o7J95j93j57K89P9k2k00J18
$$ -121 -244 -162 237 -156 94 -94 201 -220 -164 -97 146 184 -28 -95 100 -93 -250 39 118 96 -104 14
4572A4R9k80l2M05l23J55J00j95m2L83n23J36j22L37r2o0J57k47L25l64j10J22
$$ 14 113 -167 -199 206 -117 38 138 -57 -99 284 -239 -103 -225 112 20 -40 117 -130 195 -169 -279 -157
4594a57J71j20m9pK41j31J51l2k43K10K5P5j96K73j82j9P6n2qK97l15J57l13K93
$$ -157 14 -106 -155 -162 79 -52 99 67 -176 34 59 134 -62 211 29 10 86 34 26 323 8 165 -148 145
4618A45l56K21K44k22O0N6l87N3K42J62l10j3M48o75N36Rj23k97K41p1j75L76
$$ 145 -211 10 254 32 92 148 -239 -186 56 218 -92 -105 343 -332 204 213 90 -207 34 -37 -212 164
4640A64k46J3L5l1n1j03O16o74K13L02l87J95NOL9n9J5r9j06K02k16L48J00m92
$$ 164 -82 -69 -34 -65 -116 -219 397 -277 -64 238 -149 46 51 57 96 37 52 -47 -153 49 -167 181 281 -211
4664b11J55L07l13O5J92j05k74J84J88k95J61Q8l16L85q2K2k10j8Q8q2O4K5k42
$$ -211 -56 251 -62 3 195 90 -184 0 188 -107 54 142 -174 211 129 151 -59 -77 11 -71 -7 18 -224
4687b24K07J12j62O2Q0l10J7L09K26l50P0j93J51J19k9j55Q3J24l28o5L13k48
$$ -224 -17 95 -67 -5 75 -235 -218 91 317 -33 37 -156 -5 114 85 -70 13 137 -191 -256 57 -191
4709a91J14J81j74K6M40j97p1J62k75K4K09j59M7J14k13o4j43L44K0l77L12Ol25
$$ -191 -77 104 -70 -44 396 199 128 290 15 39 248 89 136 250 37 -27 -170 174 194 -183 129 135 -190
4732a90L95j85M9r0pL3j57L17k21j09N48m22L9J6ro9r1J94j44or6l8L9J90J37
$$ -190 205 20 69 -21 -28 5 -152 165 -56 -165 383 -39 0 16 7 -62 -153 41 -103 -109 -205 -243 -204 -14 123
4757A23k09M4k17j23M39q7r5J2L22m9l23R6j56J39J4Q3j14J11K23j84O4M7l13
$$ 123 -86 -42 -259 -382 57 -30 -125 -113 209 160 -163 -67 -223 -84 -70 13 -101 10 233 49 113 160 -153
4780a53J92K42l66m1Mj82K30L06ln58J01K70l21M50M6l72J60J04J69l72Pql7k5
$$ -153 39 281 -85 -126 -122 -304 -74 232 229 -329 -228 42 -279 171 217 -155 5 109 278 -94 -87 -95 -132 -157
4804a57n4K92j91P7k80N17R4m42o7J49k55J37J43n2k21q6O26n62L51J24k18K25
$$ -157 -211 81 -110 -33 -313 204 298 -144 -211 -62 -317 -180 -37 -89 -310 -396 230 -332 19 143 -75 150
4826A50j37k83J28K68j21j46M85l81Q0kN0m02J37K96Mk99J24J65r5JK54l39J75
$$ 150 13 -270 -142 126 5 -141 344 -37 43 41 91 -311 -174 122 126 -173 -49 116 21 22 276 -63 112
4849A12k18J13o1j64p5L77J83p51L28K41j34k11M79k68l5o6K20j72j4n0K24O0
$$ 112 -106 7 -54 -218 -293 84 267 -484 -156 85 -49 -260 219 -49 -84 -150 70 -102 -116 -166 58 118
4871A18j85j16L2K20k0k26K48J52j74QQ1j33k4Kl44J53M93l76k37K84K5J3L5L01
$$ 118 -67 -183 -151 69 49 -177 71 223 49 57 138 5 -19 -17 -361 -208 285 -91 -328 -44 -19 -6 29 330
4895C30n11M98n6j87q0k39K07Q4K66j91K7K37j99l32K63k65J77L8M9l5l96L20
$$ 330 -181 317 261 74 -6 -245 -38 46 312 121 148 385 186 -146 117 -148 29 67 116 81 -315 5
4917Eq5N0m5J10j76L22L15p47K98j06R4PK08k48l3K30j66l17M15k93J04K52p2
$$ 5 -80 -30 -75 35 -141 181 496 -251 47 -59 35 42 250 2 -31 199 33 -284 131 -162 -58 194 122
4940A22l48J74O9o2K5L98j87m7l0P3j78o2K45l53J12J85l6l15K64P5j0k12J98
$$ 122 -226 -52 17 -45 -20 378 191 144 114 187 9 -53 192 -161 -49 136 100 -215 49 124 114 -98 100
4963A00k66J99N0o31L84L0l6K85N6R6m51J87Q1J08j52n6j52L00L8j30l63L65k49
$$ 100 -166 33 83 -548 -164 -134 -170 115 171 267 -184 3 84 192 40 -16 -168 132 170 40 -323 42 -207
4986b07L17k35L8K62P6k18j8k6K48l29L57l86J57J47k12j10l3K5K91l12N6Q5j07
$$ -207 110 -125 -87 175 251 33 15 -11 237 -92 265 -121 36 183 -29 -139 -172 -147 144 -168 -112 -27 -134
5009a34N48l45j49J8%k49K45M5k86L20K92m13P1L45kk62J7j65J28j49K19p1k66
$$ -134 414 69 -80 -62 -62 -311 -66 -21 -307 13 305 -108 -37 308 306 44 61 -104 24 -125 94 23 -243
5032b43N85mk21r2j44j19N01l8k10oK3j17J17J02k02K27K2l97K56k4J66k34K36
$$ -243 342 338 117 25 -119 -238 263 225 15 9 32 -85 32 134 -68 159 181 -216 40 16 182 -52 184
5055A84J08j81O3n1p4l0j37K62n6Kr9m5O1J91n41J84j58M16k41M05l78J27M12
$$ 184 292 111 174 123 49 19 -118 144 88 90 -9 -54 7 198 -343 -159 -317 99 -142 263 -115 12 424
5078D24o44j30J58J73O0J51k11J37m84N81l85R8p1O5J3J77j25j37L91n11J6J72
$$ 424 -220 -350 -192 -19 41 192 -19 118 -366 215 -170 -72 -143 -78 -65 112 -13 -150 241 -270 -254 -82
5100h2p3O7j65J12P3K74j14o8J0j45O0j28K93j39Q1K76m53K51j18j86L29j51P2
$$ -82 -155 -88 -253 -141 -68 206 92 24 34 -111 -51 -179 114 -25 56 332 -121 130 12 -174 155 4 76
5123G6J5l41P07n75J20J44J25m39K94M6k09k61M04j87NJ82j20k78K4K27qK56j65
$$ 76 91 -250 457 -118 2 146 271 -168 126 172 -37 -298 106 -81 -76 106 -14 -292 -268 -41 -49 207 42
5146D2k90j81O75k72L6L0O7j83J75m02N18k35Q6Lm7j17K54j17J14r3r6P2J31l25
$$ 42 -248 -429 246 -26 10 40 107 -76 99 -303 215 -20 66 69 22 -95 159 42 156 63 -33 39 170 -155
5170a55J32Lj04N11l91j23K17j03P2j33r3J99o1K21j84j5P9M3j15J23k09o0L38
$$ -155 -23 -20 -124 387 -4 -127 90 -13 59 -74 -167 32 -29 192 8 -7 72 115 0 123 -86 -146 192
5193A92J62m56l1L19j24j98K0K9p3K21J14j91p0j32L61l45N94o12k3L07q3k96
$$ 192 354 -102 -133 186 62 -136 -116 -87 -160 61 175 -16 -86 -218 143 -202 392 -220 -243 64 -19 -315
5215c15L44n1j24K97q3K3k06J84J27n05J35L85j20J70k19l79O52k37m5J46k51
$$ -315 29 -22 -146 151 68 91 -115 69 196 -309 -174 211 91 261 42 -337 315 78 33 179 -72
5236g2k9M8R8j79J12N9J50j67J32j08Q5J69n96J59R3R1J13j91J64l32j88M49j53
$$ -72 -101 -53 45 -134 -22 37 187 20 152 44 129 298 -298 -139 -46 45 158 -33 131 -201 -389 60 -93
5259i3j13K69l0j67l9R9M9n0Q5J9k2Q8o4k99K10L5J03o8o4K1J74L4l08Q7P2M2
$$ -93 -206 63 33 -134 -173 -74 -25 -75 10 29 7 95 31 -268 -58 -23 80 12 -52 -31 143 177 -131 -44 28 70
5285G0j57L05q5k09J19J10k22K17j39J01p1l9q8k6K90l9rL2k38k33K98Jo5K1L0
$$ 70 -87 218 133 -76 43 153 -69 148 9 110 39 0 -88 -114 176 137 128 160 -78 -311 -13 -12 -77 -56 -26
5310b6k7j16J75J99l04RK81k51J54j60l7M2M16n5l32J96l50L86k9k26k6N4r8J22
$$ -26 -53 -169 6 205 -99 -90 191 -60 94 -66 -103 -61 355 300 -32 164 -186 200 171 -55 -81 -27 -125 -3
5334cm5J12j61k16N46j30j12R8K2q9Q9o0j16L73m55J67j04l6P1j28J54lL4K44
$$ -3 -48 64 -97 -313 233 103 -9 89 111 22 111 51 -65 308 -147 20 -84 -120 -49 -177 -23 -26 8 252
5358B52j11m0o47P36n24M46j77k07K84N1k28Q3L01J11m36M14m3l74j05K98j83
$$ 252 141 101 -546 190 -334 112 -65 -272 12 63 -165 -82 219 330 -106 308 265 -109 -214 84 -99
5379i9J84k4j39J49K08m72J77J26K9k16K61j36J29Qk09l08M16M4k78J03Q1N7k35
$$ -99 85 61 -78 71 279 -193 -16 110 139 -77 184 48 177 185 -24 -332 84 128 -150 -47 34 91 -144
5402a44J75K31m33n4M04k97j24N41o71K96J25l18OM18k93N8K7J13k89J51K05k97
$$ -144 31 262 -171 -225 179 -118 -242 299 -372 -76 49 -269 -263 155 -138 -80 -53 60 -229 -78 127 -170
5424a70K41J2Nl17N64j68p4j28Q1j78K42L37l22p7l60L71k8j08J09l13L18k97
$$ -170 71 83 88 -229 335 167 93 -35 46 -132 110 447 125 48 -312 59 31 -77 32 -281 37 -260
5446b60J72K07l31K04r1K6J88J8L00j64k55o2j05K49L41m80lj52M21l37p8K3Q0
$$ -260 -88 119 -212 -8 -99 -73 115 133 433 269 14 -48 -153 96 437 -43 -46 -198 223 -114 -192 -169 -89
5469h9J92J68m53K1N9K61l80J53J2K88l49K61J44k04j3L05n60K60j71K22k1l29
$$ -89 103 271 -182 -161 -102 159 -221 -68 -56 232 -117 144 288 84 71 376 -184 76 -95 127 106 -223
5491b23k1J89M21m29J3j21r4M8L85l33K93l6l60K9J79M31l43jQ0j3j94K24l7j32
$$ -223 -244 -55 366 -63 -50 -171 -265 -217 168 -165 128 92 -268 -239 -60 371 28 27 107 94 -100 124 87 -45
5515d5K47k90M8Oj50n6M06n8k56j0K00Mj24J94J2j53P5k38M2K03J02k51m9N3k25
$$ -45 202 -88 -40 -34 -184 -240 166 108 -148 -158 42 46 -78 116 128 -25 50 -188 -146 57 159 -92 -141 -88 -313
5540c13J03N33j76k53L45l38J38K25J5j16k84L81j7J6j58j45J22J44j52nj8lk5
$$ -313 -210 323 147 -106 239 -99 39 264 279 163 -121 260 243 259 101 -44 78 222 70 65 47 44 19
5563A9j74K14j75K57J62m54N5L58l88L97l52k5K01j50J6k20J22J68l9L01k77k52
$$ 19 -155 59 -116 141 303 -151 -96 262 -126 271 -81 -106 95 -55 -39 -259 -137 31 -8 293 16 -236
5585b36n6M82j53N1M5k90J11M7L5q0R1L03m16l22O84r3l75N44p24R4L78l8k75
$$ -236 -292 190 37 88 133 -157 -46 1 36 -44 47 350 -66 -388 296 203 -172 372 -352 -258 120 82 -193
5608a93J18K87l92L31j00j0j88K15j60k0J45r5j89M64j68M4K24j38j81P2j28J37
$$ -193 -75 212 -180 151 51 41 -147 68 -92 -112 33 -62 -251 213 45 89 313 175 -6 66 -62 75
5630G5K4p7j57O5P9j83r3K23K74l77j63N77j87m9p8m2K12j05m0j49j40kL46np3
$$ 75 99 22 -135 -70 9 -174 -267 -44 230 -147 -310 267 80 31 -47 -89 123 18 -22 -171 -311 -313 33 28 -45
5655d5Q2j68J78j19k8O7k85M71j92q8k10O19k57l10M46n0K32j87j93O9j11N9K58
$$ -45 37 -131 47 -72 -100 -33 -318 153 -39 -127 -337 282 25 -285 161 111 343 156 -37 32 -79 -20 238
5678B38m05K17l36K57L23l00jk1O6k70J78K03j29L7L3j00j36L72l3n46L12MjM1
$$ 238 -167 50 -286 -29 294 -6 -7 -28 38 -232 -54 149 20 57 90 -10 -146 226 193 -353 -41 -37 -38 3
5702CJ62k16J6k3M5n6L1l97K97L79k80l12J82K06j57K41j3q1JJ42k84j21L46j23
$$ 3 165 -51 -35 -58 -13 -69 -38 -435 -138 241 -39 -351 -169 37 -120 121 108 27 28 170 -114 -235 111 -12
5726a2o4Q4L2k28K48J58j02m65M37o1J19l3j95Q7J16j75k3K85l21R0M0q5n7K85
$$ -12 -76 8 40 -188 60 218 116 -349 88 27 146 113 -82 5 121 -54 -77 208 -113 -23 17 -68 -125 160
5750A60j62N2j56J59qr2q6p1J22K22j43K78j73N2k81J12Q0kj93L19r4l46L64j5
$$ 160 -2 50 -106 53 45 -47 -133 -204 -82 140 -3 275 102 154 -127 -15 65 63 -130 189 95 -251 113 98
5774I8j0j69J93Q9k14J19j22j5k14M41k0j60R7l23M39j53R7l14O01j56l68rK26
$$ 98 88 -81 112 201 -13 106 -16 -31 -245 196 176 16 113 -210 229 76 173 -141 460 304 -64 -73 153
5797A53n13M25n8k95L72R3n01N18j27l97J33J95M2k64M55j80p4j5J0K5j9Oj39
$$ 153 -360 65 7 -288 84 177 -324 194 67 -330 -197 -2 40 -224 231 51 -23 -38 -28 -3 -22 -16 -155
5820a55L2K19l64M46j26K3k20L28k27j21j04L35l24j5L06j54J29j62L2M26r5m88
$$ -155 -123 96 -268 178 52 75 -145 183 -44 -165 -269 66 -258 -273 33 -121 8 -154 -122 304 209 -279
5842b79M16l05M2J70j17L74n28kL45k99J46K94r9l24K19Q1k45j71M63p9n3j3r1
$$ -279 137 -168 -126 44 -73 301 -227 -229 116 -183 -37 257 158 -166 53 134 -111 -282 181 102 49 36 -55
5865e5K6M9P8r3MP2N8o0j0p3O0J37k99J62k58L23M8k93j58L77P5l02L62j38n3
$$ -55 -29 20 98 5 9 81 139 79 69 -4 56 193 -106 56 -202 121 169 -124 -282 95 170 -132 230 92 39
5890C9J4r4p1J13j42L10l21K82O9k86m4pN8l4K34J5r8k32L92l26K27N5k52J74
$$ 39 53 -41 -112 1 -141 169 -152 130 199 -87 -131 -138 -80 -114 120 135 37 -195 197 -129 98 153 -99 75
5914G5R7m05J59j7J10P8k2J75l21J85L1j57j67K20k8L4L7q6J22k18R8j22K00k39
$$ 75 172 -233 -74 -91 19 97 75 250 -71 114 145 -12 -179 41 13 47 84 -2 120 -98 0 -122 78 -161
5938a61Q1pO7J06p4O3J67k11Q5O4k74M45j44j73q0M25l62L33l94o3rJ32q0k29
$$ -161 -80 -87 -20 86 12 75 242 31 116 180 -94 351 207 34 -46 379 17 350 -44 -107 -116 16 -64 -293
5962b93K20K49k11N6J4k53L1L03J3k83K66o0p7Qq1L27j18o4%l92L26j4j82K42
$$ -293 -73 176 -35 21 35 -218 -187 116 129 -154 112 52 -25 -17 -98 229 111 47 47 -345 -19 -33 -215 27
5986B7j16r0J44J21k7j73N8L15k29JK10k21J20J1k81P5L07k75K56k61J56K0r3
$$ 27 -89 -179 -35 86 59 -114 -56 259 30 31 241 20 140 151 -130 -55 252 -23 233 -28 128 148 55
6009E5o6j12k13j33M05k92K57j22L87J05l76K35n3nR6Qk59J88N2m1j59j07K15
$$ 55 -11 -123 -336 -469 -64 -356 -99 -221 166 271 -105 130 77 72 168 176 -83 105 157 116 -43 -150 65
6032F5l02K32L28l33L9K6O8O6j90J9k11K86o0j38K88j1n1j84Q5Mj22p1J59O9o
$$ 65 -237 -5 323 -10 29 55 123 189 -1 18 -193 93 33 -105 183 172 121 -63 22 26 -96 -167 -8 61 55
6057E5K09n4Q8n0l97N7N7n2K5M27m45n8M58l58K33k38j41L11k09J41k23m1L76
$$ 55 264 210 298 248 -149 -92 -35 -87 -62 365 -80 -138 320 -38 195 -43 -184 127 -82 59 -164 -205 171
6080A71ON7o8j07k64N66n18J79k00L17l02M30m60J23J44j46p4L01J22l84J12K01
$$ 171 177 234 166 59 -205 361 -157 22 -178 139 -163 267 -193 -70 74 -72 -146 155 277 -107 5 206
6102B06j84l00M02j43K23p0M2k78j16L41j65J20j79K45j01J87m35K06j36M00k43
$$ 206 22 -278 124 -19 204 134 176 -102 -218 123 -42 78 -101 144 43 230 -205 1 -135 265 22
6123B2j24J99R2l87J78k6q4J85R2L6n1J3j40P1Q8j64r8m6J14q4J64K0j46K67j28
$$ 22 -102 97 189 -198 -20 -46 -130 55 147 183 132 145 5 76 164 0 -98 -144 -30 -114 50 70 -76 191 63
6148F3j38J37P8j46K18k76m4J29p1k21J08J51J00m2j46K50l18L35j03J16k78j4
$$ 63 -75 62 140 -6 212 -64 -108 21 -50 -271 -163 -12 88 46 -100 150 -168 167 64 180 -98 -112
6170a12K04o8L3J9r8K36n24J97M2j93j2K65j18K42L2p3k54K02K20l36L38l36J78
$$ -112 92 24 57 76 -22 214 -310 -113 -71 -264 -276 -11 -129 113 145 72 -182 20 240 -96 242 -94 84
6193H4k74K77j20l38Q35m14j78J91K8j82J12J06m4J4R4l56K6n5L15k3k29Q6j32
$$ 84 -190 87 -33 -371 464 50 -128 63 91 -91 21 127 83 97 191 -165 -139 -194 121 98 -131 -45 -177
6216a77P8M6J9pl0j29J3K51l88L89p3J80j46jQ2j27M9M31n54JK37j09J42k40K83
$$ -177 -99 -53 -34 -41 -71 -200 -187 64 -324 65 -8 172 26 25 107 -20 29 460 -94 -93 144 35 177 -63 220
6241B20m97J62J79k38K37j96J71k48Q0L90m75J81J57M6l05L3j11J11n3R7k15L55
$$ 220 -277 -115 64 -174 63 -133 38 -210 -130 260 -215 -34 123 169 -136 -103 -214 -103 -156 -59 -274 81
6263H1k60K64r4L0M6J00mo13P03p5k54r6L24M3j49k00J28K9l9L13j59k62K58j65
$$ 81 -179 85 -9 21 67 167 163 -450 253 178 -76 -172 152 195 46 -154 -26 3 -36 277 118 -144 114 -51
6287e1k19J85K23k26L6j66L97n8k72j94K90N4j10J48k5n9J25l31K27j67J71J39
$$ -51 -270 -85 138 -88 -52 -218 179 121 -151 -345 -55 -1 -111 37 12 -47 78 -253 -26 -193 -22 117
6309A17q3R0k75Q6J83Q5j32k1j16K83k42J40n0m2J92l60O8K28k28M7P1m49M51
$$ 117 34 124 -151 -65 118 203 71 50 -66 217 -25 115 65 23 215 -145 -77 151 -77 -30 41 -408 43
6332D3k45J78J88j90J52l30K87k60K87l85J22k3O1n9J83m49P06l55k2p0J80J08
$$ 43 -202 -24 164 -26 126 -204 83 -177 110 -275 -153 -176 -115 -174 9 -440 266 -89 -111 -181 -1 107
6354A07l63N94j29l50j64J99j81K21L03j80j80L03m59l1J71R3J60K35o55K86j03
$$ 107 -256 338 209 -141 -305 -106 -287 -66 237 57 -123 180 -279 -310 -139 -46 114 349 -306 -20 -123
6375a23l2L94m43J17j25P7j78P2P17k50n27N7J40J93m25N68k01j11K20j8l08k
$$ -123 -155 239 -204 -87 -212 -135 -313 -241 476 226 -301 -244 -104 89 -336 232 31 -80 140 122 -186 -188
6397a88K85l18K04J18j92k6M23j77k16J30m8k10J65j1J46j44q8L67l88N6J39j60
$$ -188 97 -221 -17 101 -91 -117 306 129 -87 43 -5 -215 -50 -61 85 -59 -147 220 -168 -112 27 -133
6419a33J21L04k12j03K95m74L93j05o7lL85p35J77J92l2P0q3K49k96l12O10k34
$$ -133 -12 292 80 -23 272 -202 191 86 19 16 401 -334 -157 35 3 73 -10 239 -57 -369 241 7
6441Gl38L00JQ4J12j88j89M60k25j64j13r0L46rK13k46J62J75n55L27j58O5K17
$$ 7 -331 -31 -30 54 166 -22 -211 249 24 -140 -253 -343 3 -6 207 -39 123 298 -257 70 -88 -23 194
6464A94m5k92K41J06M8k90J86l18K47j61J80K8k02K0j3Mo4L69j84p4L2L37m74
$$ 194 149 -143 98 204 252 -38 148 -170 77 -84 96 124 -78 -58 -71 -67 -131 238 54 -20 12 349 -125
6487a25J13J14j06k4J48j65J48j92K00K1j20j64J0K92jj49m17M51J37q6o7l97
$$ -125 -12 102 -4 -28 120 -45 103 -89 111 132 12 -152 -142 150 149 0 -417 34 171 85 18 -379
6509c79L70l3M6r7K01p0j23J24o5qL4J07Q5l72j11K11j32M11k16k71K52K55k26
$$ -379 -9 -42 4 -93 108 38 -85 39 -26 -34 0 107 192 -180 -291 -80 -212 199 -17 -288 -36 219 -7
6532gJK56m23K45n2j61n0L14l54J51J55l42J76J81k61K47j03Q2j00J59M5j40N8
$$ -7 -6 250 -173 72 20 -141 -191 123 -231 -80 75 -267 -91 90 -171 76 -27 55 -45 114 159 19 77
6555G7k25L06j2P3j57j58J75k75J5qM69n28J03J51k6K5Q1j87j06L04k45K7J87
$$ 77 -148 158 146 219 62 -96 79 -196 -181 -189 280 -248 -145 6 -20 5 86 -101 -207 97 -148 -121 66
6578F6j29j81L13l63K18J92k75K03m6O3j7j75J21Q3M0j55KR0j11j04l6kL71j05
$$ 66 -63 -244 69 -294 -76 116 -159 44 -2 61 44 -131 -10 73 113 -42 -40 50 -61 -165 -201 -203 168 63
6602F3k1K8o2j15m7L80l35J9j18J76j68j1J51O5j37J18K11P1Nm52J29K04k20J59
$$ 63 42 70 8 -107 -154 226 -109 -90 -208 -32 -200 -211 -60 5 -132 -14 197 268 273 -179 -50 154 -66 93
6626I3l01n3K57J11k45j72J35Q6L4j44k0K31k21L14j57k12N02n26R4M40m06k3
$$ 93 -208 -261 -4 107 -138 -310 -175 -89 -55 -199 -219 12 -209 105 -52 -264 238 -288 -194 246 -160 -183
6648a83K77J10k19L42m01j00J74j23K44l01L55k50j57K19j43K56k47K12o0mL16
$$ -183 94 204 -15 327 -74 -174 0 -123 121 -180 175 -75 -232 -13 -156 100 -147 65 5 1 317
6669C17k76k51M08j01K89l26l14J85K02m3lk90M14m76L18r3N4k4Qj65J59Q5P9
$$ 317 41 -210 198 97 386 60 -254 -69 133 90 87 -203 211 -265 53 -40 14 -10 -2 -167 -8 77 156
6692A56l26K32K68k03J44k65J42j30k19J90j99J20L6m8L16O7m37j48K79o9O6m6
$$ 156 -170 62 330 127 271 6 148 18 -201 -11 -210 -90 -54 -102 214 281 -156 -304 -25 -94 -28 -74
6714g4n0K94j97Oj16J4M66m55J65o9K71j01o7j2l6J25m8j92Q4M4k7J62j73n4j15
$$ -74 -124 170 -27 -21 -137 -123 343 -112 53 -16 255 154 87 75 39 164 116 -76 8 52 25 187 14 -40 -155
6739a55K11O1k3L2J61j87k44L1K58N7j12N2Q5L6l11K12r6J02JP8l59L4j96K78
$$ -155 56 117 94 126 287 100 -144 -113 145 202 90 142 227 263 -48 164 68 170 171 249 -110 -76 -272 6
6763Fj45M3k70M07j68Q6K13k32J89j79J71j9j89Q1Q5k01K29p7J47m4j81K95k51
$$ 6 -139 -96 -366 41 -127 -41 172 -60 129 -50 121 102 -87 -6 79 -122 107 30 177 133 -48 247 -4
6786dJ10Qn02K88m8K24m1p9M0j50J17PK7k13K58r1K10k08j71M58k38l3K22j83
$$ -4 106 114 -388 -100 -148 76 35 -44 -4 -154 -37 -30 -3 -216 42 -49 161 -47 -218 240 2 -31 191 8
6810HM7k02M3K7L0N0j85JK63q4pj97K77J62m42J53r1j8J98j93l0L3k1J76O7L14
$$ 8 55 -147 -104 -77 -47 3 -182 -181 82 -2 -9 -206 71 233 -209 -56 -147 -165 33 -160 -190 -157 -178 -2 65 379
6836C79m54J13N7l11P6K86n1J4K30o45M00j13p7O3N7M0nj58O2J15P6j03k0l02
$$ 379 -75 38 95 -216 -140 146 95 109 339 -306 94 -19 -96 -33 24 64 59 -99 -37 78 154 51 31 -271
6860b71K99k12J80n1l5k6RR5N9j53j25N21n65L08Pj81J29Q5J62m00M29m64QJ06
$$ -271 28 -184 -4 -55 -90 -116 -107 -12 47 -106 -231 290 -275 33 40 -141 -12 73 235 -165 264 -200 -192 -86
6884h6J33j54K87k63J19k81K25KK51O3l22r9K85k44J27j34l3J45k83L97k33L1
$$ -86 47 -107 180 -83 36 -245 -20 -18 233 296 -26 -125 160 -84 43 -91 -124 21 -262 135 -98 -67
6906f7J33j88J45K9o3l15O3N46J4k60J28l22J60K6k87K31L00Rj33j95J54k83L08
$$ -67 66 -122 23 52 -11 -326 -263 283 297 37 165 -157 3 29 -258 -27 273 282 149 -46 108 -175 133
6929A33j39j81J05K45m07j30N18l93L34M67j52n09%K45l17J24J94j21k03j0J57
$$ 133 -6 -187 -82 163 -244 -374 144 -249 85 552 400 -109 -109 136 -181 -57 137 16 -187 -197 -40
6950d0J0J54k52k03M09L3j65J99j61N8k11J66j4m7K7j35L58j36n6jL0k3k64K65
$$ -40 -30 124 -128 -331 78 111 -54 145 -16 42 -169 -3 -17 -64 -37 -172 186 50 -6 -7 23 0 -264 1
6974Ao6j00O5K15j73K32j13j96L08l49J51j61K37J74m32K48O2k46J03J49k01O4
$$ 1 -65 -165 -100 115 -58 174 61 -135 173 -176 -25 -186 51 225 -207 41 103 -143 -40 109 -92 -28
6996b8k1J47j52J71J72l21J98q4k6m0J56l13J31O6K09m56P8J67J99k06q4n6N27
$$ -28 -49 98 -54 117 289 -32 166 82 56 16 172 -141 -10 56 265 -191 -113 54 253 47 -37 -93 434
7019D34n91j63M04m0K7k70J9M06k91N8J70l77K36k69P4M0M2J89J0J58n16k4L57
$$ 434 -157 -320 84 44 71 -199 -180 226 -65 -7 163 -214 22 -247 -173 -133 -91 98 108 266 -250 -274 83
7042H3p4j3j33J76n2K7M7k25j65K00J48m61L65K1j72M91m04J79j17K03J52l01
$$ 83 9 -4 -137 39 -13 14 61 -164 -329 -129 19 -442 -77 -56 -228 263 -141 38 -79 124 276 -25
7064b5p6m4l8K29k09M33k34k0j17J54J29k06p2P5Q6n7m8K5o2J15k09J97q4j7J2
$$ -25 -101 -145 -183 46 -163 270 36 16 -101 53 182 -24 -96 -21 65 8 -40 -15 -77 38 -171 26 -58 -75 -63
7089f3q9J8Jj45J09K94k79L69k87K78j42rn4j52K96m29N47m65m1J85K69j23J3
$$ -63 -152 -134 -133 -278 -169 125 -154 215 -72 206 64 55 1 -151 145 -284 263 -202 -243 -58 211 88 101
7112A01J35j18l10m6K90r7j0K35k16k9L21k08nk6n5j10R2L60m20K18R4kj91j4
$$ 101 236 118 -192 -238 52 -45 -55 180 -36 -65 256 48 43 17 -38 -148 -56 304 -116 102 196 194 3 -11
7136a1K59j73J25l08J2J39k45j4L50j54K38k3l07J76J05k39O1k41J79j72m1M13
$$ -11 248 75 200 -108 -96 43 -202 -216 134 -20 218 195 -112 64 169 -70 -9 -250 -71 -243 -284 129
7158A29n9J16k34R5N3K5j14l8J39P4l11J95J92k45j87j16L74M3n26M29k32K96
$$ 129 70 186 -48 47 100 125 11 -27 112 186 -125 70 262 17 -170 -286 88 131 -395 34 -198 98
7180I8r2K17l37K1L56k50m0r4j19J76J39p0O2o7J8J90n01J18J61M0k77J19K61
$$ 98 6 223 -114 -93 263 13 -27 -121 -240 -64 75 5 67 0 18 208 -293 -175 -14 26 -251 -132 129
7203A29j00l43N69m34J16K63R0k19J66j10J57k71n8K38k52P6r8n8J61k28L24p1
$$ 129 29 -314 255 -179 -63 200 290 71 237 127 284 13 -45 193 -59 17 -81 -139 22 -206 118 47
7225D7O4m7k96M38k27K50m05J99r2Q0k44K22K7J65k56K66n06N33k37J61j29J25
$$ 47 111 64 -232 206 -21 229 -176 23 -69 11 -233 -11 16 181 -75 191 -315 218 -19 142 13 138
7247A38j42j50K55j5j31o5L55k63n5J38J01o2l1j94M0k6j56J85J87k98K71k12
$$ 138 -4 -154 101 86 -45 -110 245 -18 -73 65 166 104 73 -121 -81 -107 -263 -78 109 -189 82 -130
7269a30j01J86o6k57N62p5n2j31L7jJ83k77nJ70K05j04l23J76l6J73n9j04K71
$$ -130 -231 -45 -111 -368 194 119 67 -64 -27 -28 155 -122 -127 43 248 144 -179 -3 -39 134 75 -29 242
7292B42k59l7%o8pK87k5J47k87K06l05p7j21M61k81J92l92L55J51k33J88q7R2
$$ 242 -17 -54 -54 -122 -129 158 133 280 -7 199 -106 -183 -304 157 -124 68 -324 31 182 -51 137 50 142
7315A42j35j46K41J54R1n42J27N2j18J5n0K86J20j6j06k57R0J46j02K33k83k5
$$ 142 7 -139 102 256 347 -195 -68 -16 -134 -119 -169 117 237 221 115 -142 -52 94 -8 225 -58 -83
7337h3J67M2j39K12k32J08k88J12M9jr6K41n8J12j20j61M52m08K47Ql15j51L32
$$ -83 84 126 -13 199 -33 75 -213 -101 -52 -53 -149 92 34 146 26 -135 317 -91 156 164 -151 -302 30
7360C0po2P9J03m0l9j17J22J37m59K29k26J83k64K95j88L22p1L2p8k99J58R9k11
$$ 30 23 -39 40 143 103 64 -53 69 206 -253 -24 -250 -67 -331 -36 -224 98 27 59 -19 -318 -160 -61 -272
7384b72J27L23j54l9m6O7J10j50K4j32J47J68M4k47K8K74j50j77K32j54j7L05
$$ -272 -145 178 24 -15 -61 6 116 -34 -10 -142 5 173 217 -30 -2 272 122 -55 177 23 6 311
7406C11j78l57J12J06Q0p2Qj56J95J41k86J68m5J36l80J45J71k58J55K6R7O1l47
$$ 311 133 -224 -112 -6 74 2 10 -146 49 190 -96 72 27 163 -217 -72 99 -159 -4 22 119 180 -167
7429a67J49j92L12L5j41k5N9j56m4M30m7j86k60L41j37k7P4J39j75Kj25Q2J12
$$ -167 -18 -210 102 137 -4 -29 30 -126 -170 260 213 27 -233 108 -29 -56 18 157 -18 -16 -141 -59 53
7452E3oJ45l78J20Q4R8R4k23J83j08N4o1k29J17k13N17j09j49L19l84O6M1ml0
$$ 53 47 192 -186 -66 18 116 210 -13 170 62 116 55 -174 -57 -270 247 138 -11 308 -76 -10 31 27 -3
7476cJ33k41L78m40K24r6l5kP0j18k68L62L0J1k90J43M6p4J02K1n6m7L16n7m36
$$ -3 130 -111 267 -173 51 -45 -80 -82 -12 -130 -398 -36 -6 5 -285 -142 -96 -170 -68 -47 -103 -150 166 109 -327
7501c27M54j29l01L35k40N86m15K25k60j68J37L33l22m4K53j1j09l01K31k8J36
$$ -327 127 -2 -303 32 -208 378 -37 188 -72 -240 -103 230 -92 -136 117 106 -3 -304 -73 -101 35
7522C5Q1j20j3L3R0N5J3j41j90L00k79J33R3k16n3k3M18j00j69J15j11k31J91
$$ 35 116 -4 -17 16 106 161 174 33 -157 143 -136 -3 90 -126 -179 -202 216 116 -53 62 -49 -280 -89
7545h9L2J7P9k30L8J18K66j17o5j57N7J76Pl44M56l98K53j88j33K50J87q9l01
$$ -89 -57 -40 39 -191 -153 -35 231 114 49 -108 -51 125 132 -212 244 -154 99 -89 -222 28 215 126 -175
7568a75K30j09Q7L1p7J93j44k34K04m0M5o4k17L24Pj5N3j71N67o95L0K43P4L1
$$ -175 55 -54 33 64 -13 180 36 -198 6 -34 11 -53 -270 54 61 46 99 -72 495 -200 -170 73 147 178
7592A78k47J12J23j72L8j60J10j61K81J8l69L08k60O09l82Q3l39K91j22k20J18
$$ 178 -69 43 166 -6 32 -128 -18 -179 102 120 -249 59 -201 408 26 109 -230 61 -61 -281 -163
7613a63M82l96j5R4J21k60J76k8k4k09j51N31m21L36qj17R5J37j64n7Q8j43P3
$$ -163 319 -77 -92 2 123 -137 39 11 -13 -222 -373 158 -263 73 65 -52 43 180 16 -41 47 -96 -23
7636b3q1J46j46L1J34r8J75J47N6k23k51K23j50k32K48q0J1O0L6k0Q8Q4j26N9
$$ -23 -104 42 -104 -73 61 -37 138 285 341 118 -133 90 -60 -292 -44 -124 -113 -53 -17 -37 51 135 9 68
7660F8q0K1p0P6J70k15j21K8N9J28q9J34J33k55J38l8J02l68K43N9L3k06K41p8
$$ 68 -12 9 -61 15 185 -30 -151 -123 -64 64 -25 109 242 -13 125 87 189 -179 64 123 156 -50 191 113
7684A13j72p8J00M4R6j57O8K15j6j54m8k59L52J43n3Jj51l13K90k04K99k54k9
$$ 113 -59 -137 -37 7 103 -54 14 229 213 59 11 -248 104 247 194 195 44 -269 21 -183 116 -138 -167
7707a67K35l23J32N4o0L46k29J2j24J15J58m8J26l89K16l1J17j92Q2k50P9J78
$$ -167 68 -255 -123 -69 -129 217 -12 0 -124 -9 149 101 227 -162 54 23 140 -52 30 -220 -141 37
7729C7j7J5j54K01j97M20k12j22J21q3L10o29L07j83L50k74l0L5R0r6oJ64l16
$$ 37 20 35 -119 82 -115 305 93 -29 92 9 319 -310 -3 -186 164 -110 -140 -105 -15 -111 -117 47 -269
7752b69M24m73K89J11Q1M7j15k05n2k65O05k32l3J36K4j85L26J18k50j02J87O8
$$ -269 155 -318 -29 82 163 210 95 -110 -162 -427 178 -54 -87 49 73 -112 214 332 82 -20 167 235
7774B35j67J67k45J4j40J20j61L20q1j20J24k84Q5K91j81L40k89p0j70K17q0j7
$$ 235 68 235 -10 4 -136 -16 -177 143 62 -58 66 -218 -133 158 -23 317 28 -42 -212 5 -75 -92
7796i2j5n4J38k42L83j34K88j09k95J42j7k60K41j63K40j17N8N9K48k29P0K15
$$ -92 -107 -161 -23 -265 118 -16 272 163 -132 10 -7 -267 -26 -189 51 -66 -8 51 299 70 140 355
7818C55n92K71J21k06K03m04J79r4J14O4j7M4l79J09J04J61j19K39J1j82j67P3
$$ 355 -237 34 155 -51 152 -252 -73 -167 -53 11 -6 38 -341 -232 -128 33 -86 153 164 -18 -185 -112
7840a12J64k10j67K53J55K13j54j8J13k48K8j74J30l9k19L62P2j65m7K24m26K54
$$ -112 52 -158 -325 -72 83 296 142 124 237 -11 17 -157 -27 -66 -285 77 149 -16 -63 161 -265 -11
7862a1j68K85j7%J93k61N0N2k42K74m6J49j93j32K9P0J43l50L14j31j66J23p3
$$ -11 -179 106 89 89 282 21 71 123 -119 155 109 258 65 -67 -38 32 175 -175 139 8 -158 -35 -108
7885a08J16P1q6J90m5k50L50m69J82J01q3k86K93LJ21Q3k79J67l2J24N5m18K28
$$ -108 8 79 -7 183 138 -112 238 -231 -49 52 -31 -317 -24 -21 100 183 -96 71 39 163 218 -200 28
7908B8j14K79k09k8L4j39L18n67N37l33m7L39J25k22J12j06J78j7l31M28l29j17
$$ 28 -86 193 -16 -44 -10 -149 169 -398 139 -194 -241 98 223 1 113 7 185 168 -163 265 -64 -181
7930a81J34O6p7K2l5O5q7J90K7l53K80j17K8j4m7Q0R3m8K43m17K45R9l73M4L7
$$ -181 -47 19 -58 -36 -71 -6 -93 97 124 -229 51 -66 -38 -52 -99 -19 74 26 269 -148 97 196 -177 -133 -96
7955i6J73m0m8m7P1p0j39m7K9Q5K76j13J28Q1j45o3j2j04r1k7M05j61M6N4j70
$$ -96 77 37 -11 -58 13 -57 -196 -243 -214 -129 147 34 162 243 98 35 23 -81 -172 -199 206 45 91 145 -25
7980b5K67l93J44o2n0LJ38j72O8K69l08M6j29K19M2k57L06o2j61kJ96K1j45J3
$$ -25 242 -151 -7 -69 -119 -116 22 -150 -82 187 -121 -75 -204 15 57 -200 106 44 -117 -119 77 98 -47 -34
8004c4m8J12n9J00m5k3O7l4K68m83J98j26K21N9O4k23J02k64K57k88N06l31j3
$$ -34 -82 30 -29 71 26 3 70 36 304 -179 19 -107 114 173 237 14 116 -148 109 -179 327 -4 -17
8027a7o9J49l2j38K77K9J64m52Q3J50j44k21J40OJ8L3M5K0k4j26r5J67j32L07
$$ -17 -86 63 31 -107 170 199 363 -89 -6 144 0 -221 -81 -75 -57 -24 21 41 17 -109 -204 -37 -169 138
8051A38l55jK46r1p0Q8jk42L07K16j9j72k9L5m5j69K75k47L80j72k50O0J39O9
$$ 138 -217 -218 28 -63 -133 -45 -46 -288 19 235 216 44 15 50 5 -164 111 -136 244 72 -178 -118 21 90
8075I0j5l16K34N1O9l49L51l2k94K86m80L33LL25l11K74j81p1L06k42J27k41J94
$$ 90 75 -241 -7 44 113 -236 115 83 -211 75 -405 -72 -69 256 -55 219 38 -33 273 31 158 -83 111
8098A11q6q0J65j00P4Jj53Jj39L02j00K2n1r9R5M62n71J40Q0j1k44Q2J65J08k68
$$ 111 25 -55 110 10 84 85 -68 -67 -206 96 -4 18 -33 -132 -37 425 -146 -6 74 63 -181 -99 66 174 -94
8123i4L61p4k08M2n9K95k52J47m86L74L5l76K71J34j26k85K66k8P1L9j90K51K2
$$ -94 267 193 -15 27 -32 263 11 158 -328 46 81 -295 -24 110 -16 -301 -35 -63 8 47 -143 108 130
8146A30j53J60o8p5J03j33J22o7K71j74j45K62m98j51L37k1J53Lj52K25j67K23
$$ 130 -23 137 69 -6 97 -36 86 19 290 116 -29 233 -265 -416 -79 -100 53 56 -96 129 -38 185
8168A85k80j00Q5J37JL2J10k23O1M6m6n4k0K7l7R5M4k28K51J75k68j79R2
$$ 185 -95 -195 -110 27 28 60 170 -53 8 54 8 -46 -66 -39 -76 19 63 -165 86 261 -7 -186 -94
8191i4
$$ Imaginary data points
##PAGE= N=2
##DATA TABLE= (X++(I..I)), XYDATA
0@%%%%qQqJ6j6J6k4L6m4M8n6P2q8J04j25J49j73K00k33K71l10L54m03M58n18N84
$$ 0 0 0 0 0 -8 0 -8 8 -8 8 -16 20 -24 24 -32 40 -48 56 -69 80 -93 107 -126 145 -165 189 -214 244 -274 310
30C10o59P39q25R23j033J149j276J420j574J741j929K137k365K620k904L221l580
$$ 310 -349 390 -435 488 -545 604 -672 748 -826 915 -1014 1123 -1242 1378 -1526 1695 -1885
47a885L990m463N013n665O451p416Q642j0258J2485j5764K1078l1108N6400k31699
$$ -1885 2105 -2358 2655 -3010 3441 -3975 4667 -5591 6894 -8870 12208 -18900 37500 -194199
61a94199m70721N70984N41136k55627n18301J25641M13067n4930l93155J5001
$$ -194199 -664920 -93936 447200 191573 -326728 -201087 211980 157050 -236105 -221104
71b21104L49561L1685l29276n8878K66516M2837k72964l6424L19737J51598k57401
$$ -221104 128457 160142 -169134 -228012 38504 81341 -191623 -228047 91690 243288 -14113
82a4113j97928J87694K19257j31079k02339J18579K24655r4629k73461k2991K29583
$$ -14113 -212041 -24347 194910 63831 -138508 -19929 204726 110097 -163364 -186355 43228
93D3228J20843j02678j12426K1799N0273j8060j7828M4469L0717l6970m4544j3568
$$ 43228 164071 61393 -51033 -29234 21039 2979 -14849 29620 60337 23367 -21177 -34745
105c4745k532K2455N0504J2962m4370k7239K7225K5738k3002l9153M104M2657
$$ -34745 -37277 -14822 35682 48644 4274 -22965 4260 29998 6996 -32157 -28053 14604
117A4604J7099l1760m3796k6214J8221Q5808P7195m7670j10713J600J02045K2614
$$ 14604 31703 -57 -43853 -70067 -51846 33962 111157 63487 -47226 -45626 56419 79033
129G9033q4408k7842P6710J0072j34374p4303J41881J36816j09954j68424P6221
$$ 79033 -5375 -33217 43493 53565 -80809 -155112 -13231 123585 13631 -154793 -78572
140g8572J91828k1843j79862j6367J59966L8708j50226o1169J31459M9505j54699
$$ -78572 113256 91413 -88449 -104816 55150 93858 -56368 -117537 13922 63427 -91272
151i1272o4293J85535J25909j61143j68686J17818K03947m5062j91340L072J77761
$$ -91272 -155565 29970 155879 -5264 -173950 -56132 147815 102753 -88587 -85515 92246
162I2246J6819j78882m1732J80425Q7749j48628j17854J08676J44779m8250j43387
$$ 92246 109065 -69817 -111549 68876 156625 7997 -109857 -1181 143598 95348 -48039
173d8039o330J14354K7754r2713m5329N2935K9518l7013j6675L4945K4875k0644
$$ -48039 -54369 59985 87739 -4974 -50303 2632 32150 -4863 -21538 13407 38282 17638
185A7638l3298j049L0560J6803j9636l2592j7720Q424K5918N669k4314m881L0268
$$ 17638 -15660 -16709 13851 30654 11018 -21574 -39294 -30870 -4952 717 -23597 -28478 1790
198A790N016k9673P404N0927P618o0034l8085M6979O2673k6462q0528n205P3388
$$ 1790 6806 -22867 -15463 35464 43082 -16952 -55037 -8058 54615 28153 -52375 -57580 15808
211A5808K8499m1788k1016K2583O526j5399R387K9345q556n2201j8867N2470M0330
$$ 15808 44307 2519 -18497 4086 10612 -4787 4600 33945 25389 -26812 -45679 6791 47121
224D7121l9419m4148K6171L6532j5148j9695K0171J7710k2633k7002J5205L1261
$$ 47121 7702 -36446 -10275 26257 11109 -8586 11585 29295 6662 -20340 -5135 26126
236B6126j0008l2580Q616K8983j5377k2800L5330L5120m2391n5973L3150P7476
$$ 26126 16118 -16462 -7846 21137 5760 -17040 18290 53410 11019 -44954 -11804 65672
248F5672o580r3039l6023Q1064O3375o0387p3196L9282P1815k1684o6207P970
$$ 65672 59092 -33947 -69970 11094 74469 14082 -59114 -19832 51983 30299 -35908 -27938
260b7938O5813Q689o8307l5753N4461N1892l4980n6170J0733M2318Q374j6555
$$ -27938 37875 46564 -21743 -57496 -3035 48857 13877 -42293 -31560 10758 19132 2577
272B577p183M224j514p502O574K1090n59l3469j7108K7723L0608p400l0330j1394
$$ 2577 -4606 -382 -1896 -9398 -2824 18266 17707 -15762 -32870 -5147 25461 18061 -12269 -23663
286b3663K7041K9693j8505l9340J0945M4003m457m9465j0573N0709L1513m7806
$$ -23663 3378 33071 14566 -24774 -13829 30174 25717 -23748 -34321 16388 47901 95
298I5n9020L4883Q5675l730r0799k9749P0374M8008m0999m9513J7088M1278j2433
$$ 95 -58925 -24042 61633 57903 -32896 -62645 7729 55737 14738 -34775 -17687 23591 11158
311A1158l9896J2608M5001o081m1727K422L3160l362k6209N925K3800p548l0095
$$ 11158 -28738 -16130 28871 22790 -18937 -16515 16645 13283 -12926 -7001 16799 9251 -20844
324b0844L606L8856K098m9228j1674N9650L2597n1227m9286K5288M8401Ol3792
$$ -20844 -17238 21618 23716 -25512 -37186 22464 55061 3834 -45452 -20164 28237 28243 -5549
337e549q823K0168J51k3447M590L3836K535l1028p356J9535L552j3110J138J4702
$$ -5549 -14372 5796 5947 -17500 -12910 20926 23461 -7567 -14923 4612 8164 -4946 -3808 10894
351A0894j706k2732p992K6504J6099l1268k5238L3116M0078j9787m9810p584M1279
$$ 10894 9188 -13544 -21536 4968 21067 -10201 -35439 -2323 37755 17968 -31842 -39426 1853
364A853L0584k2083l7109N562L0798m850k9435L215L4199J3762k8832l3689R483
$$ 1853 32437 10354 -26755 -21193 9605 4755 -24680 -21465 12734 26496 -2336 -36025 -26542
377b6542M3530J0876l6520k0627K3741K0506j3076j7781L802J5776L709r372K92
$$ -26542 16988 27864 -8656 -29283 -5542 14964 1888 -15893 -12091 3685 7394 -1978 -1686
390a686R527j0625j9924J5456L3460m785l5922r088K6785J6566j6409j6399J8484
$$ -1686 7841 -2784 -22708 -7252 26208 21423 -14499 -23587 3198 19764 3355 -13044 5440
403E440K4681k0393l7730J2900M4625K856l9428j8399K4269K5778j1810k9960
$$ 5440 30121 9728 -28002 -15102 29523 32379 -7049 -25448 -1179 24599 12789 -17171
415a7171K42K8771O871k2369q967R737L600o499k519M670N547n500j4031k576
$$ -17171 -16929 11842 18713 -3656 -12623 -2886 714 -5785 -8304 -3634 1913 -3587 -17618 -20194
429b0194J2237M833m850m49k313q778M26J2801P507o395j2234k409J7286J2748
$$ -20194 -7957 -3124 -7974 -8423 -10736 -19514 -19088 -6287 1220 -5175 -17409 -19818 -2532 10216
443A0216j4724j6343J1378J8426k886j2723K46R167J667r510l162J7462J1976
$$ 10216 -4508 -20851 -9473 8953 6067 -6656 -6410 2757 4424 -5086 -8248 9214 21190
456B1190j7650j7559J1668J7375j816q373k352k71j122p15L808M473q348j2960
$$ 21190 3540 -14019 -2351 15024 13208 4835 2483 2212 1090 375 4183 8656 308 -12652
470a2652R426J9739q146k5117M06K2557O985j4021j0311P408J0282q384j3653
$$ -12652 -3226 16513 8367 -16750 -16344 6213 13198 -823 -11134 -3726 6556 -1828 -15481
483a5481J1610K0718p647k2785k115J4424Q189k443p857m436L364L100j936j082
$$ -15481 -3871 16847 9200 -13585 -15700 -1276 6913 4470 -3387 -7823 -4459 -1359 -3295 -4377
497d377k02j616L943M752q404q742O813O365n577m629M030K741m347q311j186
$$ -4377 -4579 -6195 -2252 2500 -5904 -14646 -7833 -1468 -7045 -11674 -7644 -4903 -9250 -17561 -18747
512a8747J1821R571p006p110K577R2L83J1357P840j0158j0946N274J2524L867
$$ -18747 -6926 2645 -4361 -11471 -8894 -8802 -8419 2938 10778 620 -10326 -5052 7472 11339
526A1339q757n882J0716J0205r499q942J0294Q607r009o180P626P424m650j3284
$$ 11339 2582 -3300 7416 17621 8122 -820 9474 18081 9072 2892 10518 17942 13292 8
540Hn023J2097J0189q889j1697n88J046k12N108l37r458m256M773L099l186n407
$$ 8 -5015 7082 17271 8382 -3315 -3903 -2857 -3069 2039 1702 -7756 -12012 -7239 -4140 -7326 -12733
556a2733N6P819K594j0356l299J2587M844j0926m415Q169O521l27o486m380M499
$$ -12733 -12677 -4858 -2264 -12620 -15919 -3332 1512 -9414 -13829 -5660 861 534 -5952 -10332 -5833
571e833Q002J464j220j870n343J266J0756L171j0400l960O439L254l654m339j21
$$ -5833 2169 3633 2413 543 -4800 -3534 7222 10393 -7 -3967 2472 5726 2072 -2267 -2388
586b388N927J955q774l555R595L605p841l914L668M145J998j970n752j065N658
$$ -2388 3539 5494 -3280 -6835 2760 6365 -1476 -5390 -1722 2423 4421 2451 -3301 -4366 1292
601A292M069J722k665p331L6J0699K980p988k281N742O67m095o70K098L466j470
$$ 1292 5361 7083 4418 -2913 -2877 7822 10802 2814 533 6275 6942 2847 2177 4275 7741 6271
617F271p119j388P781P42p213k069Q84K29J832K64p144l095M359K495J26k330
$$ 6271 -848 -2236 5545 6287 -926 -2995 -2111 -1882 -50 214 -6930 -10025 -5666 -3171 -3045 -5375
633e375n310o80P496K227n667j39L805q92j849J718K267L400P61n427q57O829
$$ -5375 -10685 -11365 -3869 -1642 -7309 -7448 -3643 -4535 -6384 -4666 -2399 1001 1762 -3665 -4522 2307
649B307L506k041N25j438k341M338N739m155n809K822M501J160l169n572M73O488
$$ 2307 5813 3772 4297 2859 518 4856 10595 6440 631 3453 7954 9114 5945 373 846 7334
665G334J63o360J61L178l210k587J839P44J331m95n489k401N056K174k023L44
$$ 7334 7497 1137 1298 4476 1266 -1321 518 1262 2593 2098 -3391 -5792 -736 1438 -585 -241
681b41r91m049J827N479n80l584o75O33L136J196m381j742N276J001m019J148
$$ -241 -1232 -5281 -3454 2025 1445 -2139 -2814 -2181 955 2151 -2230 -3972 1304 2305 -1714 -566
697e66K649k886j830K134R15R03O25m399k113M048J747j224n4q81k947J699L194
$$ -566 2083 -803 -2633 -499 416 1319 1944 -2455 -4568 -520 1227 3 -51 -932 -3879 -2180 1014
714A014j261q51l4j150R47L400j552l037K773J233k763J672L079j717j223p6m40
$$ 1014 -247 -1098 -1132 -2282 -1335 2065 513 -2524 249 1482 -1281 391 3470 1753 530 454 14
731A4K561K918k921l373J260J446k46K164j585l606K134K049k516m37K213k875
$$ 14 2575 5493 2572 -801 459 1905 1659 3823 2238 -1368 766 2815 299 -138 2075 -800
747h00j437L797Q77l407j680k31R08L380J8l977o28J525j221R34L578j083k883
$$ -800 -2237 1560 2437 -970 -2650 -2881 -1973 1407 1425 -2552 -3180 -1655 -2876 -1942 1636 553 -2330
764b330M07m46o7L169Q34l018P85J184l009M78M125p29k895P81J420N56n59l522
$$ -2330 -1923 -2369 -2436 733 1567 -1451 -666 518 -2491 -2013 2112 1383 -1512 -731 689 1245 686 -2836
782b836n20N857K428n458k727J629j7J274L173j259l001K60k62p42K761J283j939
$$ -2836 -3356 2501 4929 -529 -3256 -1627 -1644 -370 2803 1544 -1457 -1197 -1459 -2201 560 1843 -96
799i6J05n05l012R78M562j47k310r50o78J466K992k529m283L832L913j965l234
$$ -96 9 -496 -3508 -2530 2032 1885 -425 -1375 -2053 -587 2405 -124 -4407 -575 3338 1373 -1861
816a861O5k72K147K905j614k670K90k23J21K499j46j823P65P29l436N81M277r88
$$ -1861 -1796 -2068 79 2984 1370 -1300 -1010 -1233 -1112 1387 1241 -582 183 912 -2524 -1943 2334 1346
834A346j020l39j703k36M128K88m272k94K744o3j29j17k014M85K466q68j261R70
$$ 1346 326 -13 -1716 -1952 2176 2464 -1808 -2102 642 579 450 333 -1681 -1196 1270 402 -859 111
852A11j108j164K720N07k484P66P11j993L12L128p46k361N74m63K91L004m10l354
$$ 111 -997 -2161 559 1066 -1418 -652 59 -1934 -1622 1506 760 -1601 -1027 -1490 -1199 1805 1395 -1959
870a959N95Q82k88J357J263k542m31J973j742k4K937l1k550M99K00m95J916J469
$$ -1959 -1364 -482 -770 587 1850 -692 -1123 850 -892 -916 2021 1990 -560 -61 139 -356 1560 3029
888C029l196j126K668L20n69j57j479M43M012n50m436k82J977L38K098J94l723
$$ 3029 -167 -1293 1375 1695 1126 969 -510 -67 3945 3395 -1041 -1323 654 992 3090 3284 -439
905d39r27K621J11j123J042J62r22J92r77k231L346K788k575j832l29j87J808
$$ -439 -1366 1255 1366 243 1285 1447 525 717 -260 -2491 855 3643 1068 -764 -1093 -1280 528
922E28K203k292k583L225R28k118o67O08n88K430K284l428k401J471J033J447
$$ 528 2731 439 -2144 1081 2009 -109 -776 -168 -756 1674 3958 530 -1871 -400 633 2080
938B080J348k226k027K264Q68k345J063K445j230m13L4k247J025L732j042k694
$$ 2080 3428 1202 -825 1439 2307 -38 1025 3470 2240 1827 1861 -386 639 4371 3329 635
954F35M22O80n27J437k9k055Q58J760j476m78O66j448L48L292j291l062P14J725
$$ 635 1057 1737 1210 2647 2618 563 1421 3181 1705 1227 1893 445 793 4085 2794 -268 446 2171
972B171m68N34N31j561K38Q18j689L84K961q42k320O45N27o26J540j68j812P06
$$ 2171 1703 2237 2768 1207 1445 2263 574 958 3919 3077 757 1402 1929 1303 2843 2675 863 1569
990A569J259j419M19J512j504j020J918J48j643P68K18q49J349L75k040O36J683
$$ 1569 2828 1409 1828 3340 1836 816 2734 2882 1239 2007 2225 1376 2725 3100 1060 1696 3379
1007C379j665o58K150j62j691Q56l06r9K136l08k552O3K080p96P5J316j655o92
$$ 3379 1714 1056 3206 3044 1353 2209 1903 1804 3940 3632 1080 1143 3223 2427 2502 3818 2163 1471
1025A471J514q9q74J409j92j749J544N98k192O55J812j225j113J494j57o10J058
$$ 1471 2985 2896 2022 3431 3239 1490 3034 3632 1440 2095 3907 2682 1569 3063 2906 2296 3354
1042C354r40j117J888J080k634n32J574k04K96J077k029p00J923l79r37J838j94
$$ 3354 2414 1297 3185 4265 1631 1099 2673 2469 2765 3842 1813 1113 3036 2657 1720 3558 3364
1059C364j958Q03J185p75j89J601j463P1J253j113m34K122m51k226J411J382j360
$$ 3364 1406 2209 3394 2619 2430 4031 2568 2639 3892 2779 2345 4467 4016 1790 3201 4583 3223
1076C223P2l2p66P41J141j854r44J924m25j229J588n03j645Q70P51j375M99Q52
$$ 3223 3295 3263 2497 3238 4379 2525 1581 3505 3080 1851 3439 2936 1291 2161 2912 1537 2036 2888
1094B888j553j20J513q08q40J573l19j433R10Q05o80P06L25k239J138K201j518
$$ 2888 1335 1215 2728 1920 1080 2653 2334 901 1811 2616 1936 2642 2967 728 1866 4067 2549
1111B549p79J761l13o01J191k59j190J729M77j875L93J407j249p19J829j084p30
$$ 2549 1770 3531 3218 2617 3808 3549 2359 4088 4565 2690 3083 4490 3241 2522 4351 3267 2537
1128B537J334l31j866J050L48j038J030N03k270k84K236m49j170O73q87m47J933
$$ 2537 3871 3540 1674 2724 3072 2034 3064 3567 1297 1013 3249 2800 1630 2303 1416 969 2902
1145B902n12j844J459J193k069L27J255q66j55J297r53o55J626p12j332J550K75
$$ 2902 2390 546 2005 3198 1129 1456 2711 1845 1690 2987 2034 1379 3005 2293 961 2511 2786
1162B786j371P80R30j797j8J132m45k12N10j164q27J737L75k176J121Q19j502
$$ 2786 1415 2195 3125 1328 1310 2442 1997 1785 2295 1131 304 2041 2416 240 1361 2180 678
1179F78O5J381o23j70J319j650k57K038l85j522J573J17j269J094J107j732J32
$$ 678 743 2124 1501 1331 2650 1000 743 2781 2396 874 2447 2564 1295 2389 3496 1764 1896
1196A896J731j238pR62r31j008J430j35j023N14L33j536O39O08j265k35J277j481
$$ 1896 3627 2389 2382 3344 2413 1405 2835 2700 1677 2191 2524 988 1627 2235 970 735 2012 531
1214E31q32J860j0j440O82m59j308K055K96j682L48J681j376r57J716m10m86J462
$$ 531 -301 1559 1549 109 791 332 -976 1079 1375 -307 41 1722 346 -611 1105 695 209 1671
1232A671o02j001J030M98j151J029R53j797K23J415j396p63J803K89r94L56o81
$$ 1671 1069 68 1098 1596 445 1474 2427 630 853 2268 872 109 1912 2201 1207 1563 882
1249H82j064J286J270j530j71R16j352r9J145m41n60J144p75j287J106Q43j131
$$ 882 -182 1104 2374 844 673 1589 237 138 1283 842 282 1426 651 -636 470 1313 182
1266A82P38M57j611L8J764j316q06J884L8j603J103m2j089J104O20j170P16O09
$$ 182 920 1377 -234 -196 1568 252 -554 1330 1368 -235 868 826 -263 841 1461 291 1007 1616
1284A616j704M6J677j043o96J353m69j568R66J266j413N84K20j062M82J247j341
$$ 1616 -88 -42 1635 592 -104 1249 780 -788 178 1444 31 615 835 -227 255 1502 161
1301A61p05J508j05j086M56P0r33J164M92j736M51J280j077q26J391l43j117J651
$$ 161 -544 964 859 -227 229 299 -634 530 1022 -714 -263 1017 -60 -886 505 162 -955 696
1319F96o27j135P33O93q47L50j2j143Q77J462j531o51J652p08p90J442j24q90
$$ 696 69 -1066 -333 360 -487 -137 -149 -1292 -415 1047 -484 -1135 517 -191 -981 461 337 -553
1337e53Q35P28j681l86J961m52o04Q28m79k81J190m43r51J230O27j709Q26N52
$$ -553 282 1010 -671 -1057 904 452 -152 676 197 -84 1106 663 -288 942 1569 -140 686 1238
1355A238j204N84J493j795r11J658l59j165J312K21j494O67L20j070K77R00q05
$$ 1238 34 618 2111 316 -595 1063 704 -461 851 1072 -422 245 565 -505 -228 672 -133
1372a33J44L63j383j05J872p66j570J586K07j635L41Q57q16L17J108j327q58J450
$$ -133 11 374 -1009 -1114 758 -8 -1578 8 215 -1420 -1079 -222 -1038 -721 387 -940 -1798 -348
1390c48m54p14J046j5p87Q90K39j418N79J397j192P4J180j240l71J832K16j475
$$ -348 -802 -1516 -470 -485 -1272 -382 -143 -1561 -982 415 -777 -703 477 -763 -1134 698 914 -561
1408e61J034O32r54J05O93o05N30R60j289j50J060l18l05J088m94j496J499P83
$$ -561 473 1105 151 256 949 344 874 1834 545 395 1455 1137 832 1920 1426 -70 1429 2212
1426B212j798K01J154q04l98J047j148o39J183j88j510R85K07o60J51P8j616R66
$$ 2212 414 615 1769 965 567 1614 466 -173 1010 822 -688 297 504 -156 -5 73 -1543 -577
1444e77R00j423o99J587p69p87J030n5j349J259R24j826K93O12l67m71J026r21
$$ -577 323 -1100 -1799 -212 -981 -1768 -738 -793 -2142 -883 41 -1785 -1492 -880 -1247 -1718 -692 -1613
1462a613K10J121o92o74J252M58j164J248P05j576P10J651j207J21J295l20p95
$$ -1613 -1403 -282 -974 -1648 -396 62 -1102 146 851 -725 -15 1636 429 550 1845 1525 730
1479G30J334p3o05Q71j6q79L78M27k38J10P72j443r6J646j018j709J132M66j637
$$ 730 2064 1991 1386 2257 2241 1362 1740 2167 1929 2039 2811 1368 1272 2918 1900 191 1323 1789 152
1498A52O68K02j265L5P96j097J4M76r61j44O79m66r84J606j79j547O07J003j125
$$ 152 820 1022 -243 -208 588 -509 -495 -19 -980 -1124 -445 -911 -1895 -289 -468 -2015 -1408 -405 -1530
1517a530L48J030r09k53J402l25r06Q81L14q05R24K37j010M19P43j099nJ342m79
$$ -1530 -1182 -152 -1061 -1314 88 -237 -1143 -262 52 -753 171 408 -602 -183 560 -539 -544 798 319
1536C19n73R90n4j260J143L87j529P90J377r67l18J065o13p3J115m21m31J125
$$ 319 -254 736 682 -578 565 952 -577 213 1590 623 305 1370 757 684 1799 1378 947 2072
1554B072o19n81J075P78j275M04R82j137j84R70o54j34Q20r94j258J257K52j768
$$ 2072 1453 872 1947 2725 1450 1854 2836 1699 1515 2485 1831 1697 2517 1523 265 1522 1774 6
1572FK69M07j061j74O6j121j01Q53r12p67R77l30j378P70R91j281O64Q95j230
$$ 6 275 682 -379 -553 -487 -1608 -1709 -856 -1768 -2535 -1558 -1888 -3266 -2496 -1505 -2786 -2122 -1227 -2457
1591b457J37J253o5J80P35k58m24J225N79m87N09R72j103N40J176p66m07J376
$$ -2457 -2320 -1067 -1132 -952 -217 -475 -899 326 905 418 927 1899 796 1336 2512 1746 1339 2715
1609B715l23r34R30J4r90L29K99q06J18M65j368j00P64o13n96Q72o47j052J144
$$ 2715 2392 1458 2388 2402 1412 1741 2040 1234 1352 1817 449 349 1113 500 -96 776 129 -923 221
1628B21P7j250N41O54j056K77P79j079J80R62j55r39R89L47j035O84J12q00P42
$$ 221 298 -952 -411 243 -813 -536 243 -836 -656 306 151 -788 201 548 -487 197 309 -491 251
1647B51M72j065j71J124p53n99N11k87p71Q28K13j182L05N46j089L19Q47p49k03
$$ 251 723 -342 -513 611 -142 -741 -230 -517 -1288 -460 -247 -1429 -1124 -578 -1667 -1348 -501 -1250 -1453
1666a453P13l74l67J083K85q28R81M02q10N77J194r01k4J156m52n38J810q70m71
$$ -1453 -740 -1114 -1481 -398 -113 -941 40 442 -368 209 1403 502 478 1634 1182 644 2454 1584 1113
1685A113J400m22j184O09N04r12o2R38r18p41O70q18o08Q20k93j323O53k10p66
$$ 1113 2513 2091 907 1516 2020 1108 1046 1984 1066 325 995 177 -431 389 96 -1227 -574 -784 -1550
1704a550J72J040j097l42J147j129N5R27n43k85R36J78q65P20L75l43L04P21j038
$$ -1550 -1378 -338 -1435 -1777 -630 -1759 -1704 -777 -1320 -1605 -669 -491 -1356 -636 -261 -604 -300 421 -617
1723f17K04J111o61l98J055n6n53O61J25j054N22L45r61K52N10o68n84J071m44
$$ -617 -413 698 37 -361 694 638 85 746 871 -183 339 684 -277 -25 485 -183 -767 304 -140
1742a40n52P05J47r77L71M03j130M44J019j273K80Q19n96j38L67K00q59J194K20
$$ -140 -692 13 160 -817 -446 -43 -1173 -729 290 -983 -703 116 -480 -618 -251 -51 -910 284 504
1761E04r19M84Q20j152O5R22n49j51M76m01n68J050k9j082Q01P9p96l9Q95j183
$$ 504 -415 69 889 -263 -198 724 175 24 500 99 -469 581 552 -530 271 350 -446 -485 410 -773
1781g73K25Q51n89n75J043o21p69J200J97q64L70P42j477P69N91p72k4R54q50
$$ -773 -548 303 -286 -861 182 -439 -1208 -8 189 -675 -305 437 -1040 -271 320 -452 -476 478 -372
1800c72m38Q93L9q77P69J90j250N69K78n84J77M03k63p52R88j26p99P33L20q86
$$ -372 -810 83 122 -755 14 204 -1046 -477 -199 -783 -606 -203 -466 -1218 -230 -356 -1155 -422 -102 -988
1820i88P04jq67M11Q82m61l75R34m09l23N26J4n72N60L12o87M07O34n81k83R40
$$ -988 -284 -285 -1152 -741 141 -320 -695 239 -170 -493 33 47 -525 35 347 -340 67 701 120 -163 777
1841G77l70n27R65k55q07J040j94p11M54N73j261L23R45j123K98N77m05p05R96
$$ 777 407 -120 845 590 -217 823 629 -82 372 945 -316 7 952 -171 127 704 299 -406 590
1860E90l59p17P17J46p22J34N00o30k56N72n56j28O96l34o99P80j84q56N90M05
$$ 590 231 -486 231 377 -345 -211 289 -341 -597 -25 -581 -709 -13 -347 -1046 -266 -450 -1306 -716 -311
1880c11r85K16N93n08j47P24q1p18Q08k40p19P26N6n14O77O82q00j9O94j86j39
$$ -311 -1296 -1080 -487 -995 -1142 -418 -499 -1217 -409 -649 -1368 -642 -586 -1100 -423 259 -541 -560 134 -52 -191
1901a91J140l75o87J242p0r61J092J03n96L25O85o43j77P51o26k69O18k55n24
$$ -191 949 574 -113 1129 1059 98 1190 1293 697 1022 1707 1064 887 1638 1012 743 1361 1106 582
1920E82O88j47j141O44L38j192n2O90m84o29P61m30n25Q26l52j037N66N11j068
$$ 582 1270 1123 -18 626 964 -228 -280 410 -74 -703 58 -372 -897 -71 -423 -1460 -894 -383 -1451
1939a451L96M44q85L62N88o39n37J038J4q24Q34K56j126Q46N04r59J49R70n17
$$ -1451 -1055 -611 -1496 -1134 -546 -1185 -1722 -684 -670 -1494 -660 -404 -1530 -684 -180 -1139 -990 -20 -537
1958e37O4Q23o04n5O52Q1p24L60P59q69N96O43p07K16Q73m81r06R24L11p60N51
$$ -537 -473 350 -254 -309 343 424 -300 60 819 -50 546 1189 482 698 1571 1090 184 1108 1419 659 1210
1979A210p4p28L09O09p99L39M23n66k80K78n83o0J029m34j498O34N30r71L8N52
$$ 1210 1136 408 717 1326 527 866 1289 723 443 721 138 78 1107 673 -825 -191 339 -632 -594 -42
1999d2r06J89Q29p82n01N35J0m66L35J69l77K25M15q94J5R19n78j42K98j06m47
$$ -42 -948 -759 70 -712 -1213 -678 -668 -1134 -799 -630 -1007 -782 -367 -1261 -1246 -327 -905 -1047 -749 -855 -1302
2020a302J113L3j126K89Q33m56L63K6n19L74O67m22l58J024N6n17M19J80p07R48
$$ -1302 -189 -156 -1282 -993 -160 -616 -253 -227 -746 -372 295 -127 -485 539 595 78 497 677 -30 918
2040I18M63q25J78P65m3o36N00l72n9J065m24q11J43K72n05K63m8p10m9Q25j203
$$ 918 1381 556 734 1499 1456 820 1320 948 889 1954 1530 719 862 1134 629 892 844 134 85 910 -293
2061b93p60Q64R5j185L65J95j010O96L07j304k12Q90l86J58N3m72Q3R44j41m00
$$ -293 -1053 -189 -94 -1279 -914 -719 -1729 -1033 -726 -2030 -2242 -1352 -1738 -1580 -1527 -1999 -1916 -972 -1113 -1513
2081a513L09O82n32L42L56m54K94J168o47o03R23J37m17L28l77L60K80O9o16q2
$$ -1513 -1204 -522 -1054 -712 -356 -810 -516 652 5 -598 325 462 45 373 -4 356 636 705 89 7
2101GL51jn8O52j263k18J216l78p83M64M16r35L30K35n81L05K56k34n32O36J69
$$ 7 358 357 299 951 -312 -530 686 308 -475 -11 405 -530 -200 35 -546 -241 15 -219 -751 -115 54
2122E4l37N04k95q86J547n0j056o7N19L02o05M82n14m98O24Nj167M34L29j50k19
$$ 54 -283 221 -74 -960 587 537 -519 -586 -67 235 -370 112 -402 -900 -276 -271 -1438 -1004 -675 -825 -1044
2143a044k01n17K71R43r93p19P91J87m96P44m25r19J369Q49j216k51J139l45N09
$$ -1044 -1245 -1762 -1491 -548 -1541 -2260 -1469 -1282 -1778 -1034 -1459 -2378 -1009 -160 -1376 -1627 -488 -833 -324
2162c24J31j69o8J014l35n47Q08M4k4L07k17n90P41Q41j020j031P57J82n88N76
$$ -324 -193 -362 -430 584 249 -298 510 554 530 837 620 30 771 1612 592 -439 318 500 -88 488
2182D88p83n95P14L56r43k11L97l4n6k60p14R5J080k98j307R39L21l76M83k84
$$ 488 -295 -890 -176 180 -763 -974 -577 -611 -667 -927 -1641 -1546 -466 -764 -2071 -1132 -811 -1187 -704 -988
2202i88p53P19J134o05r45O83N50m1J03m58l79P82O59j225J58N47n60M20K66r94
$$ -988 -1741 -1022 112 -493 -1438 -755 -205 -246 -143 -601 -980 -198 461 -764 -606 -59 -619 -199 67 -927
2222i27O1J002J12j645L11N88k88N45l58r48N09Q62k60o20K02R3J32M66q61m44
$$ -927 -866 136 248 -1397 -1086 -498 -786 -241 -599 -1547 -1038 -176 -436 -1056 -854 -761 -629 -163 -1024 -1468
2242a468J206O57q95j95N66l0k3M2o54n8J313N0j291K37J88O7L97n91o63P27Q17
$$ -1468 -262 395 -500 -695 -129 -159 -182 -140 -794 -852 461 511 -780 -543 -355 -288 109 -482 -1145 -418 399
2263C99j001l61K70K91K3L12p04p48J180K82q73k40L30N2N35J21r17L4J197k49
$$ 399 -602 -963 -693 -402 -379 -67 -771 -1519 -339 -57 -930 -1170 -840 -788 -253 -132 -1049 -1015 182 -67
2283f7q49K27K76J2N07m87q99P25Q20m34r55N81J04L03J27p36m75P98P66j179
$$ -67 -916 -689 -413 -401 106 -381 -1280 -555 265 -169 -1124 -543 -439 -136 -9 -745 -1220 -422 344 -835
2303h35l22J03L33O40l20r29P7J176Q6j169l0N97K54J46k15j093O56J458j047
$$ -835 -1157 -1054 -721 -81 -401 -1330 -1253 -77 9 -1160 -1190 -593 -339 -193 -408 -1501 -845 613 -434
2322d34n69L02K82M87%n99q30J446N13q48k95L8L90L57K82j460R2J095M97j080
$$ -434 -1003 -701 -419 68 68 -531 -1361 85 598 -250 -545 -507 -117 240 522 -938 -846 249 746 -334
2342c34J85n7P8R26o88p85K55J230r35k13q7j74O19L73q51r51J162O01j085n3
$$ -334 -149 -206 -128 798 110 -675 -420 810 -125 -338 -425 -599 20 393 -458 -1409 -247 354 -731 -784
2362g84K03J07L26K13j574J63J332j37p70L9o5L74P24p35j120P57J236o54l24
$$ -784 -581 -474 -148 65 -1509 -1346 -14 -151 -921 -882 -947 -573 151 -584 -1704 -947 289 -365 -689
2381f89r8J65N14N42j216o13J406O89p74n72M50K07N88L8j255j50J646j42p44
$$ -689 -787 -622 -108 434 -782 -1395 11 700 -74 -646 -196 11 599 637 -618 -768 878 736 -8
2400ho9Q3L56M85j70j294M08J147k56p03n4J04J05O75j145o10R12Q56n95p61J45
$$ -8 -77 6 362 847 677 -617 -209 938 682 -21 -75 29 134 809 -336 -946 -34 822 227 -534 -389
2421c89j48P28L64j232l23J131J11n77p72K57L85Q02m38j209N78J350n05o20j31
$$ -389 -537 191 555 -677 -1000 131 242 -335 -1107 -850 -465 337 -101 -1310 -732 618 113 -507 -638
2440f38k82Q55O18j417o09J075J090q74n83L59j1P98n8r88j46J417j58l51n62
$$ -638 -920 -65 553 -864 -1473 -398 692 -182 -765 -406 -417 381 323 -665 -811 606 448 97 -465
2459d65K30J94Q12l68r31K30J526n21o78r1l0P76L86q53j131J366O38m36o07R0
$$ -465 -235 -41 771 403 -528 -298 1228 707 29 -62 -92 684 1070 217 -914 452 1090 654 47 137
2479A37p5N48Lj021m44J254J05m77k50o4K41P13p76j187M30J085Mo18m03l8Q48
$$ 137 62 610 613 -408 -852 402 507 30 -220 -284 -43 670 -106 -1293 -863 222 226 -392 -795 -833 15
2500A5O50j361o67J063L90k92m99k75M16J015K01j590L7J254j52k78k33j27N51
$$ 15 665 -696 -1363 -300 90 -202 -701 -976 -560 455 656 -934 -897 357 205 -73 -306 -433 118
2519A18Q36o18j136M84J261o03m32M0k62O83P05j046p13R65P77m03l94j7l38J090
$$ 118 954 336 -800 -316 945 342 -90 -50 -312 371 1076 30 -683 282 1059 656 262 245 -93 997
2539I97L03j702k8J400R8p69j24m90N48N48m56j028K96J137m18m59k46j80M29
$$ 997 1300 -402 -430 970 1068 299 175 -315 233 781 325 -703 -407 730 312 -147 -393 -573 -144
2558a44J003j478o35N62P43j48m86j89J92J013J00j391j51J019K97j85l47m43
$$ -144 859 -619 -1254 -692 51 -97 -583 -772 -580 433 533 -858 -1009 10 307 122 -225 -668
2576f68O34P26k47j366N82R00k28o61j16rJ003O23j278j087J202N63l24j38o22
$$ -668 -34 692 445 -921 -339 561 333 -328 -444 -453 550 1173 -105 -1192 10 573 249 111 -511
2595e11L58N98P55j755j26J406J37o13n05j78M58R64n66j301N96R54O9n67l21
$$ -511 -153 445 1200 -555 -681 725 862 249 -256 -434 24 988 422 -879 -283 671 740 173 -148
2614a48k67O80P11p77j049R38N80l50o9r56J77J141J2j022n97J114J55n77k62
$$ -148 -415 265 976 199 -850 88 668 318 249 -707 -530 611 623 -399 -996 118 273 -304 -566
2633e66m74L90J193l15j328M40P10K95o70j28k30O84N47o98q33P20N99k34J55
$$ -566 -1040 -650 543 228 -1100 -660 50 345 -325 -453 -683 1 548 -150 -983 -263 336 102 257
2652B57n12m8R76N23j374k69Q63L32n26j45m59K98J339q16p97l28J015K04l15
$$ 257 -255 -303 673 1196 -178 -447 416 748 222 77 -382 -84 1255 439 -358 -686 329 533 218
2671B18k92n88P30P09q37r36Q04N30j54k45o77o9J187L78j059l04N49K46P6l66
$$ 218 -74 -662 68 777 -60 -996 -192 338 184 -61 -738 -807 380 758 -301 -605 -56 190 266 -100
2691a00o72N97J174k35j657M8J563m67k93j54m75O60J027q32r21L69M56J66k43
$$ -100 -772 -175 999 764 -893 -845 718 251 -42 -196 -671 -11 1016 184 -737 -368 88 254 11
2710A1n71j9Q37J95p30l7J44J42J56k26n62J44J308l65j190L46J027m8o57j41
$$ 11 -560 -579 258 453 -277 -314 -170 -28 128 -98 -660 -516 792 427 -763 -417 610 562 -95 -236
2730b36l07O68R24j039q02O74O56j97L1n67l27Q05Q72j527k60Q70Q0j47K8o01
$$ -236 -543 125 1049 10 -792 -118 538 341 372 -195 -522 283 1155 -372 -632 238 318 171 199 -402
2750d02j07R57J65r34L0M74J67j42o14m41J010P25n57r29M43N03j2p1n47l83R03
$$ -402 -509 448 613 -321 -291 183 350 208 -406 -847 163 888 331 -598 -155 348 336 265 -282 -665 238
2771B38R32j189n61M27O04p8Q7j321M90J123j69q00k09K70L37J33j78p28N35J130
$$ 238 1170 -19 -580 -153 451 373 460 -861 -371 752 583 -217 -426 -156 181 314 136 -592 -57 1073
2791A073j001q75K51O71j3J50o98K9Q01N45r31l14J68K94K08k38q60J86J235j42
$$ 1073 72 -803 -552 119 106 256 -442 -413 388 933 2 -312 -144 150 358 120 -740 -554 681 539
$$ [...]
8191A5
##END NTUPLES=NMR FID
##END=
