##TITLE=1H_EC-3206(3)
 CDCl3, 8 sc, 
 29.8.2019
##JCAMPDX= 6.0         $$ Bruker NMR JCAMP-DX V2.0
##DATA TYPE= NMR FID
##DATA CLASS= NTUPLES
##ORIGIN= UXNMR, Bruker Analytische Messtechnik GmbH
##OWNER= root
$$ XWIN-NMR		Version 3.5
$$ Thu Aug 29 13:52:35 2019 Russian Standard Time (UT+4h)  she@DPX200
##.OBSERVE FREQUENCY= 200.13155
##.OBSERVE NUCLEUS= ^1H
##.DELAY= (6, 6)
##.ACQUISITION MODE= SIMULTANEOUS
##.ACQUISITION SCHEME= undefined
##.AVERAGES= 8
##.DIGITISER RES= 18
##SPECTROMETER/DATA SYSTEM= spect
##.PULSE SEQUENCE= zg30
##.SOLVENT NAME= CDCl3
##.SHIFT REFERENCE= (INTERNAL, CDCl3, 0, 15.7039)
##AUDIT TRAIL= $$ (NUMBER, WHEN, WHO, WHERE, WHAT)
$$ ##TITLE= Audit trail, XWIN-NMR		Version 3.5
$$ ##JCAMPDX= 5.01
$$ ##ORIGIN= Bruker BioSpin GmbH
$$ ##OWNER= she
$$ F:/spectra/data/she/nmr/H-F/1/audita.txt
$$ ##AUDIT TRAIL=  $$ (NUMBER, WHEN, WHO, WHERE, WHAT)
(   1,<2019-08-29 13:51:18.68 +0400>,<she>,<DPX200>,
      <created by zg, POWCHK disabled, PULCHK disabled
       configuration hash MD5:
       00 E9 B6 7A A2 85 ED C7 34 08 36 98 17 FE 4E 26
       data hash MD5: 16K
       60 B5 C0 16 D0 8B 52 78 81 65 41 CC C8 11 6A 3F>)
$$ ##END=
$$ 
$$ hash MD5
$$ B5 EF BB F9 C7 BA 61 72 B4 98 52 D4 BD B5 E6 0F
##$RELAX= 
##$RELAX= 
##$RELAX= 
##$RELAX= 
##$RELAX= 
##$RELAX= 
$$ Bruker specific parameters
$$ --------------------------
##$DU= <F:/spectra>
##$EXPNO= 1
##$NAME= <H-F>
##$PROCNO= 1
##$TYPE= <nmr>
##$USER= <she>
##$AMP= (0..31)
100 100 100 100 100 100 100 100 100 100 100 100 100 100 100 100 100 100 
100 100 100 100 100 100 100 100 100 100 100 100 100 100 
##$AQSEQ= 0
##$AQ_mod= 1
##$AUNM= <au_zg>
##$AUTOPOS= <>
##$BF1= 200.13
##$BF2= 200.13
##$BF3= 200.13
##$BF4= 200.13
##$BF5= 200.13
##$BF6= 200.13
##$BF7= 200.13
##$BF8= 200.13
##$BYTORDA= 1
##$CFDGTYP= 0
##$CFRGTYP= 5
##$CHEMSTR= <none>
##$CNST= (0..31)
1 1 145 1 1 1 1 1 1 1 1 1 1 1 1 1 1 1 1 1 1 1 1 1 1 1 1 1 1 1 1 1 
##$CPDPRG= <>
##$CPDPRG1= <>
##$CPDPRG2= <>
##$CPDPRG3= <>
##$CPDPRG4= <mlev>
##$CPDPRG5= <mlev>
##$CPDPRG6= <mlev>
##$CPDPRG7= <mlev>
##$CPDPRG8= <mlev>
##$CPDPRGB= <>
##$CPDPRGT= <>
##$D= (0..31)
0 1.2 0 0 0 0 0 0 0 0 0 0.03 0 0 0 0 0 0 0 0 0 0 0 0 0 0 0 0 0 0 0 0 
##$DATE= 1567072278
##$DBL= (0..7)
120 120 120 120 120 120 120 120 
##$DBP= (0..7)
150 150 150 150 150 150 150 150 
##$DBP07= 0
##$DBPNAM0= <>
##$DBPNAM1= <>
##$DBPNAM2= <>
##$DBPNAM3= <>
##$DBPNAM4= <>
##$DBPNAM5= <>
##$DBPNAM6= <>
##$DBPNAM7= <>
##$DBPOAL= (0..7)
0.5 0.5 0.5 0.5 0.5 0.5 0.5 0.5 
##$DBPOFFS= (0..7)
0 0 0 0 0 0 0 0 
##$DE= 6
##$DECBNUC= <off>
##$DECIM= 24
##$DECNUC= <off>
##$DECSTAT= 4
##$DIGMOD= 1
##$DIGTYP= 9
##$DL= (0..7)
0 120 120 120 120 120 120 120 
##$DP= (0..7)
150 150 150 150 150 150 150 150 
##$DP07= 0
##$DPNAME0= <>
##$DPNAME1= <>
##$DPNAME2= <>
##$DPNAME3= <>
##$DPNAME4= <>
##$DPNAME5= <>
##$DPNAME6= <>
##$DPNAME7= <>
##$DPOAL= (0..7)
0.5 0.5 0.5 0.5 0.5 0.5 0.5 0.5 
##$DPOFFS= (0..7)
0 0 0 0 0 0 0 0 
##$DQDMODE= 0
##$DR= 18
##$DS= 0
##$DSLIST= <SSSSSSSSSSSSSSS>
##$DSPFIRM= 0
$$ [...]
##$SUBNAM2= <"">
##$SUBNAM3= <"">
##$SUBNAM4= <"">
##$SUBNAM5= <"">
##$SUBNAM6= <"">
##$SUBNAM7= <"">
##$SUBNAM8= <"">
##$SUBNAM9= <"">
##$SW= 24.9336996594482
##$SWIBOX= (0..15)
0 0 2 0 0 0 0 0 0 0 0 0 0 0 0 0 
##$SW_h= 4990.01996007984
##$TD= 16384
##$TD0= 1
##$TE= 0
##$TE2= 300
##$TE3= 300
##$TEG= 300
##$TL= (0..7)
0 120 120 120 120 120 120 120 
##$TP= (0..7)
150 150 150 150 150 150 150 150 
##$TP07= 0
##$TPNAME0= <>
##$TPNAME1= <>
##$TPNAME2= <>
##$TPNAME3= <>
##$TPNAME4= <>
##$TPNAME5= <>
##$TPNAME6= <>
##$TPNAME7= <>
##$TPOAL= (0..7)
0.5 0.5 0.5 0.5 0.5 0.5 0.5 0.5 
##$TPOFFS= (0..7)
0 0 0 0 0 0 0 0 
##$TUNHIN= 0
##$TUNHOUT= 0
##$TUNXOUT= 0
##$USERA1= <user>
##$USERA2= <user>
##$USERA3= <user>
##$USERA4= <user>
##$USERA5= <user>
##$V9= 5
##$VALIST= <valist>
##$VCLIST= <CCCCCCCCCCCCCCC>
##$VD= 0
##$VDLIST= <DDDDDDDDDDDDDDD>
##$VPLIST= <PPPPPPPPPPPPPPP>
##$VTLIST= <TTTTTTTTTTTTTTT>
##$WBST= 1024
##$WBSW= 4
##$XGAIN= (0..3)
0 0 0 0 
##$XL= 0
##$YL= 0
##$YMAX_a= 101788
##$YMIN_a= -216472
##$ZGOPTNS= <>
##$ZL1= 120
##$ZL2= 120
##$ZL3= 120
##$ZL4= 120
##$ABSF1= 10
##$ABSF2= 0
##$ABSG= 5
##$ABSL= 3
##$ALPHA= 0
##$AQORDER= 0
##$ASSFAC= 0
##$ASSFACI= 0
##$ASSFACX= 0
##$ASSWID= 0
##$AUNMP= <proc_1d>
##$AZFE= 0.1
##$AZFW= 0.1
##$BCFW= 1
##$BC_mod= 2
##$BYTORDP= 1
##$COROFFS= 0
##$CY= 11.3945322036743
##$DATMOD= 1
##$DC= 2
##$DFILT= <>
##$DTYPP= 0
##$F1P= 20.1720416913024
##$F2P= 0.152960286110954
##$FCOR= 0.5
##$FTSIZE= 0
##$FT_mod= 4
##$GAMMA= 1
##$GB= 0.15
##$INTBC= 1
##$INTSCL= 1
##$ISEN= 128
##$LB= 0.24
##$LEV0= 0
##$LPBIN= 0
##$MAXI= 10000
##$MC2= 0
##$MEAN= 0
##$ME_mod= 0
##$MI= 1.114404
##$NCOEF= 0
##$NC_proc= 0
##$NLEV= 6
##$NOISF1= 3.799351
##$NOISF2= 2.8
##$NSP= 1
##$NTH_PI= 0
##$NZP= 0
##$OFFSET= 15.70392
##$PC= 1
##$PHC0= -9224.732
##$PHC1= 33.60096
##$PH_mod= 1
##$PKNL= yes
##$PPARMOD= 0
##$PSCAL= 0
##$PSIGN= 0
##$REVERSE= no
##$SF= 200.130013532006
##$SI= 16384
##$SIGF1= 3
##$SIGF2= 2
##$SINO= 400
##$SIOLD= 16384
##$SREGLST= <1H.CDCl3>
##$SSB= 0
##$STSI= 0
##$STSR= 0
##$SW_p= 3612.71676300578
##$SYMM= 0
##$S_DEV= 0
##$TDeff= 0
##$TDoff= 0
##$TI= <>
##$TILT= no
##$TM1= 0
##$TM2= 0
##$TOPLEV= 0
##$USERP1= <user>
##$USERP2= <user>
##$USERP3= <user>
##$USERP4= <user>
##$USERP5= <user>
##$WDW= 1
##$XDIM= 8192
##$YMAX_p= 0
##$YMIN_p= 0
$$ End of Bruker specific parameters
$$ ---------------------------------
##NTUPLES= NMR FID
##VAR_NAME=  TIME,          FID/REAL,        FID/IMAG
##SYMBOL=    X,             R,               I
##VAR_TYPE=  INDEPENDENT,   DEPENDENT,       DEPENDENT
##VAR_FORM=  AFFN,          ASDF,            ASDF
##VAR_DIM=   8192,          8192,            8192
##UNITS=     SECONDS,       ARBITRARY UNITS, ARBITRARY UNITS
##FACTOR=    0.0002004,     1,               1
##FIRST=     0,             0,               0
##LAST=      1.6414764,     0,               0
##MIN=       0,             -216472,         0
##MAX=       1.6414764,     101788,          0
$$ Real data points
##PAGE= N=1
##DATA TABLE= (X++(R..R)), XYDATA
$$ plain form
0 0 0 0 0 0 0 0 0 -8 8 -8 10 -16 16 -24 26 -32 40 -48 56 -65 79 -90 105 -121 138 -161 180 -206 234 -265
30 -265 298 -334 375 -420 469 -523 581 -647 718 -795 880 -975 1078 -1195 1324 -1470 1633
47 1633 -1818 2028 -2277 2568 -2916 3340 -3880 4576 -5527 6905 -9097 13140 -23109 101788
61 101788 79299 -117564 -28334 60540 76608 14029 -19189 -3840 61584 23229 -72866 -87914
73 -87914 -9227 28313 18616 -31148 -63131 -19982 26807 -41708 -91594 -10056 63085 19422
85 19422 -30190 -38172 -25109 7650 20407 -15355 -13203 28359 17629 -20487 -18245 -12844 -5694
98 -5694 22525 8678 -34672 -7756 31247 -12210 -48070 -7644 24458 18002 5889 -16447 -17507
111 -17507 20105 20594 -15463 -4387 20224 6265 8321 17334 -14645 -15375 33062 20877 -29322
$$ packed form
0@%%%%%%%qJ6j6J8k6L2m0N0n8P2q8J04j21J44j69J95k26K59k99L41l86M40m99
30b65N63o32P09p95Q89r92J104j228J365j513J675j855K053k273K519k794L103
47A633l451L846m305M845n484O256p220Q456j0103J2432j6002K2237l6249J24897
61A01788k2489j96863Q9230Q8874J6068o2579l3218J5349O5424l8355r6095j5048
73h7914P8687L7540r697m9764l1983M3149M6789o8515m9886Q1538P3141m3663
85A9422m9612p982J3063L2759J2757l5762K152M1562j0730l8116K242N401P150
98e694K8219j3847m3350K6916L9003m3457l5860M0426L2102o456j2113k2336j060
111a7507L7612M89l6057J1076K4611j3959K056R013l1979p30M8437j2185n0199
$$ plain form
124 -29322 -11039 24742 6258 -13191 -8770 -6377 6122 5978 -25302 -23419 13448 8821 -11730
137 -11730 -4397 -14734 -24855 13515 22758 -23389 -16683 27840 9434 -25661 -10192 8150 9963
150 9963 11684 -6921 -15909 17153 21324 -17435 -12816 16355 11046 10831 16341 -15936 -24966 22028
164 22028 29054 -8713 -4495 16743 8047 1976 660 -7355 11508 27147 -3818 -15035 16568
177 16568 14200 -9460 3216 4592 -13209 7423 22743 -13182 -25396 3315 4093 -9705 -4150
190 -4150 -6829 -8436 4170 -9414 -26226 -1101 8625 -19372 -13177 7803 -11846 -15932 11636
203 11636 -340 -21660 4298 18082 -5290 -8638 -786 -4637 7503 13775 -9238 -7743 13244
216 13244 -1647 -12257 10073 3710 -14934 7644 14108 -15564 -9044 16739 2190 -8336 6703
$$ packed form
124b9322J8283L5781j8484j9449M421K393J2499j44l1280J883L6867m627k0551
137a1730P333j0337j0121L8370R243m6147O706M4523j8406l5095J5469J8342J813
150I963J721j8605q988L3062M171l8759M619K9171n309k15N510l2277r030M6994
164B2028P026l7767M218K1238q696o071j316q015J8863J5639l0965j1217L1603
177A6568k368k3660J2676J376j7801K0632J5320l5925j2214K8711P78j3798N555
190d150k679j607J2606j3584j6812K5125R726k7997O195K0980j9649m086K7568
203A1636j1976k1320K5958J3784k3372l348P852l851J2140O272k3013J495K0987
216A3244j4891j0610K2330o363j8644K2578O464k9672O520K5783j4549j0526J5039
$$ plain form
229 6703 4931 490 10326 -393 -6906 17391 15094 -10183 3984 19136 -3414 -2098 18742
242 18742 825 -12174 9559 4885 -15856 -1846 6336 -10431 -8980 -3167 -12102 -3530 1401
255 1401 -21120 -15033 13842 -2236 -22757 242 7229 -12095 -321 11399 -6908 -3612 13049
268 13049 -99 -6481 9776 6472 -835 10125 3540 -5747 13155 9836 -14544 1625 21989
281 21989 -1362 -9502 12097 3652 -9948 6654 10042 68 9555 8327 -8363 2392 13239
294 13239 -2522 1939 17084 275 -5378 12297 -662 -17201 7520 14435 -12710 -10781 4425
307 4425 -9046 -13459 -3913 -10358 -5699 6679 -11165 -23589 -1613 514 -15584 -1391 6430
320 6430 -11833 -3548 12229 -8123 -13153 14097 11354 -6039 2759 6958 -308 7093 3964 -9156
$$ packed form
229F703j772m441R836j0719o513K4297k297k5277J4167J5152k2550J316K0840
242A8742j7917j2999K1733m674k0741J4010Q182j6767J451N813q935Q572M931
255A401k2521O087K8875j6078k0521K2999O987j9324J1774J1720j8307L296J6661
268A3049j3148o382J6257l304p307J0960o585r287J8902l319k4380J6169K0364
281B1989k3351q140K1599q445j3600J6602L388r974R487j228j6690J0755J0847
294A3239j5761M461J5145j6809n653J7675j2959j6539K4721O915k7145J929J5206
307D425j3471m413R546o445M659J2378j7844j2424K1976K127j6098J4193P821
320F430j8263Q285J5777k0352n030K7250k743j7393Q798M199p266P401l129j3120
$$ plain form
334 -9156 6862 18492 -4987 -7256 12005 666 -9462 8709 5987 -8937 7420 12867 -9021
347 -9021 -4962 12383 3399 -93 7605 -807 319 14239 -200 -11792 11175 13476 -9761 -2352
361 -2352 9040 -6822 -5709 7918 -6765 -13687 5103 189 -15196 -5434 -1436 -8241 243 -1886
375 -1886 -18250 -3305 12815 -8197 -14001 8865 4859 -7764 5273 4942 -6491 7315 13992
388 13992 -5219 -3165 12048 4408 995 7868 -2490 -1136 16470 3118 -15321 6590 16399
401 16399 -6746 -6705 6545 -2883 -1438 10008 -3714 -10874 6788 4681 -9452 -1486 1974 -5746
415 -5746 3960 2967 -16922 -6579 12471 -5833 -16667 3430 2366 -12510 -4420 -2752 -12394 -815
429 -815 5885 -10435 -8170 4775 -5449 -7622 4309 -2719 -6000 10666 3378 -13366 4229 15473
$$ packed form
334i156J6018J1630k3479k269J9261j1339j0128J8171k722j4924J6357N447k1888
347i021M059J7345q984l492P698q412J126J3920j4439j1592K2967K301k3237P409
361b352J1392j5862J113J3627j4683o922J8790m914j5385R762L998o805Q484k129
375a886j6364J4945J6120k1012n804K2866m006j2623J3037l31j1433J3806O677
388A3992j9211K054J5213p640l413O873j0358J354J7606j3352j8439K1911R809
401A6399k3145M1J3250r428J445J1446j3722p160J7662k107j4133P966L460p720
415e746R706r93j9889J0343J9050j8304j0834K0097j064j4876Q090J668r642J1579
429h15O700j6320K265J2945j0224k173J1931p028l281J6666p288j6744J7595J1244
$$ plain form
443 15473 -3387 -3521 11677 4918 1566 10218 625 -3232 12298 8582 -4621 7060 10002 -3817
457 -3817 2871 9686 -6523 -2577 15179 1808 -10614 5211 6006 -6975 985 4162 -5985 854
471 854 5956 -8477 -5202 6722 -5284 -8500 6393 -2355 -13025 2727 2762 -14351 -3941 6670
485 6670 -9180 -10754 2225 -4635 -7367 3113 -4010 -9688 4253 1680 -10313 2152 8416 -5335
499 -5335 1263 10707 -4163 -3685 14912 7473 -4874 7601 9707 -946 6640 8113 -2890 5766
513 5766 13208 -1538 -2290 9522 -225 -5230 8237 2144 -9931 3357 6791 -9813 -4812 6112
527 6112 -4666 -6725 2563 -4456 -5864 5340 -2975 -11973 2146 3686 -9605 -1108 5079 -8501
541 -8501 -4754 7621 -5747 -11174 5501 2850 -8177 149 1418 -6036 1891 3520 -9379 -1028
$$ packed form
443A5473j8860j34J5198o759l352Q652r593l857J5530l716j3203J1681K942j3819
457c817O688O815j6209L946J7756j3371j2422J5825P95j2981P960L177j0147O839
471H54N102j4433L275J1924j2006l216J4893q748j0670J5752L5j7113J0410J0611
485F670j5850j574J2979o860k732J0480p123n678J3941k573j1993J2465O264j3751
499e335O598R444j4870M78J8597p439j2347J2475K106j0653P586J473j1003Q656
513E766P442j4746p52J1812r747n005J3467o093j2075J3288L434j6604N001J0924
527F112j0778k059R288p019j408J1204q315q998J4119J540j3291Q497O187j3580
541h501L747J2375j3368n427J6675k651j1027Q326J269p454P927J629j2899Q351
$$ plain form
555 -1028 10532 -2735 -6128 6584 871 -3515 10242 5857 -7513 6069 14139 -1167 -718 9138
569 9138 2135 1459 8984 125 -2423 10630 3523 -8814 3381 7380 -5638 -226 6350 -7016
583 -7016 -4783 7711 -4266 -10612 4369 3094 -8044 -1440 187 -7241 938 3599 -9484 -3502
597 -3502 8863 -3549 -9153 4028 54 -7614 3210 1696 -9920 61 7364 -5247 -4444 5067
611 5067 -2749 -3107 7692 1194 -3998 7826 4134 -6336 5906 11086 -3433 904 11988 1911
625 1911 -1528 8596 1303 -2929 9571 5811 -5725 3363 6203 -5296 -1738 3700 -6164 -2937
639 -2937 6044 -6980 -12270 3606 1726 -10864 -2932 41 -8562 -2169 2611 -9179 -6287 3396
653 3396 -5527 -8605 3273 -1092 -8484 1578 -194 -10163 1229 6902 -7762 -5258 7516 -380
$$ packed form
555a028J1560j3267l393J2712n713m386J3757m385j3370J3582Q070j5306M49R856
569I138p003o76P525q859k548J3053p107j2337J2195L999j3018N412O576j3366
583g016K233J2494j1977o346J4981j275j1138O604J627p428Q179K661j3083N982
597c502J2365j2412n604J3181l974p668J0824j514j1616R981P303j2611Q03R511
611E067p816l58J0799o498n192J1824l692j0470J2242N180j4519M337J1084j0077
625A911l439J0124p293m232J2500l760j1536R088K840j1499L558N438r864L227
639b937Q981j3024n290J5876j880j2590P932K973q603O393M780j1790K892R683
653C396q923l078J1878m365p392J0062j772r969J1392N673j4664K504J2774p896
$$ plain form
667 -380 -5147 3796 -175 -4171 7499 5182 -5502 3729 8846 -1680 1360 9025 665 2758 12340
682 12340 1499 -4860 10163 8895 -3710 1947 6857 -1526 2942 6384 -5214 -4048 8112 131
696 131 -6663 3086 320 -6688 1147 659 -9754 -1599 4637 -8872 -8918 3283 -2747 -7775 -774
711 -774 -4209 -7558 3675 873 -11586 -2565 6077 -4349 -3771 3588 -3686 -3167 7491 -45 -6845
726 -6845 6805 7920 -4530 124 7532 1795 4606 7379 -2949 -441 11645 3270 -4740 6162
740 6162 6052 -2283 4250 5103 -5397 1236 8122 -4178 -5116 7470 1637 -6223 -50 -1044 -4887
755 -4887 3525 1874 -10125 -2820 4634 -5859 -6212 1993 -4086 -5331 3945 -2202 -9685 1382 2541
770 2541 -8682 -3105 4010 -4059 -2714 4256 -3651 -4051 6645 1384 -5628 4471 5170 -3525 3074
$$ packed form
667c80m767Q943l971l996J1670k317j0684R231N117j0526L040P665q360K093R582
682A2340j0841o359J5023j268j2605N657M910q383M468L442j1598J166J2160p981
696A31o794R749k766p008P835m88j0413Q155O236j3509m6J2201o030n028P001
711g74l435l349J1233k802j2459R021Q642j0426N78P359p274N19J0658p536o800
726f845J3650J115j2450M654P408n737K811K773j0328K508J2086q375q010J0902
740F162j10q335O533Q53j0500O633O886j2300r38J2586n833p860O173r94l843
755d887Q412j651j1999P305P454j0493l53Q205o079j245R276o147p483J1067J159
770B541j1223N577P115q069J345O970p907m00J0696n261p012J0099O99q695O599
$$ plain form
785 3074 6589 -2971 202 8580 596 -657 7820 1641 -3203 7029 5345 -3071 3938 6693 -2844
800 -2844 1321 7415 -2700 -2759 7077 -59 -4812 5390 3356 -6725 -18 2573 -5070 -23 3420
815 3420 -6467 -4968 3749 -4178 -7695 2062 -1742 -8295 107 644 -8513 -1310 3066 -7228 -4569
830 -4569 6037 -469 -4978 2922 -275 -3728 5376 3973 -4597 2492 7128 -2695 16 8264 1220
845 1220 -411 6374 599 -2133 8245 5320 -4872 2090 7349 -1482 127 4992 -2191 -514 7520
860 7520 -532 -5352 4116 2893 -6096 166 3231 -4098 -891 2403 -6992 -4948 4606 -2349 -7493
875 -7493 1157 -1340 -6924 -17 -486 -8438 -1088 3862 -6153 -4902 3262 -3285 -5709 3578 275
890 275 -4927 3278 3180 -6130 482 5857 -1920 18 6014 -811 -1012 7748 1377 -3965 5633 5271
$$ packed form
785C074L515r560L173Q378p984j253Q477o179m844J0232j684q416P009K755r537
800b844M165O094j0115n9R836p136m753J0202k034j0081O707K591p643N047L443
815C420r887J499Q717p927l517R757l804o553Q402N37r157P203M376j0294K659
830d569J0606o506m509P900l197l453R104j403q570P089M636r823K711Q248p044
845A220j631O785n775k732J0378k925j0192O962N259q831J609M865p183J677Q034
860G520q052m820R468j223q989O262L065p329L207L294r395K044R554o955n144
875g493Q650k497n584O907m69p952P350M950j0015J251Q164o547k424R287l303
890B75n202Q205r8r310O612N375p777J938N996o825k01Q760o371n342R598l62
$$ plain form
906 5271 -1766 4553 6179 -3239 960 7718 -1219 -1230 7305 1243 -4279 3710 2764 -4164 2302 2533
922 2533 -6057 -1191 4968 -4715 -5568 2360 -2910 -5982 1435 -2083 -7934 290 845 -7916 -2482 3715
938 3715 -4248 -4696 1611 -3213 -3262 4724 -1192 -7149 2923 4794 -4309 -357 3584 -2590 48 5366
954 5366 -2340 -2455 6693 2003 -4399 3598 4592 -1550 2809 3593 -3266 2660 8729 -1718 -3037 7156
970 7156 2859 -3007 3328 1952 -3319 3928 3821 -5424 -842 5297 -3555 -5046 2184 -1368 -3749
985 -3749 2381 -2736 -8021 1025 2361 -7373 -2973 2954 -4087 -3228 1923 -3703 -4395 3799 -438 -5873
1001 -5873 3150 3774 -5060 -384 4244 -1912 384 5721 -1671 -2514 6068 2041 -3822 4193 4464 -1971
1017 -1971 2594 4620 -2076 1698 6757 -1288 -1239 6968 2126 -2914 3849 2782 -3472 3267 4523
$$ packed form
906E271p037O319J626r418M199O758q937j1Q535o062n522P989r46o928O466K31
922B533q590M866O159r683q53P928n270l072P417l518n851Q224N55q761N434O197
938C715p963m48O307m824m9P986n916n957J0072J871r103L952L941o174K638N318
954E366p706j15R148m690o402P997R94o142M359P84o859N926O069j0447j319J0193
970G156m297n866O335j376n271P247j07r245M582O139q852j491P230l552k381
985c749O130n117n285R046J336r734M400N927p041Q59N151n626o92Q194m237n435
1001e873R023O24q834M676M628o156K296N337p392q43Q582m027n863Q015K71o435
1017a971M565K026o696L774N059q045M9Q207m842n040O763j067o254O739J256
$$ plain form
1032 4523 -3698 -410 4749 -3238 -3604 3776 -1681 -5478 1694 -323 -5692 300 43 -7428 -1960
1047 -1960 2948 -4888 -4528 2626 -2410 -4899 2355 -1051 -5230 2503 2662 -5371 228 4738 -2410
1062 -2410 -1463 4155 -1549 -1869 5871 895 -3804 4002 3927 -2919 2495 5526 -1381 1085 6401 -768
1078 -768 -622 6577 1513 -2939 4613 3766 -2719 3067 4020 -3508 141 5236 -2773 -3434 3073 -1400
1094 -1400 -4655 2708 -446 -6234 -61 1365 -6184 -1975 2105 -4545 -3564 2233 -3723 -5227 3146
1109 3146 -176 -5795 970 1921 -4425 -195 2583 -3916 -989 5566 -801 -3213 3951 1319 -2807
1124 -2807 3815 3112 -2370 3146 5008 -3195 -132 6316 350 -629 5492 1852 -1283 5184 2235
1139 2235 -3767 2783 4916 -2645 -383 4088 -2042 -1957 3556 -2215 -4597 3111 451 -6060 -147
$$ packed form
1032D523q221L288N159p987l66P380n457l797P172k017n369N992k57p471N468
1047a960M908p836L60P154n036k489P254l406m179P733J59q033N599M510p148
1062b410R47N618n704l20P740m976m699P806p5o846N414L031o907K466N316p169
1078g68J46P199n064m452P552q47o485N786R53p528L649N095q009o61O507m473
1094a400l255P363l154n788O173J426p549M209M080o650R81N797n956j504Q373
1109C146l322n619O765R51o346M230K778o499K927O555o367k412P164k632m126
1124b807O622p03n482N516J862q203L063O448n966r79O121l640l135O467k949
1139B235o002O550K133p561K262M471o130Q5N513n771k382P708k660o511N913
$$ plain form
1154 -147 1603 -4686 -1136 1516 -4974 -3133 2848 -3228 -6071 1036 -910 -5491 991 1073 -5426 -809
1170 -809 2932 -3904 -2123 4035 -1881 -3136 3803 1085 -3197 3429 3054 -2611 2160 4978 -1319
1185 -1319 1235 5832 -653 -1368 6261 2108 -2608 3438 3081 -2956 2010 3533 -3608 -229 4329
1200 4329 -2463 -2939 3585 -239 -3446 1922 -657 -4155 2280 1992 -5766 -2001 3441 -2606 -3082 1335
1216 1335 -3427 -3853 2667 -1174 -6293 64 1620 -5550 -1612 1395 -3708 -1219 3247 -2975 -3333
1231 -3333 4514 1216 -3976 2478 3799 -1096 2648 4260 -1823 1544 6300 24 -673 5629 2259
1246 2259 -1702 3460 2452 -2432 3054 4237 -3089 40 5194 -1251 -2819 3192 69 -2377 2982
1261 2982 602 -4588 844 2037 -4585 -577 2970 -2986 -2540 2306 -2901 -4323 2036 -1007 -6036
$$ packed form
1154a47J750o289L550K652o490J841N981o076k843P107j946m581O482Q2o499M617
1170h09L741o836J781O158n916j255O939k718m282O626l75n665M771K818o297
1185a319K554M597o485p15P629m153m716O046l57o037M966J523p141L379M558
1200D329o792m76O524l824l207N368k579l498O435k88p758L765N442o047m76M417
1216A335m762m26O520l841n119O357J556p170L938L007n103K489M466o222l58
1231c333P847l298n192O454J321m895L744J612o083L367M756o276o97O302l370
1246B259l961N162j008m884N486J183p326L129N154o445j568O011l123k446N359
1261B982k380n190N432J193o622M008L547n956M46M846n207j422O359l043n029
$$ plain form
1276 -6036 295 1583 -4882 -1961 1042 -3924 -1716 2868 -2188 -3367 3706 187 -3664 2537 2676
1291 2676 -2606 1854 4166 -1823 576 5616 -2 -1194 5015 1763 -1094 4118 2454 -2358 2610
1306 2610 4138 -2164 632 4664 -1341 -2083 4036 334 -2862 2888 963 -4208 1094 2845 -3865
1321 -3865 -1170 2309 -3293 -2695 2242 -2884 -4414 1827 -1009 -5338 190 961 -5151 -1445 2398
1336 2398 -3614 -2202 2950 -2022 -3708 2709 255 -3278 1951 1990 -2706 1689 3855 -2076 586
1351 586 5020 -348 -1182 5246 1965 -1703 3436 2510 -1822 2462 4500 -1572 582 4660 -632 -1057
1367 -1057 3886 -245 -2261 3610 1353 -4627 711 2321 -3911 -1232 2129 -2621 -2238 2059 -2414
1382 -2414 -4394 1609 -481 -4707 -197 212 -4195 -307 1765 -4488 -2557 3103 -1472 -3263 2127
$$ packed form
1276f036O331J288o465K921L003m966K208M584n056j179P073l519l851O201J39
1291B676n282M460K312n989K399N040n618j192O209l252k857N212j664m812M968
1306B610J528o302K796M032o005p42O119l702l196N750j925n171N302J751o710
1321c865K695L479n602N98M937n126j530O241k836m329N528P71o112L706L843
1336B398o012J412N152m972j686O417k454l533N229L9m696M395K166n931K662
1351E86M434n368q34O428l281l668N139r26m332M284K038o072K154M078n292m25
1367a057M943m131k016N871k257n980N338J610o232K679L361m750L83M297m473
1382b414j980O003k090m226M510M09m407L888K072o253J931N660m575j791N390
$$ plain form
1397 2127 -203 -3984 1310 1861 -3097 1438 3448 -2649 -1029 3830 -272 -675 4253 365 -1919
1412 -1919 4093 3156 -2368 2104 4106 -1013 806 4613 -643 -815 3948 -204 -2136 2997 1451
1427 1451 -2995 1216 1884 -3874 -249 2708 -3066 -2629 1948 -1856 -4196 1199 -487 -4748 -317
1442 -317 704 -4029 -960 1305 -3794 -1930 2374 -2064 -3053 2638 232 -3697 1429 1332 -3263 369
1458 369 3033 -2187 -572 3766 -404 -1563 3702 1131 -1489 3202 1941 -1997 2901 4394 -1986
1473 -1986 538 4627 -412 -914 4087 848 -1476 3191 1905 -2853 1531 2619 -2962 -768 2029
1488 2029 -2325 -1807 2325 -2611 -3895 2017 -207 -4516 -6 1269 -4300 -1535 1190 -2709 -1209
1503 -1209 2157 -2621 -3333 2210 157 -3305 1287 1092 -2829 1238 2818 -3027 -961 4161 -610
$$ packed form
1397B127k330l781N294N51m958M535K010o097J620M859m102m03M928l888k284
1412a919O012r37n524M472K002n119J819L807n256j72M763m152j932N133j546
1427A451m446M211O68n758L625K957n774M37M577l804k340N395j686m261M431
1442c17J021m733L069K265n099J864M304m438r89N691k406l929N126r7m595L632
1458C69K664n220J615M338m170j159N265k571k620M691j261l938M898J493o380
1473a986K524M089n039n02N001l239k324M667j286m758M384J088n581K194K797
1488B029m354N18M132m936j284N912k224m309M510J275n569K765K725l899J500
1503a209L366m778p12N543k053l462M592j95l921M067J580n845K066N122m771
$$ plain form
1518 -610 -1925 3471 1667 -1480 2322 1431 -1797 2635 4342 -1815 460 4393 -59 -404 3738 74
1534 74 -1513 3902 1671 -2822 1842 2658 -2603 -433 2426 -1544 -1326 2091 -1781 -3230 1797 67
1550 67 -4419 197 277 -4081 -801 1327 -3564 -2394 2115 -1877 -3403 1337 -347 -3212 1166 994
1566 994 -3202 621 2646 -2130 -353 3406 -963 -1693 3464 422 -2371 3160 2625 -1799 1488 3034
1582 3034 -1456 814 3717 -686 -681 3593 1009 -1367 2962 1796 -2409 1776 2581 -2559 159 3055
1598 3055 -2172 -1692 2527 -837 -2923 1531 -463 -3778 611 583 -4006 -905 1541 -3406 -2431 1832
1614 1832 -1913 -3422 1009 -732 -3663 1156 961 -3620 -169 2112 -2289 -789 2897 -786 -1411
1629 -1411 3136 420 -1818 2882 2276 -2238 1332 3273 -798 839 3598 -657 -279 3953 847
$$ packed form
1518f10j315N396j804l147L802q91l228M432J707o157K275L933m452l45M142l664
1534G4j587N415k231m493M664Q16n261K170K859l970K18L417l872j449N027j730
1550F7m486M616Q0m358L280K128m891J170M509l992j526M740j684k865M378j72
1566I94m196L823K025m776J777L759m369p30N157l042k793N531n35m424L287J546
1582C034m490K270K903m403NM274k584k376M329j166m205M185Q05n140K718K896
1598C055n227M80M219l364k086M454j994l315M389k8m589L101K446m947R75M263
1614A832l745j509M431j741k931M819j95m581L451K281m401J500L686l683o25
1629a411M547k716k238M700o06m514L570J941m071J637K759m255L78M232l106
$$ plain form
1644 847 -1503 3380 1812 -1821 1799 2256 -2215 761 3094 -1716 -952 2957 -1010 -3002 1674 -89
1660 -89 -3419 567 578 -3356 -803 1096 -3415 -1957 1652 -2106 -3216 1451 -116 -3403 323 366
1676 366 -3266 398 2153 -3022 -1226 2439 -1000 -1703 2064 199 -1482 2624 1434 -2294 2258
1691 2258 3429 -1368 -90 3534 566 50 2966 277 -1716 3598 2220 -2161 1345 2752 -1201
1706 -1201 374 2176 -1402 -309 3270 -1095 -2989 1767 713 -3233 -480 278 -2602 3 1355
1721 1355 -3571 -2244 2359 -1335 -2893 818 -759 -2646 577 386 -3338 125 1774 -3002 -1674
1736 -1674 2514 -291 -1233 2124 -209 -1632 2579 1551 -2389 1466 3083 -892 962 3332 -221
1751 -221 251 3560 427 -1119 3107 2087 -1777 1693 2394 -1620 579 2623 -1285 -1101 2219 -703
$$ packed form
1644H47k350M883j568l633L620M57m471K976K333m810P64L909l967j992M676j763
1660h9l330L986J1l934K553J899m511J458L609l758j110M667j567l287L726M3
1676C66l632L664J755n175J796L665l439p03L767j865j681M106j190l728M552
1691B258J171m797J278L624k968n16K916k689j993N314j378m381L506J407l953
1706a201J575J802l578J093L579m365j894M756j054l946K753P58k880K605J352
1721A355m926J327M603l694j558L711j577j887L223j91l724L463J649m776J328
1736a674M188k805r42L357k333j423M211j028l940L855J617l975J854K370l553
1751b21M72L309l133j546M226j020l864L470P01m014K199K044l908J84L320k922
$$ plain form
1767 -703 -1907 1907 -107 -2766 755 1142 -3074 -1084 1118 -2502 -1494 1593 -1925 -2909 1099 -688
1783 -688 -3218 469 563 -3046 -543 1211 -2382 -920 1916 -1605 -1838 2488 788 -1895 1535 1375
1799 1375 -1221 1402 2215 -1493 919 3589 -598 -713 3173 996 -870 2594 1399 -1209 2311
1814 2311 2719 -1622 174 3116 -594 -766 1998 -934 -1431 2142 111 -2489 1277 1198 -3042 -712
1830 -712 1418 -2120 -1500 1293 -2018 -2496 1293 -589 -3426 199 493 -2955 -359 695 -2899 -1301
1846 -1301 1878 -1641 -1519 2021 -265 -2538 1538 1026 -2042 1348 2408 -1406 89 2509 -262
1861 -262 -346 3000 301 -1135 2880 1935 -1172 1316 2425 -1001 604 2460 -1030 -557 2777 -51
1877 -51 -1568 1917 741 -1675 703 761 -2201 193 1298 -2431 -1827 1723 -1126 -2314 472 -945
$$ packed form
1767g03j204L814k014k659L521L87m216J990K202l620J008L087l518r84M008j787
1783f88k530L687R4l609K503J754l593J462K836l521k33M326j700k683L430j60
1799A375k596K623Q13l708K412K670m187j15L886k177j866L464j195k608L520
1814B311M08m341J796K942l710j72K764k932m97L573k031k600L766p9m240K330
1830g12K130l538O20K793l311m78L789j882k837L625K94l448K596J054l594J598
1846a301L179l519J22L540k286k273M076n12l068L390J060l814J495K420k771
1861b62q4L346k699j436M015r45l107K488J109l426J605J856l490M73L334k828
1877e1j517L485j176k416K378N8k962K394J105l729O04L550k849j188K786j417
$$ plain form
1893 -945 -2644 172 193 -3259 -612 1338 -2795 -1552 1291 -1085 -1725 1503 -835 -2102 1852 1264
1909 1264 -2251 754 2109 -885 141 2599 -547 -75 2898 329 -1137 2576 1525 -1270 1273
1924 1273 2139 -805 523 2194 -1343 -503 3020 -25 -1874 1643 709 -1783 628 1069 -1879 66
1940 66 1306 -2346 -1339 1777 -1039 -2469 704 -678 -2599 410 -290 -3247 -608 785 -2142 -1710
1956 -1710 1108 -1540 -1637 1129 -760 -2046 1530 860 -2324 688 2025 -939 -200 2223 -609 -250
1972 -250 2805 198 -969 2675 1540 -1208 1659 2596 -614 503 2462 -509 0 2556 -150 -1298
1988 -1298 2208 898 -1582 1173 1056 -1925 193 1381 -1703 -1065 1504 -1460 -2132 1188 -425 -2465
2004 -2465 417 182 -2579 -27 1227 -2437 -1192 831 -1589 -1732 1248 -495 -2133 1024 344 -1988
$$ packed form
1893i45j699K816K1l452K647J950m133J243K843k376o40L228k338j267L954n88
1909A264l515L005J355k994J026K458l146M72K973k569j466L713j051k795K543
1924A273Q66k944J328J671l537Q40L523l045j849L517r34k492K411M41k948J945
1940F6J240l652J007L116k816j430L173j382j921L009p00k957K639J393k927M32
1956a710K818k648r7K766j889j286L576o70l184L012J337k964P39K423k832L59
1972b50L055k607j167L644j135k748K867R37l210J117J959k971N09K556k706j148
1988a298L506j310k480K755j17k981K118J188l084O38K569k964o72L320j613k040
2004b465K882k35k761K552J254l664J245K023k420j43K980j743j638L157o80k332
$$ plain form
2020 -1988 413 1422 -1767 -21 2352 -545 -710 2050 552 -718 2137 1388 -1096 1753 1827 -1116
2036 -1116 864 2667 -433 3 2336 514 -617 2069 684 -1940 821 1529 -1491 245 1558
2051 1558 -1630 -1065 1446 -746 -1320 1192 -480 -2794 388 594 -2521 -575 649 -2176 -1042 1255
2067 1255 -1744 -1925 1164 -189 -2165 300 321 -1884 491 1315 -1934 231 2267 -864 -985 2430
2083 2430 581 -1047 1702 942 -1182 1679 2033 -972 609 2415 -374 -224 2453 359 -602 2182
2099 2182 691 -1426 1366 1321 -1563 119 1720 -980 -911 1450 -601 -2013 782 -669 -2101 461
2115 461 134 -2336 -442 916 -2041 -1379 973 -1842 -1988 933 -814 -2188 747 564 -2314 -93
2131 -93 1196 -1211 -378 1470 -1122 -562 1853 -60 -1120 1261 1398 -1137 783 1772 -767 531
$$ packed form
2020a988K401J009l189J746K373k897j65K760j498j270K855p49k484K849P4k943
2036a116J980J803l100M36K333j822j131K686j385k624K761P08l020J736J313
2051A558l188N65K511k192n74K512j672k314L182K06l115J946J224k825J134K297
2067A255k999j81L089j353j976K465K1k205K375Q24l249K165K036l131j21L415
2083B430j849j628K749p60k124K861L54l005J581J806k789J50K677k094r61K784
2099B182j491k117K792m5k884J682J601k700O9K361k051j412K795j451j432K562
2115D61l27k470J894J358k957O62K352k815j46K921j747j374K935j83k878K221
2131i3J289k407Q33J848k592N60K415j913j060K381J37k535J920R89k539J298
$$ plain form
2147 531 2355 -207 -175 2407 207 -433 2168 990 -997 1467 1085 -1167 482 1713 -1378 -771
2163 -771 1436 -997 -1962 748 -184 -1839 516 264 -2422 -415 1064 -2048 -1166 695 -960 -1702
2179 -1702 983 -892 -2176 731 595 -2048 216 931 -1644 -489 1793 -636 -653 1863 -414 -1204
2195 -1204 1773 1212 -1181 1261 1621 -717 809 2328 -389 -98 2578 514 -698 1745 1119 -842
2211 -842 994 1188 -1174 642 1641 -1336 -454 1783 -794 -1473 1047 -119 -2048 440 38 -2505
2227 -2505 -493 790 -1953 -1214 942 -1452 -1570 558 -800 -1758 836 218 -2233 235 906 -1861
2243 -1861 -512 1381 -703 -1004 1771 -93 -759 1455 925 -1208 1033 1325 -784 553 2363 -50
2259 -50 14 2630 233 -724 2284 1050 -1247 1196 1431 -1025 447 1649 -1023 -351 1568 -621 -1247
$$ packed form
2147E31J824k562L2K582k200o40K601j178j987K464l82k252J649J231l091O07
2163g71K207k433r65K710r32j655K355k52k686K007J479l112Q82J861j655p42
2179a702K685j875j284K907j36k643K264P15k575J155K282k429j7K516k277p90
2195a204K977n61k393K442L60k338J526J519k717K91K676k064j212K443o26j961
2211h42J836J94k362J816R99k977Q82K237k577o79K520j166j929K488m02k543
2227b505K012J283k743P39K156k394j18K128j358r58K594o18k451K468O71k767
2243a861J349J893k084l01K775j864o66K214n30k133K241K92k109J337J810k413
2259e0O4K616k397r57L008j234k297K443K35k456J472J202k672O72J919k189o26
$$ plain form
2276 -1247 1093 -54 -1595 952 470 -2272 8 682 -1628 -1061 729 -1314 -1603 674 -584 -2123
2292 -2123 235 -197 -2053 -80 882 -1912 -506 1196 -1046 -841 1435 125 -1132 1129 1040 -913
2308 -913 1256 1707 -593 543 1987 -42 -83 2043 126 -379 2086 926 -982 1777 1570 -1079
2324 -1079 138 1915 -616 -298 1148 -518 -925 1143 40 -1498 356 432 -1979 -275 489 -1662
2340 -1662 -902 827 -1462 -1714 489 -595 -2224 284 174 -1673 -293 386 -2171 -503 975 -1077
2356 -1077 -951 1130 -190 -1220 1308 738 -882 1120 1301 -1062 624 2016 -551 -387 1984 224
2372 224 -341 1744 679 -1028 1379 1607 -724 519 1984 -684 -116 1562 -293 -611 1262 -54
2388 -54 -1564 489 790 -1743 -50 523 -1436 -868 848 -1454 -1616 524 -1104 -2146 278 -326 -2254
$$ packed form
2276a247K340j147j541K547m82k742K280O74k310N67J790k043k89K277j258j539
2292b123K358m32j856J973R62k794J406J702k242K05K276j310j257K261q9j953
2308i13K169M51k300J136J444k029m1K126j917n05K465j160j908K759k07k649
2324a079J217J777k531L18J446j666m07K068j103j538J854P6k411J704P64k151
2340a662P60J729k289k52K203j084j629K508j10j847J380O79k557J668J478k052
2356a077J26K081j320j030K528n70j620K002J81k363J686J392k567J64K371j760
2372B24n65K085j065j707K407K28k331J243J465k668N68J678j855l18J873j316
2388e4j510K053L01k533J693N73j959N68J716k302j62K140j628j042K424o04j928
$$ plain form
2405 -2254 -502 648 -1930 -327 1006 -1186 -1179 1205 -47 -1244 1036 526 -1096 1015 1364 -1070
2421 -1070 219 1655 -715 78 2297 343 -332 1452 771 -418 1324 1467 -960 637 1681 -614
2437 -614 -8 1636 -170 -797 1283 112 -1382 941 705 -1753 -71 1210 -1295 -850 868 -1188
2453 -1188 -1493 711 -809 -1895 205 -241 -1977 -202 691 -1697 -862 717 -1160 -901 839 -616
2469 -616 -1546 910 508 -1415 333 1305 -995 37 1475 -685 -126 1730 -37 -468 1767 1317 -666
2486 -666 1077 1345 -809 850 1650 -416 210 1874 -122 -722 1158 200 -1178 702 530 -1725 -92
2503 -92 1161 -1471 -875 1120 -774 -1284 468 -784 -1628 501 -210 -2160 -387 587 -1946 -841 782
2520 782 -1076 -985 915 -556 -1216 996 411 -1353 470 930 -1042 294 1494 -665 -222 1741 287
$$ packed form
2405b254J752J150k578J603J333k192PK384j252j197K280n10j622K111L49k434
2421a070J289J436k370P93K219j954o75J784o81j189J742J43k427J597J044k295
2437f14O06J644j806o27K080j171j494K323k36k458J682J281k505M45J718k056
2453a188l05K204j520j086K100m46j736J775Q93k388Q35J579j877K59J740j455
2469f16r30K456m02j923J748R72k300J032J438k160N59J856j767m31K235m50j983
2486f66J743K68k154J659Q00k066O26J664j996o00J880r58j378J880j72k255J633
2503i2J253k632N96J995j894n10J752j252q44K129p11j950J773R74k533J105J623
2520G82j858R1J900j471o60K212n85j764J823M60j972J336J200k159M43J963j454
$$ plain form
2537 287 -374 1487 830 -644 1426 1409 -741 523 1674 -318 62 2051 -83 -461 1290 488 -1324
2554 -1324 1125 825 -1310 -12 748 -1187 -221 1102 -1123 -1695 533 -346 -1826 204 -418 -1767
2570 -1767 -93 172 -1501 -626 460 -955 -1224 1202 -624 -1367 886 359 -1314 592 974 -1105
2586 -1105 -117 1360 -712 -356 1782 32 -244 1679 733 -683 1390 1422 -888 666 1982 -92
2602 -92 284 1265 -206 -349 1678 447 -818 905 857 -1283 625 950 -1130 -327 1185 -920 -1059
2619 -1059 978 -225 -1876 60 -24 -1696 -151 273 -1924 -551 1130 -1139 -1340 666 -611 -1152
2635 -1152 302 119 -1433 745 594 -1415 72 1554 -531 -255 1161 -143 -556 1297 823 -767
2651 -767 1207 1279 -619 641 1499 -186 9 1633 -12 -412 1498 346 -1108 1010 1133 -1044 655
$$ packed form
2537B87o61J861o57j474K070j7k150J264J151j992L80J989k134l78J751q02j812
2554a324K449l00k135J298P60j935R66J323k225n72K228q79j480K030o22j349
2570a767J674K65j673Q75J086j415k69K426j826p43K253n27j673J906L82k079
2586a105R88J477k072L56K138j750k76J923r46j416K073L2k310J554J316k074
2602i2L76R81j471j43K027j231j265J723m8k140J908L25k080Q03J512k105j39
2619a059K037j203j651J936q4j672J545M24k197J373J681k269k01K006j277n41
2635a152J454j83j552K178j51k009J487J482k085K76J416j304m13J853m74j590
2651g67J974P2j898J260Q58j685J95J624j645m00J910j152j454K118J23k177J699
$$ plain form
2668 655 937 -1230 -593 910 -894 -920 878 -523 -1438 619 -10 -1391 -114 278 -1574 -344 606
2685 606 -1482 -1056 718 -548 -1500 546 -22 -1308 -38 743 -1168 14 1013 -825 -476 1318 90
2702 90 -993 1338 811 -847 1321 925 -676 743 1584 -560 18 1605 135 -257 1186 286 -522
2719 -522 1145 882 -1133 431 1181 -1240 -156 958 -898 -995 1062 -266 -1110 292 -36 -1568 -161
2736 -161 741 -1405 -518 438 -1266 -1034 754 -736 -1454 452 216 -1421 303 653 -1264 -164 678
2753 678 -1130 -451 1542 -162 -907 1177 363 -797 980 1038 -847 614 1530 -602 87 2014 -224
2770 -224 -508 1571 512 -687 884 768 -982 425 1294 -1039 -218 978 -538 -894 926 -526
2786 -526 -1025 449 -16 -1584 59 369 -1445 -790 757 -873 -1059 629 -794 -1508 520 -302 -1554
$$ packed form
2668F55K82k167O37J503j804k6J798j401r15K057o29j381J277L92j852J230R50
2685F06k088M26J774j266r52K046n68j286J270P81j911J182R99j838L49J794j228
2702I0j083K331n27j658K168l96j601J419Q41k144N78J587j470l92J443r00q08
2719e22J667k63k015J564P50k421J084J114j856r7K057j328q44J402l28j532J407
2736a61R02k146Q87R56j704K32J788j490p18J906k36j637J724L50j917J100Q42
2753F78j808O79J993j704p45K084q14j160J777N8j885J461R16k132O89J927k238
2770b24k84K079j059j199J571j16j750J407Q69k333Q21J196j516l56J820j452
2786e26m99J474m65j568J643L10j814O55J547j630j86J688j423p14K028q22j252
$$ plain form
2803 -1554 235 767 -929 -100 958 -912 -526 1234 -233 -510 1192 383 -810 703 803 -845
2819 -845 713 1442 -212 227 1651 -66 -532 1440 621 -492 988 881 -692 715 1061 -450 -91
2836 -91 1408 -463 -803 784 -340 -1019 610 188 -1158 441 115 -1488 -686 917 -1170 -1159 520
2853 520 -703 -960 442 -189 -1133 32 465 -1405 -459 852 -814 -609 993 -451 -607 1399 -137
2870 -137 -990 923 815 -701 460 1223 -449 268 1371 265 -139 1381 449 -540 1356 860 -1085
2887 -1085 720 1041 -601 -313 1117 -592 -823 1015 56 -1107 596 417 -1015 30 495 -1112
2903 -1112 -101 900 -1040 -940 642 -290 -1265 535 -216 -1096 209 337 -1301 -190 814 -622
2919 -622 -714 970 -180 -1010 837 286 -581 1278 488 -1148 122 1376 -342 -338 1209 188 -45 1534
$$ packed form
2803a554J789N32j696Q29J058j870L86J760j467k77J702q09j193J513J00j648
2819h45J558P29j654M39J424j717m66J972q19j113J480j07j573J407L46j511L59
2836i1J499j871l40J587j124o79J629m22j346J599l26j603Q02J603k087J1J679
2853E20j223k57J402o31r44J165M33j870R46J311j666K05J602j444j56K006j536
2870a37q53J913j08j516J161P63j672P17J103j106m04J520r32r89J896m96j945
2887a085J805L21j642K88J430j709k31J838r59j163J703j79j432J045M65j607
2903a112J011J001j940J00J582r32r75J800p51q80J305J28j638J111J004j436
2919f22r2J684j150q30J847n51q67J859p90j636J270J254j718MJ547j021k33J579
$$ plain form
2937 1534 404 -639 1284 1027 -973 677 1307 -820 234 1131 -266 -502 937 -128 -783 539
2953 539 189 -965 18 667 -1103 -375 482 -950 -754 377 -644 -1232 370 -65 -1558 -121 141
2970 141 -1411 -310 669 -1224 -475 1085 -310 -1060 823 157 -719 899 634 -960 480 930 -580
2987 -580 27 1353 -132 -327 1106 467 -529 852 773 -857 321 1349 -184 -40 1283 -315 -216
3004 -216 965 -127 -1237 1035 150 -1214 120 517 -1137 -548 627 -968 -854 731 -587 -1532
3020 -1532 221 -92 -1487 48 624 -1155 -56 470 -1220 -441 998 -843 -762 765 403 -928 362
3037 362 557 -780 354 1021 -556 28 1475 -228 -501 1012 524 -500 1177 640 -725 260 1258
3054 1258 -474 86 1447 19 -638 851 184 -461 608 145 -1110 456 615 -1375 -348 554 -903
$$ packed form
2937A534j130j043J923k57k000J650O30k127J054Q97j397k36J439j065o55J322
2953E39l50j154R83O49j770P28Q57j432J96J131j021n88J602m35j493J437K62
2970A41j552J101R79j893P49J560j395p50J883o66q76J618k65j594J440M50j510
2987e80O07J326j485j95J433o39r96J381p9j630J178J028j533J44J323j598R9
3004b16J181j092j110K272q85j364J334L97j654N89J175j595J14J585j318r45
3020a532J753l13j395J535N76j779J099N26j690P79J439j841Q1J527l62j331J290
3037C62J95j337J134O67j577N84J447j703k73J513m88j024J677n37j365R85R98
3054A258j732N60J361j428o57J489o67o45J069m63j255J566J59j990J027R02j457
$$ plain form
3071 -903 -819 627 -766 -1284 433 -54 -1235 110 134 -1436 -608 700 -878 -820 985 -659 -942 673
3089 673 208 -1190 641 783 -544 89 1158 -558 -121 1255 -100 -512 1307 320 -541 924 736
3106 736 -599 757 1126 -553 60 1085 -159 -15 1243 202 -837 1068 299 -758 486 619
3122 619 -983 -225 934 -1099 -1118 367 -324 -1207 561 -360 -1338 -1 330 -1040 -285 549 -1024 -437
3140 -437 563 -525 -934 694 -196 -1222 695 392 -724 69 1213 -733 -188 777 -86 -144 1146
3157 1146 370 -438 841 966 -557 622 976 -598 121 1003 -342 -402 1049 168 -749 623 420 -695
3175 -695 457 735 -729 220 727 -621 -719 698 -298 -876 335 -122 -1134 39 53 -1127 -211 343
3193 343 -1078 -952 630 -273 -787 738 4 -1157 340 218 -1020 158 792 -629 239 1037 -62
$$ packed form
3071i03Q4J446j393n18J717m87j181J345K4j570Q28J308j578N8J805j644k83J615
3089F73m65j398J831J42j327O33J069j716M37J376j355m12J819r87q61J465j88
3106G36j335J356L69j679O13J025j244J44J258j041j039J905p69j057J244J33
3122F19j602P58J159k033j9J485o91q83J768r21r78J337L31j370P55Q34j573N87
3140d37J000j088m09J628q90j026J917l03j116P93J144j946N45R65q63n8J290
3157A146p76q08J279J25j523J179L54j574P19Q82j345o0J451q81r17J372k03j115
3175f95J152K78j464R49N07j348r8J417r96n78J211m57j012J173J4j180R16N54
3193C43j421J26J582r03n14J525p34j161J497j22j238J178O34j421Q68P98j099
$$ plain form
3210 -62 -282 1267 336 -199 984 726 -522 699 1358 -450 258 915 -40 -156 973 31 -537 1026
3228 1026 579 -742 626 715 -941 -234 692 -861 -426 881 -234 -934 359 83 -1120 222 97
3245 97 -1211 -103 382 -1254 -347 315 -749 -1175 493 -1 -951 132 167 -919 137 915 -518 -200
3263 -200 974 -119 -55 1167 51 -129 701 573 -462 519 885 -284 119 1180 -19 -19 1082 29
3281 29 -339 964 400 -675 543 1040 -1015 -227 649 -543 -613 525 -696 -821 779 -60 -1032 28
3299 28 502 -1066 36 389 -928 -589 527 -290 -1151 478 -153 -940 201 192 -831 346 385 -646
3317 -646 -68 643 -191 -571 977 288 -655 993 585 -391 572 995 -355 280 1405 56 -319 889
3335 889 235 -136 930 134 -377 455 499 -953 -77 687 -647 -290 617 -434 -570 347 -307 -1231 -60
$$ packed form
3210f2k20J549r31n35J183k58j248J221O59j808P08O57r55j16J129r42n68J563
3228A026m47j321J368Q9j656P07R26j553M35J307j115p00J293k76j203J342j25
3245I7j308J108M85j636R07O62j064m26J668m94r50J083L5j086J056P78j433L18
3263b00J174j093O4J222j116j80Q30j28j035R81L66j169M03J061j199%J101j053
3281B9l68J303n64j075J218M97k055P88Q76j192p0J138j221j25J600q39r72J060
3299B8M74j568J102L53j317L39J116q17q61J629o31p87J141rj023J177L9j031
3317f46N78P11q34l80J548o89r43J648m08r76R63M23j350O35J125j349l75J208
3335H89o54l71J066p96n11Q32M4j452Q76P64j334L57R07j051j36R17o54r24J171
$$ plain form
3354 -60 153 -1017 -574 370 -821 -234 360 -665 -854 437 76 -670 309 270 -709 -290 471 -1019 -77
3373 -77 672 -324 -213 766 298 -656 826 562 -265 397 871 -325 -56 940 -359 -170 1179 356 -516
3392 -516 808 223 -299 389 653 -520 382 549 -553 -225 595 -343 -850 246 10 -705 152 333 -1354
3411 -1354 -244 481 -806 -500 59 -630 -486 305 83 -968 407 406 -1002 -133 492 -641 -36 495
3429 495 -403 -220 614 -108 -541 812 487 -534 388 512 -481 342 918 -52 -219 1159 123 -680 759
3448 759 719 -155 436 584 -386 161 971 -322 -482 631 -35 -887 475 143 -642 183 -98 -979 20
3467 20 416 -725 -446 562 -453 -626 280 -111 -868 369 -229 -951 -27 474 -372 -497 812 -337
3485 -337 -303 455 -121 -337 796 416 -593 85 672 -375 342 722 -187 -133 833 585 -200 544 201 -566
$$ packed form
3354f0K13j170M43R44j191N87N94j025j89J291l61p46R79l9r79M19P61j490R42
3373g7P49r96J11R79m68r54J482k64q27O62M74j196K69R96j299J89J349q23q72
3392e16J324n85n22O88K64j173R02J67j102L28Q20r38n07J096k36p15Q57J81j687
3411a354J110P25j287L06N59o89J44P91k22j051J375jj408Q69O25j133O05N31
3429D95q98J83Q34p22m33J353l25j021R22J24r93Q23N76r70j67J378j036q03J439
3448G59m0q74N91J48r70N47Q10j293j60J113o66q52J362l32p85Q25k81q81R99
3467B0L96j141K79J008j015j73R06l91p57J237n98p22R24N01q46j25J309j149
3485c37L4P58n76k16J133l80j009O78N87j047P17L80r09N4R66k48p85P44l43p67
$$ plain form
3505 -566 548 596 -170 110 407 -123 -78 723 -279 -617 421 68 -766 345 139 -412 -554 315 -659
3524 -659 -357 732 -405 -632 283 -220 -681 300 -10 -992 166 391 -681 -442 532 -433 -431 649 249
3543 249 -524 307 457 -470 414 874 -870 68 725 -329 -199 831 43 -181 870 383 -561 570
3561 570 813 -446 115 666 -138 -162 569 -280 -295 636 -291 -776 314 313 -862 -269 260 -730 -369 235
3581 235 -460 -621 514 -445 -946 -126 -128 -693 -53 84 -1098 -151 476 -573 -589 406 -13 -669 644 185
3601 185 -410 490 692 -406 -56 755 -16 95 882 185 15 738 365 -416 633 658 -292 349 799 -386
3621 -386 -279 360 2 -369 639 -128 -757 828 329 -571 -37 615 -335 -202 449 -626 -716 458 -299
3640 -299 -1047 -43 172 -772 -156 95 -532 -533 649 -520 -628 351 -331 -502 404 19 -243 294 237 -410
$$ packed form
3505e66J114M8p66K80K97n30M5Q01j002l38J038l53q34J111k06n51j42Q69r74
3524f59L02J089j137k27R15n03m61R81l10r82J158K25j072K39R74r65KJ080m00
3543B49p73Q31J50r27Q84M60j744R38O57j054J30J030p88k24J051m87r44J131
3561E70K43j259N61N51q04k4P31q49j5R31r27m85J090jj175N93N29r90L61O04
3581B35o95j61J135r59n01Q20kn65O40J37j182R47O27j049j6R95m19o56J313m59
3601A85n95R00K02j098L50Q11p71J11P87o97j70P23l73p81J049K5r50O41M50j185
3621c86J07O39l58l71J008p67o29J585m99r00N34O52r50J33O51j075r0J174p57
3640b99p48J004K15r44O16K51o27jJ182j169j08R79o82j71R06l85k62N37n7o47
$$ plain form
3660 -410 75 672 -230 -72 801 428 -293 673 291 -221 407 454 -63 -1 798 -186 -212 619 215 -510 356
3681 356 483 -564 366 144 -572 -74 332 -670 -383 203 -751 -383 339 -137 -809 32 45 -795 -59 415
3701 415 -784 -280 305 -464 -545 339 -53 -852 314 332 -705 419 317 -457 101 732 -22 -14 977 -17
3721 -17 -335 759 649 -497 506 740 -13 24 768 -446 63 784 -117 -164 190 -193 -402 330 376 -453
3741 -453 -290 470 -578 -282 279 -611 -462 308 -459 -838 87 -158 -678 24 309 -780 78 312 -801
3760 -801 -395 329 -122 -548 234 184 -741 207 309 -334 123 708 -132 -392 500 232 -310 579 371 -281
3780 -281 473 625 -302 278 243 -214 246 812 182 -244 468 -1 -395 87 325 -311 104 451 -589 -216
3800 -216 79 -349 -717 286 -247 -611 -20 161 -613 -44 134 -772 30 429 -261 -364 264 96 -387 433
$$ packed form
3660d10M85N97r02J58Q73l73p21R66l82n12O28M7n17O2P99r84k6Q31m04p25Q66
3681C56J27j047R30k22p16M98M06j002K87N86r54L68P22m76o72Q41J3q40P36M74
3701D15j199N04N85p69q1Q84l92p99J166J8j037J124j02p74N58O31p54QR91r94
3721a7l18J094j10j146J003K34p53L7P44j214N09P21r01m7L54l83k09P32M6q29
3741d53J63P60j048K96N61q90J49P70p67l79R25k45n20P02K85j089Q58K34j113
3760h01M06P24m51m26P82n0r25R48J02o43M57N85q40k60Q92k68n42Q89k08o52
3780b81P54J52r27N80l5m57M60N66o30m26P12m69l94M82K38o36M15L47j040L73
3800b16K95m28l68J003n33l64N91J81p74N69J78r06Q02L99o90j03O28j68m83Q20
$$ plain form
3820 433 321 -704 284 250 -272 -124 953 -258 -137 592 222 235 525 462 -606 350 724 -295 241
3839 241 804 -95 -300 924 217 -346 510 157 -503 75 197 -341 -178 397 -214 -171 2 -91 -343 158
3859 158 -185 -706 -14 -191 -551 5 287 -434 -387 189 -418 -333 317 -87 -462 339 74 -698 127 648 -554
3880 -554 -47 370 -330 -286 565 47 -217 675 310 -343 481 296 -499 220 387 -420 -130 629 -63 8 760
3901 760 214 -131 363 81 -486 287 587 -148 -328 235 -221 -463 196 -195 -809 131 -21 -780 56 139
3921 139 -557 55 186 -725 -350 412 -386 -889 380 273 -544 -30 -15 -215 -58 416 -487 -407 358 81
3941 81 -497 502 172 -204 409 184 -301 361 735 -122 -173 565 -27 -145 692 -49 -174 395 294 -487 113
3962 113 437 -544 -293 432 -81 -355 166 -246 -688 288 45 -450 -20 -178 -374 -111 179 -423 -541 -47
$$ packed form
3820D33j12j025R88l4n22J48J077j211J21P29l70J3K90o3j068R56L74j019N36
3839B41N63q99k05J224p07n63Q56l53o60N78J22n38J63N75o11M3J73r3k52N01
3859A58l43n21O92j77l60N56K82p21M7N76o07Q5O50m04l75Q01k65p72Q25N21j202
3880e54N07M17p00M4Q51n18k64Q92l65o53Q24j85p95P19J67q07K90P59o92P1P52
3901G60n46l45M94k82n67P73L00p35j80N63m56k42O59l91o14R40j52p59Q36Q3
3921A39o96O12J31r11L75P62p98n03J269j07q17N14J5k00J57M74r03Q0P65k77
3941H1n78R99l30l76O13k25m85O62L74q57n1P38n92j18Q37p41j25N69j01p81O00
3962A13L24r81K51P25n13k74N21m12m42R76k43m95M30j58j96K63K90o02j18M94
$$ plain form
3982 -47 -321 -481 159 354 -559 -237 306 -256 -186 450 -395 -218 570 34 30 590 -76 -522 436 597 -199
4003 -199 170 452 -168 23 857 194 -221 299 419 -332 459 417 -433 89 176 -141 -72 416 -296 -149 296
4024 296 92 -602 213 -207 -327 3 310 -381 -316 370 -592 -448 167 -8 -606 153 49 -712 -3 204
4044 204 -565 -69 487 138 21 333 -114 -220 248 409 -415 427 563 -292 -164 322 220 84 580 -72
4064 -72 -18 382 342 -312 600 301 -373 145 342 -117 -60 495 -324 -71 565 112 -205 -112 -108 -407 14 90 -419
4087 -419 -115 531 -272 -385 269 -263 -559 129 82 -805 58 -34 -465 224 387 -465 -294 294 9 -237 564
4108 564 165 -404 182 482 -218 128 312 -53 -62 507 -97 -141 493 531 52 320 440 -286 214 273 -321 -164
4130 -164 573 -142 -232 263 -99 -205 87 62 -294 302 142 -678 -23 404 -371 -473 112 19 -654 458 -266
$$ packed form
3982d7k74j60O40J95r13L22N43n62P0O36q45J77P88n36mN60o66m46R58J61p96
4003a99L69K82o20J91Q34o63m15N20J20p51P91m2q50N22Q7l17O9M88p12J47M45
4024B96k04o94Q15m20j20L30L07o91O5O86r62J44O15j75n98P59j04p61P09K07
4044B04p69M96N56l49j17L12m47j06M68J61q24Q42J36q55J28M86j02j36M96o52
4064g2N4M00m0o54R12k99o74N18J97m59N7N55q19K53O36m53l17R3Mk99M21P6n09
4087d19L04O46q03j13O54n32k96O88m7q87Q63r2m31O89J63q52J71N88k85k46Q01
4108E64l99n69N86L00p00L46J84l65rN69o04m4O34L8m79K68J20p26N00N9n94J57
4130a64P37p15r0M95l62j06K92k5l56N96j60q20O55M27p75j02N85r3o73J112p24
$$ plain form
4151 -266 -562 -16 -88 -640 -301 576 -436 35 674 -18 -336 168 349 -311 429 404 -545 53 669 90
4171 90 -198 358 -135 -376 731 150 -263 315 151 -499 264 442 -120 116 334 -297 -192 377 79 -166
4191 -166 141 -91 -384 -76 188 -392 -185 158 -460 -314 346 35 -660 160 146 -709 -277 -75 -594 -484
4211 -484 -56 -165 -138 93 -292 -629 221 -48 -218 306 -49 -139 119 516 130 231 376 239 -55 632 242
4232 242 -370 214 143 -183 294 331 -107 -135 297 -123 -290 141 -124 -348 396 124 -252 124 146 -236 -193 159
4254 159 35 -409 277 47 -481 30 -10 -327 -123 312 -245 -133 293 -59 -101 339 -195 -427 142 -55 -350
4275 -350 12 287 -353 -106 280 -106 75 547 -311 -348 325 73 6 249 566 -13 190 301 -196 16 300
4296 300 58 -405 240 119 -204 388 262 -307 248 269 -147 -281 -76 -273 -294 156 -154 -469 -102 143 -617
$$ packed form
4151b66k96N46p2n52L39Q77j012M71O39o92l18N04J81o60P40k5r49N98O16n79
4171I0k88N56m93k41J107n81m13N78j64o50P63J78n62K36K18o31J05N69k98k45
4191a66L07k32k93L08K64n80K07L43o18J46O60l11o95Q20j4q55M32K02n19J10
4211d84M28j09K7K31l85l37Q50k69j70N24l55r0K58L97l86J01J45j37k94O87l90
4232B42o12N84p1l26M77L7m38k8M32m20j67M31k65k24P44k72l76L76K2l82M3L52
4254A59j24m44O86k30n28N11m0l17K04M35n57J12M26l52m2M40n34k32N69j97k95
4275c50L62K75o40K47L86l86J81M72q58l7O73k52o7K43L17n79K03J11m97K12K84
4296C00k42m63O45j21l23N92j26n69N55K1m16j34K05j97k1M50l10l15L67K45p60
$$ plain form
4317 -617 -309 2 -301 51 -101 -379 -222 317 -365 -495 235 -106 -226 -11 331 -140 -37 286 -316 21
4337 21 255 119 -36 133 234 -102 328 86 -15 106 453 -293 -149 347 -203 -134 298 97 -187 419 580
4358 580 -297 195 307 -215 1 -94 -42 -177 453 -299 -229 314 -79 -472 68 175 -386 -268 111 -206 -357
4379 -357 139 -240 -41 209 -63 -444 -23 297 -239 -16 328 49 -193 205 -250 -253 341 458 29 512 58
4400 58 -243 157 347 -49 -183 396 -165 -99 343 219 -303 10 273 -101 -117 20 -225 -51 271 -197 -174
4421 -174 232 -20 -286 114 146 -436 -124 -179 -345 36 482 -566 -273 551 3 -102 202 -282 -189 39 152
4442 152 -391 -28 474 -287 -227 199 -295 80 -2 322 -302 28 210 16 189 208 -195 172 548 49 -84
4463 -84 242 -49 -312 442 -55 -237 -65 327 -313 -134 207 -162 -155 264 -272 -369 298 155 -343 54 217
$$ packed form
4317f17L08L11l03L52j52k78J57N39o82j30P30l41j20K15L42m71J03L23o02L37
4337B1K34j36j55J69J01l36M30k42j01J21L47p46J44M96n50O9M32k01k84O06J61
4358E80q77M92J12n22K16r5N2j35O30p52P0N43l93l93N40J07n61J18L79l17j51
4379c57M96l79J99K50k72l81M21L20n36K23L44k79k42L98m55lN94J17m29M83m54
4400E8l01M00J90l96j34N79n61O6M42j24n22L13K63l74j6J37k45J74L22m68K3
4421a74M06k52k66M00L2n82L12n5j66L81M46j048K93Q24n48j05L04m84R3K28J13
4442A52n43L63N02p61O0M26m94L75q2L24o24L30J82j94J73J9m03L67L76m99j33
4463h4L26k91k63P54m97j82J72L92o40J79L41l69PM19n36r7O67j43m98L97J63
$$ plain form
4484 217 -187 -269 -85 -490 -318 320 -176 -386 168 -139 -321 130 12 -307 -119 17 -387 -80 289 -73
4504 -73 -183 88 59 -518 24 174 -59 -283 567 -112 -22 407 38 -91 305 351 -390 317 241 -603 66 308
4526 308 -85 238 450 115 -29 261 38 -379 201 162 -262 17 204 -180 -2 142 -172 -207 302 53 -181
4547 -181 19 94 -184 162 -290 -524 -82 297 7 -117 370 -260 -79 107 236 -136 231 105 -373 372
4567 372 297 -389 -136 530 161 -403 464 267 -185 371 -35 -204 -108 3 -226 -102 349 219 -27 -11 -12 -574
4589 -574 167 245 -352 -42 353 -263 -27 -33 -62 36 486 -398 -221 335 122 -250 -189 65 -236 7 180 62
4611 62 -412 39 286 -8 102 -23 -20 62 67 -256 -5 367 -243 31 496 -134 -1 188 149 -207 428 128
4633 128 -481 215 115 -249 80 144 -1 -219 280 94 -64 126 -108 -469 -63 133 -14 -355 185 -102
$$ packed form
4484B17m04q2J84m05J72O38m96k10N54l07j82M51j18l19J88J36m04L07L69l62
4504g3j10K71k9n77N42J50k33k24Q50o79R0M29l69j29L96M6p41P07p6q44O69K42
4526C08l93L23K12l35j44K90k23m17N80l9m24K79J87l84J78J44l14l5N09k49k34
4547a81K00P5k78L46m52k34M42L79k90j24M87o30J81J86J29l72L67j26m78P45
4567C72p5o86K53O66l69n64Q67j97m52N56m06j69R6J11k29J24M51j30k46J6jn62
4589e74P41P8n97L10L95o16K36ok9R8M50q84J77N56k13l72O1K54l01K43J73j18
4611F2m74M51K47k94J10j25LQ2Nl23K51L72o10K74M65o30J33J89l9l56O35l00
4633A28o09O96j00l64L29O4j45k18M99j86j58J90k34l61M06J96j47l41N40k87
$$ plain form
4653 -102 -259 -136 -107 -182 118 120 -490 126 331 -310 -53 196 -99 -211 206 178 -217 26 -10 -299 -11 324
4675 324 -168 -64 175 -129 -201 302 150 -395 158 46 -136 456 152 41 -80 213 147 294 220 -23 -99
4696 -99 162 13 -155 276 49 -174 43 -16 -144 -79 154 -175 -52 165 53 33 406 257 -369 251 14
4717 14 -393 -348 76 -225 -313 52 -185 -267 168 -50 -494 321 -75 -217 -178 72 -145 -26 252 88 -377 370
4739 370 100 -157 442 -19 -253 -9 66 -137 187 84 -63 35 205 -156 -344 142 -62 -299 84 147 -301
4760 -301 -346 -127 -419 -158 211 -4 -142 119 17 -210 -179 170 -273 214 77 -112 -198 128 69 -55 167
4781 167 -186 -157 235 415 -39 -200 146 -253 -345 -76 -150 -116 45 185 -81 219 20 -101 181 223 155 -159
4803 -159 182 -100 -282 37 45 161 371 92 26 4 224 -313 -44 141 -60 13 8 13 -370 431 28 35 -50 -2
$$ packed form
4653a02j57J23K9p5L00Ko10O16K05o41K57K49k95j12M17k8l95K43l6k89K88L35
4675C24m92J04K39l04p2N03j52n45N53j12j82N92l04j11j21K93o6J47p4k43p6
4696i9K61j49j68M31k27k23K17n9j28O5K33l29J23K17j12k0L73j49o26O20k37
4717A4m07M5M24l01q8L65k37q2M35k18m44Q15l96j42L9K50k17J19K78j64m65P47
4739C70k70k57N99m61k34K44P5k03L24j03j47R8J70l61j88M86k04k37L83O3m48
4760c01m5K19k92K61L69k15j38K61j02k27L1L49m43M87j37j89q6L26n9j24K22
4781A67l53K9L92J80m54j61L46l99r2K69p4L4J61J40k66L00j99j21K82M2o8l14
4803a59L41k82j82L19QJ16K10k79o6k2K20n37K69J85k01P3nNl83Q01m03Pq5M8
$$ plain form
4827 -2 -204 -120 102 -145 7 -15 133 -138 229 -35 -246 79 17 -141 -302 489 -283 250 67 -1 243 1
4849 1 -56 -415 211 182 267 -257 -172 15 202 300 43 -67 56 88 38 -41 45 -49 102 -56 -94 -214 -17 -398
4873 -398 -255 6 -295 -177 -23 -35 -194 37 216 17 -205 543 -68 -145 90 53 -171 -183 53 -227 -143 97
4895 97 183 81 -162 22 109 53 -266 -407 142 367 -178 -33 46 -322 -170 222 -138 230 -9 132 65 -63
4917 -63 163 -289 2 152 -256 108 268 -309 -178 119 -20 -178 -4 20 -223 -244 -68 -386 57 143 -180
4938 -180 55 -7 -211 -95 -110 21 -287 188 -249 -200 -115 308 -267 -223 -100 -37 -71 21 -45 177 38 94 -115
4961 -115 31 412 -219 250 80 -262 -295 313 122 -167 -17 67 88 254 -26 -35 121 62 67 -55 73 -87 -440
4984 -440 53 -186 -176 -104 -200 -319 198 -106 77 -327 -136 -89 137 148 -274 -180 -49 34 -302 -16 267 -110
$$ packed form
4827bk02Q4K22k47J52k2J48k71L67k64k11L25o2j58j61P91p72N33j83o8K44k42
4849An7l59O26k9Q5n24Q5J87J87R8k57j10J23L2n0p9Q6r4J51j58l8j20J97l81
4873c98J43K61l01J18J54j2j59K31J79j99k22P48o11p7K35l7k24j2K36k80Q4K40
4895I7Q6j02k43J84Q7n6l19j41N49K25n45J45P9l68J52L92l60L68k39J41o7j28
4917f3K26m52K91J50m08L64J60n77J31K97j39j58J74K4k43k1J76l18M43Q6l23
4938a80K35o2k04J16j5J31l08M75m37M9Q5M23n75M4J23O3l4R2o6K22j39N6k09
4961a15J46L81o31M69j70l42l3O08j91k89J50Q4K1J66k80rJ56n9Nj22J28j60l53
4984d40M93k39J0P2r6j19N17l04J83m04J91M7K26J1m22R4J31Q3l36K86K83l77
$$ plain form
5006 -110 35 164 -222 -178 410 -242 39 186 -474 -259 -305 72 13 -76 -50 326 22 -106 -37 -144 189 53
5028 53 -456 488 71 -51 57 -183 -13 -252 76 12 -160 -142 -2 -425 -128 48 -252 -447 -122 -156 -175 135
5050 135 -301 -250 220 -157 -158 20 42 -134 39 -86 -143 -94 -20 -360 145 217 54 -10 279 223 -88 110 146 -27
5074 -27 96 217 -148 172 347 309 -295 113 -120 89 57 149 -103 -11 96 196 233 -43 -19 110 56 25 65
5097 65 -125 44 5 81 206 309 -443 235 31 -88 -19 -176 -84 243 -3 -193 -208 141 -213 140 -61 -443
5119 -443 -62 491 195 33 22 -179 -228 35 410 176 176 218 125 107 197 208 -123 291 -3 -162 -106 334 14
5142 14 -244 27 152 82 227 -36 -56 -41 -251 -269 126 -55 -407 62 276 -61 -203 -228 -116 -184 -318 -105
5164 -105 -264 131 66 -30 -22 -15 191 64 0 96 -65 251 -54 97 -100 -220 -211 2 -29 -87 22 49 -187 56
$$ packed form
5006a10J45J29l86M4N88o52K81J47o60K15m6L77n9q9K6L76l04j28O9j07L33j36
5028E3n09R44m17j22J08k40J70k39L28o4j72J8J40m23K97J76l00j95L25l4j9L10
5050A35m36N1M70l77jJ78K2j76J73j25n7M9P4l40N05P2j63o4K89n6l11J98L6j73
5074b7J23J21l65L20J75l8o04M08k33K09l2R2k52R2J07J00L7k76K4J29n4l1M0
5097F5j90J69l9P6J25J03p52O78k04j19O9j57R2L27k46j90j5L49l54L53k01l82
5119d43L81N53k96j62j1k01m9K63L75k34%M2r3j8R0J1l31M14k94j59N6M40l20
5142A4k58K71J25p0J45k63k0J5k10j8L95j81l52M69K14l37j42k5J12o8j34K13
5164a05j59L95o5r6QPK06j27o4R6j61L16l05J51j97j20RK13l1n8J09K7k36K43
$$ plain form
5188 56 281 -195 52 465 21 -277 204 273 99 426 39 152 241 -8 13 -73 -61 100 142 335 165 -241
5210 -241 178 -205 -76 -37 -65 5 -218 -121 40 -65 114 152 -95 -110 211 -263 18 -176 -136 -154 242 -262 -131
5233 -131 52 -99 -17 -194 -61 -167 197 141 -135 -10 212 61 278 117 -181 64 -3 -130 -56 -148 301 -71
5255 -71 -60 -137 -84 -428 -61 135 -49 -140 161 -15 -353 -123 -228 143 -98 -89 212 -13 -139 25 133 30
5277 30 -129 143 122 30 -137 61 -42 -194 -276 129 374 135 131 -31 139 153 -255 115 113 -261 -127 194 -215
5300 -215 87 229 116 35 131 109 21 264 -112 221 -98 37 -9 -209 -77 34 -138 178 -136 -56 124 -8
5322 -8 246 -250 253 469 -12 117 1 6 87 -194 -58 25 169 -60 -92 261 52 93 -170 11 66 158 17
5345 17 -52 -379 -126 216 -61 54 -297 -133 -196 -377 114 60 105 77 22 120 -114 -252 178 -50 -303 140 29
$$ packed form
5188E6K25m76K47M13m44k98M81O9j74L27l87J13Q9k49K1q6J2J61M2J93j70m06
5210b41M19l83J29L9k8P0k23R7J61j05J79L8k47j5L21m74K81j94M0j8L96n04J31
5233a31J83j51Q2j77J33j06L64n6k76J25K22j51K17j61k98K45o7j27P4r2M49l72
5255g1J1p7N3l44L67J96j84r1L01j76l38K30j05L71k41RL01k25j26J64J08j03
5277C0j59K72k1r2j67J98j03j52q2M05K45k39mj62J70J4m08L70kl74J34L21m09
5300b15L02J42j13q1R6k2q8K43l76L33l19J35m6k00J32J11j72L16l14Q0J80j32
5322hK54m96N03K16m81J29j16NQ1k81J36Q3J44k29l2L53k09M1k63J81N5R2j41
5345A7o9l27K53L42k77J15l51J64o3j81M91n4M5k8n5R8k34j38M30k28k53M43j11
$$ plain form
5368 29 -235 131 200 299 -218 -26 -199 -175 -427 -268 -73 209 -169 55 163 -13 50 -123 -70 -146 166 87 -28
5391 -28 269 201 131 14 -25 34 -27 -13 0 -74 -260 10 242 19 -23 89 49 181 -43 201 -38 42 292 128
5415 128 285 -322 127 -20 54 -3 -246 129 -279 -106 -138 25 218 -150 173 297 -132 257 -50 -61 -176
5436 -176 -174 139 33 -163 96 131 119 18 196 99 -49 207 -135 88 -138 -230 -139 159 404 15 203 -133
5458 -133 -154 -17 -100 48 92 278 72 -80 43 77 -88 -251 -45 -105 40 55 -149 -9 145 181 -38 149
5480 149 -70 -260 85 279 -299 117 -283 -545 31 -74 -70 -19 168 -176 113 -10 -15 -65 -82 -108 -112 69 -364
5503 -364 205 -246 -239 167 284 -266 77 4 40 -40 17 198 13 174 186 -96 -64 -85 -80 -296 261 -254 -118 -161
5527 -161 -216 211 -79 -149 -14 82 -91 -282 258 122 -15 -78 -164 -22 129 127 -14 44 72 -58 -69 -175 -111 -175
$$ packed form
5368B9k64L66O9R9n17J92j73K4k52J59J95K82l78K24J08j76O3j73N3p6L12p9j15
5391b8K97o8p0j17l9N9o1J4J3p4j86K70K32k23m2J12m0J32k24K44k39Q0K50j64
5415A28J57o07M49j47P4n7k43L75m08J73l2J63J93l68L23J24m29L89l07j1j15
5436a76KL13j06j96K59L5j2j01J78r7j48K56l42K23k26r2R1K98K45l89J88l36
5458a33k1J37q3J48M4J86k06j52J23L4j65j63K06o0J45J5k04J40J54L6k19J87
5480A49k19j90L45J94n78M16m00k62N76j05MN1J87l44K89j23nn0j7k6mJ81m33
5503c64N69m51PM06J17n50L43p3L6q0N7J81j85J61J2k82L2k1Nk16N57n15J36m3
5527a61n5M27k90p0J35R6j73j91N40j36j37o3q6J42J51kj41N8K8j30j1j06O4o4
$$ plain form
5551 -175 -113 164 -21 161 -81 -113 -95 -190 -138 -196 4 97 60 29 53 80 64 126 230 -155 88 250 -3 -17 -44
5576 -44 -83 -146 -201 147 -37 125 227 258 293 -112 -100 125 62 -195 -72 -242 28 -32 -164 31 68 -103 -180 50
5600 50 -23 12 -546 -16 -35 6 -122 27 285 -26 74 -40 -191 86 167 132 136 248 215 -70 -108 288 -75 -109
5624 -109 91 -239 -222 204 101 63 -289 131 12 -121 18 -205 -217 45 -115 179 -439 -247 123 -176 -116
5645 -116 226 203 5 -143 -228 -98 -90 -460 194 312 8 -85 -131 91 -189 162 66 -183 336 -132 145 136 153
5668 153 -34 -96 -55 9 79 -15 -74 -247 6 26 -107 52 32 -242 53 20 172 -22 -254 -80 -330 18 142
5691 142 -57 -355 -366 -31 25 -24 -205 230 -57 62 -49 -77 -108 -74 274 62 -197 44 35 -112 32 -232 -58
5714 -58 162 120 -260 199 -106 -201 -79 -121 228 61 -161 203 349 320 -14 -35 326 -106 -252 45 230 88
$$ packed form
5551a75O2K77j85J82k42l2J8r5N2n8K00R3l7l1K4K7j6O2J04l85K43J62k53j4k7
5576d4l9o3n5L48j84J62J02L1L5m05J2K25o3k57J23j70K70o0j32J95L7j71p7K30
5600E0p3L5n58N30j9M1j28J49K58l11J00j14j51K77Q1l5MJ12l3k85l8L96l63l4
5624a09K00l30J7M26j03l8l52M20j19j33J39k23j2K62j60K94o18J92L70k99O0
5645a16L42k3j98j48q5J30Ql70O54J18l04r3m6K22k80L51r6k49N19m68K77rJ7
5668A53j87o2M1O4P0r4n9j73K53K0j33J59k0k74K95l3J52j94k32J74k50L48J24
5691A42j99k98j1L35N6m9j81M35k87J19j11k8l1L4L48k12k59K41rj47J44k64J74
5714e8K20m2l80M59l05r5J22m2L49j67k22L64J46k9l34k1L61m32j46K97J85j42
$$ plain form
5736 88 132 -108 289 39 -58 69 -191 -90 -254 73 32 25 -181 17 -92 -128 -140 -26 40 -115 -342 -120 -215
5759 -215 -85 100 -274 -103 65 110 -191 -81 -182 -71 -210 138 -149 76 -191 112 -277 -61 -181 -137 104
5780 104 203 -59 72 -29 -141 142 135 -315 170 -184 -152 -108 -39 -65 135 92 -158 -83 -187 181 -150 -380 -66
5803 -66 77 138 137 -220 -92 148 -184 -64 -351 -45 99 187 -73 -42 -127 101 70 -377 240 49 214 -1 -67
5826 -67 -98 -39 71 74 -118 68 170 -102 98 -141 38 106 -168 376 345 -108 157 -121 125 -161 -220 309 -14
5849 -14 13 134 -124 125 120 131 -3 -103 125 74 -80 -180 -197 -10 -160 -51 43 -397 217 -25 -158 -130 -60
5872 -60 -317 41 203 -198 122 -57 -86 103 -295 -166 -14 -55 -161 128 -52 -16 44 -225 -127 66 -14 -148
5894 -148 -70 172 99 93 -400 -100 110 -89 0 343 35 127 -130 -257 -117 105 149 63 251 -228 -76 22 57
$$ packed form
5736H8M4k40L97k50r7J27k60J01j64L27m1pk06J98j09l6j2J14O6j55k27K22r5
5759b15J30J85l74J71J68M5l01J10j01J11j39L48k87K25k67L03l89K16j20M4K41
5780A04R9k62J31j01j12K83pm50M85l54L2M4O9k6K00m3k50P5j04L68l31k30L14
5803f6J43O1jl57J28K40l32J20k87L06J44Q8k60L1q5K28l1m47O17j91J65k15o6
5826f7l1N9J10Lj92J86J02k72K00k39J79O8k74N44l1m53K65k78K46k86n9N29l23
5849a4K7J21k58K49nJ1j34j00K28n1j54j00j7J87j50J09R4m40O14k42j33K8P0
5872f0k57L58J62m01L20j79k9J89l98J29J52m1j06K89j80L6O0k69R8J93q0j34
5894a48P8K42p3om93L00K10j99Q9L43l08R2k57j27J40K22M4q6J88m79J52R8L5
$$ plain form
5917 57 40 -24 -132 123 204 303 -261 -27 -193 -213 -145 82 127 -116 170 -218 -86 38 58 56 -200 38 -298 259
5941 259 -15 259 -111 265 -75 14 -97 -64 -95 -320 -148 -189 330 94 -52 139 17 -151 150 -330 123
5962 123 -341 5 38 243 -268 179 -64 17 18 -157 1 48 85 -17 287 -88 -87 119 6 21 -244 49 92
5985 92 -175 42 -293 -53 78 -200 182 402 9 -163 -28 210 -167 -35 40 91 -7 48 175 -42 38 -13
6007 -13 0 -105 -19 -100 -260 -15 -25 97 154 128 212 -7 -156 -32 194 195 76 96 -8 -5 36 205 5 -124 172
6032 172 75 133 352 -192 -29 -12 3 -387 66 -156 -88 153 158 -73 183 91 293 57 98 422 -152 -62 -126 -68
6056 -68 112 358 83 -204 -102 25 323 204 -64 -54 132 206 -23 -180 112 202 -273 -74 -25 51 119 -50
6078 -50 -266 133 315 -9 210 -155 -322 165 165 198 -225 65 96 -104 -163 18 -197 -65 128 55 93 174 -113
$$ packed form
5917E7j7o4j08K55Q1R9n64K34j66k0O8K27M5k43K86l88J32J24K0kk56K38l36N57
5941B59k74K74l70L76l40Q9j11L3l1k25J72m1N19k36j46J91j22j68L01m80M53
5962A23m64L46L3K05n11M47k43Q1Jj75J58M7L7j02L04l75JK06j13J5k65K93M3
5985I2k67K17l35K40J31k78L82K20l93j72J35K38l77J32P5N1r8N5J27k17Q0n1
6007a3J3j05Q6q1j60K45j0J22N7k6Q4k19j49J24K26Jj19K0j04LM1J69k00j29K96
6032A72r7N8K19n44J63J7J5l90M53k22O8K41Nk31K56r2K02k36M1L24n74R0o4N8
6056f8J80K46k75k87J02J27K98j19k68J0J86P4k29j57K92R0m75J99M9P6O8j69
6078e0k16L99J82l24K19l65j67M87%L3m23K90L1k00n9J81k15J32J93p3L8Q1k87
$$ plain form
6101 -113 -43 -173 -86 131 270 214 60 28 341 -89 -51 58 -98 -152 121 -216 58 -32 -65 -19 -55 218 50
6124 50 -19 228 116 110 84 -372 60 207 -396 -192 94 160 287 -215 267 66 126 80 -51 128 -78 -20 -263
6147 -263 114 130 -222 220 -61 -56 -121 192 41 -137 231 120 -19 109 262 -137 -54 90 58 64 -24 13 196
6170 196 139 -54 68 27 151 -155 164 343 -334 -308 192 338 -56 184 85 -57 154 80 -238 191 279 -8
6192 -8 22 -34 -150 9 198 -180 -312 234 -17 74 72 29 -115 -236 258 -170 -34 185 -252 -165 93 69 -237
6215 -237 45 67 -102 -256 -159 -164 130 -1 -185 125 -2 -73 -82 86 171 59 -52 -129 -2 9 -19 -230 77 162
6239 162 -42 126 -18 128 74 -148 141 -188 26 55 137 -296 88 -541 -33 21 52 -46 -15 288 -49 -96 212
6262 212 -43 2 436 -290 -464 -203 231 -299 -125 -102 -41 -246 125 -381 -4 -48 -20 32 -24 -49 -77 75 90
$$ packed form
6101a13P0j30Q7K17J39n6j54l2L13m30L8J09j56n4K73l37K74r0l3M6l6K73j68
6124E0o9K47j12ok6m56M32J47o03K04K86O6J27n02M82k01O0m6j31J79k06N8k43
6147b63L77J6l52M42k81No5L13j51j78L68j11j39J28J53l99Q3J44l2Oq8L7J83
6170A96n7j93J22m1J24l06L19J79o77K6N00J46l94K40r9j42K11p4l18M29Q8k87
6192hL0n6j16J59J89l78j32N46k51R1km3j44j21M94m28J36K19m37Q7K58k4l06
6215b37K82K2j69j54R7nK94j31j84L10j27p1rJ68Q5j12j11p7J27J1k8k11L07Q5
6239A62k04J68j44J46n4k22K89l29K14K9Q2m33L84o29N08N4L1r8L1L03l37m7L08
6262B12k55M5M34p26j74K61M34n30J74K3O1k05L71n06L77m4K8N2n6k5k8J52J5
$$ plain form
6285 90 -233 -34 -51 -204 19 104 286 218 -81 91 -11 -25 159 80 404 145 -161 283 100 -134 85 -46
6307 -46 150 -105 90 -77 109 -88 301 -25 -363 231 -126 -117 28 122 -243 7 -124 -39 127 -242 121 171
6329 171 -1 205 -104 62 230 188 153 -28 -128 64 84 31 91 167 -288 190 -9 -341 -131 126 -415 -113
6351 -113 77 96 -41 352 324 -139 -115 91 -141 -8 153 -217 27 117 -132 58 -245 18 -197 72 124 -149
6373 -149 -161 380 145 47 -154 -31 -37 -72 216 -111 -19 168 176 -200 253 113 -137 139 74 -27 301 -17 -105
6396 -105 150 239 -47 187 246 241 -84 186 81 -349 114 61 -7 75 197 -91 -308 19 -97 3 35 1 47
6419 47 102 -5 -56 66 132 -32 53 173 10 -157 285 182 -222 -193 -165 -259 -83 232 -212 17 -211 106 23
6442 23 65 99 33 287 -7 -339 127 311 -334 -132 80 -166 -148 74 -501 -6 145 38 -240 281 69 2
$$ packed form
6285I0l23J99j7j53K23Q5J82o8k99J72j02j4J84p9L24k59l06M44j83k34K19j31
6307d6J96k55J95j67J86j97L89l26l38N94l57RJ45R4l65K50j31Q5J66l69L63N0
6329A71j72K06l09J66J68m2l5j81j00J92K0n3O0P6m55M78j99l32K10K57n41L02
6351a13J90J9j37L93k8m63K4K06k32J33J61l70K44R0k49J90l03K63k15K69N2k73
6373a49j2N41k35r8k01J23ol5K88l27R2J87Ql76M53j40k50K76o5j01L28l18q8
6396a05K55Q9k86K34N9nl25K70j05m30M63n3o8Q2J22k88k17L27j16J00L2l4M6
6419D7N5j07n1J22O6j64Q5J20j63j67M42j03m04K9K8r4J76L15m44K29k28L17q3
6442B3M2L4o6K54k94l32M66J84o45K02K12k46J8K22n75M95J51j07k78N21k12o7
$$ plain form
6464 2 336 -67 -254 126 193 -202 92 129 -171 111 245 66 17 -55 12 32 180 137 -9 -39 150 -17 54 202
6488 202 161 -192 249 141 -191 14 227 -165 -76 -97 -5 83 -36 6 -236 59 -43 -235 67 72 -187 256 300
6511 300 -101 -315 227 149 226 183 302 64 242 -10 -278 138 146 -128 164 486 -24 -63 139 75 -5 30 261
6534 261 -227 -127 320 -150 264 263 -196 -168 -5 41 -4 396 178 -219 -62 88 -366 -50 -89 47 -83 143
6556 143 79 -120 -74 187 -245 -30 -33 -504 112 107 -322 -23 544 95 -26 319 -9 150 113 109 131 330 48
6579 48 232 -224 -21 137 -160 -28 -97 131 -35 -34 -241 -51 134 -181 -96 103 -208 -49 -20 289 -312 172
6601 172 284 -348 -60 -131 -172 -11 -94 -151 -153 -40 -132 -182 -9 -329 -15 -131 181 -482 130 -65 196 155 -21
6624 -21 -17 -62 43 154 -275 115 185 74 146 289 33 37 115 51 66 546 242 -66 144 264 142 -126 262 -119
$$ packed form
6464BL34m03j87L80O7l95K94L7l00K82J34j79m9p2O7K0J48m3j46l0J89j67P1J48
6488B02m1l53M41j08l32K05K13l92Q9k1R2Q8j19M2k42K95j02j92L02Nk59M43M4
6511C00m01k14N42p8P7m3J19k38J78k52k68M16Qk74K92L22n10l9K02o4q0L5K31
6534B61m88J00M47m70M14jm59K8J63M6m5M00k18l97J57J50m54L16l9J36j30K26
6556A43o4j99M6K61m32K15lm71O16nm29K99N67m49j21L45l28J59l7mK2J99k82
6579D8J84m56K03J58k97J32o9K28j66Jk07J90J85l15Q5J99l11J59K9L09o01M84
6601A72J12o32K88p1m1J61q3n7kJ13r2n0J73l20L14j16L12o63O12j95K61m1j76
6624b1Mm5J05J11m29L90P0j11P2J43k56MP8o4J5M80l04l08K10J20j22k68L88l81
$$ plain form
6648 -119 190 43 -124 -118 82 -189 -271 177 9 -209 74 95 -45 -282 114 -161 -82 7 -103 -176 222 -5
6670 -5 -214 221 100 -70 79 232 -158 -49 231 25 -21 -168 93 -279 -7 -30 -263 -186 -101 -70 -20 322 -51
6693 -51 105 195 62 -218 332 74 118 107 267 -55 -24 37 7 -97 -168 56 -197 -117 96 -115 172 254 -185
6716 -185 -124 -69 -136 -4 44 14 -430 -31 63 -25 340 301 -32 -120 23 -295 -113 528 -137 -241 332 113 -242
6739 -242 31 90 -53 133 441 -46 -95 146 247 65 126 169 79 248 132 -74 122 242 125 -101 193 -386
6761 -386 -53 173 -190 70 160 77 -242 65 -97 -95 -271 -48 -290 11 -52 -397 32 -19 -47 -298 29 92 -173
6784 -173 -155 130 -21 -137 -1 72 14 -148 70 -531 -142 -37 -248 -158 295 -242 -142 -116 46 -38 262 210
6806 210 159 147 417 -94 -131 371 -122 63 248 219 -114 309 -225 44 -36 108 -377 -215 174 -177 66 -8
$$ packed form
6648a19L09j47j67OK00k71q2M48j68k18K83K1j40k37L96k75P9Q9j10p3L98k27
6670ek09M35j21j70J49J53l90J09K80k06m6j47K61l72K72k3k33P7Q5L1N0L42l73
6693e1J56R0j33k80N50k58M4j1J60l22L1O1l0j04p1K24k53Q0K13k11K87Q2m39
6716a85O1N5o7J32M8l0m44L99R4q8L65l9l33q8J43l18J82O41o65j04N73k19l55
6739b42K73N9j43J86L08m87m9K41J01j82O1M3r0J69j16k06J96J20j17k26K94n79
6761c86L33K26l63K60R0q3l19L07j62Kj76K23k42L01o3l45M29n1k8k51L27O3k65
6784a73J8K85j51j16J36P3n8j62K18o01L89J05k11R0M53n37J00K6J62q4L00n2
6806B10n1j2K70n11l7N02m93J85J85k9l33M23n34K69q0J44m85J62L89l51K43p4
$$ plain form
6828 -8 30 309 -83 -159 -339 56 -10 -364 -101 160 -38 -134 -95 -460 -35 -19 -109 -261 448 73 51 2 181 -164
6852 -164 82 180 0 93 343 -45 9 321 95 -193 209 232 -70 258 276 -20 -28 -50 -191 -28 -6 -43 -369
6875 -369 268 21 -71 164 306 99 -175 60 16 -216 289 -28 -255 -34 142 -208 -22 -95 -217 -128 68
6896 68 -33 -23 572 -18 -300 191 98 -132 314 15 -40 -7 182 -252 -164 300 -62 -252 215 232 -1 -33 53
6919 53 -185 -60 226 226 -215 167 234 227 -47 353 73 -275 -187 -55 449 31 -280 -178 67 108 -232 -100 57
6942 57 -148 -141 96 -332 -124 234 -407 -138 -219 -31 40 80 -33 -101 352 41 -343 -23 34 -60 -122 115 -189
6965 -189 81 319 363 -294 287 275 -284 275 -40 -234 -264 69 -183 45 488 66 -355 82 -68 -55 186
6986 186 -170 -541 83 325 76 -93 420 -223 -255 136 86 -250 77 134 -164 -7 -92 -21 -232 -8 -153 152
$$ packed form
6828hL8K79l92p6j80L95o6l54K63K61j98r6L9l65M25J6r0j52P09l75k2m9J79l45
6852a64K46R8j80R3K50l88N4L12k26k88M02K3l02L28J8k96qk2j41J63K2l7l26
6875c69O37k47r2K35J42k07k74K35m4k32N05l17k27K21J76l50J86p3j22Q9J96
6896F8j01J0N95n90k82M91r3k30M46k99n5L3J89m34Q8M64l62j90M67J7k33l2Q6
6919E3k38J25K86%m41L82O7pk74M00k80l48Q8J32N04m18l11J02K45M1l40J32J57
6942E7k05PK37m28K08L58o41K69q1J88P1M0j13o8M53l11l84L20N7r4o2K37l04
6965a89K70K38M4o57N81j2n59N59l15j94l0L33k52K28M43m22m21M37j50J3K41
6986A86l56l71O24K42k49j69N13o43l2L91n0l36L27N7k98J57q5P1k11K24j45L05
$$ plain form
7008 152 107 -168 7 74 12 -262 -59 118 -121 22 264 -162 -90 -53 21 -152 95 259 -19 271 379 -128
7030 -128 298 186 4 -254 123 -295 92 160 -190 -263 291 33 -142 29 326 117 -229 238 -309 -336 41
7051 41 -202 21 20 50 -309 -11 -88 -218 -250 -27 -244 -327 59 -123 -471 49 -81 -211 -71 -287 -117 -364
7073 -364 264 -122 228 215 104 -305 58 -226 153 155 95 -189 108 -259 44 -92 30 117 325 202 221 15
7095 15 128 110 43 -156 -78 135 -212 373 -151 -303 251 -37 47 -361 22 -79 -14 -20 -273 -215 276 6 -291
7118 -291 143 -269 -349 -117 32 -52 131 -45 -184 307 162 -30 -4 50 -37 144 91 436 230 324 129 -265
7140 -265 -46 206 0 -86 136 71 -148 78 159 33 15 367 -142 76 106 -329 2 218 152 -187 227 -31
7162 -31 -81 -164 172 -572 -36 21 -362 25 248 -151 -334 27 -34 -208 206 -197 -110 -198 93 -88 89 267
$$ packed form
7008A52m5k75J75O7o2k74K03J77k39J43K42m26P2L7P4j73K47J64k78K90J08n07
7030a28M26j12j82k58L77m18L87O8l50p3N54k58j75J71K97k09l46M67n47k7L77
7051D1k43K23jL0l59K98p7j30l2K23k17q3L86j82l48N20j30j30J40k16J70k47
7073c64O28l86L50j3j11m09L63k84L79Ko0k84K97l67L03j36J22Q7K08j23J9k06
7095A5J13j8o7j99P8K13l47N85n24j52N54k88Q4m08L83j01O5ok53N8M91k70k97
7118b91M34m12q0K32J49q4J83j76j39M91j45j92K6N4q7J81n3L45k06R4j95l94
7140b65K19K52k06q6K22o5k19K26Q1j26j8L52n09K18L0m35L31K16o6l39M14k58
7162c1n0q3L36p44N36N7l83L87K23l99j83L61o1j74M14m03Q7q8K91j81J77J78
$$ plain form
7184 267 -138 -237 177 244 -118 -43 128 153 237 96 -125 32 364 23 71 509 232 7 -42 -21 -43 441 5
7207 5 -277 -33 155 -589 238 155 -225 -337 -84 -151 -24 5 125 -202 136 -82 -172 37 -185 -272 -166 248
7229 248 -138 -388 65 -27 -231 322 -228 -331 -35 226 -14 -43 -30 -156 -35 273 169 -216 -87 97 -16
7250 -16 106 574 51 9 90 70 -229 109 -36 -81 412 145 -263 251 125 33 -19 218 -262 -130 163 140 17
7273 17 284 105 -343 206 -4 -58 -386 100 55 -93 124 -206 -396 228 -245 31 -221 -81 -224 -226 256 -220
7295 -220 -24 283 17 -242 248 -83 -255 -167 116 -230 191 -133 60 45 222 167 -265 147 129 -36 306
7316 306 134 -169 -179 480 -131 -15 233 -73 -349 36 76 -229 149 -244 -165 -38 -42 -357 -176 201 -303 -50
7338 -50 227 -9 -311 31 278 -500 192 -33 -143 91 11 -53 -308 493 140 -443 97 94 -257 47 -77 -189
$$ packed form
7184B67m05r9M14O7l62P5J71K5Q4j41k21J57L32l41M8M38k77k25m9K1k2M84m36
7207Ek82K44J88p44Q27q3l80j12K53o7J27K9J20l27L38k18r0K09k22q7J06M14
7229B48l86k50M53r2k04N53n50j03K96K61k40k9J3j26J21L08j04l85J29J84j13
7250a6J22M68n23m2Q1k0k99L38j45m5M93k67m08N14j26r2n2K37m80J32K93k3j23
7273A7K67j79m48N49k10n4l28M86m5j48K17l30j90O24m73K76k52J40j43kM82m76
7295b20J96L07k66k59M90l31j72Q8K83l46M21l24J93j5J77n5m32M12j8j65L42
7316C06j72l03j0O59o11J16K48l06k76L85M0l05L78l93P9J27ml15J81L77n04K53
7338e0K77k36l02L42K47p78O92k25j10K34q0o4k55Q01l53n83N40ll51L04j24j12
$$ plain form
7360 -189 -60 409 -55 -179 324 -33 -346 39 -29 103 418 118 -111 249 382 -173 -169 333 106 9 152
7381 152 -96 -292 176 149 -327 173 -63 13 -172 335 -449 -183 49 -451 -276 -4 248 -80 -187 53 -532
7402 -532 -139 157 -334 -153 454 -71 79 -189 -310 -177 -55 -129 -223 131 215 -65 -93 129 26 -106 146
7423 146 -164 -7 -13 91 -106 16 257 -248 96 -122 122 -309 -219 462 126 -102 72 -312 -119 56 131
7444 131 -57 163 -251 -86 12 -240 -49 -70 7 -266 97 -37 -276 37 199 -103 17 199 -52 -168 -80
7465 -80 -165 -436 160 275 37 -47 317 -87 -101 272 -242 -30 -9 -84 -8 363 -48 -342 173 279 -69 -78 287
7488 287 151 -375 167 4 -26 165 130 -238 206 -22 -308 199 -75 -315 -162 337 -359 -399 -202 -262 -335 365
7510 365 93 -333 -26 411 -265 -120 157 -330 -81 16 2 -147 132 160 -104 -163 104 -39 30 -47 -369 53
$$ packed form
7360a89J29M69m64j24N03l57l13L85o8J32L15l00k29L60J33n55MN02k27r7J43
7381A52k48j96M68k7m76N00k36P6j85N07p84K66K32n00J75K72K52l28j07K40n85
7402e32L93K96m91J81O07n25J50k68j21J33J22p4r4L54Q4k80k8K22j03j32K52
7423A46l10J57oJ04j97J22K41n05L44k18K44m31R0O81l36k28J74l84J93J75P5
7444A31j88K20m14J65R8k52J91k1P7k73L63j34k39L13J62l02J20J82k51j16Q8
7465h0q5k71N96J15k38q4L64m04j4L73n14K12K1p5P6L71m11k94N15J06l48rL65
7488B87j36n26N42j63l0J91l5l68M44k28k86N07k74k40J53M99o96m0J97o0p3P00
7510C65k72m26L07M37o76J45K77m87K49R7j4j49K79K8k64n9K67j43O9p7l22M22
$$ plain form
7532 53 378 171 -100 102 56 -147 -25 203 -53 -196 125 -398 -75 7 -44 -465 248 142 -179 249 -93
7553 -93 -162 -150 -66 -145 -178 348 -198 -519 268 -50 -103 198 86 -117 58 347 -129 -165 178 -163 -165 323 69
7576 69 -251 67 127 -168 131 0 -100 172 246 -98 -170 161 154 -170 241 198 -427 218 131 -201 -169 99 228
7599 228 209 -46 -6 -82 143 147 -276 208 293 -272 -98 235 -345 -350 173 17 -85 106 -113 -310 -16 -175 -544
7622 -544 45 -88 -365 -220 375 -235 -15 -5 -176 -289 79 1 -283 66 144 -153 -301 -35 109 -376 21
7643 21 -66 -41 43 -14 69 397 199 -137 -142 170 -128 -80 337 112 25 77 67 -83 -90 47 -151 -3 85 -240 -92
7668 -92 388 -19 -294 53 86 -122 -91 58 -66 118 201 -460 -223 397 -88 -155 208 135 -269 14 -45 -191
7690 -191 240 106 -265 -40 220 114 -272 -30 208 -127 155 410 -58 162 190 -248 -28 285 314 34 113
$$ packed form
7532E3L25k07k71K02m6k03J22K28k56j43L21n23L23Q2n1m21P13j06l21M28l42
7553i3o9J2Q4p9l3N26n46l21P87l18n3L01j12k03J75K89m76l6L43l41kM88k54
7576F9l20L18O0k95K99j31j00K72P4l44p2L31pl24M11m3o25O45q7l32L2K68J29
7599B28j9k55M0p6K25Mm23M84Q5n65J74L33n80nN23j56j02J91k19j97K94j59l69
7622e44N89j33k77J45N95o10K20J0j71j13L68p8k84L49P8k97j48K66J44m85L97
7643B1q7K5Q4n7Q3L28j98l36nL12k98M8M17k25q7N2j0j50pJ37j98J48Q8l25J48
7668i2M80m07k75L47L3k08L1J49j24J84Q3o61K37O20m85o7L63p3m04K83n9j46
7690a91M31j34l71K25K60j06l86K42K38l35K82K55m68K20K8m38K20L13K9k80P9
$$ plain form
7711 113 -62 -60 297 409 -326 139 443 -170 160 406 104 -43 -415 11 -62 269 -80 -78 45 61 -410 -350
7733 -350 530 -268 -30 253 -423 -409 -61 -33 -468 -22 -16 -102 -63 229 -531 -232 464 152 -278 313 -221 -326
7755 -326 13 171 211 226 127 -89 -100 268 -194 -12 213 262 36 250 308 -42 192 -134 206 -300 155 157 316
7778 316 325 -159 -179 310 147 -369 -120 -84 -211 55 -5 131 82 130 -48 -19 -104 -213 -510 141 -5 2 270 98
7802 98 -96 -39 29 -87 -35 100 -180 -363 -17 432 -215 440 17 51 67 426 120 84 256 99 67 295 58
7825 58 -56 356 370 -74 -237 215 -199 273 -10 -116 -193 227 214 -299 173 257 -28 -119 164 -249 -331 95
7847 95 -167 -329 213 19 -358 -183 266 -92 -75 54 -16 150 173 -209 -514 249 -40 -152 146 148 -165 97
7869 97 61 -85 -215 191 115 -69 309 -46 2 165 53 -80 181 302 32 19 296 -330 39 364 92 -168
$$ packed form
7711A13j75KL57J12p35M65L04o13L30K46l02j47l72M26p3L31l49KJ23J6m71O0
7733c50Q80p98K38K83o76J4L48K8m35M46Oq6L9K92p60K99O96l12m30N91n34j05
7755c26L39J58M0J5r9k16j1L68m62J82K25M9k26K14N8l50K34l26L40n06M55KJ59
7778C16Rm84k0M89j63n16K49L6j27K66o0J36m9M8j78K9q5j09k97O51j46PK68j72
7802I8j94N7O8j16N2J35k80j83L46M49o47O55m23L4J6L59l06l6J72j57l2K28k37
7825E8j14M12J4m44j63M52m14M72k83j06p7M20j3n13M72Q4k85r1K83m13q2M26
7847I5k62j62N42j94l77J75M49l58J7J29p0J66K3l82l05P63k89j12K98Kl13K62
7869I7l6j46j30M06p6j84L78l55M8J63j12j33K61J21k70j3K77o26L69L25k72k60
$$ plain form
7891 -168 -2 22 -265 207 77 5 -140 274 -249 -20 316 -47 26 -3 117 -298 224 69 -204 135 -11
7912 -11 -154 -121 57 -91 -262 174 -270 -380 72 111 -127 46 186 -318 -441 16 234 85 88 150 -85 264
7934 264 254 -306 -244 144 -139 183 312 147 -120 398 -103 -98 5 52 -476 146 -180 -576 -49 469 -181 -121
7956 -121 360 -223 -271 6 -77 -17 43 133 -450 -112 151 -110 -246 229 -48 -302 -135 145 155 287 112 44
7978 44 64 -87 -135 28 -33 142 -130 124 -236 -224 89 103 101 18 438 102 -63 -24 108 111 256 -45 -513 258
8002 258 9 -306 128 -93 -157 -186 209 149 -345 202 -180 -169 191 -57 -270 -55 -83 -390 15 68 -184 93
8024 93 237 -29 -127 -165 -46 -429 262 60 -414 0 114 -321 -328 225 -166 -263 137 63 -211 292 -79 76
8046 76 167 27 -63 107 154 -48 -231 237 -109 -91 439 69 -104 54 152 -203 -149 42 -272 -224 147 -123 -178
$$ packed form
7891a68J66K4k87M72j30p2j45M14n23K29L36l63P3k9J20m15N22j55k73L39j46
7912a1j43L3J78j48j71M36m44j10M52L9k38J73J40n04j23M57K18j49LO2k35L49
7934B64j0n60O2L88k83L22J29j65k67N18n01NJ03M7n28O22l26l96N27N18o50O0
7956a21M81n83m8K77q3O0O0R0n83L38K63k61j36M75k77k54J67K80J0J32j75o8
7978D4K0j51m8J63o1J75k72K54l60J2L13J4kq3M20l36j65L9J32LJ45l01m68P71
8002B58k49l15M34k21o4k9L95o0m94N47l82J1L60k48k13K15k8l07M05N3k52K77
8024I3J44k66r8l8J19l83O91k02m74M14J14m35pN53l91r7M00p4k74N03l71J55
8046G6R1j40r0J70M7k02j83M68l46J8N30l70j73J58R8l55N4J91l14M8L71k70n5
$$ plain form
8069 -178 406 -72 -233 -127 -248 -132 13 170 -310 -20 128 190 -636 126 14 -334 32 -333 37 187
8089 187 253 32 -10 -166 136 -143 112 -99 -222 111 148 -101 53 139 -354 152 429 -1 -229 669 51
8110 51 68 -44 1 -297 -48 359 -48 -80 256 94 85 100 -168 -74 309 -30 -462 -189 -81 -117 -100 365 -388
8133 -388 -146 -93 57 -374 101 32 91 -36 404 -34 -45 263 -223 -315 -38 -175 -21 403 16 -445 -29 435
8155 435 -130 641 202 -170 -156 169 122 -213 180 -56 48 64 -45 -265 99 190 -279 -422 69 -107 -136 121
8177 121 -136 77 205 98 -319 105 202 23 66 130 -223 -271 263 99
$$ packed form
8069a78N84m78j61J06j21J16J45J57m80K90J48O2q26P62j12l48L66l65L70J50
8089A87O6k21m2j56L02k79K55k11j23L33L7k49J54Q6m93N06K77m30k28Q98o18
8110E1J7j12M5k98K49M07m07l2L36j62rJ5k68R4L83l39m32K73J08l6J7M65p53
8133c88K42N3J50m31M75o9N9j27M40m38j1L08m86r2K77j37J54M24l87m61M16M64
8155D35n65P71m39l72J4L25m7l35L93k36J04J6j09k20L64R1m69j43M91j76k9K57
8177A21k57K13J28j07m17M24R7j79M3O4l53m8N34j64
8191I9
$$ Imaginary data points
##PAGE= N=2
##DATA TABLE= (X++(I..I)), XYDATA
$$ plain form
0 0 0 0 0 0 0 0 0 0 0 0 -8 8 -8 8 -8 11 -16 16 -23 24 -31 32 -39 43 -51 58 -66 75 -83 94 -106 121 -131 147
34 147 -165 184 -205 227 -251 277 -308 342 -378 419 -463 514 -573 638 -715 806 -914 1045 -1209
53 -1209 1418 -1700 2098 -2701 3722 -5770 11475 -58638 -216472 -81575 51214 29670 -50967
66 -50967 -74627 -46275 4503 -26572 -106198 -90000 10612 41875 1016 -44353 -56331 -10674
78 -10674 36008 -15580 -59176 22610 87807 20519 -45029 -28998 3402 27495 31969 -3265
90 -3265 -10965 26111 16821 -26952 -18926 4923 7969 20939 11148 -27868 -8115 34273 -1665
103 -1665 -37106 9505 45158 20069 -3027 -12519 -9165 22493 24661 -14043 -9244 21848 7545
116 7545 -5694 5206 -12917 -19466 21875 15978 -36227 -20522 23718 3670 -24267 -11821 -1498
$$ packed form
0@%%%%%%%%%%qJ6j6J6j6J9k7L2l9M7n5O3p1Q2r4J09j24J41j58J77k00K27k52K78
34A47l12L49l89M32m78N28n85O50p20P97q82R77j087J211j353J521j720J959k254
53a209K627l118L798m799O423r492J7245p0113j57834J34897J32789k1544q0637
66e0967k3660K8352N0778l1075p9626J6198J00612L1263m0859m5369j1978M5657
78a0674M6682n1588m3596Q1786O5197o7288o5548J6031L2400K4093M474l5234
90c265p700L7076r290m3773Q026K3849L046J2970r791l9016J9753M2388l5938
103a665l5441M6611L5653k5089k3096r492L354L1658K168l8704M799L1092j4303
116G545j3239J0900j8123o549M1341n897n2205J5705M4240k0048k7937J2446J0323
$$ plain form
129 -1498 2890 3551 -18844 -17432 20060 17358 -13174 -6935 -277 -8452 18417 30236 -14060 -16515
143 -16515 29983 16211 -24837 -5641 21700 14595 6551 -4527 -11829 14695 21706 -15418 -14549
156 -14549 21554 15548 -1659 3296 -14018 -21638 21458 30357 -14460 -16463 12693 4013 -9822
169 -9822 -4881 -6310 3240 16097 -10491 -26303 6054 10384 -19302 -11514 1690 -14208 -4717
182 -4717 12443 -18382 -32667 2441 9770 -11739 -7614 -1760 -6949 2035 -2239 -17628 2971
195 2971 19054 -8226 -9862 16739 3753 -9281 16530 13309 -12466 7495 25314 -1399 -10453
208 -10453 6342 5246 7473 13665 -6116 -9777 13276 4996 -11507 7862 10233 -11309 3619
221 3619 17003 -10042 -9393 20055 8790 -10129 5921 9559 -1447 4972 1839 -7829 10145
$$ packed form
129a498M388O61k2395J412L7492k702l0532O239O658q175K6869J1819m4296k455
143a6515M6498j3772m1048J9196K7341p105q044j1078p302K6524P011l7124Q69
156a4549L6103o006j7207M955j7314p620M3096Q899m4817k003K9156q680j3835
169i822M941j429R550J2857k6588j5812L2357M330k9686P788J3204j5898R491
182d717J7160l0825j4285L5108P329k1509M125N854n189Q984m274j5389K0599
195B971J6083k7280j636K6601j2986j3034K5811l221k5775J9961J7819k6713r054
208a0453J6795j096K227O192j9781l661K3053q280j6503J9369K371k1542J4928
221C619J3384k7045O49K9448j1265j8919J6050L638j1006O419l133r668J7974
$$ plain form
234 10145 12343 -15006 -7405 13747 -6414 -14440 7537 -3777 -21898 -1154 2863 -19585 -8957
247 -8957 6501 -9814 -12378 741 -4986 -2704 6432 -8987 -7665 20139 9810 -15498 5776
260 5776 21031 -1498 1785 18026 1970 -2910 15593 6460 -5985 9891 10676 -2812 4656
273 4656 4730 -6938 5726 9264 -13812 -3506 20377 -1229 -16498 7077 6874 -11038 2702
286 2702 11409 -3620 -613 3748 -11494 -5250 9794 -4241 -8023 6834 -5011 -17088 565
299 565 -3314 -21233 -1039 11221 -16845 -19188 2656 -4998 -13582 -27 -68 -2883 8025 -2944
313 -2944 -16438 5965 15435 -3445 3294 16487 -839 -619 17189 2573 -7395 17031 17807 -6332
327 -6332 -755 9948 175 1754 4350 -7059 2491 14917 -5914 -13792 8663 3355 -11692 4621
$$ packed form
234A0145K198k7349P601K1152k0161q026K1977j1314j8121K0744M017k2448J0628
247h957J5458j6315k564J3119n727K282R136j5419J322K7804j0329k5308K1274
260E776J5255k2529L283J6241j6056m880J8503r133j2445J5876P85j3488P468
273D656P4j1668J2664L538k3076J0306K3883k1606j5269K3575k03j7912J3740
286B702Q707j5029L007M361j5242O244J5044j4035l782J4857j1845j2077J7653
299E65l879j7919K0194J2260k8066k343K1844p654q584J3555m1k815J0908j0969
313b944j3494K2403R470j8880O739J3193j7326K20J7808j4616r968K4426P76k4139
327f332N577J0703r773J579K596j1409R550J2426k0831p878K2455n308j5047J6313
$$ plain form
341 4621 8451 -9192 1093 11515 -9435 -9345 11388 3977 -6783 1875 -1600 -5865 5798 -2486
355 -2486 -16358 2471 9573 -14713 -12799 4898 -7374 -12504 3779 -4526 -15517 2634 4694
368 4694 -12729 -4542 6695 -1957 1066 4462 -7871 1437 19467 1131 -10424 13201 14052 -4980
382 -4980 3967 10691 -2963 4354 13737 -4860 -7273 10743 4797 -5750 2319 -2032 -6165 8522
396 8522 712 -18268 -447 14219 -9257 -14497 4332 -466 -6351 5087 -3490 -14029 2857
409 2857 6014 -11051 -5250 4323 -4632 -1488 2498 -13054 -7683 13308 -996 -16597 3943 9195
423 9195 -9150 -3608 5704 -3409 2886 11889 -2672 -4534 11223 4517 -3040 9851 7681 -1075
437 -1075 11630 9757 -8303 4707 19151 73 -6630 11299 6926 -3732 4788 885 -6870
$$ packed form
341D621L830j7643J0285J0422k0950R0K0733p411j0760Q658l475m265J1663q284
355b486j3872J8829P102k4286J914J7697j2272n130J6283q305j0991J8151K060
368D694j7423Q187J1237q652L023L396j2333R308J8030j8336j1555K3625Q51j9032
382d980Q947O724j3654P317R383j8597k413J8016n946j0547Q069m351m133J4687
396H522p810j8980J7821J4666k3476n240J8829m798n885J1438q577j0539J6886
409B857L157j7065N801R573q955L144L986j5552N371K0991j4304j5601K0540N252
423I195j8345N542R312r113O295R003j4561j862J5757o706p557J2891k170q756
437a075J2705j873j8060J3010J4444j9078o703J7929m373j0658Q520l903p755
$$ plain form
450 -6870 6574 6236 -9112 -1888 6354 -7688 -6138 5199 -7295 -8880 9133 -148 -16372 -936
464 -936 5554 -9768 -5546 3403 -7025 -5031 3819 -7646 -8785 5258 -1832 -9821 3977 1564
478 1564 -11941 1032 7148 -9412 -3532 11401 -2383 -8404 7494 5073 -2644 6998 5018 -3920
492 -3920 7909 10105 -3040 4855 14489 747 432 12770 1366 -3895 13405 8884 -7946 2191
506 2191 9019 -3808 -1412 4978 -5389 -2513 6935 -6245 -11079 3038 -1767 -10995 1458 649
520 649 -13154 -2769 5523 -10119 -8721 6078 -2385 -8757 2340 -121 -5793 3569 722 -9705
534 -9705 2278 8464 -5791 -2135 7926 -4033 -4632 9112 194 -8888 7278 8633 -5897 124
548 124 6760 -1898 2658 7369 -3613 106 13254 1887 -6183 7661 6335 -2469 7493 7440 -7411
$$ packed form
450f870J3444l38j5348P224Q242j4042J550J1337j2494j585J8013r281j6224J5436
464i36O490j5322M222Q949j0428J994Q850j1465j139J4043p090p989J3798k413
478A564j3505J2973O116j6560N880J4933j3784o021J5898k421p717R642j980q938
492c920J1829K196j3145P895R634j3742l15J2338j1404n261J7300m521j6830J0137
506B191O828j2827K396O390j0367K876R448j3180m834J4117m805r228J2453q09
520F49j3803J0385Q292j5642J398J4799q463o372J1097k461n672R362k847j0427
534i705J1983O186j4255L656J0061j1959n99J3744q918r082J6166J355j4530O021
548A24O636q658M556M711j0982L719J3148j1367q070J3844j326q804R962n3j4851
$$ plain form
563 -7411 2101 13062 -3400 -7433 5860 1163 -4946 2597 -1783 -8309 2631 706 -13008 -2750
577 -2750 5767 -7825 -6887 3411 -6579 -8442 5188 -1649 -11275 3021 6045 -7825 -3091 3599
591 3599 -4022 154 6188 -4962 -3084 9874 812 -9212 4557 5581 -5577 2477 5997 -5513
605 -5513 514 10784 -1191 -4520 7517 3408 -1727 7726 4882 -3865 5641 5695 -5918 2479 10116
620 10116 -4314 -4774 8067 -173 -8404 2108 -159 -7938 1802 1921 -11139 -5110 2109 -8868
634 -8868 -8074 1096 -6477 -7615 2813 -5404 -12974 3024 5402 -9593 -3645 5173 -4023 -1760 5725
649 5725 -3907 -4793 7413 1410 -5268 5756 5551 -4288 3441 5857 -4035 2973 11799 -2004 -3419
664 -3419 11089 5301 -4147 5250 5996 -1048 7263 7901 -4161 1845 10217 -974 -1996 7647 1055
$$ packed form
563g411R512J0961j6462m033J3293m697o109P543m380o526J0940j925j3714J0258
577b750Q517j3592R38J0298r990j863J3630o837r626J4296L024j3870M734O690
591C599p621M176O034j1150J878J2958r062j0024J3769J024j1158Q054L520j1510
605e513O027J0270j1975l329J2037m109n135R453k844q747R506N4j1613Q397P637
620A0116j4430m60J2841q240q231J0512k267p779R740J19j3060O029P219j0977
634h868P94R170p573j138J0428q217p570J5998K378j4995N948Q818r196K263P485
649E725r632q86J2206o003o678J1024k05r839P729K416r892P008Q826j3803j415
664c419J4508n788r448R397P46p044Q311O38j2062O006Q372j1191j022R643o592
$$ plain form
679 1055 -2296 6720 -634 -10006 3360 6139 -8930 -5714 3296 -4536 -4515 1549 -7561 -8898 3850
694 3850 -1160 -10893 -1557 945 -8129 -2688 1504 -8186 -3135 5849 -4943 -8512 5938 3111 -6238
709 -6238 1676 2843 -2510 5605 6036 -6200 619 11722 1606 -2231 7210 3156 -923 9200
723 9200 4870 -4626 6564 10503 -3495 -1722 8874 2499 -373 4117 -3058 -3817 7851 1738
737 1738 -9256 706 4787 -6194 -2640 2327 -7141 -4076 5059 -4925 -9157 4121 791 -10144
751 -10144 -3281 1028 -4964 521 2072 -8897 -3882 6462 -2482 -6718 4078 612 -4043 4942
765 4942 2440 -6742 2823 7483 -4092 -1231 8843 1544 -1379 6818 1654 -1871 8194 5411
779 5411 -4130 4114 7846 -2212 400 7262 -1707 -1768 7586 1138 -4122 4365 1450 -5805 2642
$$ packed form
679A055l351R016p354r372J3366K779j5069L216R010p832K1O064r110j337J2748
694C850n010r733R336K502r074N441M192r690N051Q984j0792l569J4450k827r349
709f238P914J167n353Q115M31j2236O819J1103j0116l837R441m054m079J0123
723I200m330r496J1190L939j3998J773J0596o375k872M490p175p59J1668o113
737A738j0994R962M081j0981L554M967r468L065R135r984m232J3278l330j0935
751a0144O863M309n992N485J551j0969N015J0344q944m236J0796l466m655Q985
765D942k502r182R565M660j1575K861J0074p299k923Q197n164l525J0065k783
779E411r541Q244L732j0058K612O862q969o1R354o448n260Q487k915p255Q447
$$ plain form
794 2642 4155 -5898 -1144 4645 -5187 -4204 4022 -3685 -7273 3527 -135 -8466 639 1837 -8659
809 -8659 -3918 2533 -4869 -3476 2899 -5512 -6286 3837 -743 -6808 2548 3245 -5534 1322 5719
824 5719 -3465 73 7749 -1289 -1932 9334 4482 -3719 4132 5052 -765 5236 6629 -2986 1522
839 1522 8050 -1346 -2056 6878 1469 -4054 3196 574 -4775 3249 3289 -7966 -2556 5294 -3734 -5156
855 -5156 1789 -3177 -4876 3545 -1707 -9469 444 2034 -7930 -3310 2710 -4932 -4457 1645 -5192
870 -5192 -5702 4628 78 -7385 824 2214 -4888 571 3592 -3847 290 7344 -1538 -3236 6402
885 6402 2185 -2935 5939 5325 -2293 4036 6412 -2793 839 8216 979 -1128 6104 1265 -2360
900 -2360 5597 2227 -5633 2714 5523 -3716 -783 4068 -4655 -3878 4681 -1923 -6199 2377 -578
$$ packed form
794B642J513j0053M754N789r832R83Q226p707l588J0800l662q331R105J198j0496
809h659M741O451p402J393O375q411p74J0123m580o065R356O97q779O856M397
824E719r184L538P676r038o43J1266m852q201P851R20n817O001J393r615M508
839A522O528r396p10Q934n409n523P250k622n349Q024M0j1255N410P850r028j422
855e156O945m966j699Q421n252p762R913J590r964M620O020p642M75O102o837
870e192n10J0330m550p463Q209J390p102N459L021p439M137P054q882j698R638
885F402m217n120Q874o14p618O329K376r205L632P377p237k107P232m839l625
900b360P957l370p860Q347K809r239K933M851q723P77Q559o604m276Q576k955
$$ plain form
915 -578 -7971 -547 1424 -6632 -2446 1243 -6570 -4159 3720 -3630 -7420 2272 -440 -5721 1317
930 1317 1592 -5420 1018 4672 -4238 -1289 6794 -655 -3080 4684 2318 -1611 5602 2707 -4713
945 -4713 3871 8012 -1916 -1243 5974 263 -589 5810 132 -2775 5914 3466 -4954 2079 5711 -2185
961 -2185 -604 3116 -3025 -439 6401 -2838 -6717 3956 2087 -6452 -1152 1353 -4912 -774 2088
976 2088 -6807 -4205 3720 -3416 -7682 1564 371 -4625 647 -346 -6484 1508 5391 -4868 -2680
991 -2680 5909 223 -2548 4345 769 -2321 5801 4118 -3416 3375 6469 -2418 -379 6495 585
1006 585 -522 5595 139 -3133 5353 3526 -4396 2304 5214 -2424 -628 4331 -2583 -1569 4845
1021 4845 -1842 -4515 3775 1089 -6495 -140 1767 -5408 -1571 2403 -5719 -4563 2788 -3336 -6514
$$ packed form
915e78p393P424J971q056M186L689p813K411P879p350l790R692k712n281P038
930A317K75p012O438L654q910K949Q083p449k425P764k366l929P213k895p420
945d713Q584M141r928O73P217n711q52O399n678k907Q689k448q420P033L632p896
961b185J581L720o141K586O840r239l879J0673j869q539N300K505o265M138K862
976B088q895K602P925p136m266R246j193m996N272r93o138P992L883j0259K188
991b680Q589n686k771O893l576l090Q122j683p534O791L094q887K039O874n910
1006E85j107O117n456l272Q486j827p922O700K910p638J796M959o914J014O414
1021D845o687k673Q290k686p584O355J907p175L837L974q122J156P351o124l178
$$ plain form
1036 -6514 1618 -741 -6547 222 1297 -5284 -740 2437 -4689 -1219 5396 -1590 -3536 4784 1730
1051 1730 -2723 3949 3192 -2943 3339 5437 -2538 256 7020 55 -1940 5191 1298 -1963 5217
1066 5217 2874 -4486 2349 5238 -2922 217 4619 -1858 -2181 4354 -890 -3886 3471 756 -5907
1081 -5907 712 2419 -4933 -1680 2073 -5506 -3759 2948 -3312 -6647 1289 -745 -5733 452 703
1096 703 -6043 -879 3216 -4071 -2225 4123 -1313 -2971 3863 98 -3336 4335 3818 -3825 1506
1111 1506 5719 -1574 353 5315 -637 -692 6782 1603 -3373 3837 3496 -2052 2593 4384 -2413 1071
1127 1071 4445 -2837 -2231 5203 561 -4030 2651 1089 -4298 1150 954 -6051 -1239 3828 -4437
1142 -4437 -4752 1558 -2743 -4669 1663 -1168 -5769 1655 1214 -6547 -1788 2888 -3191 -2562 2690 -2477
$$ packed form
1036f514Q132k359n806O769J075o581M544L177p126L470O615o986j946Q320l054
1051A730m453O672p57o135O282K098p975K794O764o965j995P131l893l261P180
1066E217k343p360O835K889q160L139M402o477l23O535n244k996P357k715o663
1081e907O619J707p352L253L753p579J747O707o260l335P936k034m988O185K51
1096G03o746N164M095p287J846O348n436j658O834l765l434P671n17p643N331
1111A506M213p293J927M962n952n5P474n179m976P210l41n548M645J791o797L484
1127A071L374p282O06P434m642m591O681j562n387N448j96p005M812N067q265
1142d437l15O310m301j926O332k831m601P424m41p761M759M676o079O29N252n167
$$ plain form
1158 -2477 -3128 3913 311 -4649 2885 2870 -3096 1782 4167 -2679 380 5832 -215 -1140 6105 1984
1174 1984 -1994 4708 3990 -2124 2744 5110 -1638 688 5223 -1075 -1540 4161 -1041 -3869 3651
1189 3651 1195 -5365 179 2001 -4553 -1725 2118 -4277 -2873 3142 -2276 -5127 1982 392 -4946
1204 -4946 89 847 -4155 237 2559 -5265 -2941 4154 -1033 -4095 1876 -283 -3142 2997 1758
1219 1758 -4321 1271 4687 -1960 -717 4764 -9 -273 5494 1192 -1771 6233 4568 -2873 2657
1234 2657 6067 -174 959 4070 -1434 -645 5067 6 -3360 3015 1260 -4412 154 1635 -3974
1249 -3974 -639 2559 -4385 -3357 3293 -2157 -5441 1386 132 -4109 816 390 -5544 -848 2371
1264 2371 -4057 -2140 3307 -2005 -4229 2074 -720 -4245 1984 1848 -4291 845 3936 -2484 -1331
$$ packed form
1158b477o51P041l602m960P534j5n966M878K385o846L059N452o047r25P245m121
1174A984l978O702p18o114M868K366o748K326M535o298m65N701n202k828P520
1189C651k456o560N544J822o554K828L843o395J404O015n418k851P109j590n338
1204d946N035P58n002M392K322p824K324P095n187l062N971k159k859O139j239
1219A758o079N592L416o647J243N481m773k64N767m302k963Q004j665p441N530
1234B657L410o241J133L111n504P89N712n061l366O375j755n672M566J481n609
1249c974L335L198o944J028O650n450l284O827j254m241M925m26n934M696L219
1264B371o428J917N447n312k224O303k794l525O229j36o139N136L091o420J153
$$ plain form
1279 -1331 4134 -166 -665 4988 1109 -2311 4095 3672 -2663 3005 4905 -1335 747 4667 -1304
1294 -1304 -766 5118 600 -2999 3082 2053 -3368 812 1708 -3814 -399 3075 -3467 -2930 2795 -2230
1310 -2230 -4516 1871 -454 -4844 555 722 -4961 -1008 2066 -3958 -3114 1915 -1917 -3446 2357
1325 2357 -891 -4130 1720 1477 -3740 678 3949 -2717 -663 4891 -413 -1303 4345 1280 -1903
1340 -1903 3862 3437 -1928 2485 4450 -1271 1279 4852 -606 -837 4705 692 -2724 3342 2357 -3385
1356 -3385 856 2351 -3266 -264 2852 -3139 -2791 2450 -1707 -4075 1262 -1010 -4663 829 501
1371 501 -5754 -1860 1847 -3865 -3082 2132 -1809 -3498 1844 -640 -3984 1835 2082 -3436 -23 2675
1387 2675 -2191 -298 3678 -1468 -1748 4816 1417 -2799 3365 2903 -1979 1917 4065 -1089 1152
$$ packed form
1279a331N465m300m99N653l879l420O406m23o335N668J900o240K082L920n971
1294a304N38N884m518l599O081j029n421M180Q96n522L415L474o542N37N725n025
1310b230k286O387k325m390N399J67n683L953L074o024Q44N029l832j529N803
1325B357l248l239N850k43n217M418L271o666K054N554n304q90N648l065l183
1340a903N765m25n365M413J965n721K550L573n458k31N542m013l416O066r85n742
1356c385M241J495n617L002L116n991L48N241m157k368N337k272l653N492l28
1371E01o255L894L707n712P83N214l941j689N342k484l344N819K47n518L413K698
1387B675m866J893L976n146k80O564l399m216O164m62m882L896K148n154K241
$$ plain form
1402 1152 4475 -1092 -1299 4425 1233 -1417 3242 1140 -2788 2600 3070 -3570 -378 3372 -2182
1417 -2182 -2481 2538 -1548 -3547 1330 -721 -4508 404 1106 -4641 -1732 1276 -3923 -2473 2186
1432 2186 -2413 -4055 1856 -453 -4311 1180 1708 -3891 268 2880 -1727 -459 3284 -1366 -1580
1447 -1580 4174 575 -2735 3518 2534 -2268 1745 4324 -1106 471 4588 -268 -899 4494 1189
1462 1189 -1974 2844 2352 -1765 1620 2470 -2634 750 3953 -2363 -2100 3380 -849 -3241 1676 384
1478 384 -3505 588 586 -4613 -1013 1622 -3386 -3177 1827 -2141 -3211 1569 -1119 -4294 1669 1528
1494 1528 -3903 -91 2724 -2490 -1441 3220 -696 -1351 3423 -220 -2856 3308 2850 -2010 1127
1509 1127 3600 -1245 887 4245 -1088 -793 4336 1061 -2285 3259 2919 -1625 1168 2016 -1878 1158
$$ packed form
1402A152L323n567k07N724l192k650M659k102l928N388M70o640L192L750n554
1417b182k99N019m086j999M877k051l787M912P02n747K909L008n199J450M659
1432B186m599j642N911k309l858N491N28n599M159K612m607J268L743m650k14
1447a580N754l599l310O253r84m802M013K579n430J577M117m856o31N393l305
1462A189l163M818m92m117L385Q50n104L384L203o316K63N480m229k392M917j292
1478C84l889M093kn199L600K635n008K09N004l968j070M780k688l175N963j41
1494A528n431L812K815n214J049M661l916o55M774l643k636O164m58m860L137
1509A127K473m845K132L358n333K95N129l275l346N544l40m544K793Q48l894L036
$$ plain form
1525 1158 3628 -2183 -1762 3110 -637 -2885 1256 -33 -3621 941 844 -4390 -946 1994 -3447 -2920
1541 -2920 1439 -1719 -2943 770 -1311 -4091 1172 918 -4373 -683 2127 -2300 -916 2630 -1556
1556 -1556 -1680 3311 672 -2299 2688 2441 -1733 1993 3152 -1419 872 4059 -613 -406 4027 840
1572 840 -1559 3012 1936 -2288 2242 3361 -2027 -221 2921 -1327 -1077 3020 -887 -2596 2021
1587 2021 136 -3332 925 991 -3915 -816 1615 -3180 -2407 1567 -2250 -3827 1191 -503 -3633 -157
1603 -157 398 -3402 -61 1708 -3406 -1296 2326 -1232 -1969 3015 245 -2307 2098 1830 -2188 1988
1619 1988 3387 -1531 396 3946 -24 -573 3563 504 -1117 3404 2000 -1825 2125 2900 -1965
1634 -1965 621 3632 -603 -1162 2656 -874 -2181 2211 480 -3077 912 1324 -3288 -771 1148
$$ packed form
1525A158K470n811M21M872l747k248M141j289l588M562r7n234L444K940n441N27
1541b920M359l158j224L713k081k780N263k54n291L690K810m427J384L546m186
1556a556j24M991k639k971M987k47m174L726J159m571K291L187m672K07M433l187
1572H40k399M571j076m224M530J119n388J806L142m248K50M097l907j709M617
1587B021j885l468M257O6m906L099K431m795P73L974l817j577N018j694l130L476
1603a57N55l800L341J769n114K110L622l558p37M984k770k552M405k68m018M176
1619A988J399m918J927L550l970n49M136l059j621M521j404l825L950P75m865
1634a965K586L011m235n59L818l530j307M392j731l557L989M12m612K517J919
$$ plain form
1649 1148 -3066 -1583 2028 -2137 -3299 1327 -817 -4141 97 671 -3445 -818 1435 -2938 -1347
1664 -1347 1760 -1243 -1619 2849 138 -2288 2304 1982 -1910 1188 2625 -1654 763 3882 -698
1679 -698 -841 4093 888 -1361 2205 1954 -1062 2216 2597 -1768 869 3398 -1455 -1468 3206 450
1695 450 -1584 1645 -383 -2720 1855 1234 -3527 -914 1787 -2055 -2118 710 -1893 -1942 1576 -1369
1711 -1369 -4146 836 1173 -3772 -1396 1166 -2040 -861 1786 -2295 -2160 2867 341 -2603 1514
1726 1514 1629 -1561 1346 2379 -1839 687 3713 -674 -904 4137 1434 -932 2587 1809 -1126 2410
1742 2410 2938 -1559 469 3335 -862 -752 2680 -90 -1608 1800 619 -2516 1191 1194 -3128 -683
1758 -683 1927 -2292 -2318 1518 -1868 -3088 1307 -836 -3244 613 243 -3418 -254 1483 -3026 -1468
$$ packed form
1649A148m214J483L611m165j162M626k144l324M238N74m116K627K253m373J591
1664a347L107l003l76M468k711k426M592l22l892L098J437m279K417L119m580
1679f98j43M934l205k249L566k51l016L278L81m365K637K529m853j3M674k756
1695D50k034L229k028k337M575o21m761K613K701l842o3K828k603m9L518k945
1711a369k777M982L37m945K376K562l206J179K647m081J35N027k526k944M117
1726A514J15l190K907J033m218K526L026m387k30N041k703k366L519p78k935L536
1742B410N28m497K028K866m197J10L432k770j518L408j181l135L707Lm322K445
1758f83K610m219k6L836l386j220M395k143k408L857l70l661L164J737m509J558
$$ plain form
1774 -1468 1820 -1465 -1744 1696 -487 -2518 1414 1126 -2128 1136 2243 -1350 358 2786 -417
1789 -417 -494 3274 369 -1053 3127 2209 -1743 1563 2840 -794 624 2784 -853 -438 3111 -176
1805 -176 -1879 2361 1066 -2318 543 1124 -2581 350 1732 -2820 -1841 1897 -1268 -2730 730 -843
1821 -843 -2834 631 -164 -3767 -111 1231 -2847 -1829 1449 -1063 -1970 1202 -764 -2257 1458 381
1837 381 -2553 308 2209 -1483 -321 2291 -662 -982 2900 365 -1321 2861 1881 -1625 1442 2422
1853 2422 -826 942 3072 -768 -540 2737 240 -1123 2132 526 -2042 1430 1690 -2115 -468
1868 -468 1652 -1707 -997 1514 -1531 -2217 1658 -459 -3020 219 512 -2605 -927 1012 -2628 -1162
1884 -1162 1444 -1944 -2278 1638 -278 -2724 406 578 -2374 518 1568 -1795 24 2590 -927
$$ packed form
1774a468L288l285k79L440k183k031L932k88l254L264J107l593J708K428l203
1789d17p7L768k905j422M180r18l952L306J277l634J418K160l637M15L549l287
1805a76j703M240j295l384K861N81l705K931J382m552R79L738l165j462L460j573
1821h43j991L465p95l603L656J342m078J018L278k512r07L172j966j493L715j077
1837C81k934K861J901l692J162K612k953l20L882k535j686M182r80l506L067R80
1853B422l248J768K130l840K28L277k497j363L255j606k568L472K60l805J647
1868d68K120l359P10K511l045o86L875k117k561L239K93l117J678J939l640J466
1884a162K606l388l34L916j916k446L130J72k952K892J050l363J819K566l517
$$ plain form
1899 -927 -1040 2636 860 -946 1814 1213 -1047 2232 2789 -1584 686 3161 -379 -606 2167 104
1915 104 -1030 2354 464 -2062 1015 1725 -2050 -285 1764 -1344 -1035 1198 -1324 -1955 1573 -395
1931 -395 -2883 194 768 -2669 -928 750 -1992 -1376 934 -2107 -2230 1646 -266 -2620 581 834
1947 834 -1950 169 929 -1976 -60 2574 -667 -817 2525 661 -807 2054 1382 -1162 1650 2311
1963 2311 -683 870 3194 -313 -403 2570 562 -518 2221 796 -1444 1516 1468 -1569 326 1924
1979 1924 -1259 -1103 1673 -1233 -1702 1384 -307 -2712 447 493 -2578 -529 1069 -2053 -1383 1187
1995 1187 -2091 -2097 1054 -844 -2747 822 337 -2478 -75 1254 -1739 -343 1639 -1166 -950 2687
2011 2687 552 -883 1824 1197 -1154 1450 2018 -862 1035 2873 -155 -237 3020 127 -891 2213
$$ packed form
1899i27j13L676j776j806K760o01k260L279N57m373K270K475l540k27K773k063
1915A04j134L384j890k526L077P10l775J765K049l108L09K233k522o31L528j968
1931c95k488L077N74l437J741J678k742O16K310l041j23L876j912k354L201K53
1947H34k784K119P60k905J916K634l241j50L342j864j468K861o72k544K812O61
1963B311k994J553K324l507r0K973k008j080K739j425k240K960m8l037J895J598
1979A924l183J56K776k906m69L086j691k405L159M6l071K049J598l122O70K570
1995A187l278oL151j898j903L569m85k815K403J329k993J396J982k805K16L637
2011B687k135j435K707o27k351K604N68k880J897J838l028q2L257k893j018L104
$$ plain form
2027 2213 1110 -1201 1310 1584 -1372 49 1944 -1454 -1034 1809 -540 -1934 1264 -308 -2281
2042 -2281 342 19 -2817 -425 1075 -2237 -1686 1211 -1362 -2218 788 -612 -2146 401 -4 -2669
2058 -2669 565 1506 -1781 -798 1584 -882 -594 2041 -81 -1313 2149 1201 -1112 928 2123 -662
2074 -662 356 2019 -529 -15 2843 -26 -1302 2173 1699 -1202 1002 1415 -1397 168 1706 -890
2090 -890 -663 1732 -519 -1223 1094 191 -2243 611 169 -2414 -579 788 -2157 -1621 1226 -1593
2106 -1593 -2204 484 -804 -2222 229 154 -2154 -118 978 -1782 -667 1757 -966 -1328 1530 339
2122 339 -1237 1432 1090 -1201 1309 1912 -1157 247 2288 -80 -112 2141 -77 -529 2351 1082
$$ packed form
2027B213j103k311K511K74k956J421J895l398M20K843k349j394L198j572j973
2042b281K623l23k836K392J500l312N51K897k573q56L006j400j534K547m05k665
2058b669L234R41l287R83K382k466K88K635k122j232L462r48k313K040J195k785
2074f62J018J663k548N14K858k869j276L475m74k901K204M13k812J565J538k596
2090h90K27K395k251p04K317r03k434K854m42k583J835J367k945N36K847k819
2106a593o11K688j288j418K451p5k308K036J096k760J115K424k723l62K858j191
2122C39j576K669l42k291K510O03l069J404K041k368l2K253k218m52K880j269
$$ [...]
8191f2
##END NTUPLES=NMR FID
##END=
