##TITLE=1H_EC-3206(2)
 CDCl3, 8 sc, 
 29.8.2019
##JCAMPDX= 6.0         $$ Bruker NMR JCAMP-DX V2.0
##DATA TYPE= NMR FID
##DATA CLASS= NTUPLES
##ORIGIN= UXNMR, Bruker Analytische Messtechnik GmbH
##OWNER= root
$$ XWIN-NMR		Version 3.5
$$ Thu Aug 29 13:59:46 2019 Russian Standard Time (UT+4h)  she@DPX200
##.OBSERVE FREQUENCY= 200.13155
##.OBSERVE NUCLEUS= ^1H
##.DELAY= (6, 6)
##.ACQUISITION MODE= SIMULTANEOUS
##.ACQUISITION SCHEME= undefined
##.AVERAGES= 8
##.DIGITISER RES= 18
##SPECTROMETER/DATA SYSTEM= spect
##.PULSE SEQUENCE= zg30
##.SOLVENT NAME= CDCl3
##.SHIFT REFERENCE= (INTERNAL, CDCl3, 0, 15.7039)
##AUDIT TRAIL= $$ (NUMBER, WHEN, WHO, WHERE, WHAT)
$$ ##TITLE= Audit trail, XWIN-NMR		Version 3.5
$$ ##JCAMPDX= 5.01
$$ ##ORIGIN= Bruker BioSpin GmbH
$$ ##OWNER= she
$$ F:/spectra/data/she/nmr/H-F/1/audita.txt
$$ ##AUDIT TRAIL=  $$ (NUMBER, WHEN, WHO, WHERE, WHAT)
(   1,<2019-08-29 13:58:35.32 +0400>,<she>,<DPX200>,
      <created by zg, POWCHK disabled, PULCHK disabled
       configuration hash MD5:
       00 E9 B6 7A A2 85 ED C7 34 08 36 98 17 FE 4E 26
       data hash MD5: 16K
       F0 0F DB E7 90 EC 67 72 B3 40 D5 0F AE 4E E6 82>)
$$ ##END=
$$ 
$$ hash MD5
$$ 8C A7 80 99 14 F8 89 3D 5E 41 F1 89 1A F1 5A B5
##$RELAX= 
##$RELAX= 
##$RELAX= 
##$RELAX= 
##$RELAX= 
##$RELAX= 
$$ Bruker specific parameters
$$ --------------------------
##$DU= <F:/spectra>
##$EXPNO= 1
##$NAME= <H-F>
##$PROCNO= 1
##$TYPE= <nmr>
##$USER= <she>
##$AMP= (0..31)
100 100 100 100 100 100 100 100 100 100 100 100 100 100 100 100 100 100 
100 100 100 100 100 100 100 100 100 100 100 100 100 100 
##$AQSEQ= 0
##$AQ_mod= 1
##$AUNM= <au_zg>
##$AUTOPOS= <>
##$BF1= 200.13
##$BF2= 200.13
##$BF3= 200.13
##$BF4= 200.13
##$BF5= 200.13
##$BF6= 200.13
##$BF7= 200.13
##$BF8= 200.13
##$BYTORDA= 1
##$CFDGTYP= 0
##$CFRGTYP= 5
##$CHEMSTR= <none>
##$CNST= (0..31)
1 1 145 1 1 1 1 1 1 1 1 1 1 1 1 1 1 1 1 1 1 1 1 1 1 1 1 1 1 1 1 1 
##$CPDPRG= <>
##$CPDPRG1= <>
##$CPDPRG2= <>
##$CPDPRG3= <>
##$CPDPRG4= <mlev>
##$CPDPRG5= <mlev>
##$CPDPRG6= <mlev>
##$CPDPRG7= <mlev>
##$CPDPRG8= <mlev>
##$CPDPRGB= <>
##$CPDPRGT= <>
##$D= (0..31)
0 1.2 0 0 0 0 0 0 0 0 0 0.03 0 0 0 0 0 0 0 0 0 0 0 0 0 0 0 0 0 0 0 0 
##$DATE= 1567072714
##$DBL= (0..7)
120 120 120 120 120 120 120 120 
##$DBP= (0..7)
150 150 150 150 150 150 150 150 
##$DBP07= 0
##$DBPNAM0= <>
##$DBPNAM1= <>
##$DBPNAM2= <>
##$DBPNAM3= <>
##$DBPNAM4= <>
##$DBPNAM5= <>
##$DBPNAM6= <>
##$DBPNAM7= <>
##$DBPOAL= (0..7)
0.5 0.5 0.5 0.5 0.5 0.5 0.5 0.5 
##$DBPOFFS= (0..7)
0 0 0 0 0 0 0 0 
##$DE= 6
##$DECBNUC= <off>
##$DECIM= 24
##$DECNUC= <off>
##$DECSTAT= 4
##$DIGMOD= 1
##$DIGTYP= 9
##$DL= (0..7)
0 120 120 120 120 120 120 120 
##$DP= (0..7)
150 150 150 150 150 150 150 150 
##$DP07= 0
##$DPNAME0= <>
##$DPNAME1= <>
##$DPNAME2= <>
##$DPNAME3= <>
##$DPNAME4= <>
##$DPNAME5= <>
##$DPNAME6= <>
##$DPNAME7= <>
##$DPOAL= (0..7)
0.5 0.5 0.5 0.5 0.5 0.5 0.5 0.5 
##$DPOFFS= (0..7)
0 0 0 0 0 0 0 0 
##$DQDMODE= 0
##$DR= 18
##$DS= 0
##$DSLIST= <SSSSSSSSSSSSSSS>
##$DSPFIRM= 0
$$ [...]
##$SUBNAM2= <"">
##$SUBNAM3= <"">
##$SUBNAM4= <"">
##$SUBNAM5= <"">
##$SUBNAM6= <"">
##$SUBNAM7= <"">
##$SUBNAM8= <"">
##$SUBNAM9= <"">
##$SW= 24.9336996594482
##$SWIBOX= (0..15)
0 0 2 0 0 0 0 0 0 0 0 0 0 0 0 0 
##$SW_h= 4990.01996007984
##$TD= 16384
##$TD0= 1
##$TE= 0
##$TE2= 300
##$TE3= 300
##$TEG= 300
##$TL= (0..7)
0 120 120 120 120 120 120 120 
##$TP= (0..7)
150 150 150 150 150 150 150 150 
##$TP07= 0
##$TPNAME0= <>
##$TPNAME1= <>
##$TPNAME2= <>
##$TPNAME3= <>
##$TPNAME4= <>
##$TPNAME5= <>
##$TPNAME6= <>
##$TPNAME7= <>
##$TPOAL= (0..7)
0.5 0.5 0.5 0.5 0.5 0.5 0.5 0.5 
##$TPOFFS= (0..7)
0 0 0 0 0 0 0 0 
##$TUNHIN= 0
##$TUNHOUT= 0
##$TUNXOUT= 0
##$USERA1= <user>
##$USERA2= <user>
##$USERA3= <user>
##$USERA4= <user>
##$USERA5= <user>
##$V9= 5
##$VALIST= <valist>
##$VCLIST= <CCCCCCCCCCCCCCC>
##$VD= 0
##$VDLIST= <DDDDDDDDDDDDDDD>
##$VPLIST= <PPPPPPPPPPPPPPP>
##$VTLIST= <TTTTTTTTTTTTTTT>
##$WBST= 1024
##$WBSW= 4
##$XGAIN= (0..3)
0 0 0 0 
##$XL= 0
##$YL= 0
##$YMAX_a= 121342
##$YMIN_a= -267361
##$ZGOPTNS= <>
##$ZL1= 120
##$ZL2= 120
##$ZL3= 120
##$ZL4= 120
##$ABSF1= 10
##$ABSF2= 0
##$ABSG= 5
##$ABSL= 3
##$ALPHA= 0
##$AQORDER= 0
##$ASSFAC= 0
##$ASSFACI= 0
##$ASSFACX= 0
##$ASSWID= 0
##$AUNMP= <proc_1d>
##$AZFE= 0.1
##$AZFW= 0.1
##$BCFW= 1
##$BC_mod= 2
##$BYTORDP= 1
##$COROFFS= 0
##$CY= 11.3945322036743
##$DATMOD= 1
##$DC= 2
##$DFILT= <>
##$DTYPP= 0
##$F1P= 20.1720416913024
##$F2P= 0.152960286110954
##$FCOR= 0.5
##$FTSIZE= 0
##$FT_mod= 4
##$GAMMA= 1
##$GB= 0.15
##$INTBC= 1
##$INTSCL= 1
##$ISEN= 128
##$LB= 0.24
##$LEV0= 0
##$LPBIN= 0
##$MAXI= 10000
##$MC2= 0
##$MEAN= 0
##$ME_mod= 0
##$MI= 1.114404
##$NCOEF= 0
##$NC_proc= 0
##$NLEV= 6
##$NOISF1= 3.799351
##$NOISF2= 2.8
##$NSP= 1
##$NTH_PI= 0
##$NZP= 0
##$OFFSET= 15.70392
##$PC= 1
##$PHC0= -9221.05
##$PHC1= 27.00096
##$PH_mod= 1
##$PKNL= yes
##$PPARMOD= 0
##$PSCAL= 0
##$PSIGN= 0
##$REVERSE= no
##$SF= 200.130013532006
##$SI= 16384
##$SIGF1= 3
##$SIGF2= 2
##$SINO= 400
##$SIOLD= 16384
##$SREGLST= <1H.CDCl3>
##$SSB= 0
##$STSI= 0
##$STSR= 0
##$SW_p= 3612.71676300578
##$SYMM= 0
##$S_DEV= 0
##$TDeff= 0
##$TDoff= 0
##$TI= <>
##$TILT= no
##$TM1= 0
##$TM2= 0
##$TOPLEV= 0
##$USERP1= <user>
##$USERP2= <user>
##$USERP3= <user>
##$USERP4= <user>
##$USERP5= <user>
##$WDW= 1
##$XDIM= 8192
##$YMAX_p= 0
##$YMIN_p= 0
$$ End of Bruker specific parameters
$$ ---------------------------------
##NTUPLES= NMR FID
##VAR_NAME=  TIME,          FID/REAL,        FID/IMAG
##SYMBOL=    X,             R,               I
##VAR_TYPE=  INDEPENDENT,   DEPENDENT,       DEPENDENT
##VAR_FORM=  AFFN,          ASDF,            ASDF
##VAR_DIM=   8192,          8192,            8192
##UNITS=     SECONDS,       ARBITRARY UNITS, ARBITRARY UNITS
##FACTOR=    0.0002004,     1,               1
##FIRST=     0,             0,               0
##LAST=      1.6414764,     0,               0
##MIN=       0,             -267361,         0
##MAX=       1.6414764,     121342,          0
$$ Real data points
##PAGE= N=1
##DATA TABLE= (X++(R..R)), XYDATA
0@%%%%%%Qj6J6j6K4l2M0m8N6p2Q8j04J25j49J75k06K39k74L16l64M14m71N36o06
30c21O83p69Q64r67J082j210J346j494J660j841K036k254K497k767L066l398L772
47A985m195M678n237N892o668P611q784J0284j2290J5127j9469K7039m4011J49380
61A21342l2494k42320J32087J29296Q997j03965n8638J8714J06574r573j22840
72e2820n8673R1977O9750k6097q7357k5943P2379N6705p5607o1708O1432O6343
84C0381k5669l6187j4203J0385M2320J1788n0637o3N8590R9m8892n226K3999K5070
98B1755J1269m1709l6847N6035N2194m6817m8482J7062K6180K4277P149n1247
110i181k6331O0527K1565n6273n088L8855n456p782R566l0638j3923N0406R645
$$ y = [0, 0, 0, 0, 0, 0, 0, 8, -8, 8, -8, 16, -16, 24, -24, 32, -40, 48, -56, 69, -80, 95, -111, 128, -146, 170, -194, 220, -251, 285, -321, 362, -407, 457, -510, 572, -638, 708, -786, 874, -967, 1069, -1185, 1312, -1455, 1611, -1787, 1985, -2210, 2468, -2769, 3123, -3545, 4066, -4718, 5566, -6724, 8403, -11066, 15973, -28038, 121342, 88848, -153472, -21385, 107911, 116908, 12943, -45695, -26981, 79593, 70020, -52820, -111493, -19516, 50234, 24137, -63220, -89163, -16784, 39921, -35686, -97394, -35962, 30381, 4712, -31475, -45678, -35293, 7027, 18815, -31822, -31885, 26705, 26804, -22088, -27314, -3315, 21755, 33024, -8685, -45532, 10503, 62697, 15880, -32602, -15540, 10640, 34917, 42066, -9181, -35512, 25015, 46580, -9693, -14781, 24074, 18618, 10836, 20402, -10236, -24159, 26247, 35892]
123C5892n4350j0210L8077J2681j3424j9710j2474J7242J2263j8278q92J4278
135A095j4897k303K5246j9227k8191L5221J8168l9814k77L3816j3111j7144J8640
148b778n58r539J8404P69j6152J1783J975j8139J7749J7813k2937L14K2244k2511
162a563j3319L7719P76l6981J0570K2875j3370j542O197k1009R55K7076p111j7604
176f331J1372m7j1803Q988L5r841J8205P272k6979k718J7773j0609m699J3160
190C778r635k988K2774j5690l2246K5083K3794k7986p745K0498q323n121J4269
203D62j6933j1954L5859J2776l3935j2029J4148J2423J8039q382l7913J1837M7152
216C1550j0356l3207R602Q705m318J7460k251k9494J4128K9794k0121k1957J5552
$$ y = [35892, -18458, -28668, 9409, 22090, 8666, -11044, -23518, -6276, 5987, -12291, -13183, 1095, -13802, -16105, 9141, -10086, -38277, -3056, 15112, -24702, -24979, 8837, -4274, -21418, -2778, -3336, -12875, 5529, 6298, -9854, 1929, 3904, -14235, 3514, 21327, -1610, -1296, 20948, -1563, -14882, 22837, 23613, -13368, -2798, 20077, 6707, 5165, 11362, -9647, -8692, 18384, 11273, -6331, 5041, 4994, -6809, 2179, 2214, -7627, 10578, 17850, -9129, -11847, 5926, -4683, -9382, 3778, -5857, -8845, 13929, -1761, -34007, -8924, 14870, -13116, -20861, -363, -8686, -13807, 462, -16471, -28425, 7434, 20210, -13725, -25754, -11606, 817, 18856, 10474, -27439, -15602, 31550, 21194, -12013, -2411, 6294, 1976, 19436, 17185, -12309, 1819, 31613, 11492, -10465, 5087]
229E087R491n51P2j6769k292K8123o660l4112J3585K6159j3291q925L355j6108
243a2836N617K8023j9266l0458K6471K2665k4615j5489L085L259K1556N052m0294
256b7230r196M1023Q503k5375k749K095J284K1154j895l1911P824L0983r114j4550
270i154R472k13K454J6167j5027k0914K5491J6949k3599k222J6465q753p49J2651
284A9018j3764r931K0621J354j5578R625K245j5608P518P132j6993O233J8010
297A9882k0564j3658K0779k308j7138J2879L770j9705P690J4513j7311o708J1543
310f336n926O24J3605j3254j1260K1481J697k1201R765J4780j1076M026Q645k0075
324a4505m8K9652j901k1286P448N798m056J1454k888k0476J3442K1211j6750q928
$$ y = [5087, 14578, 14027, 14099, -2670, -4962, 23161, 16501, -17611, -4026, 22133, 8842, -83, 3272, -12836, -7219, 20804, 1538, -28920, -2449, 20216, -4399, -19888, -16803, -13544, 8012, 13064, -27230, -36426, 4597, 13100, -12275, -15024, -12929, -11645, 9509, 7614, -24297, -16473, 14510, 5396, -9154, 318, 105, 2559, 18726, 3699, -17215, 8276, 25225, 1626, -596, 15869, 7116, 6367, 19018, 5254, -4677, 15944, 17298, 1720, 11345, 13590, -2018, 5500, 12632, -4361, 1872, 19882, -682, -14340, 6439, 4131, -13007, -128, 3642, -16063, -8373, 6140, -11171, -17879, -6336, -12262, -11638, 1967, -11287, -22547, -1066, 631, -20570, -10805, 3975, -7101, -3075, 5570, -14505, -14553, 15099, 13198, -8088, -640, 5158, 1102, 12556, 9668, -10808, 2634, 23845, 7095, -1833]
338a833J4254p238q517J5322l260j3984J4615N165k0527L041J4723j0229l650
351b118R451r651k458J6176j1017j6074J9259O106k2314L165J5080r264j172O609
365A778j6563k829K4528k163j9744N314N204m599J1819Q9k1442Q444K1313j3410
379b261r188J7269k332j1105J3472J827j2565J1449N773j6204N310J5227j2177
392D495m923J2978n749n350J4147q870j5646J9299Q759k4539j717J7969l684m270
406B899J956j6035m96K5731l243k3369L456Q041m630R028l65k1955N639K2599
420I256j2453j4803J4069J849r039R248p12j2872J1602R698j7039n46J4026p548
434e264k431J3653p474j0078J5875J474j5495J0264J0522j4884L83J3671o906
$$ y = [-1833, 12421, 5183, -3334, 11988, 8728, -5256, 9359, 14524, -6003, -2962, 11761, 1532, -2118, 7333, -2318, -4776, 11400, 383, -15691, 3568, 9674, -12640, -9475, 5605, -3659, -4831, 1778, -14785, -17614, 6914, 4751, -14993, -9679, -4475, -9074, 2745, 2834, -18608, -10164, 11149, -2261, -11449, 5820, 3488, -7617, 5855, 7682, -4883, 6566, 12339, -3865, 1445, 16672, 4495, -428, 12550, 6801, 1451, 15598, 6728, -8918, 10381, 19140, -5399, -7116, 10853, 7169, 2899, 4855, -11180, -11676, 14055, 10812, -12557, -9101, -1060, -5690, 3338, 2973, -18982, -13343, 9256, -3197, -18000, -3931, -2082, -11121, -1873, -2585, -15457, -3855, 5843, -11196, -11742, 2284, -5264, -7695, 5958, -1516, -11594, 4281, 5755, -9740, 524, 11046, -3838, -3455, 10216, 3310]
447C310k761R704r481n362J9182M57j7625O545N880j0644R993J0614k0371o393
461f952K0093k113j2028O094k484p880J3104kj9620M916J3800r237l463M935j2805
476a3642K049K1373j1302k3689J4099J5408j0136K08K213j2532O524J7057j1541
489c911j0221J4829K391p002O360l157r122J4300O289j6876M614J6423j1440r168
503e691J3105q82l819J1158o119j4333J4467R769j7781j407J4638l811l848M217
517I663j2707k815K1554k676k2586L479J2373m120K70l571j5148Q751J9724j3055
531h64j5851J2814J997p655R079j694j4844J1971J4958j6475q148J4245j044n082
545f593Q223k952n706J0999j55j1035P798N188j1460O269J2341j3211l964J4604
$$ y = [3310, 549, 10253, 772, -4590, 14592, 15049, -2576, 3969, 9849, -795, 9198, 19812, -559, -6952, 13141, 11028, -1000, 5094, 2610, -5270, 7834, 7832, -11788, -6872, 6928, -2309, -5772, -837, -13642, -11593, 9780, -1522, -25211, -11112, 4296, -5840, -5632, -3419, -15951, -9427, 7630, -3911, -14132, 697, 3088, -3914, 2446, -711, -9833, 4467, 10756, -6120, -1506, 14917, 3477, -5691, 7414, 6532, 2713, 13871, 7752, -6581, 7886, 17655, -126, -1533, 13105, 9294, 5446, 9663, -3044, -5859, 15695, 13019, -9567, -6088, 6285, 2165, 2435, -1136, -16284, -7533, 12191, -864, -16715, -3901, -1904, -9559, -480, -2174, -17018, -5047, 9911, -6564, -14712, -467, -1511, -6593, 1630, -1322, -7028, 3971, 3816, -7219, 579, 5767, -5693, 576, 12917, -294, -4258, 10346]
559A0346o199q864J6714J169j8565O045J2827p590j257N406j0101o34J4029o022
573G304j0358P743o46p298R590q10j4841P493J2488j4268n616J1284o041n172
587i148J3772l654j5064R813P075j2059K323Q024j0146J172J2749q359r729Q872
601d359J583k553Q570l966j2560R969J0500j0206P48P056j0168J878J7320q172
615E640j4751J4924P319j2870K391O894q832L450J1139j0803q338R794L42l471
629B828M578o855q317J3550L238j7017K927J0804j0086j836J2015j0630j0585
642a5386J5132L784j3689M783O355j0014J182P065o028J65O317q626j344J3829
656C525m358j1540P571L685o260Q772J583j6016O743J9516j1577j4360J1443O880
$$ y = [10346, 4147, -4717, 11997, 13166, -5399, 646, 13473, 5883, 4626, 10032, -69, -703, 13326, 7304, -3054, 4689, 4043, -3255, 6335, 5525, -9316, -1823, 10665, -3603, -9219, 2065, -3976, -9148, 4624, 970, -14094, -4281, 2794, -9265, -6942, 1082, -9064, -7892, 4857, -3502, -13231, -4359, -2776, -5329, 3241, -725, -13285, -3316, 7184, -3022, -2274, 4782, -5386, -3508, 13812, 5640, -9111, 5813, 13132, 262, 2653, 9547, 715, 4165, 15304, 4501, -3837, 5957, 6299, 2828, 7406, 551, -7766, 5784, 9022, -7995, -5068, 5736, -4350, -6186, 5829, -4801, -15386, -254, 3530, -10159, -5376, 979, -9035, -7853, -788, -6816, -6651, -334, -8960, -10304, 3525, -833, -12373, -4802, -1117, -7377, 1395, 2978, -13038, -6295, 13221, 1644, -12716, -1273, 5607]
670E607j779O665p202j4336J5042J6440j4446j0784Q697M139K355J750j3340m467
684e659J9541K225j7729Q68P528m284M247J694j5252K721J8110r233j6935J1588
698e70P584r439n74J890n245N635M545j2842j744J2912k951p181L856l004P03
713f425J3419p225j9132J2966J8575j2405r457R072j356K74J1384p479j3031J3657
727B837J1522j1317n025M905n29O036M056j3950j636J5644k405j0754O034J804
741G222o854P825J465j3712L794J1881r642o240J0551l478p801P029p02q695O683
756f74L173j1446L021Q537q110l415O349n490r85J1421n497j0511J0459M587j2081
771a0662M525Q756r545J326J3361p200r980J0960L619p270N877K588q240L655
$$ y = [5607, 3828, 10493, 3291, -11045, 3997, 20437, 5991, -4793, 3904, 8043, 10398, 12148, -1192, -5659, 13882, 16107, -1622, -754, 6774, 2490, 6737, 8431, -6821, -4100, 14010, 4777, -12158, -570, 7014, -2425, -2999, -1109, -6354, -719, 3826, -9016, -10760, 2152, -799, -7980, -4124, -7128, -6425, 6994, -231, -19363, -6397, 12178, -227, -9684, -612, -1968, -1694, 9690, 2211, -10820, 2837, 14359, 3042, -1983, 2922, 2393, 8429, 12485, -1465, -3101, 12543, 10138, -616, 5418, 7222, 368, 8193, 9658, -4054, -260, 11621, 1979, -4261, 6290, 2812, -4989, 2040, 1338, -7357, -674, 2499, -8947, -5926, 2611, -5499, -8914, -2565, -8055, -9040, 2381, -3116, -13627, -3168, 1419, -10662, -6137, 2619, -6926, -5600, 7761, 561, -9419, 1541, 5160, -2110, 3767, 6355, -1885, 1770]
785A770O563p130p61N547m053J539Q280r544p881J3909L317j2444L001M913r042
800b016L824R202j0780p049J1693L39p386M347k601p573P997L345j1405R47P829
815G13p167p12Q355q978p533J2939J711r786N353L552r610N744Q960j0118l140
830i717J1911j056m778P487l756o494J0297N110j0161J228O466m866K087O129
844I887q279k916J0411k665o856Q762j052j1603P753P839j0896j837Q117n111
858A554k697Q998n987j0643R510O217q623q40j48m578P514O227j4671m130J4101
873A804p5q441L572k787m588J1712L253j4642J210J2214m207m663M663k957q57
888d789J0441l447r496Q650M461r179K878O309o057J467Q083p302l919R911k687
$$ y = [1770, 8333, 1203, 442, 5989, 1936, 3475, 11755, 2211, -5670, 8239, 11556, -888, 2113, 7026, -2016, 1808, 11010, 230, -6819, 4874, 5213, -2173, 2174, -427, -8000, -3, 3342, -8063, -7116, 713, -6454, -7166, 1189, -7789, -15322, -2383, -672, -10458, -5105, -1553, -11163, -5419, 3541, -6577, -9717, 2194, 1138, -3640, 3847, 91, -6403, 3894, 9004, -1157, 71, 6537, 1671, 3758, 9887, 1608, -1308, 9103, 6438, -418, 8344, 7292, -4311, 3442, 11281, 385, -1452, 6665, 1554, -1143, 7855, 1868, -8775, 735, 6952, -1671, -2511, -2659, -7237, 277, 6504, -8167, -12297, 1804, 1729, -6712, -3140, -5927, -10515, 1197, 4450, -10192, -8982, 3232, -975, -5638, -975, -3932, -4789, 5652, 2205, -7291, 1359, 5820, -3359, -481, 5828, -229, 1238, 9321, 2019, -1900, 8011, 5324]
903E324q008Q255L585q556K953L693q354K806Q789q766n948J0333o40p900N061
918B627j70p503O261N112j0172q77O997n219j158O978o469n835J0603L35j0115
933h605L867L931o580M268P132j0228k898J1462k212p375N462N69l191P873O20
948D095j0981M411R184o616j936P645l957l242Q826k974p714Q635L581r761K234
963A430O488n864n35N669o506j562R837n272r678Q124N141q212N70K551o915M479
979b55P889j1162o291J0493J356o519K522j829m397R420K316j3846J197J1057
993A951l735l070N019m952l103J0333l87j0175O179N914o519J795N095o162j53
1008a970Q204m860k698Q895k505q611P492N528q474M93M664n303K952P034r555
$$ y = [5324, -2684, 5571, 9156, 600, 3553, 7246, -1108, 1698, 10487, 1721, -4227, 6106, 5466, -2434, 2627, 2457, -5046, 1215, 6327, -3845, -4722, 2275, -2944, -4102, 2876, -3593, -9428, 1175, 1510, -8605, -4738, -807, -7387, -3119, 4013, -6215, -9113, 2349, 137, -7238, -1776, -1207, -4398, 3475, 4095, -6886, -2475, 6709, 93, -1843, 5802, 1845, -1397, 7429, 4455, -3259, 5376, 8957, -804, 1430, 7918, 2054, 1519, 7188, 682, -880, 8957, 3685, -5993, 2131, 7272, -940, -370, 2181, -4734, -255, 7634, -3528, -9819, 674, 2030, -4489, -1967, -3796, -8193, 1227, 3543, -10303, -9106, 1951, -1784, -4854, 165, -4787, -7890, 2443, 2056, -8119, -1940, 3974, -2545, -750, 4345, -1817, -1970, 6234, 1374, -1324, 7571, 5066, -3545, 3947, 9475, 1001, 1494, 6158, 855, 3807, 10841, 1286]
1023A286o209J1214J936p975K154n67m882P589K962j3516m25J1671l141o469L892
1038d80l243l443Q874j42j0296M172N665p204M24N364o039n88Q818m449n724Q148
1054a43o37q110P322N828q294J03O476m225K25O787o782l991J0771K020q222K359
1070A487K430m173O328L832j1346n48J1355l051o249M201j972l435Q206k38j1556
1085d729K797P337o007p62M381o968j840R584l837q726N746L359n982L171K811
1100C35q142K374P789n660l436O733k602l828Q174l52q042N271M123p607K642
1115b228P382o671k590Q423k045m521N123j342n117P587L685r063O72O369l891
1130A773R47N101q239k423J1959n35j1176L187M168m167L280J605r484J154J0741
$$ y = [1286, -4923, 6291, 8227, 252, 2406, 1839, -3043, 4546, 7508, -6008, -6433, 5238, 2097, -4372, -480, -3723, -7166, 1708, 1566, -8730, -4558, 1107, -6097, -5673, -309, -6348, -6936, 1882, -2567, -8291, -143, -780, -8890, -1568, 4260, -4034, -3931, 2545, -1680, -1455, 5332, -1450, -5441, 5330, 7350, -872, 1487, 3917, -256, 6072, 9904, -1442, -1990, 9365, 6314, 65, 4266, 2294, -1141, 7065, 6827, -4729, -1932, 5405, -602, -1364, 3017, -3951, -5791, 3793, -44, -8770, -3024, 335, -5647, -2476, 335, -7807, -5433, 2356, -3304, -6740, -7, -2609, -6437, 1737, 1385, -6657, -1386, 2737, -4870, -2228, 5154, -1517, -4107, 4316, 2271, -2250, 2873, 1531, -3586, 4001, 7686, -1377, -705, 5664, 1773, 2720, 7821, -418, -2841, 9118, 8583, -2593, 594, 4762, 595, 3875, 5480, -4004, -2850, 7891]
1145G891m906q090M815J59l088N950k019q839N471O183q425r78O804m070k200
1160e342O500m150m659Q209k05p479N704M924q609K55O430l587n60O930n167n038
1176e844J0201J305r098K818M978l334K776K938q735J018J0765m074p681N819
1190C852Q00m110N750J14r830L889Q272p081l426N704k730l017N794l103n138
1205d260M974J709o854L576L363q226R47O967m754l280N947l562n097Q677R81
1220A108r337L287O221n137J0M390o015L09R782l294p448O598K341m761M864J819
1236D737p631L503P745o483k586P109k914m038P223j344p015N146L462p044J480
1251A350M417o406p17P349m703m604N106j314m582N431Q77q040K801M641o287
$$ y = [7891, 2985, -5105, -290, -131, -3219, 2731, 712, -8127, -2656, 3527, -4898, -5876, 928, -3142, -5342, 1158, -2992, -7651, 558, 353, -7126, -1422, 3502, -5107, -4852, 1578, -2009, -2569, 4361, -806, -5844, 4357, 5662, -3436, -618, 4360, 1026, 3802, 6740, -1995, -977, 9788, 5714, -1967, 3852, 4652, 542, 6292, 6406, -3424, 465, 8737, 1656, -1770, 3934, 1204, -1813, 3981, 878, -4260, 714, 2423, -4431, -855, 2508, -5718, -4771, 2196, -2558, -5838, 109, -3453, -8550, 127, 1108, -8229, -4942, 1279, -3858, -3848, 542, -5473, -5164, 4618, 1324, -6124, 474, 2815, -1946, 2918, 4737, -2894, 609, 8354, 1871, -715, 6394, 3480, -558, 6665, 5321, -1694, 3452, 6914, -130, 1350, 5767, -639, -1356, 5993, 1290, -3314, 1792, 478, -4104, 1327, 2204, -5836, -3035, 1606, -4681]
1266d681R00M948o687k169R567k480q010N246K302m848M270K866q856J408R650
1281C426l913m736M471q10j105P335k291q809O533O801o373j444M170l492J126
1296H89P386n992o707Q667K880p032J824K287m304K901K706o820J01Q014m137
1311B663n804O105j66n503M380k33o139N742M179j0355j497R158k216n046L360
1326a372k319k607Q699q96j1294L752Q876m054l218K669l357K081Q877n687q587
1341h437Q162N012n274P76J035m627N268N646q292l086R339l88n195L742n78m140
1357a037O023K038q100J860O660n331k094M970k895k438N742l099n403O660J922
1372E478r319R33O593m679j263M391n708j714Q103k482q410M417M591m497J545
$$ y = [-4681, -3781, 1167, -5520, -7689, 1878, -602, -8612, -3366, -1064, -5912, -1642, 1224, -7632, -6224, 3426, -487, -5223, -752, -1562, -2667, 4668, 2377, -6432, 101, 6902, 529, -915, 3255, -237, 889, 8275, 2283, -4424, 4243, 7123, 91, 1915, 4202, -102, 2799, 5505, -1315, -1214, 6800, 2663, -3141, 2964, 2798, -2705, 1675, 1442, -4697, 1045, 5224, -5131, -6628, 2530, 314, -4732, -1372, -3691, -6298, 2401, 1505, -9789, -6037, 2839, -1215, -4433, -1764, -5121, -3040, 5837, 150, -8437, -275, 4737, -537, 239, 1274, -3353, 1915, 7561, -731, -3817, 5522, 5134, -61, 3681, 3103, -1037, 4986, 7024, -1076, 784, 7444, 2113, 19, 4989, 2094, -344, 5398, 2299, -3104, 3556, 5478, -3841, -2908, 3685, -994, -2257, 2134, -3574, -5288, 2815, 333, -8077, -3660, 931, -3566, -2021]
1387b021J179n999K381P953n846m978O924N24l741M593p36o263O508N030p352
1402a844m11N651l306k16N828m571m044P474J439o713L175K752o203K402N688
1417G101n985k170O352k796l857N575j866n953N412K515p174J427M728o697o67
1432d055P228l698n106N740q32m864M488J434o969K949N404n264j105M497l863
1447d016l39P041l986o399O563L837n969J898K500m847K512O395n347l767O610
1462B686M3l477M780j048n061N227L156o805J291N704n198q09O493m348n172N848
1478C310Q31n451L762J198o750L091N322o797k834N867k100k706M949l125n691
1493g124O334K811o721M14L798m034Q62M964n161k640P568j325n489M723J841
$$ y = [-2021, -842, -6841, -4460, 3493, -2353, -7331, -407, 117, -3624, 969, 233, -6030, 478, 5508, -1844, -2255, 3396, 90, -126, 5702, 1131, -2913, 4561, 6000, -713, 2462, 5214, -989, 1413, 7101, 1116, -1054, 5298, 2502, -1355, 4220, 2354, -3599, 1813, 4328, -2846, -1419, 3309, -3388, -4055, 3173, -525, -5631, 109, -723, -5587, -1099, 335, -6634, -3685, 1719, -3545, -4650, -153, -4016, -4355, 2686, -1300, -7699, -1136, 2701, -3268, -1370, 1130, -3717, -1205, 5190, -157, -3924, 2686, 2729, -748, 4032, 2984, -2077, 3150, 6306, -499, 792, 6496, 1298, 489, 6982, 2634, -2538, 3310, 4141, -1310, 2452, 3650, -3100, -9, 5313, -1484, -4318, 1549, -551, -3257, 1692, -1433, -7124, -790, 2021, -4700, -4286, -488, -4522, -3660, 1304, -3857, -6497, 1071, -254, -5743, -1020, 821]
1508H21n130L420M309o443R14O167m473k309O564j159n296N042J888m454L402
1523C263J195o380K733O815n397l623N760j818k426N094k469o667N811M941o856
1538b4j794M148l199Q26M157n780m239P570P46o399K120J696l936K907K770p387
1554e818m4P695k808m372M587j286l518N792L86o045L207N067o264LO182k882
1570a18k203N191j773l662O016R14o729L291N082m501l72K856m098P21O689m346
1586B958n875O522J905m984J220Q69n162M033N285p657l212O661l93l790K242
1601F22k271l672P028J770q267L47N097l115q01L924m258j712O983j673o162M052
1617b108L015m591K173K836m819P21N348m305j686O713j684n157M853K292m545
$$ y = [821, -4309, -889, 3420, -3023, -2109, 4058, -415, -2724, 3840, 2681, -2615, 2427, 4315, -139, 3263, 4458, -1922, 811, 7626, 2229, -1394, 4366, 2548, 122, 5216, 2747, -3920, 1891, 6832, -24, -1818, 2330, -869, -43, 4114, -1666, -5905, 1665, 2411, -3988, -1868, -172, -4108, -1201, 1569, -5818, -5862, 1833, -975, -5347, -760, -2046, -5564, 228, 614, -5431, -2224, 2843, -3421, -3418, 2764, -118, -2321, 2870, 1097, -2565, 3451, 4365, -2364, 927, 6009, 1508, 1136, 3992, -106, 615, 7304, 2958, -2917, 3605, 5510, 526, 1746, 2615, -2547, 1486, 6771, -886, -4098, 2563, 2170, -1620, 622, -1649, -5321, 1707, 3477, -4790, -4443, 654, -2461, -3262, 662, -3596, -5308, 1675, 2, -6160, -2108, 907, -3684, -1511, 1325, -3494, -2773, 2575, -1730, -3416, 3297, 1613, -3544, 1309, 3601, -944]
1632i44K750K064n654K999O258n555l916N700K92k844K956j849m350O499L098
1647G504q428j357N973k373o33K841m455k407O545n17p289L163L207m438J377
1662a287K309n230J16N683l593l273N553n83n515M583K404n084J714K420m249
1677d032J481N806n017l128O030J130m043K704L7m123N354L664p341q29O674j571
1693B796k082L043k222k875O369K68o790K770M307m751j70L038m533n34O042l066
1709A610m583M735P6n449L013K561n279O58L728m651l36N120l589l591M901M10
1725f66m064L015M19m483L745M531o624q87N488j145k141M003j948l499O558J779
1741D081o344J415L810k570M09L729m801q30O936j027n845K722J753l313L348
$$ y = [-944, 1806, 3870, -1784, 1215, 7473, 1918, -1998, 3702, 3994, 1150, 4106, 2257, -2093, 4406, 7504, -924, -2281, 3692, 1319, 686, 3527, -928, -3335, 3210, 2693, -4596, -1433, 1774, -2664, -1287, 1022, -4208, -4092, 1591, -2002, -5275, 278, -305, -5820, -1237, 1167, -3917, -2203, 217, -4032, -2551, 3255, -1762, -4890, 1140, 2270, -1773, 931, 968, -3155, 2199, 5863, -1478, -2307, 4367, 2796, 714, 3757, 1535, -1340, 5029, 5297, -1493, 1277, 5584, 833, 663, 3701, -832, -1366, 4676, 1610, -2973, 1762, 1838, -3611, -598, 1963, -3316, -2658, 1070, -3581, -3917, 1203, -2386, -5977, -1076, -666, -4730, -1715, -1296, -5779, -2034, 2497, -4127, -5014, 474, -671, -2812, 1191, -757, -4256, 2302, 4081, -2263, -848, 2962, 392, 801, 4530, -271, -1101, 5835, 4808, -1037, 1685, 3438, 125, 3473]
1756C473J538o287J284N177l874k405M138k042l284M991n46n339L118K515n037
1771b580P34M081m710j600M916j904k448L911j625m112M563K130n758J417L304
1786C19l302Q58M388m837k511O664J44m981K730J582k956L535K871o452o68O766
1802D150j522k762L700k304j969N138M41o219K126M044l897M73L085m150j203
1817h69N931k271m579L832N51m182L364J847o019K00M316l537j078L924l044k986
1833d600N277j26n518K478K113l582K519K686n808n91O810k118l596L940l38l018
1849c472M410J578n645J742M665l280r71M009k863j211M828j261l642L829P27
1864C443l664K829K670n991M84M907k421j932L579k508l322N060P27n998J146
$$ y = [3473, 5011, -1276, 8, 5185, 1311, -1094, 3044, 1002, -2282, 2709, 2163, -3176, -58, 2457, -2580, -1846, 2235, -2475, -4075, 841, -1063, -3511, 400, -1225, -5337, -774, 1356, -4402, -2985, 319, -2983, -2125, 2263, -2574, -5085, 1579, 1723, -3258, -528, 1054, -1902, 1633, 4504, -1948, -2616, 4150, 2628, -134, 3566, 1262, -707, 4431, 4872, -1347, 779, 4823, 926, 1399, 4484, 334, -869, 5062, 2791, -1788, 2044, 2595, -1587, 1777, 3624, -2395, -2195, 2121, -1416, -2494, 1430, -1614, -4600, 677, 551, -4967, -2489, -376, -3958, -1439, 1247, -4561, -5152, 1658, -460, -4056, -116, -454, -3472, 938, 2516, -3129, -1387, 3278, -2, -973, 3036, 173, -1038, 3790, 2529, -1113, 2716, 3443, -221, 2608, 5278, -713, -229, 4678, 2257, 325, 3904, 1396, -1926, 3134, 3861, -2137, -991]
1879i91L710l111J89J975m873m60N969k192m819L173J198l492K987P12n473J898
1895c600N348m253j937M005j503j997M887j106m207L209K864m247J826K821l904
1910a794L71N295k893k720M443r61k718L967O37m870K590L333m422N60M166m203
1926G81j651N112j246m157K657J233l900K316K177n446L52M565k506k381K806
1941G12k321j938N327q29o337K529L887l173k11K069m194M86N993k689m588L658
1957a619J528k433K003P09m313K975L967m255j017M436j586j667M095j377k970
1972a524L891J492m695K170L581m641m02M606k400j956L617j673l411M717R66
1987D338n367R36L113k732mK476m406n75N244j641m794K812M89k789K968N22n459
$$ y = [-991, 2719, -392, -203, 1772, -3101, -3561, 2408, 216, -4603, -1430, -232, -3724, -737, -25, -5498, -3600, 1748, -2505, -4442, -437, -1940, -3937, 950, -156, -4363, -1154, 1710, -2537, -711, 2110, -1794, -1423, 3872, 979, -1741, 2702, 1741, -977, 2990, 3627, -1243, 1347, 4680, 258, 818, 4984, 781, -870, 4242, 2996, -1161, 1496, 2729, -1171, 1145, 3322, -2124, -1772, 2793, 287, -2094, 712, -1609, -3547, 1780, 951, -5386, -2857, 1030, -2143, -2354, -285, -4479, -3993, 2000, -689, -5277, -1619, -91, -2524, -521, 188, -4125, -1150, 2817, -1438, -2455, 1981, 395, -1272, 2823, 1446, -1524, 2367, 3859, -836, 1334, 4915, 274, -128, 4478, 2078, 122, 3739, 2066, -1345, 3372, 4338, -1029, -93, 3020, 288, 284, 2760, -1646, -2221, 3023, 1382, -3412, -600, -111, -2900, 68, 590, -4869]
2004d869K036N012l747k515L216r30j526M151j195m623L622K498l517P18K557
2019H88l212O74M806l375k310M753m14l345L539J161m818K670L834l905j000L634
2035C580j914j866M214j350l951L492J154l411J864J827m698Q32L294l165j808
2050a906L829j769l127L881J40m844K095K925l533J17K538l830l28N043j913m187
2066d869L479P85k404K206P59m045J921M521l693j666L949j262j382M079j477
2081I01m024M323K593m221J043K561l115K00M151k528k587L688R7k958K217O47
2097B988l667J767K551l680j39K946l485n51M156k343l835L851R27l974J300J894
2113G06m116J100L849l401j940L518r52k498L609m05l891K889K307l473L64K654
$$ y = [-4869, -2833, 2179, -1568, -4083, -867, -1797, -3323, 828, -367, -4990, -1368, 1130, -2387, -1669, 888, -2324, -1650, 3156, -219, -2529, 2224, 1810, -1535, 2004, 3165, -1653, 1017, 4851, 946, -54, 3580, 1666, -200, 4014, 2664, -1287, 2205, 3359, -52, 1812, 3639, -1059, -227, 3067, -98, -1906, 1923, 154, -2973, 908, 1048, -3796, -1701, 1224, -2309, -2192, 346, -3484, -3812, 1231, -682, -4869, -1390, -605, -3009, -803, -44, -4089, -2168, 2353, -1340, -3006, 943, -319, -1701, 2378, 901, -3123, 1200, 3793, -428, 615, 3176, 61, 261, 4412, 1884, -703, 2985, 3082, 124, 2341, 2988, -679, 1088, 3639, -41, -180, 2766, -719, -1270, 2886, 543, -3292, 559, 1486, -2488, -1188, 706, -3410, -2310, 1539, -1862, -3802, -284, -1236, -3734, -125, -530, -4421, -1532, 775, -2698, -2334, 320]
2129C20k720J05M455k531k673L762M70k719K671Q98l684J938L914l348j519L260
2145B599j471p82L877j485m054L333K101l788P70J957l302O39L735l638k686M259
2161B064q67k714K711m7m136K603K657m639l53L687k216k019L693j834k850L504
2177g56M94l492K519J758m400J654L557l586m48L434j267k063M174n17m349L122
2193a66K675k744L61J886l036J763L484k592k975L919Q6k438K251J98l455K624
2209A841K815m389j195L581j398j623K719j740l352L811J515m835J343J980l179
2224b106P30K956l448j729L885p90k689K400o2l096K366K422l508lL143k916m34
2241b879M269j940l091L926M81k648K422J171l754J594L785k965j404L354q57
$$ y = [320, -2400, -2295, 2160, -371, -3044, 718, 1188, -1531, 1140, 2038, -1646, 292, 4206, 858, -661, 2599, 1128, 346, 4223, 2738, -1316, 2017, 4118, 330, 1100, 3057, -245, 394, 4129, 491, -2195, 2064, 1197, -1517, 1194, 1147, -2989, -386, 2271, -2368, -2721, 966, -1250, -3269, 424, -1410, -4260, -756, -262, -3754, -1235, 523, -3877, -2223, 1334, -2252, -2700, 734, -533, -2596, 1578, 1061, -3288, -166, 2509, -235, 126, 2012, -1024, 739, 4223, 1631, -1344, 2575, 2661, 223, 2474, 2672, -783, 1841, 4656, 267, -928, 2653, 1255, -368, 2351, 611, -2741, 1070, 2585, -2250, -907, 1073, -2106, -1376, 1580, -1868, -3597, 288, -502, -3191, -791, -853, -3949, -1583, 839, -2669, -2672, 471, -2445, -2879, 1390, -550, -3641, 285, 766, -1882, 540, 1711, -2043, -449, 3336, 371, -1033, 2321, 1464]
2256A464j114L040j579l413L815K306l918K93J905k196O39L005l738k496M705
2271B718M6l308J252K22k901K600J974m609k27L311k100j280L005j408k716K990
2287d31O88l827J600K343l232O88L516l084j586L345p12j510L163n98l259L206
2303C10K223l503k71K813k085L98L417k406k586M220N56l367J829Q05k684K044
2319A713K308l639o47L648j908j658L024j251l195L115J220m070J220J896k654
2334h78J6K811l336j966L872m49k912K463n74l149K936K175m218l1L287k129o11
2351b693L203k173k198L689P33l304J580J874k310J295K715l618o83M464j250
2366A324j977K601m96k353L046J157l592P11K993k340m52L149k724j837L526j04
$$ y = [1464, 350, 3390, 1811, -1602, 2213, 4519, 601, 894, 2799, 603, 1242, 4247, 509, -1987, 2718, 2764, -544, 708, 930, -1971, 629, 2603, -2006, -2233, 1078, -1022, -2302, 703, -705, -3421, -431, 257, -3570, -1970, 373, -2859, -2171, 1345, -1739, -3325, 20, -692, -2202, 961, 363, -2896, 310, 2533, -970, -1241, 1572, -513, -115, 3302, 896, -1690, 2530, 3086, -281, 1548, 2353, -331, 1713, 4021, 382, -265, 3383, 1475, -183, 2841, 1590, -1605, 1510, 2730, -1340, -120, 1776, -878, -862, 1949, -1387, -3353, 519, 70, -2842, -379, -953, -4102, -1166, 1009, -3209, -3240, 47, -2082, -2693, 510, -1663, -3861, -172, 561, -2743, -1163, 711, -1599, -304, 2411, -1207, -1890, 2574, 1324, -653, 1948, 1452, -901, 2145, 3302, -290, 421, 3414, 1074, 622, 3771, 1047, -790, 2736, 2632]
2382B632l193K140M46l335J956K241m167n40L061j518j957L041j665l184L920
2397a22Q65l977J223K117l164R47K705l176j495M377n48k877K133M30k490K944
2413a08J745m035O35L590j991l52K640k224j870M655L91l926J753J681k412J459
2429A631J946l574k11L922j591k186K486n19k373K569O96l952J313K649k985j80
2445c59K610k763j832L582l49l437K049O02l092K222K049l764o32L568j747j135
2461b428K260j374k087L993P61m203J565K105j950O39K476l225l47M005q69k685
2477a364K590K82k329K545J306l615Q43L293k206r77K401j594j679L772n95l411
2493g38J985J190k630J357J888m104J04L480k220k355L018q92k735L201N30m031
$$ y = [2632, -561, 1579, 2025, -1310, 646, 2887, -1280, -1820, 1241, -277, -2234, 807, -858, -4042, -122, 743, -3234, -2011, 106, -3058, -2111, 594, -2582, -4077, 300, -248, -3125, -992, -562, -3052, -108, 1637, -2398, -1763, 1827, -164, -516, 2124, -100, -1970, 2685, 3076, -850, 903, 2584, 172, 1631, 3577, 3, -208, 3714, 2123, -63, 2423, 1904, -469, 2100, 2796, -1156, 157, 2806, -179, -359, 2251, -512, -2344, 1238, 889, -2548, -499, 103, -2989, -767, 1282, -2482, -3114, 454, -1293, -2428, -168, -1542, -3629, 364, 1125, -3078, -1513, 592, -1358, -719, 1757, -1468, -1815, 2190, 1321, -1364, 1226, 1508, -821, 1724, 3030, -585, 258, 3551, 1345, 368, 2769, 1175, -504, 3268, 2673, -738, 1247, 2437, -193, 1164, 3052, -1052, -948, 2532, 312, -2043, 975, 83, -2652, 549, 1079, -2952]
2509b952J243K464k653J30K250k474j278L368r09k670K545M41k507K422J139l097
2525b538O35L346k265p25L113k115j424L812K25l948J990K110k412J066K582l331
2541A21m86L605r56k712K435J51k293K839K91l914P78L121k624m07K215k536j566
2558a938M070j138l573J882J494k586J002J362l335L95L536k205j786K103p49
2573a466j798K905M7l424K280K145k746N02K450k583o00L761j061k662L007N69
2589A326k629K128J891l389K99L592k310p37K559j795j681L889k62l458J848J320
2605B591k350J013J725l743l18M092j267l154J976l20j710K805m2m006R76L431
2621A699k707j015J957k149l79L685j663l260K641J286k880J414J565l014J331
$$ y = [-2952, -1709, 755, -1898, -1768, 482, -1992, -3270, 98, -811, -3481, -936, -495, -3002, -580, 559, -2538, -1903, 1443, -822, -1547, 1566, -549, -1973, 1839, 2064, -1884, 106, 2216, -196, 870, 3452, 121, -365, 3240, 2284, -428, 2007, 2158, -135, 2704, 2995, -919, -141, 2980, 356, -51, 2164, -372, -1938, 2132, 994, -2579, -697, 797, -1789, -787, 575, -2760, -2365, 1171, -1034, -2820, -717, -1466, -3264, -359, -312, -3736, -1456, 689, -2057, -1555, 895, -1688, -2288, 1473, 412, -2250, 757, 1326, -1303, 825, 2716, -673, -374, 3218, 908, 171, 2730, 935, -746, 3143, 2881, -577, 1271, 2591, 241, 1254, 2979, -764, -1082, 3010, 1743, -1411, 565, 245, -1465, 1340, 1298, -2708, -1732, 1699, -1008, -2023, -66, -2215, -2594, 1091, -572, -3832, -1191, 95, -2785, -1371, 194, -2820, -1489]
2636a489K983k574j735L423n62k292L147Q08l510J926K116k697P66K351k580o09
2652e28L346p10k321K279k7k487K905Q77m073J173K914k697p65K490k241j296
2668a161L343o87l677J804J943k738Q73J386l498K20L423k412j755K470p11j511
2684b688K616n9l572K048K625k851m46K253j691l86L268j199k744L046J013k625
2700a392J659J298k393L46L107k158j274L260r93j999K794K39k883J971J558l373
2716b33R80K269k834m34L267j985k294K412J08k095K015K60l344R12K378j808
2732d26j383K208j860j097L345j002l378K412J462k778J264J534l166N46L488
2747A169k123k205K828m4j464K460L20l364K189K579k937K68K261k308j94L338
$$ y = [-1489, 1494, -1080, -2815, 608, 46, -2246, 901, 1709, -1801, 125, 2241, -456, 310, 2661, 81, -528, 2818, 2108, -213, 2066, 2039, -448, 2457, 3334, -739, 434, 3348, 651, -114, 2376, 135, -1161, 2182, 1495, -2182, -378, 1565, -1173, -300, 1086, -2412, -2192, 1231, -1181, -2936, -466, -1177, -2688, -72, -131, -3703, -1655, 970, -1881, -2327, -74, -1765, -2151, 1117, -82, -2826, 220, 1233, -1392, 267, 1565, -828, -482, 2625, 467, -807, 2453, 1460, -539, 2255, 2494, -389, 1582, 3140, -233, 747, 3016, 182, -252, 3015, 1030, -1264, 1148, 1256, -839, 1176, 1436, -1908, -996, 1382, -426, -1809, 399, -1461, -2558, 787, -215, -3593, -1181, 281, -2497, -1233, 301, -2865, -2319, 1169, -954, -3159, -331, -375, -1839, 621, 941, -2423, -234, 2345, -592, -324, 1937, -371, -565, 2773]
2763B773j802k414L473N05k528J829Q54l103P63L018k404j305K923j386k043L190
2779B343p09l022J865J629l428Q53J883l016p0L136k020j989K279j82j997K208
2795b37M84l606J513K848k785j43K070j902p91L112r57k630K345J539k435J367
2811b08J326k882J088L263k465j596L045n34j604K742o46k982K793K151l512K87
2827B66K555k198m50K850j509k561K630O91k722J284P54k947J157K400k969p87
2843a556K446j394j713K983o94l147K129J346k739J033J662k901K48L050k027
2858a274j625K689Mk302K636m8k508J636K602k952k93K878j665n60L377j404k764
2875a573K904J630k825N79J879l303J534K699k649j792L283n46j638K237r74k313
$$ y = [2773, 971, -1443, 2030, 2535, 7, 1836, 2690, -413, 350, 3368, 964, -341, 2582, 1196, -847, 2343, 1634, -1388, 477, 2106, -1322, -469, 1414, -1602, -1672, 1464, -556, -2545, -266, -448, -2445, -237, 247, -3359, -1846, 1002, -1783, -1926, 144, -1758, -2549, 563, -394, -3024, -679, 860, -1575, -208, 1118, -1764, -676, 2587, 122, -1474, 1571, 1037, -567, 2175, 1529, -1453, 1340, 3491, -21, 266, 2821, 623, 173, 3023, 1514, -1047, 1583, 2274, -448, 836, 1590, -1357, -200, 2200, -769, -1556, 890, -504, -2217, 766, 72, -3075, -946, 400, -2339, -1306, 356, -2545, -2297, 753, -1274, -2899, -210, -206, -2508, 128, 80, -2428, -792, 1810, -1142, -1435, 1443, -222, -782, 2595, 1191, -1573, 1331, 2961, 136, 715, 2594, -709, 825, 3524, 875, -917, 2366, 1820, 182, 2419, 1445, -868]
2891h68K187R67l177M11K173k264o43K653j902k017L149m13k545J803R47l326
2907b865J374K520k824p85K867j451j439L054p78k945K931J177k877J266J774
2922I99k671P15L268k681j217K859P6k051K322k24k309K113J878l257M63K627
2938B910k485k21K813j471k353K913J84k795J121J608l091J366J895k616j041
2953a263K790j314j615K300p93k665K768J072l359L19J943k096L0K544k073j564
2969b976K863Lk247J765M18k200J765K183l045n45K925j147j245L030j077k367
2985a897L176J158l168R21J960k664J242K344k411j452L149l72k133K195j33k483
3001e68K112J433l318M4K493k206l43K348j672k488K907L13l098J926N23k754
$$ y = [-868, 1319, 2286, -891, -480, 1693, -571, -1214, 1439, -463, -2480, 669, 256, -2289, -486, 461, -2865, -1491, 1029, -1795, -2580, 287, -1164, -2603, 451, -327, -3272, -341, 836, -2041, -775, 999, -1672, -957, 2311, -370, -1587, 1272, 1348, -703, 1619, 1395, -914, 1199, 3077, -180, 283, 2910, 425, 204, 3017, 1546, -807, 2106, 2290, -505, 616, 2224, -867, 499, 2394, -222, -1263, 1527, 213, -1402, 898, 105, -2560, 208, 1280, -2079, -1760, 183, -1913, -1883, 661, -1412, -2976, -113, -110, -2357, -592, -174, -2374, -609, 1574, -1471, -2016, 909, -238, -1483, 1547, 470, -1897, 1279, 2437, -731, 190, 2150, -514, 728, 3072, 661, -791, 2358, 1986, -147, 2048, 1915, -568, 1544, 2977, -341, -297, 2196, -10, -353, 1995, 323, -2165, 742, 1055, -2043, -117, 406, -2348]
3017b348J035K309l195n61K824r58j557K259o90j924K456R01k923P57K062k253
3033a806O41L006k668j677L782l17k459K302N70k712K146K027l360J87K842j310
3049A194j259K490j395j755L108K00k823J200J721k802N31K383k749j105L025
3064A964j048k071J932q6k702K080J214l432L91K241j821l96K676k220j885L354
3080A91K3k899J907Q05k639J679J926k709n34L366j453j384K552n30k189K874
3096I86M63k797J104K410k364K25K472k111j349L585p43k019J781J14k384K008
3112A381J507l140J25K709k050j263K783j724j586K627k91k465J217J443k729
3127a456L98K298k897m87K647r00k081K671o97k384K437J212l339O03K651k192
$$ y = [-2348, -1313, 996, -2199, -2760, 64, -894, -2451, -192, -882, -2806, -350, 551, -2372, -1615, 447, -1806, -1165, 1841, -827, -2504, 1278, 961, -1498, 804, 1374, -1338, 808, 2835, -525, -338, 2504, 1194, -65, 2425, 1030, -725, 2383, 2583, -240, 960, 2681, -121, 410, 2793, 44, -1061, 1964, 916, -1155, 777, 691, -2011, 69, 1283, -2149, -1758, 483, -1338, -1734, 942, -1278, -3163, 191, 214, -2685, -778, 27, -2612, -933, 993, -1716, -2250, 1116, -337, -1721, 831, 301, -1888, 986, 1449, -1348, -244, 2166, -198, 27, 2499, 388, -961, 2624, 1881, -138, 1643, 1757, -627, 1381, 2888, -252, -127, 2582, 532, -731, 2052, 328, -1258, 1369, 1078, -1387, -170, 1273, -1456, -1058, 1240, -1657, -2144, 503, -397, -2478, 193, -504, -2888, -451, 761, -2578, -1975, 676, -1516]
3143a516M5K188j545j466L229m84k587K172J097k460J438K268l277K37L133j899
3159E73j145L075j255k007K592N79l121J267J919k326J28K521k640o28K955j307
3175A180k224J754L42k442J971Q58l507J011K076j865p80J940j166j648K812r9
3191B13l086J969R57k533J211J741k637k57L131r63j986K489j86k094K458P78
3207A205k687J024K075j932M60K045k267p02L214q99k256K017P29k200J677J308
3223B811l305L08K850j306j799K327j116j691K471n2k641J142J365k278M74J550
3239A110k528l37K798j311k164K223J40k326J937P59k842O99K234j797o04K589
3255E80j473j300K738l21k423J820R75k143J598J584k725L1K900j346j333K405
$$ y = [-1516, -1471, 717, -828, -2294, 935, 451, -2136, 36, 1133, -1327, 111, 2379, -898, -661, 2472, 573, -572, 2503, 1248, -759, 1833, 2412, -709, 558, 2477, 151, 279, 2800, 160, -468, 2487, 1180, -1044, 710, 1052, -1390, 581, 1439, -2068, -1057, 1019, -846, -1626, 314, -852, -2500, 312, 213, -2873, -904, 53, -2480, -1269, 472, -2165, -2422, 709, -254, -2240, 249, 63, -2031, 427, 1205, -1482, -458, 1617, -315, 145, 2190, -77, -779, 2435, 1536, -720, 1297, 2026, -174, 1503, 2811, -494, -186, 2664, 1358, -441, 1886, 770, -921, 1550, 1498, -1143, -1, 1364, -914, -440, 1110, -1418, -1755, 1043, -268, -2432, -209, -69, -2395, -458, 301, -2541, -1842, 392, -1405, -2009, 580, -893, -2193, 545, 224, -2199, -379, 596, -1547, 51, 1635, -1090, -1059, 1841, 495, -838, 1567]
3271A567o79j548K662L74l320J321K182k028j53J858k024o59L164r50k499J800
3287A068M97k260J569O10k941P43K789k468j158J972r74j421K383l11k807J840
3303h69J230k215L94J708k161m71L051j526j368K175k83j747K012P76k410Q94
3319h10K136k059r2K387j493j099K689k45k299J792R40k187J436J559k954L26
3335B7K715j785j316K023p64j102J939K21l025J244J788k360Q5J609k283j33K634
3352A517j385k454K401J87k293J885N25k640M53K825j998j041K069j105j331K774
3368C89n11k340J741J332k128R12J716k189P7K894j628j856L064k47j828J668
3384A066Q32k523J396J571j990j95K018j561r07K459m78k380J696O28k023J366
$$ y = [1567, 888, -660, 2002, 2376, -944, 377, 2559, 531, 378, 2236, 212, -447, 2717, 1767, -732, 1068, 1565, -695, 874, 1484, -1457, -714, 2075, -393, -1551, 421, -553, -1974, 409, 98, -2709, -869, 361, -1854, -1460, 248, -1913, -2384, 667, -859, -2227, -52, -335, -2082, -70, 706, -1704, -810, 1326, -733, -825, 1562, 69, -1030, 1659, 1414, -885, 907, 1847, -340, 1096, 2655, -299, 27, 2742, 957, -359, 1664, 900, -202, 1737, 1958, -1067, 177, 1965, -395, -310, 1299, -984, -1117, 1517, 132, -2322, 79, 266, -2027, -142, 383, -2257, -1804, 1021, -977, -2018, 51, -1054, -2385, 389, -122, -2462, -721, 611, -1517, -605, 1111, -1078, -1001, 1893, 265, -1591, 1473, 1226, -602, 1066, 1898, -625, 771, 2342, 352, 157, 2175, 614, -293, 2166, 1688, -692, 1004, 1632, -391, 975]
3400I75J073l194P11K288j676j672K272j033j267K052l90k681J489J713k273J46
3416a467J581j894j4K358j511j644J985P29j972J608N00k224R40K452k061p31
3432a365K194j051p94K475q89k008K146J344k556O79K284k364L71K219j685j492
3448d92K383o37j798K193L84k646J201J198k022Q5K060k337p30K464q84k060J759
3465A21N96k381J283Q46k478M06K764k388j080K137n60j020J891m84k373K141
3481e79J385k069R6J599j754K34K527j552j828K574N33j907J412Q07k550J440
3497C68J778j787p41K241q78p13J715p11j853K303O32k418N66J666k449K05K448
3514B372j930j656K339q17j528J949q4k322J135J512k158k0J321j384m96J986
$$ y = [975, 2048, -1146, -435, 1853, 177, -1495, 777, -256, -1523, 529, 139, -2542, -1053, 660, -1613, -1467, 114, -1780, -1794, 564, -947, -2591, -606, 123, -1849, -241, 259, -1965, -1025, 1427, -634, -1365, 829, -222, -1016, 1459, 570, -1438, 708, 2052, -504, 175, 2459, 95, 466, 2685, 1000, -492, 1891, 1254, -544, 1649, 2033, -613, 588, 1786, -236, -151, 1909, -428, -1158, 1306, 422, -1638, 121, 717, -1664, -381, 465, -2013, -1607, 1157, -1231, -2311, -174, -734, -1754, 137, -347, -2720, -579, 806, -1263, -1167, 432, -1322, -1088, 1439, -113, -1941, 633, 1166, -741, 671, 1478, -1072, 368, 2146, 359, -382, 1859, 981, 268, 1983, 1272, -581, 1722, 2354, -64, 502, 2168, -281, -76, 2372, 442, -1214, 1125, 308, -1220, 729, 645, -1677, -542, 970, -1188, -1208, 113, -1271, -1767, 219]
3530B19q12j856J887N42j736J027Q77k275R01K483k247o33K291p51j036K048n23
3547D06j968J945J523k076K42J372j568L68K073j574j290K451l61j427J280N92
3563A988k557J404J499k035o62J728p53j105J961r93j643J802M37k413J055R10
3579F23k215N86J952k165n97J916o68j272J755l09j943J648J135k046M74J444
3595C18j515m47K580j249j793K320N14j688J497L36j947J519J843k291L5J815
3611A847j215n00J704o03j724J936Q52k454Q60J281j759J53J999j976j212K022
3627A211k93j567J325J46k365J478J599k753J34J527j194o01K058j467j457K153
3643f6J39j971J258N99j917P84J845j837q83K367o05r76J191K63k030J832J485
$$ y = [219, -593, -2449, -562, -20, -1756, -729, 148, -2127, -1226, 1257, -990, -1623, 668, -83, -1119, 929, 406, -1562, 383, 1906, -170, 72, 1444, -124, 244, 2317, 743, -547, 1904, 1543, 116, 1396, 1988, -569, 835, 2334, 299, -363, 1365, 612, -493, 1468, 475, -1168, 634, 1071, -1342, -287, 623, -1592, -1006, 946, -1219, -1816, 100, -568, -1840, -85, -394, -2337, -689, 446, -1600, -1126, 318, -1197, -1644, 936, -313, -2106, 214, 728, -960, 537, 873, -1074, 445, 2288, -3, 32, 1847, 632, 132, 1836, 1233, -491, 1445, 2297, -157, 703, 1984, 225, 378, 2377, 401, -811, 1211, 918, -649, 676, 822, -1543, -65, 1534, -1219, -1085, 442, -752, -1353, 705, -762, -2219, -66, 73, -1898, -640, -41, -1958, -1174, 671, -1166, -2049, 318, -287, -1263, -72, 191, -1839, -7, 1478]
3660A478k275N22J649j681J89K108j133j556J995L41j933J415O04k028J146J566
3676B407k165l74J917j176q02J757r06j883J832O13k002Q28N65j704K56J951j899
3693g85q17J909n44j377J183K64j831J101J437k254LJ853r91p36J940j272j159
3710b076K192K99j944J475O49j547Q11J948j922q04K071k65j372J853k41j508
3726c81J719P52k440R25J078j305m9J788j556j219K183m38j706J237M25j834J021
3743B00J148k036l02J712j016q08J643r57j660K040N34k066P90R23j625M00J605
3760E25j910o86K437o53j177J441r6j346J237J111j961M20J730j226l06J871j329
3777H2j103K458j65j672J232P23j736J189J457k432l23K289r09j067J553m90j939
$$ y = [1478, -797, -275, 1374, -307, -118, 1990, 857, -699, 1296, 1637, -296, 1119, 1723, -305, 841, 2407, 242, -132, 1785, 609, -193, 1564, 658, -1225, 607, 1220, -782, 46, 611, -1093, -837, 1114, -785, -1602, 307, -237, -1614, -431, -167, -1998, -897, 540, -1714, -1711, 142, -849, -1585, 355, -917, -2076, 116, 415, -1529, -54, 595, -952, -141, 1807, -115, -919, 1152, 887, -485, 1368, 1127, -381, 1338, 2090, -350, 575, 1653, 348, 299, 2087, 531, -688, 1495, 1057, -649, 588, 1013, -821, 200, 1348, -688, -990, 722, -294, -1102, 541, -416, -2076, -36, 498, -1568, -778, 145, -1480, -1080, 525, -1385, -2071, 366, -287, -1464, -23, -119, -1465, -228, 883, -1078, -658, 1072, -154, -460, 1411, 82, -1021, 1437, 1272, -400, 832, 1555, -181, 1008, 2465, 33, -290, 1999, 1090, 23, 1576, 1086, -853]
3794h53J939O02k284O70J294j776j94J424j412j209K500k90j981J416K96k060
3810a918J401J021k129J68J532p74p20J496p08j446J911L13j737R08J094j417
3826a005P51J813k355l58K658r11j286J579o8j680K111N38k189N66J914j461l85
3843B32J438j252j146K654o05j784J531J90j868J123J050k137j42J856j246j093
3859a199J693q03j389J876L34k268O81J553j754J47J421j851l26K277l65j868
3875a841J539K06j567J415J116k474M07K052r19q49J607n78j354K352o3j702J499
3892H46O56j895R93J075j421m29K328r09j205J217k49j225J412L06j672M7J599
3909A474j524l69J375j244o39J800n36j639J339N03j942J030P80k082K77J846
$$ y = [-853, 1086, 1688, -596, 74, 1368, -408, -602, 822, -590, -1799, 701, 411, -1570, -154, 142, -1918, -517, 504, -1625, -1457, 75, -699, -1419, 77, -631, -2077, -166, 147, -1590, -682, 412, -1005, -254, 1559, -796, -1154, 1504, 593, -693, 886, 818, -862, 1249, 1787, -402, 164, 2078, 617, 232, 1670, 418, -728, 1926, 1321, -463, 1068, 1258, -610, 513, 1563, -574, -716, 1140, -106, -1199, 494, -309, -1698, 178, 512, -1756, -1075, 478, -1276, -1129, 292, -1559, -1885, 392, 27, -1841, -302, -96, -1663, -248, 868, -1606, -1199, 853, -66, -915, 692, 114, -1240, 1112, 1049, -653, 846, 1502, -393, 600, 1675, 254, -175, 2153, 1244, 39, 1256, 1007, -218, 1194, 1500, -172, -125, 1474, -50, -419, 956, -288, -927, 873, 337, -1302, 37, 540, -1402, -372, 408, -1674, -1397, 449]
3925D49j203q91J762j093q85J823N1j609Q05R96j560Q13J554j935k12K188m82
3942E71j497J560m8j371J810N96k276P22J985j519n29J267n35q35J786l06k054
3959f73J391Q89j635N10Q69j776K34J647j237j250J860r32j010J597J5j876M99
3976h78J272j665k39J742j287o36J748n93j604J582N07j553J312O00k025M20K132
3993H35j124j152J995l15j401J942M2k009J352J372j875P89J468j872k46K234
4009B035j135j031J402j98j367J192P08k042N95J648j346o63J490j106q07J876
4025A251r64j281J124O13k008J128J66j658N10K029j587j061J941p38j290J678
4041a47R3j759R47J148j377j90J876j102p51J985p92j361J950K48j759J166J443
$$ y = [449, -754, -1645, 117, -976, -1861, -38, 13, -1596, -791, 205, -1355, -542, 1012, -923, -1135, 1053, 571, -926, 634, 586, -785, 1025, 1621, -655, 67, 2052, 533, 4, 1271, 736, -99, 1687, 1381, -673, 718, 1607, -28, 482, 1351, -425, -191, 1456, 219, -1031, 829, -103, -1113, 484, 499, -1377, -878, 394, -1271, -1510, 232, -1055, -1691, 57, -536, -2140, -558, -51, -1604, -292, 308, -1717, -1297, 835, -289, -1441, 554, 239, -1162, 780, 822, -1187, 165, 1537, -338, 451, 1919, 47, -199, 2035, 900, -131, 1271, 1073, -294, 898, 1606, -436, 159, 1807, 461, -202, 1288, 182, -625, 1251, 287, -994, 130, 743, -1265, -137, 29, -1629, -1119, 910, -677, -1738, 203, -535, -1825, -147, -54, -1813, -866, 282, -1095, -1285, 591, -511, -1262, 723, -69, -1430, 520, 768, -991, 175, 1618]
4058A618k230K39J787j168n7J307r94p95J866R7j988O93J541j712J44J062j678
4075b68p7J824p85j202J185k88j174J320O00k376Q77J423j921j03J261j285n63
4092a552K403r83j715J451P53j871M23J321j746L16J870j339m05J631r05j101
4108a449J950k79j332J075J325j983N02J499j505j50K202j191j500K005K25j408
4124a4J236L81j646N43J706k087P9J053o33j018J613k01j974J255N29j759P89
4141a48Q73k058N86J628j097j479J485q6j087J464J6k162J183J424j677m40J413
4158a62n96p39J718n13j434K066L72j746J328R48k116Q17J730j530q91J702k64
4175F90q76J647k99j799J462J275k145M20J341j604%J799j437r23J618m17j354
$$ y = [1618, -612, -373, 1414, 246, 189, 1496, 502, -293, 1573, 1670, -318, 375, 1916, 204, 348, 1410, -268, -345, 1479, 694, -508, 677, 389, -785, 535, 1135, -1241, -364, 1059, -862, -965, 296, -989, -1552, 851, -132, -1847, -396, 357, -1514, -1091, 230, -1516, -1200, 670, -669, -1074, 557, -348, -1449, 501, 222, -1110, -35, 1290, -693, -191, 1308, -197, -347, 1855, 664, -836, 1169, 1394, -14, 1222, 1603, -43, 500, 2206, 119, 198, 1251, 618, -400, 1213, 1012, -962, 293, 822, -937, -148, 725, -1333, -747, 881, -216, -1695, -210, -296, -1383, 81, 97, -2065, -882, 542, -1135, -1575, -162, -758, -1497, 221, -292, -1726, 340, 712, -1034, 294, 1242, -874, -57, 1673, 143, -748, 954, 690, -186, 1461, 1162, -637, 825, 2100, -45, 375, 1716, 112, 112, 1911, 474, -449, 1169, 752, -602]
4192f02J094N30k022Q61J353j941j29J546j246p98J524l96j861J789K95j620Q21
4209h02J106j798J67J823j207j481K672m58j293J502K6j657J262J327j933K53
4225d91J388j099O2J709j626q15J884l7j403J282O47j641O54J303j582n35J812
4242A512p66p95J527n38j890J628M61j909O65J074j553k26J735j148j147J678
4258C08k78j302P57P51k388J251J475j875m1J517j042p45J689l49j348J490P05
4275E75j550O42R43j680O82J663j184j265K326l74j027J378j82j371J207J038
4291A821j892J69J582j256l24J520o30j468J852k04j701J104N38j760O07J602
4307A560k077j87J372p57o55J345q09j162J427J87j470J85J076j229J61J227j024
$$ y = [-602, 492, 1022, -1000, -139, 1214, -727, -856, 690, -556, -1354, 170, -226, -2087, -298, -3, -1623, -802, 304, -1494, -1327, 496, -711, -2192, 480, 22, -1271, 231, 257, -1400, -138, 1189, -744, -491, 897, -202, -140, 1569, -57, -872, 1012, 975, -428, 854, 1501, -140, 514, 1817, 235, -300, 1512, 746, -49, 1478, 940, -950, 678, 1139, -770, -105, 969, -584, -810, 925, -223, -1370, 308, 30, -1272, -515, 236, -2152, -901, 574, -1301, -1342, 175, -867, -1612, 77, -272, -1620, -130, 575, -975, -333, 610, -1070, -388, 1275, 91, -1174, 1152, 778, -249, 1129, 947, -424, 783, 1821, -71, 98, 1680, 424, 100, 1620, 990, -478, 1374, 1170, -531, 573, 1111, -649, -42, 1560, -517, -704, 668, -89, -744, 601, -208, -1370, 57, 244, -1226, -1041, 35, -1194, -1033, 194, -830]
4324h30q11J797m51j394J512J18j628J388Q25j487r1J822p52o25J625p72j075
4341h29J551N71j626R95Q28j611L95J752j577n84J549m38j390J769k38j854J333
4358E96R19j748O5J239j412k91J937j482r90J715k75j482J224K29j686R15J354
4375H27j964r6J442p70q84J628p66j250J680L57j131M0J518j352J64J372j105
4392b90q04J987n41j047J202L38j237J060J160k084K23J510j048m54J658j025
4408F08j059J692L86k173J305N23j844P33J139j384q85J705o94q65J407n09j416
4425a331J157M69j257K5J063j211m4J532j459m86J446k29j154J299K22j484J162
4442b80R01j906O5J843r26n12J757j158p52J488O45k038R84J175j625N39J243
$$ y = [-830, -1641, 156, -295, -1689, -177, -59, -1687, -299, 526, -961, -1052, 770, 18, -607, 1018, 246, -829, 722, 1293, -333, 662, 1490, -121, 274, 2026, 449, -135, 1414, 976, -414, 1355, 1117, -737, 596, 1515, -233, -168, 1071, -341, -632, 1305, -177, -1167, 548, 273, -1209, 15, 244, -1442, -527, 827, -1137, -1233, 209, -561, -1445, 183, -583, -1833, -153, 204, -927, -887, 631, -721, -557, 815, -290, -1094, 893, 352, -695, 507, 845, -392, 668, 1828, -256, -33, 1477, 429, -25, 1633, 608, -451, 1241, 1627, -546, 759, 1282, -562, 171, 1310, -74, -959, 746, 52, -813, 594, 85, -1331, -174, 295, -962, -937, 126, -1085, -1129, 403, -1056, -1542, -96, -325, -1479, -180, 42, -1442, -280, 621, -1285, -1220, 623, -303, -815, 942, -216, -968, 520, 1165, -873, 111, 1286, -339, 200, 1443]
4459A443r21r12J864m10j120J157Q2j756J148J288k271K13J578j354k23J162r15
4476E3r69J704k18j511O74P54j717J029J025k029q2J548o87q99J511m00j443J590
4494f7L11j647J87J423j329M65J295j269o08J871m68j146J176N03j249P20J216
4511A384k083K58J678m73j005J702p54j123J560K94j510M08J096j480M58J200
4527A610j546n70J837m51j466J050o1j701J689L26j884L11J372j076p0R04p25
4544d51j179J628j7j437J067M60j229N41J083j336l64J736j095m96J711m26j616
4561a420J721M74j730Q34J136j152K9J406j214m26J738l80j305J123K93j321Q68
4578F74O67j704N33J262j058n34J428q92j106J543j84j840J283Q11j808N13J294
$$ y = [1443, 522, -390, 1474, 1064, -56, 1101, 1183, -573, 575, 1863, -408, -195, 1383, 29, -194, 968, 53, -916, 788, 570, -941, -267, 487, -1230, -201, 824, -1205, -1287, 261, -426, -1325, 186, -214, -1657, -67, 244, -1403, -1216, 207, -1122, -657, 638, -631, -1239, 632, 164, -982, 194, 697, -552, 168, 1384, -699, -441, 1237, 764, -241, 1461, 707, -416, 1144, 1438, -72, 336, 1432, -48, 410, 1610, 64, -506, 1331, 880, -586, 464, 403, -1298, 391, 717, -1167, -856, 516, -560, -630, 274, -451, -1630, -2, -19, -1456, -389, 71, -1158, -617, 466, -870, -1234, 502, -593, -1089, 622, 196, -1420, 301, 775, -955, -121, 1015, -137, -108, 1298, 84, -342, 1396, 1016, -289, 834, 1127, -194, 674, 1341, -363, 170, 1432, 374, -160, 1268, 376, -730, 813, 629, -1211, 72, 883, -925, -412, 882]
4595H82k049l40J987o58r31J058rj425J270N13j904Q74J143j113j75J360j300
4612h17m74J630k13j145R30N62j354J017R02j517J26J728j243o88J633m42j081
4629d46J489K31j382K40J122q29l71J418j281p04K111m04j981J567%j360Q92N33
4647H45j550M9J567j369o59J468q12r51J923q47r96P28O31j233N08Q51j120k41
4665a208J811p75j286J549m59j017J550K23j208L92J176j237J30J093o30m43J223
4682H84K1j368J236K10j006O82R23j794L79J446j289l64R27k07r20J210O2j510
4700d78P49P47j265L5Q39j558J40J410q51r61J357k21j338J093K52j031K13J458
4718E90j354n81J440p59o01J632m46j362J034Q11j275Q68P02j375J37J561q38
$$ y = [882, -1167, -1507, 480, -178, -1109, -51, -60, -1485, -215, 298, -1606, -732, 411, -702, -877, 483, -817, -1291, 339, 126, -1019, -89, 473, -881, 136, 1038, -479, -353, 1375, 132, -556, 1077, 635, -446, 1043, 1274, -108, 132, 1254, 425, 54, 1472, 191, -513, 1598, 1194, -787, 780, 780, -580, 312, 845, -705, -656, 911, -458, -1117, 351, -461, -1412, 511, -336, -1332, -604, 27, -1206, -698, 153, -967, -1208, 603, -172, -1458, 91, -368, -1385, 165, 388, -820, -428, 748, -489, -359, 734, 104, -339, 884, 905, -463, 773, 983, -23, 659, 1582, -212, 167, 1613, 324, -40, 887, 680, -240, 970, 1032, -478, 271, 1018, -247, -212, 627, -931, -791, 619, -232, -1193, 164, -57, -1395, -302, -50, -1081, -868, 590, -764, -1345, 95, -664, -1265, 367, -79, -1441, -407, 404, -871, -3, 699, -676, -539, 1022, 184]
4735A84p99J436k73o24J044K32j459P66R75j378N7J387j262m94J669m16j585J550
4753A010J93j611R26N31j634M20J259j342o71J036l67p27J258n35j138J205M65
4770B78j586N05J204j362Q9J224r49r35J452m7q91R95n2j179M10J778j367o0J185
4789F92r74j34J149J69j488J269M62j265P25P22j764M98J599j043p85J662n21
4806I73j239J153K89j776Q54J216j468L0O52j188l9J190l28j169R83L8j398J232
4824EM62j851M99J309j113m97J210n44o71J413k09j386J064P02j269M02J013j266
4842g27L45J168p99r35J743n32p12R71O28j610P24J279j140o87J496o49o82J487
4860A368n46j425J502k3j201Q51L26j319N60J247j167r74J486n03r16J351m99
$$ y = [184, -615, 821, 548, -76, 968, 1200, -259, 507, 1482, 104, 161, 1548, 286, -208, 1461, 1045, -540, 1010, 1203, -408, 518, 1049, -585, -165, 1094, -248, -919, 117, -250, -977, 281, -254, -1392, -187, 278, -1308, -803, 401, -961, -872, 352, -597, -1532, -80, -127, -1018, -23, -75, -1254, -844, 934, -433, -493, 692, -282, -416, 733, 902, -586, 683, 1145, -120, 605, 1327, -437, 61, 1660, 617, -168, 1494, 973, -266, 887, 1176, -600, 254, 1470, 2, 32, 684, -504, -543, 647, 319, -850, 133, 171, -1227, 5, 467, -1384, -885, 424, -689, -1186, 24, -520, -1191, 222, 13, -1373, -309, 393, -876, -474, 539, -727, -382, 786, -13, -948, 795, 263, -449, 522, 1150, -460, 264, 1543, 403, -284, 1212, 563, -119, 1368, 822, -603, 899, 876, -325, 526, 852, -467, 93, 1340, 173, -801, 685, 182, -734, 617, 118]
4877A18j324J049P24j421J75P19q89l22J224l77r09Q35J41j142Q98M95j092N05
4895e93J355j216j71Q42n88l54J423n26j115J356L34r87N60P39j128l9J760j102
4913E50o26J077p9q04P22n2r83N27P96j126k94J421j483KJ486r11j156J234M11
4932G12j431L78R11j475L98J050j334j00O54M4q40Q49J76j118O21R07j578P26
4950d50M51r18J74J146n41r38J395M46j328Q05O78j525P68R98j277k06J428l56
4968G50q71J399n54r21J030L84j241K24J199j011j16R39j191n74J455k12j188
4985d99J107j69j294M85J097j348k1J240j175l68J197p44r58J570Q7j223O75M37
5003I6j479P64J222j632m0J422r24k67J287k16j351J334O43j127J41J071j015
$$ y = [118, -1206, -157, 567, -854, -679, 40, -849, -1171, 53, -324, -1233, -398, -257, -1399, -501, -6, -1098, -593, 762, -454, -625, 217, -371, -725, 698, 172, -943, 413, 747, -240, 320, 1059, -69, -108, 1652, 550, -76, 1001, 922, 118, 840, 788, -195, 332, 1128, 2, -292, 1129, -354, -352, 1134, 223, -933, 301, 712, -719, -341, 570, -905, -507, 543, -791, -891, -237, -193, -1033, -184, -8, -1126, -505, 402, -1176, -450, 1, -917, -743, 403, -138, -1076, 319, 765, -563, 242, 920, -605, 163, 1161, -116, -322, 1106, 750, -121, 1278, 724, -197, 833, 1217, -24, 200, 1399, 388, 272, 1211, 20, -554, 901, 689, -499, 608, 439, -855, -370, 727, -621, -642, 598, -577, -945, 252, -492, -1450, 120, 207, -1016, -341, 96, -1383, -619, 603, -1029, -1069, 353, -571, -838, 449, 233, -1118, 216, 859, -268, -127, 944, -71]
5020g1J08J211q98q10J405k28q22Q94k1j004O91Q86j505O5J370r55p12J013j54
5039D63j242J099K07j338L35J058j319L09R62j223m62J399l68j169R85j62o64
5056a130O37Q39j068J6P37m43k02J075p97q07J469j63o46K80O71r99P77N29p65
5075A0l46J410n44o37Q47k44q86J437j2r93L57O31q30o1J280j047o86J048j26
5094F08o14O17j38r50O24M89j254M4J099r26l03J087q36r60J664j75j229N92N93
5113C2j019O62M35r48j35J253p29n70J197k18r66Q25Q66j160L5P73m82k95J368
5132I24o19n74P20K51o89O90j14p51N08R69j574K45J325o86q87J406n23r00O87
5151D08L81r67J55N01p52rR02j034o38J270k11q37N89K63j173J098M3j025K80
$$ y = [-71, 37, 1248, 350, -460, 945, 717, -105, 789, 768, -236, 455, 1341, -164, -99, 1271, 316, -396, 617, 463, -779, 320, 527, -811, -476, 582, -737, -428, 534, -689, -1151, 248, -120, -1289, -304, -466, -1130, -493, 346, -722, -706, 31, -412, -614, 461, -336, -1143, 326, 163, -483, -203, 468, -531, 246, 775, 10, -336, 1074, 530, -107, 740, 496, -390, 1047, 1035, 42, 399, 1030, 200, 139, 1419, 372, -314, 734, 608, -6, 611, 473, -477, 147, 636, -618, -574, 525, -401, -704, 383, -453, -1413, 251, 76, -1153, -561, 32, -987, -325, 110, -838, -973, 280, -449, -1019, 178, -40, -1006, -181, 685, -475, -440, 333, -149, -444, 924, 305, -269, 451, 702, 13, 703, 589, -162, 346, 1315, -259, -14, 1311, 625, -262, 1144, 621, -279, 408, 789, -178, -23, 478, -274, -283, 619, -415, -1053, 217, 6, -831, -242, 21, -1152, -54, -11, -1036, -756]
5170g56P82p05l84J204n91p19J091Q0r90Q30L92r74M43J010r10k03J377q93q5
5189aP98n39q33J346L24j739N27R50q32K5J174o30p33J057n3j136O88R5q38M07
5209E7O16r42l96J179n62o66J167n39p75J153o9j076N92N2r49L79J159j185m94
5228a299J477n14p26Q26K71r30R40M73j169K93P99n73k15J196j105k96J105r0
5246D63q23R56L29j256M28J012r55k60J021m30q11R92j57r09J088K57j358M56
5264D3Q01q34K4L99l73o85J129o10j041Q45M10j011M96M58j288K39J080m06o47
5283i71J039j83r12J413m85r87N14Q91j039M69P29j036j65J592q26m84J122l38
5301C43n39P12L17r26K71Q26m51M4K91n40n37J422m78p83L50J60n20M25J98q80
$$ y = [-756, 26, -679, -1063, 141, -450, -1169, -78, 2, -988, -158, 234, -740, -297, 713, -197, -400, 977, 84, -1, 797, 258, -575, 771, 1095, -644, -117, 833, 1, 26, 1200, 570, -163, 894, 841, -295, 393, 488, -350, 57, 673, -269, -665, 514, -48, -714, 453, -86, -861, 292, 223, -853, -261, -209, -1158, -779, 380, -805, -1299, 178, -336, -1062, -236, 35, -895, 45, 518, -651, -358, 441, -132, -347, 849, -256, -552, 553, 463, -360, 596, 925, -331, 97, 1109, 154, -106, 915, 485, -326, 666, 509, -400, 688, 945, -413, 43, 844, 10, 34, 433, 60, -625, 504, -106, -1147, -302, 108, -903, -407, 51, -1237, -998, 82, -324, -971, 68, -115, -1027, 386, -99, -1086, -572, 319, -720, -251, 478, -558, -723, 869, 43, -441, 681, 343, -196, 516, 833, -93, 178, 1004, 553, 597, 888, 348, -189, 1233, 755, -28, 322, 482, -38, 387, 585, -295]
5321b95k6J037n12q07J012j99j134P02M90j108L38Q16p33o98J484j058j88R24
5339D5j98p80M84L69q64P71M88j195N21M61m03m59J101k71o21J192k83q69Q92
5358C81M86r03l6J173r15l90J471q88n13R40p1r71J059Rp22m3R58j090O9R63r49
5379A8p66J454o00q45L91Q50j127N38O80j403J32P87p31l11R62k80p98R35n6r77
5399a147R23L71q00J35P99q88J74P83m31n80O51N87j053O85M40r91L01J044p61
5418B42k32Q04m57o55J447m90j122R85N10j069L51K24l61k25Q26m95n54P79k69
5437B39r80R57R4j348O18Q48r61p1P83q08j49O79J46j139J038K19j131R36K0r29
5457i39K63J043q16l37R50p9p26J173k65r32N21P70n71J43P74j113K10P47m63
$$ y = [-295, -321, 716, 204, -603, 409, 210, -924, -222, 268, -840, -502, 314, -419, -1117, 367, -691, -879, 45, -153, -933, -449, -80, -944, -173, 315, -880, -359, 102, -301, -760, 341, 70, -551, 641, 358, -511, 381, 867, -36, -72, 1101, 186, -204, 1267, 379, -134, 806, 735, -236, 823, 832, 110, 67, 1025, -65, 4, 967, 18, -748, 706, 106, -739, -348, 502, -625, -87, 593, -810, -678, 109, -622, -933, 29, -251, -1049, -114, -170, -1147, -224, 147, -653, -518, 281, -607, -433, 350, -81, -661, -10, 577, -476, 209, 649, -342, -41, 1003, 242, 10, 814, 357, -298, 1149, 659, -463, 522, 1032, -37, 314, 538, 177, -48, 778, 283, -271, 508, 239, -741, 216, 310, -1038, -420, 428, -533, -604, 179, -629, -778, -99, 47, -1092, -54, 165, -966, -30, -10, -939, -676, 367, -449, -786, 164, 85, -641, 532, 267, -665, -144, 626, 55, 198, 972, -141, 69, 816, 353]
5476C53p18J242Qj301J154K69j144K23Q30p29l76R03n52n60J165m69j075O91P35
5495F49j084K91M67r19j19R31m17p75J132j84j079Q60L10j122N52P13r22KR54
5514B40o40j47Q40j65r70O46L33p29N09O97r34J27J249j012j05O76l36n47J078
5533H10k95p04J032K80j260K83Q27j275J2J084k46q99J009j15j053N84J73o96
5551d49M05L58q01P8Q68j321L83P74l27j173J058j59n14O18O02j454K97J239j174
5570f92k15R55k60l46L84M42r84O69Q05j469M71O72n87J58J018n64p35R00j31
5589D91m89L65L01r57M29Q13p73n57J086m87m50Q22J89j264P68J86q59J96L24
5608A34n39l23J308j070m81R88N6p25J069l79r32L15Q49j009p1R96o75m39R54
$$ y = [353, -365, 877, 885, -416, 738, 1007, -137, 86, 916, 187, -189, 714, 162, -398, 767, 298, -777, -86, 649, -435, -144, 323, -596, -715, 216, -201, -976, 156, -28, -1107, -247, 63, -1059, -507, 206, -716, -714, 240, -400, -547, 293, 128, -842, -196, 137, -592, -83, 614, -320, -193, 1056, 44, -61, 615, 279, -268, 810, 515, -189, 843, 1123, -137, 146, 973, -302, -290, 794, 548, -351, 658, 543, -510, 74, 247, -449, -44, 314, -487, -409, 459, -862, -479, 295, -32, -1205, -147, -306, -820, -202, 400, -1054, -757, 482, -692, -907, 48, -212, -558, -174, 268, -716, -47, 758, -711, -240, 432, -155, 3, 1021, 457, -278, 622, 491, 2, 367, 668, -289, 140, 953, 180, -377, 709, 222, -228, 594, 783, -481, 287, 473, -386, -190, 134, -405, -728, 580, -490, -971, 17, 73, -652, 417, 38, -894, -579, 270, -739, -810, 186, -489, -928, 26]
5627B6j50j044J101K73n80L14L44j088O52J143r46o23J190l6p82J142l67n98N44
5646E15L49j068L69P04p62M3Q91n60q39P42J98n67N02L3q44K98P46j074L0Q92
5666E98m98p91R92l43p98J046qr38N19J42q67m5R96m81m42Q67r2p00R01K24j250
5687i68J165K83r12j70J131o49j20P13k95m10R17L07r04K8N08p67L05O02o36k84
5707a56J049n92m26N81M04q68K83Q18j295J46J014j261J44Q31j008l48J009N1
5725C76j211Q12M2o90K46O54j135m8J002m81m95J193p12n16Q92J14o48M18K58
5744G1j164N92J216q84o03J190p9p60R28r2j013Q53N08p71j23R30r9p09R13n21
5764C83o13P59J41j123O86N47j124M46Q32j157k46J006m59m11N30k22q95R47o4
$$ y = [26, -124, -1168, -67, 206, -374, -60, 284, -804, -152, 991, 45, -578, 612, 576, -206, 936, 569, -29, 515, 864, -204, 165, 869, 107, 150, 1041, 481, -358, 384, 582, 15, 517, 550, -294, 4, 750, -324, -294, 598, 100, -691, 301, -42, -840, 206, 198, -740, -221, -79, -946, -991, 5, -476, -918, -51, -143, -843, 58, 282, -968, 197, 480, -432, -602, 529, -120, -240, 473, 178, -232, 685, 992, 88, 116, 624, -143, 162, 764, 128, -156, 893, 301, -125, 456, 860, -8, 275, 1093, -202, -56, 958, -303, -159, 672, -336, -684, 325, 376, -835, -23, 19, -671, -425, 229, -906, -954, 48, -433, -928, 265, -447, -963, -71, 43, -605, -187, 71, -1093, -501, 715, -169, -772, 418, 339, -421, 507, 415, -598, 255, 763, -8, -131, 799, 700, -9, 904, 383, -230, 529, 670, -453, 233, 780, -344, 102, 934, -223, -469, 537, 78, -333, 197, -25, -920, 27, -37]
5783c7p27Q8Q68r06l07J332p40n18P57k51l55P65p7p30N57P85j211K59Q66l38
5803H0o21R08k63o77R45N04j270O63O75j189L85P63p61j05R46p49k46R13m60p40
5823b99Q70J53j040J48R38p38K6O19n14j014J253j94j074O55K82p36L30N22r03
5842g16k07J121o04n59J030l56r23J044J90j112O65O70o77l61J011l76n50J171
5860D61m30o40R13o0p02N54O18p86J11R33n78l27R05o11m41R54j58q12N38M66
5880I08j279M48R64q34l52J150o65q98R92R3j091M40N68j305M91O69q97j8J045
5899D29p87p15J105K19j144N85%j080J016Q44j371J76R56k61o76J142l17r00J381
5918F02R3p19L70M08q13J46M61m70L4Q94n60o60N52M80j212Q95N26r53r8Q05n79
$$ y = [-37, -764, -676, 192, -714, -1021, 311, -429, -947, -190, -441, -796, -31, -108, -838, -281, 504, -707, -448, 418, 80, -541, 367, 104, -573, 372, 876, -394, 269, 944, -245, 140, 903, 142, 37, 983, 234, -12, 901, 441, -299, 571, 724, -316, -168, 770, 32, 58, 677, 163, -851, 402, 208, -866, -211, 71, -665, -335, 187, -716, -923, 198, -406, -965, 65, -291, -1214, -170, 20, -1092, -427, 243, -434, -795, 216, -160, -710, 461, 31, -609, 304, 244, -458, 96, 714, -72, 39, 972, 394, 67, 972, 361, -80, 874, 716, -96, 442, 908, -371, 77, 1041, 207, -145, 1005, 340, -558, 434, 527, -564, -124, 444, -861, -370, 299, -598, -616, 429, -358, -1073, 32, 251, -893, -308, -308, -1388, -372, 472, -899, -723, 233, -28, -704, 438, 121, -779, 602, 695, -24, 346, 754, -59, 87, 548, 78, 112, 1006, 446, -214, 338, 818, -394, 501, 1027, 74, -24, 781, 202]
5939B02l93R76o22o22Q22k73o18M07L96p58J56M00p46q1R60n46p74J041J45j305
5959a233Q97L49r13K47R98r27j08J022q49k62R72n7o90N55L1l65O25L96r27L89
5979A50N28l60n61R62l23l95Q09J89j167M35N45j047M34P55n91n41J151n34n09
5998g0O03j21p64N43J41r75N04M52p26J00L23l01n25P58K00r85O68M34q56L40
6018b57N04r61l1J077p57k75Q42J15q11P78K92r70K79R75r88rJ012r15m2J243
6038A101n10r03P83K65j062O66O44j129K42R99p86m83N69k86k51P35o1j217O77
6057gL41q26K26O09j015K51O20m49n41P54qn86M48J72r32J99J008q59RO11m73
6078d48l91J032l18l81K57O34p35L71N76j021J18J059o67l46R30J1r15R06o1j214
$$ y = [202, -191, 785, 163, -459, 363, 90, -528, -121, 275, -483, -327, 73, -673, -754, 206, -340, -1114, -73, 72, -1233, -336, 13, -900, -653, 345, -582, -690, 332, -517, -779, 193, 136, -554, 1, 32, -333, 292, 688, -239, 150, 678, 318, -243, 719, 396, 1, 810, 999, -168, 267, 812, -235, 199, 954, 363, -178, 973, 439, -70, 533, 412, -352, 191, 332, -643, -139, 313, -413, -313, 10, -291, -816, -58, 142, -843, -175, 259, -597, -257, 247, -714, -745, 332, -425, -700, 142, 257, -554, 224, 516, -454, -175, 800, -188, -197, 815, -100, -142, 1101, 591, -312, 471, 736, -326, 340, 984, -145, 97, 1096, 310, -173, 396, 110, -141, 594, 533, -684, -7, 334, -492, -266, 343, -672, -421, 199, -250, -791, -37, -45, -631, -183, -11, -943, -744, 264, -595, -586, 25, -448, -839, 193, -125, -506, -249, 385, -350, 21, 597, -424, -306, 753, 86, -260, 670, 681, -234, 672, 611, -603]
6098f03N38R62o43m14R11r09J89Q16n80m43P44r5o44L60K51r48L86N59n12m57
6118e32P31m46k83O47k7p62N76L60j080L32M55l92k54J064n02n66P61mr17Q62
6138B3J20r81P76L91m14j1P07q61J17M51J2n33Q05P5q52P47J75q86p6J472j032
6159B25l40J033k68p52N80J78r81P30J2n10N7O31q36k74O95k89n73R22j09o47
6179e16J7M45o77L00P72p31n41J016l72m70Q59j03p25M78N64j054N53N55r46K6
6199e50J118o14m68Q24K5m37L71L6p86O67J027j339J77Q07q14p6J163q10m35P91
6219F77m1q55N66M42r04j12R64r26l19J013l52p48R30k92r65Q14J83o61%Q17p20
6240d89r3J059r55l28P13j67m49N35N78r23J80Q98r86q2N88j05k45Q06l27o16
$$ y = [-603, -65, 897, 254, -160, 751, -158, 31, 847, 267, -176, 568, 473, -171, 189, 440, -508, -122, 437, -75, -532, 199, -247, -530, 117, 90, -672, -96, 264, -816, -484, -29, -421, -675, 389, -113, -679, 82, 78, -839, 23, 143, -838, -62, 329, -85, -96, 611, -250, -133, 318, 330, -203, 602, 677, -175, 572, 747, -139, -215, 1257, 225, -115, 918, 650, -102, 478, 656, -325, 405, 417, -93, -36, 595, -241, -515, 180, -109, -682, 240, 131, -516, -499, -54, -731, -431, 341, -390, -931, 85, -287, -757, 102, -1, -726, -248, 316, -738, -185, 370, -576, -550, 568, -46, -514, 310, 335, -102, 269, 305, -481, 186, 1213, -126, 51, 858, 44, -32, 1131, 321, -114, 677, 636, -219, 347, 789, -115, -227, 737, -189, -508, 505, 153, -595, 335, 43, -922, -108, 75, -586, -586, 231, -489, -582, 477, -478, -806, -93, -260, -709, -174, 404, -519, -339, 559, -427, -509, 79, -26, -271, 535, 208, -408]
6260d08R06J64j090N32P06q73J04J007r36k90Q58p0q28N94M64j008M42N38r57
6279a45M8M03l5m68P54n88m80O43qn01K56O0o07K78R62j113k32O21m33k86P58
6300a13r7o01Q53L48j248N55O12q05J82O78n69n90J277l06p79Q13J01n43K54P69
6320G91q80N2Q58n14k82R05p68p94R13M82j010P55jo32L98N49o98l52P08o09p04
6341h33J015p4q18Q69k3k58j08L82m55p1N08l14p43R60J4q73M38K54m61M96J14
6362A9p92J35J094p14k01M96j21o31Q22N09j114N83N45n55k79J153q82m45J189
6381H11k20p14R66j89p29N38M47n64l77O50o99j52P70l45n20N81L36q94P8M57
6401B31o83K79J57n76o2J062p43l63N15K39j142R74K40j070M45P55o17q4P94p80
$$ y = [-408, 498, 662, -428, 104, 810, -63, 41, 1048, 112, -178, 680, 610, -218, 376, 840, -168, 274, 812, -145, -97, 306, 271, -197, 557, -31, -511, 132, 124, -377, -121, -61, -668, -390, 572, -541, -773, -152, -585, -871, -113, -210, -811, 42, 390, -858, -303, 309, -496, -314, 364, -205, -795, 482, 176, -603, 210, 311, -232, 22, 791, -89, -37, 821, 307, 25, 930, 162, -632, 281, 763, -247, 508, 507, -125, 273, 822, 124, -228, 480, -129, -833, 182, 108, -710, 159, 136, -122, -230, 152, -303, -374, 134, -180, -923, 37, 51, -822, -384, -130, -591, -95, 19, -773, -638, 456, -258, -459, 37, -84, -715, 107, 616, -498, 85, 630, 75, -204, 949, 67, -378, 811, 591, -123, 843, 654, -75, 463, 910, 346, -31, 619, -80, -232, 538, 193, -327, 254, 590, -304, -226, 231, -452, -173, -16, -592, -654, 408, -335, -698, -183, 56, -1086, -112, 128, -942, -497, 258, -359, -443, 351, -429]
6421d29m2O94Pl96M07J00n20K34M73o84m0Q47l36l98Q15m65m53O10M86j102L69
6442A77O80q25J89K46j13r28J115n97j79N78Jq27N46M90p82j21O76m60l48P41
6462B59o25j66M50J31q41N70J70m58l50R89k97l73P18k25l80L23L8m01Q12K67
6482F11p33K1M21n59Q8J033m54o47O60J96o54M78K93n80M12K79o57l8N37q15J0
6503i8M76k44j18M29j04p37L17K95n99l2O94n56l84P70m44m38Q81k58l92L04M90
6524B52j043R9P47l79j45N05j56m78N90J75p15N81K89q70P30L63q63J1J063n19
6544B37n72P96q7o45R71Q5p69o2P73n32OP21p73j37N40l25n12N41K95j142R27
6565C36M29j035k63O49k20k36P06p06l30R14j17j095O04L09k53j31N11n42k61
$$ y = [-429, -471, 223, 230, -166, 241, 341, -179, 55, 528, -156, -196, 651, 315, -83, 732, 267, -186, 424, 910, -192, 177, 857, 32, 221, 467, 354, -574, 541, -56, -235, 343, 344, -483, 63, 553, -229, -350, 326, -134, -482, 259, -366, -532, -82, 49, -792, -222, -52, -510, -860, 129, -168, -541, 177, -48, -428, -105, -67, -468, 344, 611, -122, -101, 320, -239, -151, 882, 428, -219, 441, 637, -17, 461, 754, 174, 586, 865, 208, 170, 707, -108, -98, 378, 134, 16, 445, 341, -396, -79, 216, -383, -415, 279, -277, -661, 109, -335, -773, 108, -150, -542, -238, 252, -791, -692, 55, -324, -469, 36, -120, -598, -8, 167, -548, 33, 322, -548, 182, 545, -318, -307, 756, 237, -335, 461, 374, -271, 700, 785, 16, -46, 727, 195, 201, 922, 149, 12, 552, 227, -285, 256, 551, -591, 336, 765, -270, -533, 116, -104, -340, 366, -340, -670, 244, 127, -968, -364, -55, -308, -439, 72, -470, -731]
6584g31Q20k42o59O96j01m40O63K66p13K99P94p55k26M86j79m98J120k35n57O86
6604D94J16l89J26O27p62j02N59p30J75L48J03o27N02J28j007M87O46r01o8M76
6624B01l77j64M21j52p81Q70J66q20O37l0m65K17N01o71l21P24j79m17N37J05
6644Bo24L65L88n87K80N65o58k53R88k49n74P66J13p71M56N88j188O15N11q51
6664a18K07Q04n23o29R27j51q18O85K22q80L03L32m26J01P66r94j33L02K07n82
6684c98M96J80q02J64L39p18K08L07m85J13M06Q4n74O47J35n92L78P60j127R5
6704c84R29n94l16P44l35l07O19J8r24Q39J60p06M72L81n87j62J033n07m91Q03
6724F85m24n43O74L65q41J42M46p81K25M30n35j12P68n43p03P64K9m77K23L43
$$ y = [-731, 89, -153, -812, -116, -217, -657, 6, 272, -441, -142, 652, -103, -329, 157, -22, -520, 600, 365, -192, 494, 610, 221, 347, 974, 212, 110, 669, -61, 114, 462, 565, -62, 440, 568, -439, 48, 694, -207, -275, 201, -176, -340, 81, -71, -852, 18, 184, -636, 1, -29, -494, -277, 224, -447, -768, -44, -223, -640, -103, 2, -622, -257, 131, -456, -176, 389, -269, -522, 466, 217, -357, 409, 522, -249, 207, 795, -393, 222, 733, -118, 89, 893, 370, -259, 668, 517, -301, 384, 606, -274, 29, 361, -65, 36, 802, -192, -325, -23, 184, -398, 98, 278, -524, -360, -21, -739, -531, -224, -709, -596, -190, -106, -680, -33, 102, -490, -112, 648, -479, -384, 545, -49, -365, 379, 44, -263, 356, 374, -550, 289, 449, -257, 215, 596, 9, -153, 880, 373, -118, 685, 261, -282, 392, 757, -84, 58, 504, -277, -52, 378, -157, -269, 499, -44, -747, 17, 46, -431, -208, 135]
6744A35o45J64O95p62l35P73m48q6O39K7o70J55L20m09M1P60m21n40Q96k30m06
6765c47N15J91n17N67J45r81M66M66jo42N28k04l89J054n62m49P61J08q66L44
6785A87N49p32K85K13o58j52P29j8p80N88j82n92N95L7m16q0Q95p85l44Q03q9
6806E3q23N65N4p92J064N5p73L12O89n59k56N92n38j27P17p7j62JP02r06L30N77
6828F98p70L5O30l67l99Q20J2n53M19J73q92M26N38m99l55O67m16n14Q82j16p22
6849c03J41K87j37N5K5p32P4Q71o66m19R52n92j75L98n6j45J57N38p11j21O95
6870A36n28P1N33o3p87O43K30p09N57K70k55M4L51n13o5O76m80K8L37n2p84O55
6892B95K17n36o1O65n51Q8P45n24m22P53o08o56R34n23l1Q2N61q29ML63k58k29
$$ y = [135, -510, -346, 349, -413, -748, 25, -423, -509, 130, 157, -513, -358, -38, -447, -406, 354, -67, -607, 289, 59, -347, 168, 359, -158, 409, 554, -427, 39, 505, 504, -138, 390, 186, -203, 851, 289, -160, 601, 709, -157, 187, 736, 4, 289, 502, -156, -308, 421, 403, -377, 211, 29, -563, 32, 69, -347, -427, 468, -317, -661, 142, 53, -770, -205, -151, -943, 121, 176, -597, -285, 404, -155, -411, 181, -357, -484, 233, 156, -6, -5, 697, -209, 121, 698, -72, -37, 593, 226, -173, 647, 659, 106, 525, 698, -194, 232, 770, 271, -84, 583, 167, -347, 535, 419, -303, -162, 125, -12, 43, 68, -664, -590, 281, -385, -804, 148, -444, -619, -221, -277, -422, -265, 273, -438, -559, 136, -392, -321, 212, 149, -638, 5, 235, -474, 83, 353, 98, 142, 493, -20, -85, 591, 111, 139, 476, 424, -360, 295, 512, -24, -85, 580, 29, 117, 862, 338, -84, 669, 61, -595, 339, -184, -215, -133, 428, -401, -397, -34, -292, -521]
6914e21M54l79k17M89K31q21M36J24m99K92P59r56j32Q58j1n15K80J42m74K60
6934b00L98%j91L44k82p1P63k16o00O23J8l80P4L39o84r0R62o54k93O76k36p03
6956d03Q07J82n74J40K65o66J64M31p60m2Q18n14l66L15rk61L12J57o39N9P86
6977B02n98PP11m03l76P29l12m00P15J21r43M74N61o54J9O89m69j50N74m58l03
6998b64O28L66r50M92J88o79L09K21n05J65O98o66k59N96jm61K12J99p34M66K68
7019B89l37k04L86k89l22N67k26n50N37J16m18J06M40n14J37K58l12J05L25j21
7039b7l97P77o1r41M74N11m61R3L24k54n04O45J26q77J076m7o97L09L92o33K52
7060H0K05q4p5L61q2o81O51o0q88M86N39p42M25L17n42l85R35m09l88M22j2n97
$$ y = [-521, -67, -446, -663, -174, 57, -764, -328, -204, -703, -411, 348, -608, -740, 118, 107, -408, -128, 14, -460, -200, 198, 198, 7, 351, 69, -2, 761, 545, -55, 568, 586, 206, 280, 619, -65, -155, 807, 153, -140, 536, 300, -403, 404, 586, 12, 152, 417, -249, -85, 346, -414, -456, 362, -152, -518, -203, -212, -473, -161, -4, -643, -584, 202, -396, -389, 322, -81, -457, 272, -40, -440, 275, 396, -547, -73, 488, -166, -147, 542, 73, -77, 497, 39, -264, 364, 730, -220, 272, 460, -219, 90, 311, -194, -29, 669, 3, -256, 340, 339, -122, 90, 289, -445, 21, 289, -48, -252, 134, -155, -477, 90, -136, -686, -149, -33, -451, -345, 95, -419, -282, -24, -336, -231, 94, -27, -424, 353, 292, -649, -175, 336, -125, -32, 292, 38, -466, 179, 305, -572, 504, 457, -240, 69, 461, -172, 80, 285, 201, 126, 487, 405, -276, 375, 315, -573, -87, 452, -290, 135, 452, -90, -475, 460, 51, -337, 85, 73, -524]
7082e24N14M85o48j68M07p13J53P08l48k93L46P4q10P62N5l77K50J91o67N21N25
7103D43o49JO69J24o19L23L81n98M59K62p77K86K67l99k77Q27k70m50N31j49k73
7124A12J78P6n33K22M99p13k9P63n51l85N17j51q13J030j37n73J16M49l65k20
7144e08L72k67m6M56j73l93L42L04n99M27N23j001L82N05n24l2Q75p33l60P82
7164C32J71n87J74O75q23K77O36m58o27Q87m83l53O23j69n80P24J56n08m9M25
7184D43o47R7K42om92M00R0q11O55L33q73J22P81p58j57M63m95j62R74k09n91
7205f01L25L36o31L20M13n98P6P99n68k88N10r6k97N42k75n06P59M91q38j26O46
7226C93k84J59K47j86m11J94L87n64K94J81n10K30K80j25j88K62k82o57J064l39
$$ y = [-524, -10, 475, -173, -341, 66, -647, -494, 214, -134, -427, -81, -7, -817, -55, 0, -377, -127, 64, -603, -82, 443, -206, -205, 464, 588, -31, 292, 673, 75, 534, 796, 19, 305, 572, 173, -104, 723, 453, 3, 534, 385, 112, 290, 366, -167, 55, 554, -159, -188, 575, 24, -361, 156, 5, -808, 222, 85, -488, -372, 77, -288, -508, -136, -403, -449, 7, -166, -559, -217, 87, -512, -85, 438, -563, -181, 324, -200, -232, 643, -90, -450, 332, 503, -84, 90, 765, -58, 219, 855, 397, -230, 657, 174, -179, 444, 275, -305, 419, 575, 67, 18, 443, -204, -107, 135, 129, -363, 37, 127, -684, -29, 304, -569, -447, 334, -424, -581, -118, -613, -775, 199, -10, -601, -276, 60, -571, -251, 162, -436, -360, 439, -129, -417, 93, -3, -300, 242, -33, -539, 220, 711, -127, -253, 393, 109, 268, 515, 329, -82, 112, 499, -65, 229, 410, -100, 130, 410, 285, 97, 359, 77, -580, 484, 145]
7246A45j044Q27M44r08M39P6n21K34J99l3n36O27J09r08O04K85o84M94Q31r86
7266c06P4N95p43L2J018l98o10P90J09j082N06P23q84N79P1m19m5M64l15l42P33
7287E50j04q26M92L81p01K10L51k19j3M38p07Q1K62J61r57N88K46n74rN93q19
7308e76j10N82l35q1N22k72k85M63J91r10O34Q0l08l7L59m6k55Q82k39p74O74
7329A59J01n79L76K59j91r0Q08o17n3M64m96k79M68K04p34P06K61q00R9N88o15
7350C9Q8O12n44m44N76j95m34N66R1n97L5P60m56o17Q11n64m84Q03j46n48M93
7371a55K35n17k4O28m73J19L37K57p11O03j09q57Q22J80p87L74L54l10j11N43
7391C98m45q4N48j28n48O33J51q32P21r0o70N77M12o56j13Q73m96m33N15L8m85
$$ y = [145, -899, -72, 372, -536, -97, -21, -542, -308, -109, -142, -678, -51, 58, -850, -246, 39, -645, -151, 680, -306, -232, 363, -380, -348, 670, 272, -338, 452, 561, -521, -15, 708, -176, 403, 474, 55, 10, 474, 159, -183, 550, 446, -380, 112, 493, -208, 2, 353, 134, 121, 559, -148, -67, 195, 356, -601, -13, 233, -341, -350, 243, -576, -686, -104, -439, -520, 2, -270, -555, -92, 99, -811, -177, -97, -405, -442, -83, -129, -384, 498, 259, -515, 159, 260, -319, 57, 316, 125, 35, 843, 226, 173, 637, 141, -138, 330, 534, -200, 506, 767, -33, 66, 654, 39, 127, 739, 195, -249, 327, 132, -302, 264, 355, -242, -207, 553, 97, -520, 291, -273, -757, 46, -100, -648, -155, 80, -437, -461, 167, -306, -187, 150, 407, -304, 299, 190, -667, 155, 335, -452, -78, 276, -34, -145, 398, -47, -131, 417, 289, -259, 374, 525, -307, 414, 324, -346, 231, 643, -13, -126, 747, 251, -182, 333, 371, -114]
7412a14L45J31n84J10K84m13J0M46n91l5N36j93o80O33J96n95P2L64k41j54P60
7433B87p15j61J068n51n50P04Pm70N26O8l37JR11q67p9N31j59l32O54K83r97K92
7455A14M59n17J68L11n93k50P10J32j058Q26R9n80K64M17p29K31R8l01j02M42
7475A41j8o71Q84n14l18N00J27p06N86R1m87J22M73p42mM70P3j89K97p1m59K19
7497a96N87o44K32L59k28K8J60j77n1K47k11l75O33K79p90J08N33j26p45Q74k35
7518B62k88L14R5m62j29O14q20L37N42p01k14P13o10k32L64j26l97N41L43o25
7538d79L43L87n79l84R54n75j42P91n02n45O51O5l87K33K37k27kO56j69m52P26
7559F00n83n85Q16Q4o74K15O75n10K68L38o35j24P97m34l24M01J29o79M68n7j87
$$ y = [-114, 231, 362, -222, -112, 172, -241, -231, 215, -376, -411, 125, -68, -748, -115, 81, -514, -442, -78, -319, -473, 287, -428, -589, 479, -72, -622, 82, 89, -381, 145, 213, -124, -123, 788, -79, -158, 373, 214, -118, 536, 819, -178, 114, 573, 56, 224, 535, -58, -308, 402, 534, -524, 302, 401, -179, 85, 502, -227, 4, 102, -199, -301, 141, 123, -548, 336, -178, -496, 4, 131, -575, 11, 102, -385, -263, 210, -532, -536, -66, 7, -182, 115, 44, -415, -196, 391, -253, -21, 338, 110, 138, 298, 121, 70, 317, 106, -269, 364, 643, -147, -39, 494, 368, -377, 497, 262, -26, 288, 383, -79, -208, 406, -414, -77, 465, -236, -450, 263, -347, -579, -215, -341, -738, -197, 146, -479, -136, 251, -328, -712, 242, -333, -475, 316, -186, -731, -80, -15, -402, -169, 68, -159, -161, 495, 326, -126, 600, 17, -568, 248, 332, -342, -127, 548, 38, 306, 644, 9, -115, 682, 248, -76, 325, 454, -225, 243, 186, -1]
7580am18O45k47m40O82m42k88O42n0n97L56K61o28K99M16n75k73N61j46m77R58
7601B38m37l27M13K88n82L33J39l03j43O27n91j83R19k52m45Q51j37q23N98M89
7621F72o28j77Q28o70k96R36l23m01K26m5j20J49K79p98N50J18l15l08N79k10
7641D6l76O53j89l48J93K03o93J25N34n15M5K22q1l18N89k86k55m0M90m02O5O78
7663C40o00K2M47k22l98O95l00j11L67P8n28M59M40o28N7M21n32qO84k72l09L84
7685D86j13m65K75J92n95J52L96m97k89R77o24n5O02j93r49O58K52m64j24L76
7705bn70L8N86m56j55M90N8n54K71M98p71K26O30q39K73M68l82k66O25j16m13
7726c61N84K36o85L96L86q98M76O23n69k30M80o4l23J68Q7n33L37O19n80m44M12
$$ y = [-1, -419, 226, -21, -461, 221, -221, -509, 133, 83, -514, -158, 103, -525, -226, 190, -385, -658, -97, -243, -720, 238, -199, -526, -113, 175, -407, -74, 65, -238, -381, 246, -345, -528, 391, 139, -306, 545, 408, -415, 183, 672, 44, -133, 695, 25, -271, 665, 342, -59, 167, 122, 2, 151, 430, -368, 182, 300, -15, -323, 256, 46, -330, 323, 134, -214, -21, 182, -511, -386, 148, -367, -322, -100, -181, -499, 90, -196, -451, -491, -1, -403, -338, 340, -260, -238, 209, -13, -411, 284, -16, -127, 240, 318, -210, 249, 689, 61, 118, 539, 7, -1, 683, 411, 102, 486, 373, -92, 183, 375, -220, -68, 328, -169, -458, 519, -105, -160, 442, 249, -700, -42, 210, -254, -378, -2, -572, -534, 52, -404, -559, -69, -11, -565, -294, 204, -567, -341, 289, -550, -277, 191, -191, -457, 168, 52, -361, 223, 459, -226, 170, 556, -342, 134, 757, 188, -42, 438, 374, 51, 219, 306, -227, 110, 729, 149, -295, 117]
7747A17j51j52M83l14k88M59J70o24M14j14k5k98M24k81m39P23j85l98O28q5q05
7768g41O53L07n57n2N65o31qN16k10j16O34n6n99M95qm20J87O17o79K09L3J58
7790B97l83K14k13l2L59J84o41K16L88m89j0O49n04jL86j61n39M59l7n03J72O76
7812D87q44L3M39m35j34L86k53m50N38N7l92M63jo76M76Q03p51k03M14l3l24O39
7834B39k11m69P05j09m85L49K75k89j34O68n69k04L63N68r40M19M48o79L79K49
7854E73l77k63N12m91k51P48l11m44L92Q6o19P37j77n23L30L08l73j5L36m08j03
7875c33M08l87k36M45K02p55O57J77n70lP70m86k60P32n12J4K46K05o58K98L64
7896C18n70J76N91m22k67N13n6o07O32J54n17N93M3l81l19M09r1j96M19k04k67
$$ y = [117, -34, -186, 297, -17, -305, 154, 324, -300, 114, 0, -25, -323, 101, -180, -619, 104, -81, -479, 149, 64, -741, -88, 219, -338, -390, 175, -456, -464, 52, -158, -274, 360, 304, -295, 200, 192, -228, -41, 576, -103, 106, 139, 297, -86, 128, -85, -117, 242, 426, -215, 1, 389, -100, -110, 539, 35, 34, 420, 259, -280, 179, 142, -361, -189, 487, -357, -324, 115, -320, -454, -68, -321, -771, -233, -176, -568, -105, -106, -782, -306, 497, -254, -457, -43, -76, -400, 239, 28, -441, 264, 155, -330, 19, 294, 5, -129, 539, -30, -234, 129, 697, -243, 176, 624, -55, 324, 573, 196, -67, 445, -46, -297, 451, 140, -304, 88, 174, -445, 292, 115, -408, -78, 230, -143, -158, 178, -230, -333, 75, -312, -548, -103, 99, -656, 1, 178, -392, -395, 375, -111, -371, 361, -151, -137, 109, 314, -344, -46, 318, -252, -76, 515, 93, -174, 339, 283, -324, 308, 462, -55, 538, 581, 200, -119, 290, 199, 3, 422, 218, -49]
7917d9K69j05m44K73L32o72R1M00j40j73M13k02n52O11m4l81M20K38q20Q2N19
7938F6m10n4N04j49m17J63J45m96Q48j1o57L01M29m00K87K90l16m27O46pm48N49
7960D36q6n50L46O13q22K03L79l33j63M08j28o87O59J74r18O64J29m87K24J99
7980B60n18O4N29k05p61P46k03j73j13K77p9n09R82n17q6M50l76j91P70k63l58
8001b74L70r3n83N10K29q3l22Q86m92l99O62m49j53N48K33j096M06P32p28mN94
8022D94l56l41M97j06n22P39r6k97J07K17m19J09L02k72m49N40k10n16N89L0n14
8043d74K30M20n82k92Q80m88k8M67k4p46N50J91k41J46K8m70M98K18n98L18K45
8064B48m00P9M25m9l35K69L17p40P00P8p84K03M55m51j92O79l46k09L91l0m20
$$ y = [-49, 220, 115, -329, -56, 276, -396, -305, 95, -45, -218, 195, -7, -559, 52, 8, -373, 47, 285, -535, -453, 66, -344, -398, 106, -43, -460, -297, -152, -648, 200, 189, -468, -167, 262, -138, 149, 439, 123, -304, 342, 335, -113, 436, 350, -200, 146, 759, -63, 140, 519, 186, 23, 431, 303, -384, 275, 449, -469, 195, 324, -163, 61, 260, -258, -194, 335, 130, -631, 115, -88, -261, -374, -97, -176, -685, 297, -220, -306, 144, -232, -423, 347, 84, -274, 96, 3, -580, -70, 159, 76, -246, 640, 148, -251, 411, -38, -191, 357, 590, -506, -100, 632, -96, -100, 494, 138, -203, 294, 188, -334, 405, 309, 12, 119, 336, -83, 26, 328, 56, -393, 147, -63, -579, 10, 40, -474, -244, 176, -406, -698, 182, -306, -334, 133, 109, -637, -87, 104, -137, 9, 37, -433, 65, 283, -315, 3, 248, -152, -73, 352, 303, -32, 237, 554, -186, 514, 592, -192, 11, 466, 15, -177, 502, 156, -53, 338, 308, -112]
8085a12k7R54j024K21L69n27K7M80l77r3M42o8p33L70J02l34K26K27l86J37K10
8106H4k87l15L71J86n38K22L65n46O70q6j34j31J99N8j71K72K71m74m9L29k63
8127C3k11O10o07L36M19l50l75O54n18l77R38j98l42M6K16n46P1N25n61j65O12
8148B10j9l23K28J22m64L49o5k66R0L18m38l17Q54l91l20L77K24o14K56J51l33
8169c71p2P29p94j3P39l01k23O31p5n18M80q1j41J29K63l73L79J77l95k31K88
8190B27o3
$$ y = [-112, -139, 815, -209, 12, 381, -146, -119, 361, -16, -109, 333, 265, -468, -98, 4, -330, -104, 123, -263, -126, 84, -203, -518, -147, 39, -499, -277, 88, -458, 212, 126, -8, -139, 60, 118, -53, 219, 490, 16, -33, 296, 33, -178, 432, -175, 161, 580, 230, -145, 509, -9, -386, 552, 354, 12, 58, 274, -272, -201, 324, -237, -402, 210, 191, -132, 96, 218, -246, 103, 38, -228, -138, 180, -258, -575, 279, -112, -432, -55, 169, -445, -189, -38, -371, -443, 286, -508, -521, 218, -83, -306, 325, 250, -268, 212, 131, -10, 119, 382, 9, 388, 565, 170, -61, 227, 164]
8191A64
$$ Imaginary data points
##PAGE= N=2
##DATA TABLE= (X++(I..I)), XYDATA
0@%%%%%%%%%Qj6J6j6J6k4L2l2M0m8N6o8P6q8J04j20J36j53J74j98K24k52K82l17
33a68L53l93M40m88N41o02O66p35Q14r01R98j107J229j366J521j701J912k160
51a147K459k828L294l911M764o017Q046j1881K1563q7160j94543J81738J72611
64H6988m6303j26635l3251N2302Q7652j7461j15282k4410J19172O9025n4615p9534
76h2352K768Q2367M9658p0971n5613P3707P0306m3913n1095O606K4438L1590N468
89D2964m7060o665N5694j103n6867j092L7497J4918o779l4184k5831N0029M5432
102F6953n4985n3545L3963L9217L131j0632m1144k0466N7202K5757o0754j4764
114c0067M9005k318k6440P615j3722j2968M3048J2127n5318r758M7971J0588k6579
$$ y = [0, 0, 0, 0, 0, 0, 0, 0, 0, 0, 8, -8, 8, -8, 8, -16, 16, -16, 24, -24, 32, -36, 40, -48, 56, -64, 72, -81, 93, -105, 119, -133, 149, -168, 185, -208, 232, -256, 285, -317, 349, -386, 428, -473, 525, -582, 647, -719, 802, -899, 1013, -1147, 1312, -1516, 1778, -2133, 2631, -3386, 4660, -7221, 14342, -72818, -267361, -85623, 86988, 40685, -85950, -119201, -66899, 20753, 3292, -111990, -136400, -17228, 51797, -2818, -82352, -79584, 2783, 52441, -18530, -74143, -436, 69870, 25957, -25138, -18532, 5906, 37496, 42964, -4096, -10761, 44933, 43830, -13037, -14129, 23368, 38286, 31507, -2677, -28508, 21521, 66953, 11968, -41577, -7614, 31603, 34734, 24102, -17042, -37508, 19694, 45451, -15303, -30067, 18938, 16620, -9820, -2205, -15927, -28895, 14153, 26280, -29038, -38796, 9175, 19763, -6816]
127f816j7405j176J9065J6099j7056p285J8178o183q715K1146p677k6908K9536
140D803K5543l8166r419L9893o973k5708J8843Q813j5049J1188N545j9603N622
153E332J0284j5751P661J9859k2199j1157K2487j2552j9152L1020O114l9734N084
166a2704L0576j4235j3487R556j1289k703K6028l827k4631R277P873j2702N533
179f735P048j0180Q719Q438k5058o171K4020m301j0965J3955k646r877J6834o478
193c397k8837K2018L0600k6846j5916K6613n75j2802J3236m125j2850K8480J3431
206B9030l6704j1871K6301J2915L043j0074k9555R789M4391j1479m2513R865K0730
219A3868p752N262M06k5493O825L0619j8750k7365J8603J5154r447m591r321l260
$$ y = [-6816, -24221, -25397, -6332, 9767, -7289, -14574, 3604, -2579, -11294, 9852, 2175, -24733, 4803, 30346, -7820, -17239, 22654, 15681, -10027, 8816, 17629, 2580, 13768, 19313, -290, 5332, 15616, -135, 7526, 27385, 5186, -5971, 16516, 3964, -15188, 15832, 21946, -17788, -12704, 17872, 3637, -9850, -294, -11583, -14286, 11742, 7915, -16716, -7439, 434, -12268, -6735, 313, -9867, -1148, 7290, -17768, -23939, 81, -4220, -15185, -1230, -3876, -13753, 3081, -3397, -32234, -10216, 20384, -6462, -22378, 4235, 3660, -9142, 4094, -31, -12881, 15599, 29030, -7674, -19545, 6756, 19671, 22714, 12640, -16915, -7126, 37265, 25786, -16727, -6862, 13868, 6116, 11378, 11784, -13709, -6884, 23735, 4985, -22380, -3777, 11377, 1930, -2661, -11982, -15242]
233a5242K2869k074l2335R854L1517j5205j8652Q572m158J119K3614j2214l0453
246c2788K4429K7108k6914j8775J5629J0862R974J936l1732o416M3716J0277l3929
259f623m489J5184J786J1218p27k7457N656L3763q600k3533J0986O168m608R207
273A7931j0167j9768K0573J9919k5632j0996K0345m693r890J0851p515j3794J7952
286E116N446j9927L083Q357j4639K547J1796j3256j483J8096j5087j7038K1918
299e071O210j9859Q606J1554j7323K846J8521j3821r749J7059J496n305J1554
312F718n687j3021J9319P896k1470N483J9838j0812n602J0699j1809m404K6900
325B4048j611k7538N147J3814p109L163J37j7717Q534K1014j6695j7390J5925
$$ y = [-15242, 7627, 5553, -26782, -16928, 14589, -616, -19268, -10696, -14854, -13735, 9879, -2335, -32788, -8359, 18749, -8165, -26940, -11311, -449, 9525, 11461, -20271, -26687, 17029, 27306, -6623, -11112, 4072, 5858, 17076, 16349, -11108, -5452, 28311, 19711, -3822, 7164, 13332, 8724, 17931, 7764, -12004, 8569, 28488, 2856, -8140, 12205, 7512, -2378, 8473, 958, -12836, 5116, 10562, -9365, -6282, 2075, -12564, -10017, 1779, -11477, -12960, 5136, -9951, -26989, -5071, 1139, -18720, -10114, 1440, -15883, -13037, 5484, -8337, -18086, -1027, 469, -4836, 6718, 1031, -11990, 7329, 15225, -6245, -762, 19076, 8264, 2662, 13361, 1552, -2852, 24048, 22437, -5101, 46, 13860, 6751, 9914, 10051, -7666, 868, 21882, 5187, -12203, 3722]
338C722k58j2310J2007K643j6537Q849R821j9105j714J8782p642r658J0440l498
352d458o798J3708m409j6729J5833J1837k2094j114K0059o395q667R223p827m235
366a2066K2413J104k3433M391J4279m871M432L436j7255M397K3668j0910j6073
379f488J6917L284j5223Q979O807j4519M434R794j5205r51J6663r810j1465J3104
393F321j498j0930J0084k326j6421J4120J2357k3492n711K2329k064j2618L398
406f451n921j656K2158o75k6919L773J6995m340J395K869j6450L079K4190r069
420B978j9451J4969R488j2025M699N144j1039O726J2344j4758n132J7033l148
433G828q643J2250k696j3442J2772O075j6360M974J3521j3462n098J4957m621
$$ y = [3722, 3464, -8846, 3161, 5804, -10733, -1884, 7937, -11168, -12882, 5900, -1742, -11400, -960, -4458, -11256, 2452, -1957, -18686, -2853, 8984, -13110, -14224, 5835, -560, -9227, -4, -7831, -12066, 10347, 11451, -11982, -7591, 6688, 1817, 6249, 9685, -7570, -3173, 20495, 9585, -6488, 10429, 13713, -1510, 7469, 14276, -243, 4191, 13985, -1220, -2171, 14492, 4682, -6783, 6321, 4823, -6107, 3977, 1651, -14770, -650, 11707, -11785, -17496, 4833, 2769, -9849, -6451, -12372, -14028, 8130, 7455, -19464, -15691, 1304, -3036, -1641, 1228, -15222, -12143, 12047, 2978, -16473, -1504, 7984, -4041, 658, 5802, -5237, 1489, 13833, -925, -6057, 10976, 7828, -815, 11435, 8739, -4703, 8069, 14144, -2216, 2758, 16279, 2817, -2281, 12676, 8055]
446H055r458R203m339q337J5374K113k0442K781J1907r503J781J0081j6824r627
460a7235K0419J724j7434M231M331p728Q004L862j7154K265J7620p313q840Q302
474d946m155j531J8542o370k2567J4059K1378j2259o990P099o745K909J7054r077
488F401j4252J4453P131j1995K894J727q496R654Q264j6046j579J7218r402j3387
502g415J3080L785r127N798j989j4145R847J2890j7675n975J6548l020j0049L732
516c715n092m189J7419K43k3617K981J8265m657n868O92q037P366J8921j1226
530e14j7922J3609R811j0106M376M441j2137P984J6003j4553j1850J6590L999
543I731r707N659J436p402P464L477j1986M298R243j0408M60J2396j0203q999
$$ y = [8055, -1403, 7800, 3461, -4876, 10498, 12611, -7831, -5050, 6857, -2646, -865, 9216, -7608, -17235, 3184, 4908, -12526, -8295, -3964, -11692, -3688, 174, -16980, -14715, 2905, -4408, -13248, -4946, -9101, -10632, 7910, 1540, -21027, -6968, 14410, 2151, -4839, 2260, -4485, -1576, 15478, 6401, -7851, 6602, 13733, 1738, 4632, 6359, -2137, 7517, 15781, -265, -1844, 15374, 5972, -7415, 5665, 9450, 323, 6121, 4132, -10013, -166, 12724, -4951, -10926, 5622, 2602, -7447, -3715, -8807, -12996, 4423, 4666, -18951, -15970, 2295, -2362, -8230, -7538, -15575, -8209, 10712, -514, -18436, -4827, 4984, -5122, -746, 3695, -8442, -458, 15545, 992, -10858, 5732, 9731, 24, 5683, 7119, -283, 7181, 10658, -1328, 2970, 12213, 1805, 2265, 14661, 4458, -4541]
557d541J4546q90j2597J1592M430j9151K440J6428q058q117O567n556l626J2906
571F373l368j4081O964M809q430N807L703j3514M200J4822j1745r693J3941k58
585d70p874J1261N48j4961O820J2575j1067k203J1163o405l180J2228m638j2009
599h212R967P266o323M039j64j1562P673J2998j0801n389J0014n972l390J5049
613A5193n614j6962J1374J1006j5271k933J0144o716k623R959q317j1190J0042
626a908M601q308K227j929p838J0523O553j6447l88J4847o623o830J1913l957
640c564j1765J4251P350j4918J046J0684p824k028R943l444l973P031l724l939
654d874J2063r48j3568O946Q539p172K965M784j2734K528J8759r237j7777J2677
$$ y = [-4541, 10005, 9115, -3482, 8110, 12540, -6611, -4171, 12257, 4199, -3918, 2649, -2907, -6533, 6373, 3005, -11076, -4112, 697, -7733, -1926, 1777, -11737, -7537, 7285, -4460, -14153, -212, -470, -8344, 2917, 3465, -11496, -4676, 7899, -3168, -5371, 5792, -613, -3793, 8435, 3797, -8212, 1755, 9021, 2698, 6737, 6573, -4989, 2684, 15682, 4881, -508, 9506, 3534, 144, 15193, 9579, -7383, 3991, 14997, -274, -3207, 6937, 221, -2402, 7557, -760, -11950, -1908, 2693, -5615, -3388, -5317, -13155, -2632, 3921, -12526, -12914, 1933, -4690, -11520, 393, -3564, -15329, -1078, 6272, -8646, -7600, 3084, -4740, -6768, 3175, -269, -4242, 2789, -935, -4874, 7189, 6241, -7327, -381, 8158, 986, 3951, 8735, -3999, -1471, 17288, 8051, -9726, 2951]
668B951J1164p460q9l086j1646J1727J5789j6244j4903J2502O449l986j030q747
682f609m172J7142K718j9915j360J2892l044j716L023j0983J99J7701o280j8531
696a8935J0993J2900j0943l886O440k770K688N473r182k933J4114l85r854M090
710b190L223j419Q858l482j7112J1249K0863j3075j4614J1678M237m460P450m264
724F942j2953J1361J2600j4064q257Q380J229P28K307j1116l670J5324p43j4563
738f495M192O274p435K486M114j1804M56J3601p200r691J0808N00j0112N955L929
753d22q463L961O773r646K23J1222n902o020Q636l89l415R871j964j1274Q704
768A895Q489j1790J009J1647o812l852J1976m333j2443R718O754r326J259M461
$$ y = [2951, 14115, 6655, 6566, 3480, -8166, 3561, 19350, 3106, -11797, 705, 7154, 3168, 2138, -6609, -10781, 6361, 9079, -10836, -12196, 696, -2348, -4064, -1041, -12024, -11825, 5876, -404, -18935, -7942, 4958, -5985, -9871, -3431, -6201, -3513, 1960, -7222, -10155, 3959, 3574, -6280, -2190, 1033, -386, 8472, 4990, -12122, -873, 19990, 6915, -7699, 3979, 8216, 3756, 11206, 6942, -6011, 5350, 17950, 3886, -4371, 4009, 5238, 5966, 8273, -2843, -6513, 8811, 8068, -6495, -2303, 3971, -3464, -978, 3136, -8668, -8212, 5389, -1811, -11502, -694, -194, -10306, -4351, -422, -8885, -4924, 1849, -7797, -7574, 3648, -2254, -8274, 362, -27, -3442, 6429, 4465, -6809, 1895, 10384, -1406, -397, 11250, 4438, 586, 12562, 8229, -4214, 5504, 12258, 2932, 4191, 8652]
782H652p958K55Q043o234m087O689k541l071O446n933r626J2507N509j4492k02
797f043Q528p214n75R574q290r316J2276L545j0526J807K694o504N378O267j0278
812h677j076J0529l775m455Q670l727p838J2304N270j1325K398Q078p491J468
826C53J0245p880o217J2409J251q977M234J037p863P488O061j1269k496Q842l656
841C562k582N055n754n400J0017l30j0003N616K555j1068L936J0257j0114n594
855i847J0129j904n994P031k110j0043Q294Q494r722l389M571j509M193O195j1690
870g301m980J5020K385j1589K552L561m022Q153M873j3494q77J4573k996q812
884b954N844Q31k836P265j231j0220O141P124r361o34Q304m815l053P571m998
$$ y = [8652, 694, 949, 8992, 2758, -1329, 5360, 2819, -252, 6194, 261, -9365, 3142, 8651, -5841, -6043, 2485, -4729, -5304, 4270, -4020, -13336, -1060, 2485, -8041, -6234, -3540, -10044, -4666, 1601, -8677, -9753, 776, -2999, -7454, 1216, -2511, -10349, 1955, 7225, -4100, -1702, 6376, -1115, 353, 10598, 2718, -3499, 8910, 10161, 1184, 5418, 6455, -1408, 6080, 12141, 872, -1624, 7218, 3562, 980, 6035, 281, -5119, 4898, 4568, -5435, 181, 2736, -8332, -4396, 5861, -4253, -9847, 282, -1622, -7616, -585, -2695, -12738, -4444, 4050, -5672, -9061, -4490, -5999, -1806, 4389, -7301, -12281, 2739, 5124, -6465, -3913, -352, -4374, 3779, 8652, -4842, -5719, 8854, 5858, -2954, 2890, 3721, 885, 8150, 6919, -3301, 2840, 9964, 603, -31, 8273, 3458, 405, 7976, 2978]
899B978o854Q501P93j0163N725N828r258r47O262o089j335R427o481q268R709
914a72K403r575K970L965p158L613P009r190k904R107j738m269O710k929o570
929h728R079L815j0784K228Q476n876O17P519p329m701J1711L41r313M303M523
944E881m821M396K041r939J847J0884n388o476P624j485o046O830l15q953N847
959A927N580j0157m62Q409n455m103O263l843l916Q298j954j0848P038P666r558
974e115j782N634m089J180P710q038p568J1859L815q633R29K647l470O345L894
989E318j1634j75J3190k028p143M937r70m108Q634J863j0834M356Q361o821k389
1004E57O977m721l102P896k656n837O994L0r854N087P252r002k639O807l697j283
$$ y = [2978, -3876, 4625, 5418, -4745, 980, 6808, -2450, -3397, 2865, -3224, -4559, 4868, -1613, -9881, -172, 2231, -7344, -4374, -409, -7567, -3954, 3055, -6135, -9039, 68, -1670, -5939, 771, -2158, -8728, 351, 4166, -6618, -4390, 4086, -1790, -1173, 6346, -983, -5684, 6027, 6368, -2945, 1358, 5881, 1060, 5456, 7497, -2442, -595, 10289, 4901, -1575, 6049, 4564, -1482, 5348, 5033, -3920, 1927, 7507, -2650, -3112, 5297, -158, -4261, 2002, -1841, -5757, 2541, 587, -10261, -3223, 4443, -5115, -6897, -1263, -5352, -4172, 3538, -4500, -12068, -209, 3606, -5027, -4098, -1451, -4921, 1424, 5318, -6316, -6491, 6699, 4671, -2472, 2465, 1495, -2613, 6021, 7884, -2950, 1406, 9767, 2946, 557, 7534, 2813, -289, 7607, 4951, -886, 6108, 6138, -3716, 1371, 8623, -379, -3018, 3789, 92, -1191]
1020a191N750o710p413J0785L768j0243p6L351l879M683L932j1513j645J3057
1034B656j609r423M255J489l511O612K345j0117K606Q605n362k719P210l187k848
1049b998Q472j833p336O690L082q534M986P442q279k783Q341k631l565O024l823
1064C255n615R213K867j0414K6N820m338J483M285r270l214J1844j875j0165L523
1079b575K192m765N207J564j0728J296J0139m780m623N551k935l245Q421m69r917
1094i667N529O616o000P55M880n675n49R073l671n540O668M90n181N903K160q683
1110b892L056O853o931o25Q086m962n455P938K89p176M314J573n831N033M739
1125H009r539k312Q971l032l321M530m977m337J0274Q81j2498J671P929m351p18
$$ y = [-1191, 4559, -2151, -9564, 1221, 4989, -5254, -5330, -1979, -5858, -1175, 2757, -8756, -10401, 2656, 1047, -8376, -4121, -2632, -6143, 469, 2814, -7303, -4697, 3908, -1454, -4173, 3037, -150, -2998, 5474, 3641, -3695, 2995, 6077, -2457, 2529, 9971, 1692, -1091, 7250, 4619, 1054, 7078, 3255, -2360, 6853, 9720, -694, -668, 5152, 814, 2297, 6582, -2688, -5902, 5942, 4067, -6098, -2575, -383, -5148, 59, 1623, -9105, -7809, 2330, -2450, -7073, -1522, -4457, -7702, 719, 250, -9667, -4138, 2478, -3522, -2767, 2113, -3562, -4111, 4962, 1291, -4249, 2419, 2909, -2272, 3631, 5791, -2892, 164, 7017, 86, -539, 7547, 2585, -2870, 5068, 5357, -1819, 2495, 4068, -1763, 3270, 8009, -1530, -3842, 5129, 2097, -1224, 3306, -1671, -6008, 4266, 5147, -7351, -5680, 2249, -2102, -2820]
1140b820K560o577n16J1043l675r833N434L859l947L268P47p839M139Q385p141
1155b913l602Q063j246m329N682n91n800P037K727p871L153O441p320k474Q823
1170E780k379l357O123k661o383Q227L268j0033R64P278l745j354L475o660r37
1185b394J0043l468r417M605M599n812K263K042q421J692R240n909o141O589P5
1200d14n181M763L39o361M315L960o244Q78N485o133q98Q060k714n406O550k64
1216G35n661P137L185q978J476Q521m418k716N722l543j665Q803j710r072N526
1231C342N012o134J353L438o995M23Q093n603n784O790o05o084N005Q89p566K831
1247a595N524p083j501N969m407k992P233j983o656M876K008n371M080K843p611
$$ y = [-2820, -260, -6837, -7353, 3690, 15, -9818, -4384, -525, -4472, -1204, -457, -8296, -4157, 4228, -2913, -6515, 1548, 302, -4027, 1655, 1064, -4736, 2301, 5028, -2843, 310, 6751, -569, -3043, 5780, 3401, 44, 6167, 3506, -2877, 5350, 8618, -1415, -451, 6827, 3082, 1728, 5203, -1457, -2394, 7649, 4181, -5236, -631, 3968, -1844, 419, 2461, -5960, -4268, 4972, -937, -7078, -489, -414, -5595, -832, -493, -6854, -2539, 1421, -4823, -3945, 1540, -4593, -5491, 2569, -145, -5551, 999, 735, -4926, 2211, 5396, -3582, -2106, 6415, 1997, -719, 5003, 1460, -205, 8598, 6888, -2184, 3342, 8354, 2220, 3573, 7011, 16, 439, 8532, 2929, -2855, 3935, 3330, -2754, 2251, 3140, -4426, -1595, 3929, -3154, -4655, 1314, -3093, -6085, 1148, -835, -7491, -2615, -607, -5978, -1898, 945, -6666]
1262f666J324P044m692j992O166l716l401Q741J52r277M272O178n393J180N214
1277E134o978o99R926k397p534M278K463l093M509n44q390M208Q463p432m194
1292b280N702j394k169N700l961p756P519M680q152j085M988l872k88M343n357
1307c382k161Q070k731p219N542K373o389K532K925n403K702N413q177k780J0067
1322A382j56p076L170J754k855O368R75j0394K666J1110m027o102M172L1j91O532
1338G359l720r244P138P591o970k099K939k896K241N839p386m956R078J464p799
1353a421J766K377m698L429L342p492p52P305l957m541N011n54m005M245l53o153
1369f451M910L912q925M0Q344l216m133N031k280l410P359O59q840L608P391m736
$$ y = [-6666, -5342, 1702, -2990, -4982, 1184, -2532, -5933, 2808, 2960, -6317, -2045, 4133, -1260, -80, 5134, -1844, -2543, 7383, 4986, -2548, 1730, 4193, 1100, 5609, 5065, -3325, 883, 9346, 1914, -2280, 3422, 2028, -141, 5559, 1598, -6158, 1361, 6041, -2111, -3196, 1792, -2080, -2368, 1975, -3382, -5543, 2527, -204, -7423, -1881, 492, -5897, -3365, -440, -5843, -3141, 2272, -5905, -8685, 1382, 1226, -5850, -2680, -926, -3781, 2587, 3562, -6832, -4166, 6944, 2917, -3185, 987, 1018, 827, 7359, 3639, -5605, 1533, 9124, 2154, 55, 2994, 98, 2339, 8178, 792, -4164, 4914, 6378, -1421, 345, 2722, -1976, 1453, 4795, -2697, -3449, 3856, -101, -4642, 369, -185, -4190, 55, -298, -6451, -1541, 2371, -6554, -6514, 1830, -1386, -5519, -488, -2768, -6178, 1181, 1840, -7000, -3392, 3999, -737]
1385g37o29L034m465J359Q262m255o548O632L102n332K141J500n488L725O598
1400H899p162l099O636j434l269M611k258n708N923K781p333R40M006n114j32
1415a713O070m624m704O225o47n635M341J077o381L675M431p098m9N870m098k477
1431e737P217j616o194N121K400n582K979L552o050J796O568m821l113N443p72
1446A191k232N649j683p213O065N179o379o20M544l664l3O465m443n477O667J804
1462E820n596K322J389n679L007M476o958j150O373l745l706N910j995o196M773
1477i55L190o268J349L264n501O35O158m985m398O588N07m612L837j73n441N476
1493a329M813o824j274O205k239j203N291l407l693O884N11o585L982M146n671
$$ y = [-737, -1366, 1668, -2797, -1438, 6824, 2569, -3979, 2653, 5755, 423, 2564, 4064, -1424, 2301, 8899, 1737, -1362, 5274, 3840, 571, 5182, 2924, -2784, 3139, 5920, -1413, -473, 3533, -1581, -1713, 4357, -267, -4971, 1254, 607, -5028, -687, 390, -5991, -2316, 2115, -4983, -5032, 838, -3260, -5737, 1480, -136, -6330, -1209, 1191, -4391, -1412, 2140, -3910, -2114, 4454, -367, -3480, 1963, 1191, -1041, 4608, 2925, -4288, 1777, 6956, 577, -43, 4501, 837, 804, 7269, 2826, -2651, 4016, 5820, 224, 2546, 3935, -1744, 1263, 5739, -1219, -2369, 4004, 259, -3447, 2463, 468, -5728, -955, 2235, -4033, -2684, 580, -4921, -4286, 1872, -3113, -7511, -923, -416, -5028, -1191, -1364, -6805, -1329, 3484, -3340, -4614, 1591, -648, -1851, 3440, 33, -3660, 3224, 3735, -2850, 1132, 5278, -393]
1508c93J317N264n297j528O514k801m596O012Q6n943L296L510n485R16K697n503
1524a934N71P310n088n621N840O91m511L038Q6o940M883N748o960l266N285p89
1540a657j670M061l650m514O779K901p060O25M724l265N95M048n484j576Q792
1555C649j128o207L743K080m050L864K505n817J667N544m821k463O586j486m407
1570g41M513J25m932M234K276p100J735N776m441l144L822k150j614N737l236
1585H60o585N270M478o740r47L141l425J609N396o037m704P569J345n632J357
$$ y = [-393, 924, 6188, 891, -637, 5877, 3076, -1520, 4492, 4578, -1365, 1931, 5441, -44, 872, 3569, -1934, -1363, 5947, 859, -4762, 1078, 1769, -2742, 296, 382, -6558, -1675, 4073, -2887, -6153, -868, -1657, -3327, 734, -2916, -7430, -651, 2250, -4810, -4185, 539, -2726, -2131, 1917, -3567, -5143, 3649, 2521, -3686, 57, 2137, -1913, 1951, 4456, -1361, 306, 5850, 1029, -1434, 5152, 3666, -741, 3772, 3897, -1035, 3199, 5475, -1625, 110, 5886, 1445, -1699, 2123, -27, -1641, 4096, 860, -5725, -455, 4023, -2717, -3664, -523, -3948, -2339, 3057, -2980, -7684, -115, 1230, -4402, -3045]
$$ [...]
8191c7
##END NTUPLES=NMR FID
##END=
