##TITLE=1H_EC-3204
 DMSO, 8 sc, 
 30.7.2019
##JCAMPDX= 6.0         $$ Bruker NMR JCAMP-DX V2.0
##DATA TYPE= NMR FID
##DATA CLASS= NTUPLES
##ORIGIN= UXNMR, Bruker Analytische Messtechnik GmbH
##OWNER= root
$$ XWIN-NMR		Version 3.5
$$ Tue Jul 30 14:50:04 2019 Russian Standard Time (UT+4h)  she@DPX200
##.OBSERVE FREQUENCY= 200.13155
##.OBSERVE NUCLEUS= ^1H
##.DELAY= (6, 6)
##.ACQUISITION MODE= SIMULTANEOUS
##.ACQUISITION SCHEME= undefined
##.AVERAGES= 8
##.DIGITISER RES= 18
##SPECTROMETER/DATA SYSTEM= spect
##.PULSE SEQUENCE= zg30
##.SOLVENT NAME= DMSO
##.SHIFT REFERENCE= (INTERNAL, DMSO, 0, 15.7039)
##AUDIT TRAIL= $$ (NUMBER, WHEN, WHO, WHERE, WHAT)
$$ ##TITLE= Audit trail, XWIN-NMR		Version 3.5
$$ ##JCAMPDX= 5.01
$$ ##ORIGIN= Bruker BioSpin GmbH
$$ ##OWNER= she
$$ F:/spectra/data/she/nmr/H-F/1/audita.txt
$$ ##AUDIT TRAIL=  $$ (NUMBER, WHEN, WHO, WHERE, WHAT)
(   1,<2019-07-30 14:49:10.71 +0400>,<she>,<DPX200>,
      <created by zg, POWCHK disabled, PULCHK disabled
       configuration hash MD5:
       00 E9 B6 7A A2 85 ED C7 34 08 36 98 17 FE 4E 26
       data hash MD5: 16K
       91 93 6B CE 8B 75 0E 95 9D B7 D5 49 A1 53 4A C3>)
$$ ##END=
$$ 
$$ hash MD5
$$ C8 5B BA C7 96 16 ED 49 6D 91 DB 63 D8 2B DF 0F
##$RELAX= 
##$RELAX= 
##$RELAX= 
##$RELAX= 
##$RELAX= 
##$RELAX= 
$$ Bruker specific parameters
$$ --------------------------
##$DU= <F:/spectra>
##$EXPNO= 1
##$NAME= <H-F>
##$PROCNO= 1
##$TYPE= <nmr>
##$USER= <she>
##$AMP= (0..31)
100 100 100 100 100 100 100 100 100 100 100 100 100 100 100 100 100 100 
100 100 100 100 100 100 100 100 100 100 100 100 100 100 
##$AQSEQ= 0
##$AQ_mod= 1
##$AUNM= <au_zg>
##$AUTOPOS= <>
##$BF1= 200.13
##$BF2= 200.13
##$BF3= 200.13
##$BF4= 200.13
##$BF5= 200.13
##$BF6= 200.13
##$BF7= 200.13
##$BF8= 200.13
##$BYTORDA= 1
##$CFDGTYP= 0
##$CFRGTYP= 5
##$CHEMSTR= <none>
##$CNST= (0..31)
1 1 145 1 1 1 1 1 1 1 1 1 1 1 1 1 1 1 1 1 1 1 1 1 1 1 1 1 1 1 1 1 
##$CPDPRG= <>
##$CPDPRG1= <>
##$CPDPRG2= <>
##$CPDPRG3= <>
##$CPDPRG4= <mlev>
##$CPDPRG5= <mlev>
##$CPDPRG6= <mlev>
##$CPDPRG7= <mlev>
##$CPDPRG8= <mlev>
##$CPDPRGB= <>
##$CPDPRGT= <>
##$D= (0..31)
0 1.2 0 0 0 0 0 0 0 0 0 0.03 0 0 0 0 0 0 0 0 0 0 0 0 0 0 0 0 0 0 0 0 
##$DATE= 1564483750
##$DBL= (0..7)
120 120 120 120 120 120 120 120 
##$DBP= (0..7)
150 150 150 150 150 150 150 150 
##$DBP07= 0
##$DBPNAM0= <>
##$DBPNAM1= <>
##$DBPNAM2= <>
##$DBPNAM3= <>
##$DBPNAM4= <>
##$DBPNAM5= <>
##$DBPNAM6= <>
##$DBPNAM7= <>
##$DBPOAL= (0..7)
0.5 0.5 0.5 0.5 0.5 0.5 0.5 0.5 
##$DBPOFFS= (0..7)
0 0 0 0 0 0 0 0 
##$DE= 6
##$DECBNUC= <off>
##$DECIM= 24
##$DECNUC= <off>
##$DECSTAT= 4
##$DIGMOD= 1
##$DIGTYP= 9
##$DL= (0..7)
0 120 120 120 120 120 120 120 
##$DP= (0..7)
150 150 150 150 150 150 150 150 
##$DP07= 0
##$DPNAME0= <>
##$DPNAME1= <>
##$DPNAME2= <>
##$DPNAME3= <>
##$DPNAME4= <>
##$DPNAME5= <>
##$DPNAME6= <>
##$DPNAME7= <>
##$DPOAL= (0..7)
0.5 0.5 0.5 0.5 0.5 0.5 0.5 0.5 
##$DPOFFS= (0..7)
0 0 0 0 0 0 0 0 
##$DQDMODE= 0
##$DR= 18
##$DS= 0
##$DSLIST= <SSSSSSSSSSSSSSS>
##$DSPFIRM= 0
$$ [...]
##$SUBNAM2= <"">
##$SUBNAM3= <"">
##$SUBNAM4= <"">
##$SUBNAM5= <"">
##$SUBNAM6= <"">
##$SUBNAM7= <"">
##$SUBNAM8= <"">
##$SUBNAM9= <"">
##$SW= 24.9336996594482
##$SWIBOX= (0..15)
0 0 2 0 0 0 0 0 0 0 0 0 0 0 0 0 
##$SW_h= 4990.01996007984
##$TD= 16384
##$TD0= 1
##$TE= 0
##$TE2= 300
##$TE3= 300
##$TEG= 300
##$TL= (0..7)
0 120 120 120 120 120 120 120 
##$TP= (0..7)
150 150 150 150 150 150 150 150 
##$TP07= 0
##$TPNAME0= <>
##$TPNAME1= <>
##$TPNAME2= <>
##$TPNAME3= <>
##$TPNAME4= <>
##$TPNAME5= <>
##$TPNAME6= <>
##$TPNAME7= <>
##$TPOAL= (0..7)
0.5 0.5 0.5 0.5 0.5 0.5 0.5 0.5 
##$TPOFFS= (0..7)
0 0 0 0 0 0 0 0 
##$TUNHIN= 0
##$TUNHOUT= 0
##$TUNXOUT= 0
##$USERA1= <user>
##$USERA2= <user>
##$USERA3= <user>
##$USERA4= <user>
##$USERA5= <user>
##$V9= 5
##$VALIST= <valist>
##$VCLIST= <CCCCCCCCCCCCCCC>
##$VD= 0
##$VDLIST= <DDDDDDDDDDDDDDD>
##$VPLIST= <PPPPPPPPPPPPPPP>
##$VTLIST= <TTTTTTTTTTTTTTT>
##$WBST= 1024
##$WBSW= 4
##$XGAIN= (0..3)
0 0 0 0 
##$XL= 0
##$YL= 0
##$YMAX_a= 13659
##$YMIN_a= -16349
##$ZGOPTNS= <>
##$ZL1= 120
##$ZL2= 120
##$ZL3= 120
##$ZL4= 120
##$ABSF1= 10
##$ABSF2= 0
##$ABSG= 5
##$ABSL= 3
##$ALPHA= 0
##$AQORDER= 0
##$ASSFAC= 0
##$ASSFACI= 0
##$ASSFACX= 0
##$ASSWID= 0
##$AUNMP= <proc_1d>
##$AZFE= 0.1
##$AZFW= 0.1
##$BCFW= 1
##$BC_mod= 2
##$BYTORDP= 1
##$COROFFS= 0
##$CY= 11.3945322036743
##$DATMOD= 1
##$DC= 2
##$DFILT= <>
##$DTYPP= 0
##$F1P= 20.1537800932815
##$F2P= 0.134698688090026
##$FCOR= 0.5
##$FTSIZE= 0
##$FT_mod= 4
##$GAMMA= 1
##$GB= 0.15
##$INTBC= 1
##$INTSCL= 1
##$ISEN= 128
##$LB= 0.24
##$LEV0= 0
##$LPBIN= 0
##$MAXI= 10000
##$MC2= 0
##$MEAN= 0
##$ME_mod= 0
##$MI= 1.114404
##$NCOEF= 0
##$NC_proc= 0
##$NLEV= 6
##$NOISF1= 3.799351
##$NOISF2= 2.8
##$NSP= 1
##$NTH_PI= 0
##$NZP= 0
##$OFFSET= 15.70392
##$PC= 1
##$PHC0= -9377.739
##$PHC1= 9.600971
##$PH_mod= 1
##$PKNL= yes
##$PPARMOD= 0
##$PSCAL= 0
##$PSIGN= 0
##$REVERSE= no
##$SF= 200.130013532006
##$SI= 16384
##$SIGF1= 3
##$SIGF2= 2
##$SINO= 400
##$SIOLD= 16384
##$SREGLST= <1H.CDCl3>
##$SSB= 0
##$STSI= 0
##$STSR= 0
##$SW_p= 3612.71676300578
##$SYMM= 0
##$S_DEV= 0
##$TDeff= 0
##$TDoff= 0
##$TI= <>
##$TILT= no
##$TM1= 0
##$TM2= 0
##$TOPLEV= 0
##$USERP1= <user>
##$USERP2= <user>
##$USERP3= <user>
##$USERP4= <user>
##$USERP5= <user>
##$WDW= 1
##$XDIM= 8192
##$YMAX_p= 0
##$YMIN_p= 0
$$ End of Bruker specific parameters
$$ ---------------------------------
##NTUPLES= NMR FID
##VAR_NAME=  TIME,          FID/REAL,        FID/IMAG
##SYMBOL=    X,             R,               I
##VAR_TYPE=  INDEPENDENT,   DEPENDENT,       DEPENDENT
##VAR_FORM=  AFFN,          ASDF,            ASDF
##VAR_DIM=   8192,          8192,            8192
##UNITS=     SECONDS,       ARBITRARY UNITS, ARBITRARY UNITS
##FACTOR=    0.0002004,     1,               1
##FIRST=     0,             0,               0
##LAST=      1.6414764,     0,               0
##MIN=       0,             -16349,          0
##MAX=       1.6414764,     13659,           0
$$ Real data points
##PAGE= N=1
##DATA TABLE= (X++(R..R)), XYDATA
$$ [...]
582a027r80R68J936O45j328j622o00J607K079J68k123j898O28K397J745j080k978
599a463j226K216K926J81k648k468O23L116J678j806k883n70K110K128j69k376
615f31j439Q83J810O07j008j310m25Q87J037r9o63m74j30M12N19N9l87l20j09
634g81J24M37K72j40k74k00r2L39P52J25o11p95n3R38J150j34j563j160Q98J941
654A173O68j398k122j71K293J817q72k503j358J469K518M78k220k200M03K259
670B34J485r80k327j058J456K123J83j613j637nJ667J426n56j680q21P25J466
687H8O89q78j417j89J202R77j31r84n14L86Q76K32m89k34J09J77k4n0J35M68q6
708C43p57l77P08R38M2j046j017L60J580Q19j194j562l19J409J540j35j891j350
$$ plain form
582 -1027 -2007 -1039 897 1542 214 -1408 -2008 -401 1678 1846 -277 -2175 -1547 850 2595 1515 -1463
599 -1463 -2689 -473 2453 2634 -14 -2482 -1859 1257 2935 1129 -1754 -2324 -214 1914 1745 -631
615 -631 -2070 -1187 623 1230 222 -1088 -1513 -626 411 312 -351 -825 -955 -543 -24 35 -352 -672 -781
634 -781 -657 -220 52 -88 -362 -562 -654 -315 437 562 -49 -844 -897 41 1191 1057 -506 -1666 -768 1173
654 1173 1841 443 -1679 -1850 443 2260 1388 -1115 -2473 -1004 1514 1992 -228 -2428 -2025 234
670 234 1719 739 -1588 -2646 -1190 933 1116 -497 -2134 -2139 -472 954 398 -1282 -2103 -1378 88
687 88 777 -101 -1518 -1707 -505 472 341 -643 -1157 -771 105 337 -152 -386 -277 -100 -124 -174 -39 429 343
708 343 -414 -791 -83 855 897 -149 -1166 -806 774 1593 399 -1163 -1482 -73 1467 1332 -559 -1909
726a909Q02J927P79j127j895n71J681J730k20j731j433M12J927J271j083j974
742a414n41J332J729J73j721j464N81J840P22r51j422m31J140J341l36j184n01
759a107L95Q59K80n00o31J52L96P7j30L4L0N8j57j67N4N63K14n10n40J34O62N74
781G40j70r83m96P30J213J90q78j137j3J371J168n88j519o85Q52J649M82j412
799E14j652K12J658J201n98j853q80J077J818J98j532j457K15J552J029p62j664
816i24n35J013J156J59j082j025J58J066N57m37p83l98M87O83J0l75k84P8K18
835b58K12K0j53J86Oj78m3L29M27j5m11m80J13R55N44n49r30j66P62J112k9j182
857B72j063N25J506O02q83j475l53J258J349k06j562j022N23J476P64j136j506
$$ plain form
726 -1909 -1107 820 1599 472 -1423 -1994 -313 1417 1197 -534 -1967 -1555 372 1643 560 -1414
742 -1414 -1955 -623 1106 1279 -442 -1906 -1325 515 1237 286 -1136 -1567 -427 914 578 -606 -1107
759 -1107 -712 147 427 -73 -704 -552 -156 -79 -209 -175 -145 -87 -244 -411 -357 206 420 -90 -630 -496 166 740
781 740 570 -413 -909 -179 1034 1224 346 -791 -804 567 1735 1147 -372 -1057 -205 1444 1926 514
799 514 -1138 -926 732 1933 1335 -518 -1398 -321 1497 1695 163 -1294 -1079 473 1502 740 -924
816 -924 -1459 -446 710 869 -213 -1238 -1080 -14 543 106 -677 -1075 -588 95 105 -270 -554 -476 -258
835 -258 -46 -26 -179 7 13 -165 -208 121 548 533 122 -358 -245 710 1254 705 -225 -391 371 1483 1454 272
857 272 -791 -266 1240 1842 959 -516 -869 389 1738 1532 -30 -1052 -529 947 1711 575 -931
874i31k62J261J159k55j299r96N59J291M54q63j104j10R10R66k98j045m37M44
892e56P94K79m79o95N6O05L23k03l43l4K70J48l8k24K26K97j52k94o8L33L75J9
914F39o12l84M20P57J46n81p43q4R84P02m34j109m87P11J089K24j088j159K75
933g34J280P97n68j402o05R68J267J19j207j070K51J206Q50o29j310l80R32J035
951H00j8r72q84K74J120M21n47o89k99O11O49k3o40k59K32L67Q7j43k31QK83j0
973A37k13L7K93kj73l27M3M68L51l52o13q4M53O11J07p83o89L83R61M18o68r86
995f28k32Q56J108l14j105p07M84J156M51p21j194j55J118Q62l02j022o91M94
1013e42J149K54p73r38N3Q22P36k95q86m28N88O52Q0m58o44J73N74K87k99m64
$$ plain form
874 -931 -1193 68 1227 972 -327 -1323 -764 527 981 118 -986 -1096 -186 780 482 -563 -1000 -556
892 -556 238 517 38 -657 -601 4 327 124 -219 -253 17 165 127 -97 129 426 274 -20 -88 245 620 639
914 639 27 -357 63 820 966 385 -358 -442 542 1244 810 -299 -786 -75 1014 1238 150 -1009 -734
933 -734 546 1343 775 -627 -1232 -264 1003 1122 -85 -1155 -904 302 1152 523 -787 -1167 -235 800
951 800 782 -190 -1074 -800 320 741 194 -495 -794 -183 466 443 -197 -456 -224 143 230 87 -144 -136 147 137
973 137 -76 -39 254 252 79 -248 -205 263 614 262 -351 -435 18 629 736 -47 -736 -353 608 1026 358 -628
995 -628 -860 -4 1104 790 -315 -1022 -538 618 1069 348 -846 -1001 117 979 677 -345 -1036 -542
1013 -542 607 861 88 -850 -797 25 761 466 -420 -848 -260 392 472 14 -630 -457 117 404 105 -359
1033c59R2K42K64n3k44j05L31Rk36l0M7L19L8k57l29J87N28O5l86l95r5N49N62
1056G44k56q01l78N89P28J73p12q64K35R43N28m56r57l49P07R91n1r00p54K76
1076e64R16O23n21j109k29Q11P56k9q19o05K56Q93M02n61p49OM81N89j76n36l23
1097d88L33M20oj14l38pL46J29k52j02J82O6o0q5j02K24J84j34l41r1L29L89L9
1120E21m48n21J70P03L19n42o00j31O28O58j62p88n34M69P85K89n75q43j10Q26
1140A14P02k53q51m72M31Q17K86p27p00J37O58N37k86p37k92N08N81jm87m38O8
1161d05O76J74l84l83Q4L56J49n2l66k9J91J97j58j40rJ89J08q6k81nL59Q3j27
1184A41k95r0L39L95j76m95k17K77M68J08m12n81J13P07M03m29o88j69M50P30
$$ plain form
1033 -359 -267 -25 239 186 -58 -163 168 177 -59 -89 -42 277 315 58 -271 -84 444 509 123 -272 -367 182 744
1056 744 488 -313 -691 -102 626 799 87 -777 -542 401 929 473 -484 -833 -126 865 814 -86 -840 -564
1076 -564 352 975 454 -655 -884 -73 683 654 -165 -770 -514 379 781 220 -529 -523 -42 547 371 -165 -488
1097 -488 -155 265 259 145 -193 -200 146 275 23 -79 103 169 109 24 -78 146 330 196 -145 -236 93 482 521
1120 521 73 -448 -278 425 744 202 -398 -529 99 757 595 -193 -727 -258 527 816 241 -602 -712 114
1140 114 816 563 -288 -760 -329 488 774 47 -653 -516 142 679 393 -344 -636 -128 453 452 -35 -473 -405
1161 -405 271 445 61 -322 -238 118 267 215 -151 -180 11 208 50 -90 -99 90 198 112 -169 -174 185 268 141
1184 141 -154 -244 95 490 314 -181 -398 -121 347 455 43 -538 -425 282 685 256 -432 -601 -151 579
1204E79Pp92n75L43P46K89m01q33j11P65O10k71n80m64K81P35K02n58n13N1M43
1225d7M15o0n47k64L48M01J0k68k89L7L60N6j95j99J05J50R0p9j59P7J16J12k19
1248d9j61J72K64O7l16l04R9M48K62l93m20o0L89M64j07n42l50L23N78J91n29
1269B6o12R7N94M06k79o28k56L75N92J10o20m68K10M90L32k56o33j14M43M43l0
1290B22m46l39J59N35J34l61l35j2L91J89j01k82j45L15K36j22j68o0J65J44m9
1311G0j48j00K52J05j45j60p2J86L52j26m15n8K49L44m1k98l79J17M59J49k98
1332D3l44j02L43M20m5n01m32K85M88K57l76n47p8N00N12j97n17l05J96N81K22
1353D03m75m88R5N10K36r4n14j50L67L87q1l63j86J99K45Q1j34l00J25J50R1k0
$$ plain form
1204 579 586 -206 -781 -438 308 597 196 -637 -748 17 627 356 -224 -688 -407 328 530 -28 -541 -490 -47
1225 -47 368 308 -239 -503 -155 246 256 -12 -301 -264 96 152 -43 -242 -137 13 103 24 -135 -58 58 170 -49
1248 -49 -210 -38 226 293 -23 -327 -228 220 482 89 -331 -391 -2 462 355 -187 -537 -214 364 555 26
1269 26 -586 -489 105 511 232 -396 -652 -277 315 425 -195 -663 -453 37 369 113 -520 -634 -191 252 222
1290 222 -224 -563 -404 131 265 -96 -431 -443 -52 137 36 -246 -391 -76 160 38 -130 -190 -25 119 70
1311 70 -78 -178 74 179 34 -126 -198 -12 340 214 -201 -259 -10 334 293 -5 -384 -267 192 341 43
1332 43 -301 -403 -60 360 315 -186 -618 -333 155 412 36 -511 -589 -89 423 226 -291 -596 -400 181 403
1353 403 -72 -560 -465 45 281 187 -327 -477 -110 277 196 -167 -353 -154 91 172 38 -262 -137 13 104 84
1375H4k19M2J45K9j05q3J35Q7k4o5k73P9K72P6j38k04p7K52K45om11k57K94M29
1399C07L3l40l51m0M68L25j90m82j60K87M77O0m77l47J61N23J49k23m62p6M04
1420D6L86j36m48j23J37M05O6k04l65J00K60M8j6k18j32J17L25j94j15q0J60J04
1442A23m8o5j86J06K03m7j53p1K2K22L2k55j12J57K06N6j80k66P7L15K13k59l57
1465b67k3L53K86j08l83k43L22L64J04l04l98M5L74L14j06m52j26J36L39J50k74
1486A03m08J00L56K49k24l13j62K95L18m4l56j28J13K27J24k09k36Q9J75M4n8
1507E5j47j7J25P9o3j77N6J20J07j31j34J6J34J46j45j82rJ83K27q5k94j25K93
1530C2J46M9k33j90m3L20K73j77l34j15K93K47J7k93k73J83L17O9j66k44j40L30
$$ plain form
1375 84 -135 -93 52 81 -24 -107 28 115 91 26 -247 -168 104 180 42 -162 -239 13 258 252 -159 -416 -122 307
1399 307 340 0 -351 -391 77 402 212 -270 -430 -143 334 394 -83 -430 -269 254 403 180 -282 -358 46
1420 46 432 296 -152 -275 -138 267 333 129 -236 -136 124 172 156 -62 -194 -77 248 54 -61 -141 19 123
1442 123 75 10 -176 -70 133 86 -67 -138 -116 106 138 -117 -229 -72 134 190 10 -256 -179 136 349 90 -267
1465 -267 -290 63 349 241 -142 -385 -63 301 405 101 -297 -252 122 436 330 -122 -248 -112 227 377 103
1486 103 -305 -205 151 400 176 -137 -299 -4 314 270 -86 -214 -101 126 250 41 -195 -106 69 113 55
1507 55 -92 -109 16 95 32 -145 -89 31 138 7 -127 -111 23 169 24 -158 -167 16 243 158 -136 -261 32
1530 32 178 227 -6 -196 -239 81 354 177 -157 -272 21 268 285 -8 -281 -98 219 288 122 -122 -262 68
1552F8K82j08l26j82J99L14nk39k59J39K14Q9p1k30j21K12K43j31j73l4J12J28
1574A21qj85j24R1J17N5j21J1k2J34P8k22k3K9K02l2j03j45N3J70J11j26j33r4
1598a66J60K45m4k24k70K47K92J3j82k72L9K74K06j92k88l9K41K08K1k48k44J10
1620a13K66J47j96l16rK40J87o1k82q2J60J59Q1k53j28R6K04L9j15q0q1J06J50
1643A19j01j16j4J02P8Lj33j03J37J35r1j33JJ34P7P3j87j61J50J64j6j08j65
1666a55N6K45J28j62l01L9K15J37N9l18j43J67J87J31k47k68P4J57K35j11k39
1687a14k5N7K67n6k40j21J13J96N5r6k18PJ18K50j39j30q8J05J70q1m0j02L1J77
1711I6Mj66jm7K14j8p4l9j4J17j8j15K1m6J82L0j42m0J2P1R4kk00o5J76J29r7
$$ plain form
1552 68 350 242 -84 -266 -67 247 242 3 -256 -117 97 186 115 -115 -236 -24 219 88 -85 -119 -7 121
1574 121 113 -72 -196 -105 12 67 -54 -43 -65 69 147 -75 -98 -69 133 101 -2 -147 -94 76 187 61 -72 -166
1598 -166 -6 239 195 -29 -299 -52 240 253 71 -201 -162 112 318 126 -162 -201 40 248 269 21 -223 -113
1620 -113 153 300 104 -212 -221 19 206 145 -137 -219 -59 100 181 -72 -200 -104 100 139 24 -56 -137 -31 119
1643 119 18 -98 -112 -10 68 71 -62 -165 -28 107 16 -117 -116 18 95 168 -19 -180 -30 134 118 10 -155
1666 -155 -99 146 274 112 -189 -150 65 202 261 -57 -200 -33 154 285 38 -230 -156 1 236 125 -114
1687 -114 -139 -82 185 129 -111 -232 -119 77 132 36 -182 -175 -57 193 54 -76 -164 -59 111 30 -10 -112 -81 96
1711 96 100 -66 -67 -114 100 82 8 -31 -45 72 54 -61 -40 -86 96 126 -16 -56 -44 27 121 119 -81 -146 30 159 62
1738F2q0j26J24L7J74o9l21M8J63J43k0j53j96J17K23R6k52j85M8J78J65p0k45
1761a39oJ25J26l6n7k23P7J72P9j22j05j4J63M8j8k02O5J25qL8r8k0K5R2p6n8
1787d7QO3J10j4j73n1M2J31N8k02ROQ0J53j61j42j8J51K02j00k36k8P4K58j34
1812C9j01kk6J22J38j60j73l7K10Q5N2j84j18R3J98K9n9k04M4J31M6m4j99RJ41
1837C0Q5q1o0q9J04J15m1n3n0L4j0J21j07m0N6M6J1q8k0NO3J06j28o6pJ23K9k6
1865F2j44n3Q7J89o8j43j1k0J09R8j28j51R0J32N8m4j51o3J48J26j3j73n5o4J91
1890IJ69o1k21n4J85J00l5r3j48J28Q3Q6j56l0k5J46O2j10m1j29Q7J25j3r6p5
1915a07M9L8O3p8l7j9J74m5l5j25J48N8K4j31n4k0J38Qj0j26J6P9M3n3p3J8l9
$$ plain form
1738 62 -18 -144 -20 17 191 122 -199 -151 12 155 135 -18 -214 -97 126 222 -30 -215 -167 11 176 106 -139
1761 -139 -145 -20 106 70 13 -210 -133 39 118 -4 -109 -123 40 88 70 -132 -67 58 50 88 -10 -30 -5 87 11 -47
1787 -47 -39 24 134 120 -53 -104 -62 69 127 -75 -66 -60 20 173 12 -130 -148 3 205 105 -131 -159 -85 173 39
1812 39 -62 -64 -90 32 170 10 -163 -200 10 95 147 -37 -155 -62 136 165 106 -98 -54 77 123 79 -120 -111 30
1837 30 115 34 -26 -115 -11 104 63 10 -40 -6 -16 105 -2 -42 14 60 71 -17 -37 -32 31 137 9 -57 -64 59 88 62
1865 62 -82 -135 -48 141 73 -70 -81 -101 8 106 -22 -173 -83 49 107 63 -88 -151 -3 123 110 -63 -118 -182 9
1890 9 178 117 -104 -158 27 127 92 -1 -149 -21 62 148 -8 -38 -63 83 145 35 -6 -135 -48 77 64 -32 -107
1915 -107 -58 -20 43 -35 -72 -91 83 38 3 -122 26 84 108 -23 -77 -97 41 49 39 -87 -71 8 51 -2 -75 -57 -96
1942i6J80K2j37m8K6J32P6j33j26L3J52R0q9k05l1J31J36l0m6j87J52P8M6p2k10
1967a56Q1J14Lrp0m2K7J02Ro1p1J7M5N2l9j39J04PK1Jp6K4Q7M3l8o8k6R9K8o7
1997Bm2k9K1Q0M3q5p9M7Q9J01j92p6N7J29O0j19o5m3J02J11l3j18m2M1R7J3j01
2024c1o4J1R5Q3n0j00J6J3R7k2l6o5pQ2M9p7q0k6J76k5N7j41l9J24j0J3l9l8L9
2053Ej1O0K7j06M2L0ol4l8O3N0k8m2n4L4K5J12j23o0P2j3R4q4jr1M2O4j1j3o2
2083e7nR8N7r7o3kQ2J7M4j28ll3J46Nk7j38j2J73Jn3n6l9N0J56o3j13j7L1J22
2112G6km1l6J1m1N6jk3l5R8m8J7o2J8PkK9p1j3MJ58q3r4K0L2%R6j46l9Q9M2R6
2144A12n8j19M1pJ34l1j50l0P3Q7P6o5j71J00L9Q6j07r1p2J68J6m3J0m5O7%J9
$$ plain form
1942 -96 84 106 -31 -79 -53 79 155 22 -104 -71 81 171 82 -123 -154 -23 113 83 37 -150 2 80 126 54 -156
1967 -156 -75 39 42 33 -37 -79 -52 50 59 -2 -73 -56 -11 41 2 -137 -33 -26 -5 -4 -80 -56 31 74 36 -32 -58 41 69 2
1997 2 -40 -69 -48 32 75 -10 -89 -42 47 148 -44 -120 -63 66 126 7 -58 -101 1 112 79 -39 -81 -40 57 70 -31
2024 -31 -95 -84 11 94 44 -56 -40 -27 70 48 12 -53 -60 22 71 -6 -86 -112 64 39 96 -45 -84 40 30 43 4 -34 5
2053 5 -6 54 81 -25 17 47 41 7 -31 32 82 54 12 -42 -8 17 129 6 -54 18 5 99 15 14 -77 -35 29 18 5 -57
2083 -57 -62 36 93 -4 -67 -69 13 30 74 -54 -57 -90 56 61 34 -104 -116 57 58 5 -51 -90 -40 116 53 -60 -77 -46 76
2112 76 74 33 -3 8 -33 23 22 -1 -36 62 14 31 -31 -13 -6 -8 21 -50 -63 -59 99 16 -78 -58 -26 -26 70 -76 -115 -26 16 112
2144 112 54 -65 -24 -31 103 72 -78 -108 -35 52 128 63 -108 -8 31 117 10 -81 -153 15 31 -12 -2 -47 20 20 39
2171C9jn4J2N7%p1K4j5n5P4l0K6j8M1J3k0k8J5NRL0p1J1N0m5N8k3j57N1R8J2L6
2203G3p3p5R7O6j5j71J4P5J46p2o4j19M0J33Pk7p1n5J00J07j23l0j8N9N2L1o3
2230B4j10L1J39%o3o9KQ2J8J5j16LN0N5K8j29Ll2J57j2j46M7L8J7m2J2m0jM0K4
2260B5k6o1O1n7R3J3j59P3P4K9k6q7o9Q9K1P3j27M0l6R2k7M8k2m5j9M2k8L1j02
2289h7L5J16J8n1n5l5Q2K8Nj25ML5R6k2J5j44K3J63Kj29k8RJ09N3j10n2P2K6o6
2318a3P0l4Km5lO7n9O7r0O2On9nQ1o6L0k9J1K1M6rj16J6m4J13j1%pj8j3O1J0k2
2351B0o2OJ12K0p7q1j5P4P5k0n3j02J12N4j1p7KL8K1P1r1k1K1J1j5l8L6l5l4Q4
2381B5K7n6L2r5M8P6jo8j7N0m4J1j0m9N8P8J0q2q4O2N1%r6l5O3J06Nj09k6J0R6
$$ plain form
2171 39 38 -16 -4 53 53 -18 6 -9 -64 10 -20 6 -12 29 42 22 -6 9 14 23 53 -18 -7 43 -2 56 33 -124 -73 25 37 73
2203 73 0 -75 22 88 73 -98 -84 -9 137 65 1 -118 -78 55 62 35 -36 -91 9 116 -7 -37 -55 4 56 87 24
2230 24 -86 -55 84 84 21 -48 -46 36 54 69 -47 -44 6 61 89 -40 -37 -69 88 76 -70 -23 15 32 -10 2 -38 -39 1 25
2260 25 -1 -62 -1 -58 35 48 -111 -38 36 65 39 -48 -117 -28 -7 66 -61 -21 -57 35 8 56 34 -11 -30 12 -16 15 -87
2289 -87 -52 64 82 31 -24 -59 23 51 56 -69 -65 -30 66 44 59 -85 -62 101 103 -26 -54 -45 64 117 7 -45 27 53 -13
2318 -13 57 23 25 -20 -23 44 -15 52 -38 24 30 -29 -34 47 -19 11 -18 -7 14 60 51 -65 -49 -93 20 9 9 2 -16 -29 32 42 20
2351 20 -42 -36 76 96 19 -62 -77 -3 72 52 -1 -103 9 63 52 -25 -23 15 36 107 16 -5 16 27 12 -26 10 -25 -59 25
2381 25 52 -4 28 -67 -19 57 56 -12 -29 21 -23 -12 -22 -71 -13 65 75 -7 -91 -29 22 22 -74 -109 -46 60 65 -44 -70 -60 36
2412C6O1r8%J0Rpk9Nj4nJ27j0r9K6o1J02j9K3o7lRJ30o3k7j28N6P3K1j9j11N2
2443b0L2M9l1m7o5J02M2o4o4lO5Q3l5j26pR3N2n9l6N0m7O9j2o6m4P9K2K2K0r3
2473c9PO6j6k6L3j08N2N5j4N9r5K3K9jQ7j58M7NR2qj20l9P1L3M2q5r1M9R1Lm8
2504dm4m1Q9K8j6p0Q4k7O6m6q3J9J37k7k4r8lR0n3N9l8J6j8oM5j8J6m0J4J8M4
2535F9j04m9J26RK1l1j31O5M8L8N0j74M2N3R7o6j26l0J11N3K6p4j18J3J13P5r4
2562A2j15O7R1Qn7J1o3J09n0Nk5n1L8N2j8m0M9m1O0k7j5j25J17P2m4m8j3L1n8
2591f8R9L0m2l6l7O0P8n2n6M6QL3q8%k1R1k1L5r1p6J44N0n1l7l1P8l9M8Lj00j9
2622f2J15p5N0n1K3l4k1L8N4o6JK1M1L1o7Ro9J26Oj11m6K3Q7L2n4j08N8R1qk7
$$ plain form
2412 36 97 -1 -1 9 18 11 -18 -13 -27 -32 95 85 -14 12 -49 53 34 57 -10 -13 -4 126 63 36 -92 -36 37 58 39 -72 -20
2443 -20 12 61 30 -17 -82 20 62 -2 -66 -69 -4 79 44 -82 -89 4 56 -3 -39 11 -36 33 21 -45 -89 -10 12 34 54 -39
2473 -39 -32 34 18 -8 25 -83 -31 24 10 69 -26 -3 26 25 112 -46 1 6 98 90 -30 -69 2 35 77 -8 -99 -50 41 44 -4
2504 -4 -48 -89 0 28 12 -58 26 -1 65 19 -64 -45 92 65 41 -57 -60 30 -23 36 -2 14 -4 -10 35 17 33 -7 7 25 69
2535 69 -35 -84 42 51 72 41 -90 -25 23 61 111 -63 -21 32 129 63 -63 -93 18 71 97 23 -95 -82 31 106 12
2562 12 -103 -36 55 63 6 17 -46 63 13 18 -7 -58 -20 32 14 -26 23 -18 42 15 0 -125 -8 64 20 -28 -41 -10 -68
2591 -68 31 61 19 -17 -54 6 84 32 -24 22 30 63 -25 -25 -46 45 24 59 -32 -108 36 86 35 -2 -33 45 6 54 57 -43 -62
2622 -62 53 -22 28 -23 0 -34 -55 -17 37 -29 -28 -7 34 65 -2 7 -62 64 70 -41 -87 -64 23 55 1 -107 -49 42 34 7
2652Gq9Q5N8N4o8j04M2O6M7o2q6K8O8M6j36kj2J04j5k5k4R3j35O0jJ4kn5j0Q4
2682C0k4k3L6n2J02m5Nr0L9QM6J0r7o6N8J14J7j13m0N9J19l6r3m4N7P6knn2qJ11
2713I7j3j46O8K9k7N3m7qKj7k9O4L4j12J31n1j6L6nm8l1P7m8On6O2L5m2n2k9M9
2744c4NO1m3n4M8K4L6l4r3JJ30M5o4o6J3M2R2p6p5K4L8L4m3K9l6n3J27l4mj6o8
2775d4J11k7j5J2p2L3K4l9J06j07mJ1O1Mm8n9N0j8Nj9m7L4R0kj27j9K3Q2L5o3
2805b9l9O1Q1m3n4q9J18K1N7r4m8O3o0L8P9j44K9J11m8L0Nk0j6PqM6j8l7M3rL0
2836F3n3n6N0j8M4K1j00j3J20K1oj07L4k5P6n0l3o6J05M2q9M4q4O1N5L1j35K1
2864d7O2L2p4mL7%L6o9J2ML7l3l2Q3p5P3J6k0j3m5OJ3lO6o1m2l7Q1K2M7q1j28
$$ plain form
2652 7 -82 3 61 115 47 -57 -15 51 98 36 -50 -22 46 92 -44 -46 -58 46 31 6 -18 75 -60 0 -1 13 11 -44 -54 30
2682 30 6 -17 19 -33 69 24 29 -61 -22 -14 32 42 -55 -121 -63 51 68 -45 -85 -26 93 57 -36 -80 -23 53 51 46 -6 -14 97
2713 97 84 -62 6 35 8 61 14 6 8 -9 -38 26 60 -52 79 28 12 48 43 -5 -36 41 -7 -1 -57 5 40 -2 -54 -83 -34
2744 -34 -29 32 -11 -65 -17 7 43 9 -84 -83 47 92 28 -38 -25 17 109 33 -42 -18 20 54 11 40 4 -49 78 44 40 24 -44
2775 -44 67 40 25 37 -35 -2 22 -17 89 -18 -22 -11 50 54 6 -53 -3 -21 -16 -35 -82 -48 42 40 -87 -106 -83 -1 34 -29
2805 -29 -68 -7 74 31 -23 -112 6 27 84 -10 -58 5 -55 -17 62 -82 -53 58 10 40 45 25 9 16 8 54 36 -1 42 33 63
2836 63 10 -46 4 -14 30 51 -49 -62 58 79 73 -34 0 -25 51 1 -32 -98 7 49 -40 4 -80 -19 36 67 -68 -47
2864 -47 15 47 -27 -31 6 6 42 -27 -15 -11 26 -7 -39 44 -31 42 58 38 25 -20 -14 -1 -4 62 1 -41 -78 3 25 72 -9 -137
2896a37J07M1N5r4J4n6J36j6kr6M7J9PJ1j05KR1N1j02o9Q5m6N3P1j02j0M3nKL0
2926B5k2o9NN2M0j5k5ONN6l2p7L9K1K8M9m1p1J7N7rl4m9M5P5J6k02O3P3M7m9p9
2958e5L9l4L2R5j19OL2qQ1n2k2k3l8J00j7m1k1J7L7J1l2r3J02Kj3K8K0o5l5Q8
2988B2l5N0j16J02m5P9k5m5M7kL6m3Lm3N0L5l4l9KL0J14j31K0j06J45p8J9l2m
3017b4QQ8op1L3j44J06Ll0l6k0R5J0k7oq6N4nR5j9j06R3l6N8P7j58k8N3P2J1l3
3048B1k0pO5K5l9o0N9Nk5j4o6K2J14qRj60P9qJ09r8N3n8qL2m4L7l7J0k4L6K9o6
3080c7N4l9qK9J6j3o2N2l7M0m7MK6P3j9o9q7J33MK4l5j32J07R8Mr3p7Q3O4M1p9
3111A8p7K5Q8oo4KJ5k8Q7%L6p1%qL4k0q2MR3m3j6M4n1L0l1P4n6m9J9J1L0oj0k4
$$ plain form
2896 -137 -30 11 66 -28 -14 -70 66 50 48 -48 -1 18 25 36 -69 -67 24 75 -27 -96 -11 -57 -4 67 -35 -45 -2 -7 -5 25
2926 25 3 -66 -61 -9 31 16 -9 -3 2 58 26 -51 -12 9 37 86 45 -26 -9 48 39 5 -44 1 76 92 -110 -47 26 73 24 -55
2958 -55 -16 -50 -18 77 -42 -36 -4 -12 69 17 -5 -28 -66 34 17 -24 -45 -28 9 20 -12 -105 -3 -1 -14 14 34 -31 -66 22
2988 22 -13 37 -79 23 -22 57 32 -13 34 32 68 25 28 -15 35 70 36 -3 -1 29 143 12 32 -74 71 -7 12 -20 -24
3017 -24 -16 72 66 -5 28 -116 -10 -7 -37 -73 -93 2 12 -15 -21 -107 -53 -58 37 18 -88 5 -31 27 104 -54 -82 -29 43 54 21
3048 21 1 -6 59 84 45 -15 44 49 24 10 -56 -34 80 72 81 -79 0 -8 101 3 56 -2 -10 22 -22 15 -22 -12 -36 0 29 -37
3080 -37 17 -22 -30 -1 15 2 -60 -8 -45 -5 -52 -48 -22 51 32 -37 -124 9 13 37 2 -130 -23 75 79 -14 -91 -8 56 97 18
3111 18 -59 -34 54 48 -16 -14 1 -27 60 60 96 25 25 17 51 31 -51 -47 46 3 -13 31 -20 10 -21 53 -3 -52 -33 -22 8 2 -8 -32
3145c2O4L3j22J8L2n1J04k3m5kO1j4Mk4o6L5P8n1%r5J02K5l3K6j5m5O5Kn4ljJ3
3177a4L3MQj07L0P8m5N4n9k2K0J8m7P8l4%P6n5q0J2J4L2l5oK4OL5J6l4l2LL8j7
3210hK8Pk6k5Q0p1L3l2M1j1%l5N0ql6L9l4n2R5m5J3M7n4Lk9N0M6q3q6J06k6M0
3242A7qp4qL0Q6K4o3j04J55l4K0j48J34p8P2J8j3k9j1RPOJ4o9M7M6nr0m6J00K9
3273C4j2o7J2MN7K2n8k7N1rJ9p5J0K3JO7o2Nn8pQ8Oo1O7p4J13n2j3j07J17OJ7
3305C7J2q9j6M6m2P3n5l8Q7k5J6km6N7K4n9P9q6J9j4M7jo5kL7Jq1Q8p5Q1j1K1
3337A8m0NnK3M4k6n6kmN1Rk3o4M9J5JqK0KN4lp6J3l1Q6j0q8j1j4J39j5l1r4L4
3371c8j3K4J0j9L1Jq0Q4J9n6l1O0K2k1j9J0qM5PpLr5J05nk0o9P1K7%J5m7k2n3
$$ plain form
3145 -32 32 65 -57 -39 -7 -58 46 23 -22 -24 37 23 27 3 -63 -28 50 -1 -1 -96 6 31 -2 24 9 -36 29 31 -23 -26 -27 -14
3177 -14 19 23 31 -76 -46 32 -13 41 -18 -40 -20 -2 -49 29 -5 -5 71 16 -64 -52 -38 -6 -41 -47 -23 -17 18 34 0 -32 -29 9 -8
3210 -8 20 27 1 -24 56 -15 18 -14 27 16 16 -19 31 23 -13 26 -8 -60 35 -10 3 50 -4 -1 -30 20 66 -17 -103 3 -23 17
3242 17 9 -65 -73 -43 43 67 4 -100 55 21 41 -107 27 -51 21 39 26 -3 -14 -5 2 8 22 -47 0 46 41 -49 -95 5 34
3273 34 22 -45 -33 -29 28 50 -8 -35 16 7 26 -49 -39 -16 -15 52 -10 -5 -63 -70 18 24 -37 30 -44 69 17 4 -103 14 20 37
3305 37 49 -40 -56 -10 -52 21 -34 -72 15 -10 6 4 -42 15 39 -20 59 -27 -8 -22 25 24 -41 -43 -6 -5 -86 2 -73 8 -3 18
3337 18 -22 -17 -22 1 45 19 -37 -39 -43 8 17 -6 -70 -21 -6 -5 -13 7 9 63 60 -16 -3 -34 52 42 -46 -57 -71 68 53 22 -72 -38
3371 -38 -51 -27 -17 -36 -5 -4 -84 0 19 -37 -68 -8 14 -7 -26 -16 -24 21 28 21 24 -71 34 29 9 -60 11 38 38 53 6 -16 -69
3404f9J40o1L7p9kP2k9Mm4N6j4Q2q2l6K4K1l6L2K7o9PJ8L7n3oM1m3j6L5k9M8O4
3436G7Qj03K8K1k9L7J2j05J6L0L2L3q8Kj7O0lM0o6m3Q3Qm9j7K8L8o5P6n8J2J9
3467A7j2L5m2o3P2j2R3m5n8Rj6J5N3m8J3n3K1J4k7j9J40j13Q4o8j1k7L6Pol7l
3498e1MO3M2p1k9P0J1j0jlol8Q4r0rk0M6M2L0j00O8r7L9J4N1q9O2PRQn5J4j9M4
3532B0J4pk9J2J9j8k1n1M6K4J1q1lQ1k9M3L2l2l0k2N7m4l4k2j3Q1j0pPm0M6Lq
3565ejK5rl3J9k7%MM8m3O5j20M7L7K3L4j17J09m1P1r1j1Q0o0qK2p7J2J40l6Lp4
3597a4l4J0M3jK1m6OrOK2p1N7j8O7rj3oK2l6M3m9JJ4O0k8mo7qOM8L7r4R1j00J08
3632E5n4j1m5l0Q8N6q5N5l8J9j0K0J9k7Ml3pM6m2J2K5k5K4m1L2JL4o6J7N7n6n
$$ plain form
3404 -69 71 10 47 -32 -34 38 9 13 -31 25 11 93 11 -25 -1 20 -16 16 43 -26 -19 -1 36 -17 -23 18 -25 -41 -6 -35 13 77
3436 77 85 -18 10 31 2 39 51 -54 -38 -8 24 57 -31 -29 -46 14 11 51 -15 -58 25 33 -16 -33 -5 33 -32 44 -14 -2 17
3467 17 5 40 -2 -65 7 -5 88 43 -15 -6 -22 -7 46 -2 11 -42 -21 -7 -34 -53 87 -26 58 -10 -21 -48 -12 -5 -11 -48 -51
3498 -51 -47 16 58 -13 -42 28 39 29 28 25 19 -19 65 -25 -34 -54 -8 34 64 -36 32 -65 -26 -12 39 -50 12 19 28 36 -19 -5 -24 20
3532 20 34 27 -2 10 29 11 -10 -61 -15 9 20 -61 -64 17 -12 31 63 31 1 -21 36 -8 -42 -64 -77 4 -6 -13 -6 -46 0 3 -5
3565 -5 -6 19 10 -23 -4 -31 -31 -27 21 -22 43 -77 -30 7 30 64 -53 56 15 86 -5 -16 64 4 -4 18 -59 -47 93 57 60 -14
3597 -14 -48 -38 5 4 25 -21 -15 -24 -18 4 -67 -10 -28 39 30 17 11 33 -3 40 -9 -8 6 66 38 34 -33 -41 -35 13 50 -44 47 -53 55
3632 55 1 -10 -55 -85 3 59 -26 29 -9 10 0 20 39 12 16 -17 -24 22 -20 -8 17 -8 16 -25 7 8 42 -24 -7 50 -6 -11
3664a1M8q3jM5J8mj8l0k2N3k5L3l9M2j7P6p9L8KN2k2k1m0%l6L7L1l5J1K7k7Rn0
3697c8kj1R3j4q6N6K5k9k1R9j01j9N6J8m5JLq0J11o1L3j5OP3J9p3k6J3l3N3J4
3728A9Mn0PL1lkk7l0P0J4jm8L2l5L9Rr9M8O7l0L5n9l7J11k7jk8J2qmJ7prn8Q6
3763C8rk5m5J1J2NK2m1K1J6p3L6l2k1J55m1Jn7K2lJ14o9m5l4N7mP1j16n0P6j9
3794b7m1O5p0O9q1P5m6L3M4p4M3MM9l7o8J20j5p8K8L5j9J7K7KK3o7k3K4M1o3N1
3825D1k8rN8j3K2k4m5N2l9j6k5N0K2l8l2qL6J1Qp3m7Q6l8J7lL9o2J3k7P5r%JJ3
3859Hqo2Q0JM2p5J5J5k3j6O5q9O8m5L6o6O2Lj4OK3j5OP0j40R2l8O0l3o5O7K3k3
3892C0j05O5K1l2K5m0Q0l3OK6o6k4l8Q4N5q1J5P8j07M1Kl8%L1K0M6r9qL5o1N7
$$ plain form
3664 -11 37 -46 -47 -2 16 12 -6 -36 -58 -5 -30 3 -36 6 -11 65 -14 24 26 78 56 35 -5 -5 -41 -4 27 -8 3 30 3 12 -38
3697 -38 -40 -51 42 28 -58 -2 23 -6 -27 72 -29 -48 8 26 -19 -18 -15 -95 16 -45 -12 -27 -21 52 71 -2 -28 -15 -48 5 19
3728 19 23 -27 -20 11 8 6 -21 -51 19 33 32 -16 16 -19 20 29 -70 -22 45 15 50 -9 -46 65 38 37 9 21 13 9 26 19 10 -48 38
3763 38 29 4 -41 -30 -18 -13 9 -32 -11 5 -68 -32 -64 -85 70 29 30 -27 -5 -8 106 37 -8 -42 15 11 82 -34 -84 -8 -27
3794 -27 -68 -3 -73 -4 -85 -10 -56 -23 21 -53 -10 -6 43 6 -62 58 43 -35 -7 28 9 26 53 55 78 11 -12 12 53 -10 41
3825 41 13 4 62 49 71 47 2 54 15 -1 -26 24 46 8 -24 -32 4 15 23 -50 -97 -11 -49 -32 -35 4 -58 -45 -72 3 -6 -6 -5 8
3859 8 0 -62 18 19 61 -14 1 16 -7 -23 42 -47 21 -24 12 -54 8 11 -3 3 26 11 17 87 -53 39 1 61 28 -37 30 53 30
3892 30 -75 -10 11 -21 4 -36 44 11 17 43 -23 -47 -85 -1 54 -27 -12 66 -41 0 2 -36 -36 -5 15 61 -38 -46 -11 -72 -15
3923a5j5k3PP7l6m1N9m6L6koJL4m4MP7m0rpK0J1Lo1jLR8q1m1Q0l9K0%Qj2OL8K1
3960H4j27K9N8o0M0l2J7op2M3M9k7K4j6l7qL4j4k0N5K5l0p4K7J1kO2m8J9j5N3
3991D2j7m1kKm7Q5j3m5K9k0P7kk0Lm7O6n1j8k4NM6mm3O4m2m3N1K6J0o1k3R7Ql1
4025A7k6n3O9j7j7N7k6l0QL8p0L0L5k3o1N5O9PQm3n7N5m6L4J2O5j09N0jJ1l6J5
4057B0q0J01J5n7pK2m2J2J7k1J5nK3J26r2p1N1Oj6l1L1j6k6N3q1N1L3k4j0rj3
4088b5J5m3J1N7m7k1N3K3k1k3N9j00M2M6p1K6m6Q7Qk3N7o3J4p4O7J7k1l1N5L7
4118F5m1l4PL7l1Oj1N0K0m9lOj4Qj2N2o8m6K2rK6J1l5kQ1q0N3Mn6N7K5j40J53
4151E2o9j2K8N0j9ll1K1L5k2jq3J29q9L7mL7o4%K4o5N1j9N4pj4kn6R8m7L4l8k4
$$ plain form
3923 -15 -30 -53 -46 31 -5 -46 13 -33 3 1 -5 -4 30 -14 -10 67 27 18 11 31 42 45 -16 -17 -14 84 3 -38 42 3 23 23 31 19 25 63 84
3960 84 -43 -14 44 -16 24 -8 9 3 -69 -26 23 -4 20 4 -33 -41 -7 -21 -41 14 39 9 -65 -38 -27 -29 33 -15 4 -11 42
3991 42 25 -16 -18 -16 -63 22 9 -36 -7 -27 50 48 28 31 -16 50 -1 -19 -43 -38 8 4 -39 25 -17 -60 -9 17 27 -34 -57 40 48 17
4025 17 -9 -62 7 -10 -27 30 4 -26 -18 20 -50 -20 15 -8 -69 -14 55 62 70 27 -30 25 -21 13 25 90 -19 31 30 41 5 20
4057 20 -60 41 56 -1 -8 14 -28 -16 1 -20 -5 -10 13 139 47 -24 27 33 17 -14 17 1 -25 28 -53 -2 31 7 -3 -12 -25
4088 -25 -10 -53 -42 15 -32 -53 0 23 2 -21 38 -62 -20 26 -45 -19 -65 22 30 7 64 1 15 -59 8 25 4 -27 28 65
4118 65 24 -10 -3 34 3 9 -2 48 68 19 16 22 8 16 4 56 -12 -58 -36 -45 -19 -8 -43 -45 36 -44 9 13 -43 14 39 -101 52
4151 52 -17 -29 -1 49 30 27 -4 17 52 30 29 -54 75 -14 23 19 56 -8 -8 16 -49 2 -17 37 30 16 14 -42 56 9 43 5 -19
4184a9J9K2k5k3kO4j05Q9K7n3j2L8Rm7mq%nN8oj4j1j9j5P5j7l5K9j5k3P9j24M1
4217c2K5l1Q1j00J36n0J7K0lj29P0KpJ5%oO1j10R1j09O3MKqk1k3P2nn1j7K1n9
4249h1P7L7l6N9m2K2j5n5m5K1M9J3J1k9J0K2q6L1J2K5K4j4j1%j6m7R2n6JL5n0
4280d2J9oL9j0O3k2K8o2l1J7K4L4J2n6M7p8kR4q0J9K9J3k5Nn6J3m8Q5k6nm2O6
4312A6P0l8j50R2j0K8m1J5j1Q4k3j3oj9Rj5P6p4J9m0K9j0L7k4P0o5%K7j7j1Pn4
4344d2Q5j7K7n7L4K0J0J4r7NK0k2l5O1L0m8M1j2Ll4L3j5k4jrJ0K5rM0n6LK0nl5
4378c7L4lo2K7M9l5M0k9P6j05M5n8N5Jl1L8l7M2M3l0l4J1m6%Q8r8N2Jk7k8O4j8
4410a2k2M7M4k5jn8jQ5q4R5j47M3qN9k0l6J5J5j7J4k0N9k5J1M2p7ll5O2j7K7n8
$$ plain form
4184 -19 0 22 -3 -26 -28 36 -69 20 47 -6 -18 20 29 -18 -22 -30 -30 -35 23 17 3 -8 -27 -42 33 16 -19 10 -5 -28 51 -73 -32
4217 -32 -7 -38 43 -57 79 29 46 66 63 -66 4 6 -1 14 14 8 69 -41 50 -59 4 8 10 2 -19 -42 30 25 -26 -43 -22 -81
4249 -81 -4 33 -3 56 14 36 21 -34 -79 -58 -9 4 15 -14 -4 18 -68 -37 -25 0 24 10 -1 -1 -17 -64 28 -28 -27 8 -42
4280 -42 -23 -29 10 0 63 41 69 7 -24 -7 17 51 63 7 54 -24 -26 68 -12 7 36 49 24 29 -27 -14 -62 23 -3 -8 -50 16
4312 16 86 48 -102 -10 -20 8 -33 -18 -29 55 32 19 13 -6 3 -12 64 -10 9 -31 -2 -12 25 1 71 6 6 33 16 5 12 -42
4344 -42 43 26 53 -4 30 50 60 74 -23 -18 2 -20 -55 6 36 -12 29 17 20 -14 19 4 -20 -21 -30 -20 5 -4 36 -20 -17 3 -2 -37
4378 -37 -3 -6 -68 -41 8 -27 13 -16 60 -45 0 -58 -3 -2 -33 5 -32 10 53 23 -11 0 -46 -46 42 -56 -4 -3 -30 -58 6 -12
4410 -12 -34 13 57 32 31 -27 -28 57 -27 68 -79 -36 -44 15 -5 -41 -26 -11 -28 -14 -34 25 0 11 53 -24 -27 -62 0 -17 10 -48
4442d8O6L6n1j9j2k4L9J3l1K5jOQlK4n8pJ08p4L3j8K2k6K6l0j5Mk0j%N1l4M8j7
4476B0q1R6o6L6KN5n9om9N6K2n1L3j03R8l8j7J6nl2J01o6%L1Qj6O1J9j61J22l5
4507ik6M8mK8l2O8n5k2J7k4M3L8r6O2j0j8%K3K1M3n2j13O5L6n2L1K0Rk2j7L9k2
4539A7j4N3l6l8kJ2k9KnKk3O8mm2j6J8k4N6Rj3nPJ1J8rn7qP1j6m3J29r9J8n6J04
4574E6l2o5K4J1j2JN7j2l3PL1o2M6q9Q0l1j7P8jm5j6N1q9N5K8m9k2P8m3j9l3J6
4606e1PK9K1l3k7K7O8j1q7P1l2k3R9n3J8m7mm1N0lM5m7j9R1r0J06m2l6L0k8L0
4637A8O0r3O1k7k3lL8k4L6j09P0O1m6j0o4L6kJ0Rj1QJ1L9l4Kk2M8p1L6Mj8J0L1
4670C1r0O0o4N3k2K7o0J03n6k3lL2O5q6P9k9Pl8K9k7J0nM7l0n5L2J4m0nL1L0K5
$$ plain form
4442 -48 18 54 3 -16 -28 -52 -13 0 -31 -6 -7 -1 7 4 28 -30 -37 71 -3 30 12 34 8 34 4 -11 -7 -27 -28 -28 23 -11 37 20
4476 20 -61 35 -31 5 7 62 3 -3 -52 4 26 -25 8 -95 3 -35 -52 -36 -41 -73 28 -38 -38 -7 1 -15 46 65 -96 26 -9
4507 -9 -35 13 9 37 5 73 18 -4 13 -11 32 70 -26 36 26 8 8 31 52 95 43 -70 -5 31 -21 10 30 39 17 0 39 17
4539 17 3 56 20 -18 -20 -8 -37 -35 -40 -38 -61 7 3 -39 -55 -37 -61 -5 4 -9 -14 -7 4 22 13 -44 -52 19 3 -40 89 -10 8 -48 56
4574 56 24 -41 -17 -6 -18 -17 40 28 -5 2 33 -29 17 -72 8 -23 -40 38 37 -8 -24 27 -62 -7 21 -28 -50 28 -15 -34 -67 -51
4606 -51 -44 -15 6 -27 -54 -27 41 30 -57 14 -18 -41 58 5 23 -24 -28 -69 -19 -22 23 -24 -43 48 -42 64 22 -14 16 -12 18
4637 18 78 -15 46 19 -4 -7 31 7 43 -66 4 65 19 9 -55 -19 -21 -11 -2 -13 -5 6 45 11 13 -9 39 -32 4 8 -10 0 31
4670 31 -59 1 -63 -10 -32 -5 -65 38 -18 -41 -44 -12 53 -33 46 17 24 -14 15 -12 -2 -7 40 10 -45 -13 1 -39 -44 -13 17 42
4702D2m1m3M5O2p6J3k0Qm1N0n7L7K4J7m3J1M2n6K2K3J9p2L9J1n4M1M4j01nP4p
4733HMqL0p3PP6m4J8m6j5l8J05j5K6n5MN5k0rJl7Q9m0kjj1n0J32j08J1ONn4P0
4767B1lm2j3K6J1m8N3o3N6k5N7lo0LN8n9M9j3r4L6P6l5%n5K9M7J9j13J19m8L2
4798A8p3L8oM9n5R9r1m6M5L5l3L7j0Pj1k1N9jl2l1P6n7J5j7jQ9j28M2K6pj7l6
4830c8R8j28Q1p3J14r4j3O6p1O1Pq0L8L3n1L5Q%k0J09p2p0M7j7k2K7j3O9K6p8
4860b1O1q2O0k6M3m2K8k6K9Rp6P4l5J9n4M8j6J1L5on8J02n7k0L2p7M8K2o5M2j23
4891a21Q1M7l6n2M1Q8m8k5J5K8o4K0O1o1J3pK1kN9q6j6OM2o5J29q3J3Jn0N5N0
4922E4k0o6O7j07M2N4k1J7k5M2k7Rj8m8L3M4n1j3M2j4N0n3m7N1RLl6K5kNNL5n1
$$ plain form
4702 42 1 -42 3 65 -11 2 -18 -10 -51 -1 -58 -21 3 20 -23 -12 30 -26 -4 19 38 -34 5 16 -38 3 47 -54 -59 15 8
4733 8 12 4 34 -39 -32 44 0 18 -28 -43 -81 24 9 35 -20 -16 39 19 10 11 -26 63 23 21 20 9 -41 91 -17 -6 0 5 -49 21
4767 21 18 -24 -37 -11 0 -48 5 -58 -2 -27 30 27 -33 -30 28 -31 18 5 -89 -53 23 -12 -12 -67 -38 9 28 -85 34 -14 18
4798 18 -55 -17 -23 26 -29 70 -21 -67 -22 13 -20 17 7 14 3 -18 41 40 8 -23 53 -4 11 -6 -7 82 -46 -4 22 15 -2 -38
4830 -38 60 -68 13 -60 54 -40 -53 13 -58 3 10 -70 -32 1 -50 -15 -7 -7 -27 82 10 -60 -13 -30 -52 -25 -38 31 57 -21
4860 -21 40 -42 18 -8 35 -7 21 -5 24 33 -43 31 -4 15 -39 9 -7 4 39 33 -25 77 20 0 32 -45 3 25 -40 2 -121
4891 -121 -40 7 -29 -81 -40 48 0 -25 -10 18 -46 -26 35 -26 -13 -20 1 -1 58 -28 -44 -38 4 -61 68 -15 -2 -1 -51 4 54
4922 54 34 -32 35 -72 -30 24 3 20 -5 37 10 19 1 -47 -14 30 -21 -34 8 -6 44 -9 -56 -5 4 7 -29 -4 -6 -1 4 39 -12
4955a2k2L4j8k0kJ6k2M3K7k5l4K9k7J7l1JK1K8k1mjJ4P0o1K9p3N9J5N1q9j1N2
4987C3nl9rN2l0P9j11O4o8N0J1k8l5K7J5p6J27j04M9Lm9m5N0M7Jm2m7O9k0P5q7
5018d3qN0k1N7n7J1JjkMJ7K4Rl7m4lOpK2N6o4PL2lk5J1L4m2M7j0p6L5mO6j7J9
5054D4o7M3m2L4j1l8K9L2K9p6k1L6l1P7l8K4k2lJ5o7O8l9mM7lK0r6kJ10j3p8O0
5086A7k6k3K7j9L3n7K2L7oj3nK2k8M9p0L6J3k1M2Mm5k3PK3O0l8jNLl6J0rK7n3
5120c6L4L3k7m0Q4Oq3nQN3j3o3K5M8n8N7l5N4n5lmL4j2pqj3j6K2k2kK1M1j9L9
5154C8Lk7k7l5N5Rm0jL6L2j5m4J6n2M8J8n2N8n2M4j1L0n7K2N1m2L1j05Q8k9O1
5185E1Oo4m7L9N7oj15P6m5PL8L0l7N2r4O2m1J4rj9N2j4J6j2pJkO1K3q4L3n2K6
$$ plain form
4955 -12 -34 0 -18 -38 -40 -24 -46 -3 24 -1 -35 -6 -33 -16 -47 -46 -25 3 -18 -22 -23 -9 61 0 29 -44 15 30 81 -8 -19 33
4987 33 28 -11 -20 32 2 81 -30 34 -34 16 27 -1 -36 -9 6 -70 57 -47 2 5 -44 -89 -39 8 9 -33 -80 -11 -31 44 -43
5018 -43 -51 -1 -22 35 -22 -11 -10 -11 -13 -9 8 32 41 4 -40 -43 -37 -44 -22 34 -30 -23 9 6 -19 -8 26 -16 31 21 -55 -20 -24 42 25 44
5054 44 -23 20 -22 12 1 -37 -8 24 53 -23 -44 -8 -39 38 0 24 2 -1 14 -53 15 -24 -28 19 16 36 -60 -62 48 35 -43 17
5086 17 -9 -32 -5 -24 9 -48 -26 11 5 -8 -13 9 -19 30 -40 -4 9 -12 30 34 -11 -34 -27 -4 56 18 17 22 25 -11 -1 -10 17 -36
5120 -36 -2 31 4 -36 48 54 -29 -34 -26 27 14 -49 -24 24 -34 23 -12 42 -13 -16 -20 14 2 -5 -13 -26 -42 -20 -42 -44 -23 18 -1 38
5154 38 41 14 -13 -48 7 16 -24 -25 11 43 28 -16 0 -52 -4 14 -38 20 -32 12 1 31 -26 -4 47 5 36 -69 19 -10 51
5185 51 57 -7 -54 -15 42 36 -79 -3 -48 -41 -3 27 -10 42 -52 10 -31 -17 -26 -45 7 -7 9 -3 -10 -9 -11 50 73 -11 22 -30 -4
5218drK6o5Q8p5L4j8P6J1o5l0k0N8n8M5N8j07R0k2MRn6J1K4o1L1K3J0k5j0j8K7
5250a8k2M3j4p2M9K1M6n7J4K5k6L3l2n8M2noj9N7K4k5LK0l0Mj6n1P8k9Mk5P2m4
5283a4M7l9j7QK1J6qj8m4N0QMJk8m7J16o9m8J02m5j7K9j0QK3ko7rK6k1J5K9J2
5316A2Ln4m6Q1K2MmJ9l7l7O0l9j5J0j9j1M2K7K9q7L6M1p7L1LK2J6n1K6l2J17L
5348I5j27Q3l5k3m4P6kn5O8m1m7P0n2nM1N8p7J1lL6l5J5nl0m8PP2k1j7P4ok7K2
5381B8p4O7j29J02L8k1J8m0K3k1mm5O3K1r2R6p0M0j6J3K2n4R4l2p3P7p8kL1l8
5411e6K4k8QM8m9M4Ln1%Q2l0l5L6k2k8P4n8J3J3o9P6O8j40L9P6j4q1N5LJ8qN5
5443F6q9L8MN4o6qJ5j4j6k7O2o8O3j0j1J3K0Qj8l5K5k5L4K4q5L9j1J9pok6J9K9
$$ plain form
5218 -4 -13 13 -52 36 -39 -5 -23 53 64 -1 -31 -51 7 -51 -6 52 -55 35 13 17 26 -30 -19 5 -56 -25 -2 8 -17 -27 -45 -18
5250 -18 -40 3 -11 -83 -34 -13 33 -24 -10 15 -11 22 -10 -68 -26 -31 -37 -56 1 25 0 3 23 -7 -3 -19 -70 8 -21 -17 -42 30 -14
5283 -14 33 -6 -23 -15 6 22 14 -4 -48 2 10 14 15 -13 -60 56 -13 -61 41 -4 -21 8 -2 6 29 27 -40 -49 -23 -44 -29 0 12
5316 12 15 -39 -85 -4 18 22 18 37 0 -37 23 -16 -31 -21 -40 -51 -9 18 47 -40 -4 37 -40 -9 -6 16 32 -19 7 -25 92 95
5348 95 -32 51 16 -7 -51 25 23 -32 36 -5 -52 18 -34 -39 2 60 -17 -6 -9 27 -8 7 2 -28 -76 -69 3 -18 -35 39 33 6 28
5381 28 -46 21 -108 -6 32 11 29 -11 12 -9 -13 -58 5 26 -66 30 -40 0 -16 -3 19 -35 59 27 -46 31 -47 -49 -18 -56
5411 -56 -32 -60 -52 -4 -53 -9 -6 -57 -57 25 -5 -40 -4 -26 -54 20 -38 -25 -12 -81 -5 63 -77 -38 38 24 -57 -2 1 19 11 66
5443 66 -23 15 19 73 7 -1 14 0 -16 -43 19 -49 14 4 -7 6 26 34 16 -19 6 -19 15 39 -46 -7 -18 1 -6 -12 -38 -19 10
5476A0p4M1JQ7k6n7P6j07N8k0%K1Op5N2%j0Np2O9K4O0%r5K0l0P5q3J7K0J4j9J8
5509Fk4K7Ro4Q8J1p9L6j7L8N4j06%K1o0J04j2m7qL4K6m9n3M1PN2l3m1nO3j8K3
5541B4k2m6O0k3M9j2p3l8N4L%K7j0Mj5R0j10M7n6rO5nM1o8L3l4N1k0m1J9L3l1
5573a3LJ5K6n0rN6l6l1L1mkM2q6Q5o5N1MPl2j2j5pK6L3m4pNJ3l1K0L9p5O9%m4
5608c8l1O0L3n6L3l6L4j3L3m3J2JM6n3K2l9O6k7k2Mk6l5K9N6k2O0q8J3L0J9m5
5639b3P3n6jl9R0o2J5m6j3J13p8LNK6K7k5N9j21M7LOj1j1Nj1M1l9Moj0mj0OQM9
5674A4m7N4q6J15j08K8LK4JN2rl4m4L5k2L7n9L5j0qN7l8M2n8oM9qm1R2np7O0Q
5707D6n6l0rj7J5KN1j1m9R5kn2K3Ll8m0K7O2l6k3K5Jl8N4kl2j4O5n2k5J40j7o8
$$ plain form
5476 10 -64 -23 -22 65 39 -18 58 -49 9 -11 -11 10 16 -59 -7 -7 -17 -12 -84 -15 9 69 69 -26 -6 -36 39 -44 -27 -7 7 -12 6
5509 6 -18 9 18 -46 42 53 -26 10 -7 31 85 -21 -21 0 -60 44 32 -15 -23 11 37 -12 -65 -24 -17 35 2 -39 -44 19 1 24
5541 24 2 -44 16 -7 42 30 -43 -81 -27 -24 -24 3 -7 -3 -18 72 -38 9 -47 -56 9 4 45 -23 10 -24 27 7 -34 -15 18 -13
5573 -13 -10 5 31 -19 -28 28 -8 -39 -8 -12 -14 28 -58 27 -38 13 17 24 -8 -20 -35 -42 -16 17 -27 -34 -29 -16 -47 -27 12 -63 6 6 -38
5608 -38 -69 -9 24 -32 1 -35 -1 -14 19 -24 -12 -11 35 -18 4 -35 31 4 -18 -14 -40 -75 -46 10 -12 48 -40 -27 3 22 -23
5639 -23 50 -6 -7 -46 44 -18 -3 -49 -62 51 -27 -24 -19 7 34 9 68 -53 -6 -3 3 -8 -19 -14 -25 16 -23 -19 -25 -35 -39 -49 -43 -35 14
5674 14 -33 21 -65 50 -58 -30 -27 -3 -2 50 41 7 -37 -2 -24 13 -46 -11 -21 -29 28 -10 32 -26 -32 17 9 -32 60 55 -22 38 46
5707 46 -10 -40 -49 -66 -51 -49 2 -9 -58 37 35 -17 6 9 -29 -69 -42 20 -16 -39 -14 -13 -51 3 1 -31 -45 20 -32 -57 83 66 -2
5740bJ2M2p5K6K1J4n8K1p7Q0om0j3J05Qo4J2k3P1r1K6Jl1K4J7N3jp7Jj4L1K1k3
5773im9J9M2J6j8ll0N1qm6j4O2m8K0P9n9j2nL1m2P3K9o9m6N2M9p0j2MoN1Pn7Q
5807a0J9j8J1K6j3j8Rj9L1L4p1n4L3K4oJ2L4l5K5r1K8mL1K5jKj8J6K7n4N7n9N3
5840B6q0R9o5RL6j04R4j1k9j4M3J8K6m3J8n5P0j2J7k9o1J6O2jpL7m2Q9q9l6J7
5871aj1k6N8oq0J14l1Jk9p3Q2o4O6QJ06j13J6n2M0K6n3mN3j9q0J29r8L4j3j4J5
5902a9L4m0l7K9M1j6pJ7rk2P5K8n6Pk3M6n4k9N5k3qO5q7k6N6K8j9K8k7QK3m7M8
5935C9n4rM5L6m5l0J8J8K9p2K5l8m8P9n%m0J13j4n9M1Kj9o4m7L3N3L8j02L5M8
5966Fl0NQ6o4r5J56m7l1O3j8n1J1Q7j05K7k7M3j7N7Oj07K2L8j9Kl8M0L6k3k2L3
$$ plain form
5740 -2 10 52 -23 3 24 38 -20 1 -76 4 -2 -42 -55 50 58 -6 6 -17 54 -37 -11 -10 -41 -17 0 53 52 -25 -24 -38 -7 14 -9
5773 -9 -58 -39 3 19 1 -2 -32 19 11 -35 -49 13 -35 -15 64 5 -7 -12 19 -23 50 79 10 -36 16 65 -5 -17 -13 -19 32 39 -18 -10
5807 -10 9 -9 2 28 15 -3 6 -13 18 52 -19 -73 -40 -16 -22 -10 24 -11 14 -77 -49 -53 -22 3 2 4 -14 2 29 -25 32 -27 26
5840 26 -54 45 -20 -11 25 -79 15 4 -25 -39 4 22 48 5 23 -32 38 26 43 14 -47 -31 31 30 23 60 18 107 18 -18 -1
5871 -1 -12 -38 20 14 -66 48 17 18 -11 -84 -2 -66 0 8 114 1 17 -35 5 31 -22 -26 27 8 -72 57 -41 -7 -20 -34 -19
5902 -19 15 -25 -62 -33 8 -8 -15 2 -7 -29 46 74 18 25 2 48 -6 -35 20 -3 -11 54 -33 -59 -3 25 6 34 7 15 38 -9 39
5935 39 -15 -24 21 57 12 -18 0 18 47 -25 0 -38 -86 -7 -12 -12 -52 61 47 -12 29 31 12 -52 -99 -66 -13 25 -77 -42 6
5966 6 -24 -19 67 3 -92 64 17 -14 49 31 -20 -9 78 -27 0 -27 16 -1 56 62 -45 -23 15 -4 -2 -40 0 36 13 -9 24
5997B4r4R3OL2o5M6q9M3jk5NK4j5k1LRL1m5P6k5o5K3N8m1k8R0o6M4m5ON8l4L1
6030D3l4q0Q7J6m9J46j32N7l8Ko0M2K6l9j6pJ8OM7j2m9M3oNp9O3j2J4L7m9j4N2
6062B8K0q4J7l3ML4j9M4L4q0N3n1PN2p6L9j0n9O3oL0j4l5K6RL0k8j8j2P9q7JQ8
6095D6p9M9p0J29o0L5p4J1J4K5k3K1j4L0o1K7M4r1N0l2KK7k2K0k8j3l4J11j4j4
6125A2o5M7j8J5ro0Q4l7N5l7N1m2K0k6j5O9j04jJ04l6m5N1j8Lk1J7K5J2l3M8N
6156E1k1%j7j3j8Pj1qQ3K3m6J4k7k6N5q6l5N7N5n0L2o6j1N5qJ8m5plRK8l9O3k0
6190gnOkL0q4L3L5rRn5N6kJ7n8M5L2k5K9j3l5j5j2L5m2OM7l2j6Q0k6l8N3l0L9
6224D6%o7NN7j03L7K8L6k2k0Jj6j1P9l2p1K1K5L2J7j2nj7nmPl5L4m6L1Pj7N7r4
$$ plain form
5997 24 -70 23 29 61 -4 42 -47 -4 -5 -30 -25 -1 -16 -37 -34 -25 6 -39 37 12 -53 -30 28 -13 -41 49 -17 27 -18 -12 46 12 43
6030 43 9 -71 16 32 -17 129 -3 54 16 18 -42 0 26 -13 -29 -36 -18 -12 35 23 -26 17 11 16 -63 0 -12 2 39 -10 -24 28
6062 28 48 -36 -19 -52 -48 -14 -33 11 45 -35 18 -33 -26 26 -50 -11 -21 -80 -17 -23 7 -7 -42 -16 -7 23 -5 -23 -35 44 -43 -42 46
6095 46 -33 16 -54 75 15 50 -24 -13 1 26 3 24 10 40 -21 6 50 -41 9 -23 -21 6 -16 4 -24 -37 -71 40 26 12
6125 12 -53 -6 -24 -9 -18 -78 6 -31 24 -13 38 -4 16 -10 -25 44 -60 -61 43 7 -38 13 -5 -2 -23 -6 19 31 -2 46 51
6156 51 30 30 13 0 -18 -11 -22 -30 53 76 30 44 17 -9 46 -40 -75 -18 37 -13 19 -47 -58 -3 -11 7 -38 -45 -48 -39 -11 -50 13 -7
6190 -7 -12 -6 -8 22 -62 -29 6 -3 6 -49 7 5 22 -36 9 41 16 45 32 -3 -18 -30 5 -37 -31 16 -16 -32 48 22 -16 37 7 46
6224 46 46 -21 -16 41 -62 -25 3 39 17 -3 -2 -18 -29 50 18 -53 -32 -7 25 42 30 25 8 3 -1 6 -29 5 -41 -10 -3 -20 37 -57
6258e7Q2l8oJ7k7L0kj3k4KQ1p7N9k3Oj3J4L7j7r9R1j06K9Q5k0n8J2J00p5j7MP
6290a6Qk8P1p4J37r3K2m5Mk7N3J6o0M4L1j2p0L2j9kK5l5P3j2o0j4K1J4K4Jm0O5
6322C4q2K7N5p3J9KL3J4J8K5qj01O7m2K3KNj5l9N2J5m2L0q3Q9p7L0K2p2P6l6O
6354b6qMJ7k1k4L3K2mJ3k8JRM1k1L1m4mp0Q0om2P5l7K7l9K9p5P1k6Mk4N9k6m0
6388d9L1L7K3m3L1l4lm0O3K4rm0K9m7O9l7J8k5Kj5L5n7K9l7K7J6k9M6qK8k1k1
6420gl3P1p0J3Q1j31R6j4o4O3L0jj8Rm2N2r2R2l1k5M8l6P4p6L2j6m2J28o9k1L5
6451C6q3j5J00n9M9NJ6J4o8jK5k2KO1p3Jl0L4KJ4m6k2L3P9m0l9L4Mk9l0J5M7m0
6484b6l9O7k6N9m3J7o6M2L3%o3L6J4PO2j15O9Ml6J2kJ5M2k4J0j01K7k0K7K1m5
$$ plain form
6258 -57 25 -13 -19 -2 -29 1 -1 -14 -38 -36 45 -32 27 4 10 -3 11 48 31 -68 23 -83 -54 31 11 -47 -35 65 -10 -27 -23 -16
6290 -16 -8 -36 35 -39 98 5 27 -18 -14 -41 12 28 -32 12 43 31 -39 -7 -26 -28 -3 -38 35 23 -37 -51 -30 -16 8 9 -31 34
6322 34 -48 -21 34 -39 -20 -18 15 29 47 72 64 -37 30 -12 11 13 18 3 -36 16 31 -11 19 -64 25 -52 -22 0 -72 4 -32 -26
6354 -26 -34 -30 -13 -34 -58 -25 -3 -7 6 -22 -21 -12 29 8 39 -5 -9 -79 1 -5 -47 28 -9 18 -21 8 -67 4 -22 -18 -42 17 -9 -49
6388 -49 -18 19 42 -1 30 -4 -7 -47 16 40 31 -9 20 -27 42 5 23 -2 0 -15 20 -37 -8 -45 -18 -2 -31 15 7 35 14 -7
6420 -7 -40 31 -39 -26 55 -76 20 6 -58 5 35 34 16 25 -17 35 -57 35 4 -21 27 -9 65 -11 21 5 -37 91 22 1 36
6451 36 -47 -62 38 -21 28 33 49 63 -5 -6 19 -3 -1 60 -13 -12 -42 -8 -6 8 -38 -60 -27 52 12 -27 7 11 -18 -48 -33 14 -26
6484 -26 -65 2 -24 35 -8 9 -57 -15 18 18 -45 -9 5 12 74 -41 28 32 -4 8 6 21 63 39 49 -52 -25 -45 -18 3 -42
6515d2J01n1mjM6m6j5N5o3K5k3M4Jj6n3O3k9j9m4J08p9P4q7O0m6O9qKq1P1jk6
6547a5J3J1j4j6Q3o3Qj3O3p3M6j6L1m4Pk3j8lj1J04m7K0J7j00O4m7K9l5Q0l6k7
6578b5j8MN9n7J1j0R1j12Q0k2k1k2m3Q7o7P6n1QP5o9oj3L6k9oO5j0p9J17k5qQ
6610B4k0NL9j02J07o0K0mk4k9L3N0o6N3l7PK2j3k4oL0Jk4rRJ5k6K1K3j05O4J6
6642a0LL2o8M7n0N9nj7l3k9O5OJ00l8n9om6O7l9M8m1kn0P2l5O2p2N6%NL6m4l8
6675b4N9K5p1J0lL6%L3p0J8MK3k7k4O8j0o1J1L7k8j3n4M3P9m1m1K7m9O8j09P5
6706iojL8m9RM3kk4m2O0l4oL2Mm7J1N1k1k3k1LK4O5n7K0K1k5Nnk0k2M1mk5J0K9
6742B3rKrK5Jmn3L9O0k1q7MJ6RK6m3L3l4OoO1o2j9O5o7M1l9P3o9L1K6Km6J3m6
$$ plain form
6515 -42 59 8 4 3 49 3 -12 43 -20 5 -18 26 27 11 -42 21 -8 -27 -71 37 -42 32 -55 5 -41 28 20 22 -59 12 11 -15
6547 -15 -2 9 -5 -21 62 -1 7 -6 57 -16 30 14 45 1 8 -15 -33 -36 -47 57 10 30 47 -53 11 -36 -7 -42 38 2 -25
6578 -25 -43 -39 20 -37 -26 -36 55 -57 23 1 -20 -42 -85 2 -65 11 -40 -32 43 -26 -32 -45 -9 -38 -44 21 11 -68 49 24 16 24
6610 24 4 9 48 -54 53 -7 13 9 -15 -44 -11 39 -27 26 -11 -4 18 5 -19 -25 5 6 -18 -27 -18 -3 -29 -8 15 -90 -26 -10
6642 -10 -7 25 -43 4 -46 13 8 -9 -42 -71 -6 0 100 62 3 -3 -49 18 -21 27 -14 -16 -66 6 -29 33 -39 17 17 22 58 14 -24
6675 -24 35 60 -11 -1 -4 32 32 65 -5 13 17 40 13 -11 57 47 -14 -3 34 6 -7 -61 -18 61 20 -21 6 -43 25 -84 -9
6706 -9 -15 -16 22 -27 -18 25 23 -1 -43 17 -17 -23 9 13 -34 -23 28 7 -16 -37 -34 -10 55 -2 18 39 14 19 14 -6 -28 13 9 -16 -6 23
6742 23 14 16 7 32 33 29 -24 15 75 54 -33 -29 -13 -4 22 -21 12 -22 -16 -22 39 -23 -42 23 -44 -3 -42 31 -38 -7 19 21 -25 -12 -58
6777e8N9k3P8q4k0k7Q3J0J3o3J4MK3mnk9P0m5k3R5j13QR2n6mK6pj1k5QO0q8O9
6810B7lK8nK5p4J2j2Kq4N6K7J4j33J17j9J5L3k5qk7m4M2K7J6l4J5j8J8N5q8M7
6841Bl0J8J3n7Rj1M2nqL0k9j9N8J8k0N5o3j9M2J8ok2k4L6N7q5K0km2k5K0K0QK4
6875B3l9JJ7J4J2k0L2l3ok3k4J2N0l0J6n2KM3l9P8n1l8P8k1lk3M1k7l4J9K9o6
6907f2K6j5L0J8NJ9m1J3J4nj5N4m5K8J0N8j08K7m2O9k1n4j2J3JL4L9q3KQ4p4L9
6939Fl9QNJ5Mjm%M1qk1Nk7nq2J13K4j4n5nJ9JJ7QM5k6MJ3l0Qj5m6N5l2MM7l1L6
6977C7kj9p1R2o7N2m6M1k8j8J14l7n4n0L1j4P0m5J5l3J5O4m6l8l1N0Ko3N7N8o9
7008c3J7kL5j3l4J2J0l3P1q2O2k4NN1k2L3p1O7r2RPN7%Jn7l0J30n1m0K5PJ9m9
$$ plain form
6777 -58 1 -22 56 -28 -48 -75 8 18 31 -32 -18 -14 9 5 0 -29 41 -4 -27 68 -45 -37 55 -1 -5 21 14 3 -22 -14 46 -42 27
6810 27 24 52 47 72 -2 10 -2 0 -84 -28 -1 13 -120 -3 -22 -7 26 1 -7 -34 -78 -36 -9 7 -27 -12 -30 -12 43 -45 2
6841 2 -28 -10 3 -54 -45 -56 -14 -19 -27 3 -26 -45 13 31 11 66 3 -16 26 44 38 16 -8 28 85 0 20 18 -24 -49 -29 -9 -1 23
6875 23 -16 -15 2 16 28 8 40 7 1 -22 -46 -34 16 -14 2 -50 -48 -5 -44 34 -17 -55 23 2 -1 -24 17 -10 -44 -25 4 -62
6907 -62 -36 -51 -21 -3 2 21 -20 -7 7 2 -13 41 -4 24 34 92 -16 11 -31 38 17 -37 -49 -36 -35 -1 38 -45 -43 41 -33 6
6939 6 -33 -25 -20 -5 -1 -2 -6 -6 35 27 6 11 -16 -21 -103 10 34 20 -35 -40 -21 -20 -3 5 50 24 28 41 11 19 4 -42 13 -19 -15 32 1 37
6977 37 35 16 -55 37 -30 22 -24 17 -11 -29 85 48 -6 -56 -25 -39 31 -14 1 -32 -17 47 1 -37 -68 -18 -16 -79 -22 36 -33
7008 -33 -16 -18 17 4 -30 -18 -8 -41 30 -52 10 -14 -9 42 20 53 -18 49 -43 -34 -27 30 30 31 -26 -56 74 23 -17 8 15 34 -15
7041a5QJ0j9j0K2kK9o6N2ol3N9l9l5J9J1J7m8NKL0jl7K0L8n6J8J9J4PNm0l0J05
7075E3o8n6Q7m4Q8r5K3P0k9q6M8Q9Ro5k0j7pK8kJ4j1OM0l2k7K1K0j9j4m1L2J5
7107A0o2L1J0L5j2mlk6M0l8Q2p8Kl7j3N6J3k7o2O9pK3l7RM6m6Q4m8K0m7K6oM0
7140D3Qj7k6M1p6QM3K2Qk4q5L2K8n0K7L1kpk6n1J45q5Q2o4n0M8j8J1L3J0o4kM1
7173A4j8l2P1p3L1l8M4Nrl8R3q7K7J0Rl1mj8pO1n0L3NppM4n6L1K3p7Q7k1J6m4
7207a3J3l4Q6o4J8k8OL4L6om9l0M8o2M6m7Q4n6P2m2j3JKrJ5J2l8l1nN6J8J5r6
7240f1j8R3m3K4j6k3J0J7j1K1l0K2j6J2mJ6J8l1JM0l0m8N4m4j4R0k4n0O2nj7N0
7272D5j4j3j7L1J9m6L4j7Rl4Rm5N4n7M1Rpj3KP0l9q9L5k0L9n0J08l0j8j8%L3j9
$$ plain form
7041 -15 -7 3 -16 -26 -4 -6 23 -43 9 3 -30 29 -10 -45 -26 -15 2 -46 -41 -39 -9 -10 -47 -27 11 -45 -27 -8 6 13 18 -22 -52 53
7075 53 -15 -71 16 -28 60 -35 -12 58 29 -57 -9 80 89 24 4 -13 -20 8 6 20 9 15 55 23 -4 17 37 18 4 -37 -5 10
7107 10 -52 -21 -11 24 12 8 5 -21 19 -19 63 -15 -13 -50 -63 -7 6 -21 -83 -14 -21 2 -35 -26 20 -26 58 10 30 -17 9 3 43
7140 43 51 34 8 49 -27 -19 24 46 54 30 -55 -23 5 -45 -18 13 11 4 -22 -73 72 -13 69 5 -45 3 -15 -4 29 39 -25 -27 14
7173 14 -4 -36 35 -38 -7 -45 -1 4 -5 -43 50 -37 -10 0 9 -22 -26 -44 -51 10 -40 -7 -2 -9 -16 28 -28 3 26 -51 36 15 31 -13
7207 -13 0 -34 52 -12 6 -22 -16 18 54 48 -1 -31 17 -45 1 -46 38 -18 54 12 -1 0 2 -7 8 20 -18 -49 -54 2 20 35 -61
7240 -61 -79 14 -29 -5 -21 -44 -34 -17 -28 -7 -37 -15 -31 -19 -23 -7 11 -20 -19 21 -9 -57 -3 -47 -61 29 5 -45 17 12 -5 45
7272 45 31 18 1 32 51 5 39 22 31 -3 6 -39 15 -42 -1 8 1 -12 -10 60 21 -68 -33 -53 -14 -64 44 14 -4 -22 -22 11 -8
7305hK0QOkpm4j4J8lrQk1L3l5M9NK2Rnm7L9Ro3M4rl2M4K0k0o3J10l8llm5J8j2
7342b1nkK3j2L1N9r0m6K0M6On0NP1qp0K9nqj0K9N9n3J2k9L0K2q1O5%J2n0mL0j5
7377a0M1J4l2q3J08l3%L6l6K5m5m5K1LL8j2K7ok4L2K9j46Q1mM7n6j5N7o5n9J73
7408F1n7K5m0Lj8K0l3L0nj3o8N4L5k2O7r9O3J2j9Qk1JQl3kL7O1p4O0q5L3L8qj9
7442@p3J24p7R0l5k9pL7q8K5N9p5P1q7K2P9k9l2K5n6K4K6j7j6L6K9k5qpJ2l7L8
7474al9j9O5n7L7J9n9J8lJ4L2l7N0p4M5K5K1j7JL9n3NOj9M5k3j9N4o9K4J11m1
7506H1r5OmK8L6p3O1k7N3l7q0P8l5K7k0Nj8j1K5Ml9j8M4n7O4o9L3K6o1M2k6N5
7538bM8k9k4N3l8K6m0M4k2m0k5K4j9K7L8j0K1Lo2J7Rp1J17Qn4k1J4J9Rm4m0N4
$$ plain form
7305 -8 12 20 26 24 17 -27 -41 -23 -26 -35 -27 -48 -15 -50 -1 4 26 35 30 -17 22 31 -32 12 3 -29 15 35 15 -48 62 24 21 18 -27 -9 -21
7342 -21 -26 -28 -5 -17 14 73 -17 -63 -43 3 9 -41 -36 35 27 -43 -14 -19 -27 -37 -8 51 -2 10 -19 11 33 -48 17 17 29 -21 -25 5 -10
7377 -10 31 45 13 -70 38 5 5 41 5 30 -15 -60 -39 -36 2 -10 17 11 -13 19 48 -98 -17 -21 26 -30 -45 12 -53 -112 61
7408 61 4 29 -11 -8 -26 -6 -39 -9 -14 -27 -95 -41 -6 -28 39 -60 3 15 -4 4 -17 -16 -8 -41 -43 -6 55 -19 41 -44 -11 27 19 0
7442 0 -73 51 -26 64 29 0 -7 30 -58 -33 26 -49 22 -65 -43 36 7 -25 0 -56 -32 -6 -23 -39 -3 26 1 -7 -14 -2 -39 -1
7474 -1 -40 -59 6 -51 -14 5 -54 -36 -39 -25 7 -30 20 -54 -9 16 37 20 21 60 7 12 18 -1 44 21 2 56 -13 11 122 81
7506 81 -14 -8 -12 16 52 -21 40 13 66 29 -51 27 -8 19 -1 4 -14 -25 0 4 -35 -53 -9 -66 -2 -71 -38 -12 -73 -31 -57 -2
7538 -2 46 17 -7 46 8 34 -6 38 16 -24 -49 -25 -44 -17 21 11 32 35 -27 -10 -1 -72 45 53 -1 -22 -8 11 20 -24 -64 -10
7570a0L1J0m7k0J6J5L3n5j1O8o1J0Ll8M5k6N6o2K3pK9%j3n3O1K2J1K1j32M8O8
7601C5l1J9j1NM4o3Qk7j5l6Q3k3k7L7L0m5j8QJ9L0J4OL2p5lj0mM5o0J2%j6L2o
7635a1J6L0l4K9k6n7K4J0JK9nm8oN4K4om2J1J7L1Mq0M5J1Ql2J7j11K4L0N2n0P8
7668C7o9M7pl4N6j00P3K0K7jr0P3j3N4o7m5%K5J7ok5JK9p3R1K4o3K0L0q0L3qL3
7701IL5k5Pj2k1k3j2N2mo7J27q1J9j5K4j8Q%m8P3n6k1K9l2K6Q0j14J02m8K1oj9
7733a0J0k8N3JJ9l9kL0m0j4M3p8O4j2k6N1j2NKk1L7m9nJ4J3Orm2K5L2oM4o8OM4
7768C8l0l4j8K3k6O8j4M7m0jo6L7N1q6L3J06o7kn9P5n6L7J9m8K0O4p5kj1M3L3
7799E9j02P7l6k4k5L0K7L1j2j1p1OlN5J1l7j7MnL9J2J7qMq1J6O4l6Rlj1J6k9L
$$ plain form
7570 -10 21 31 -16 -36 -20 -5 28 -27 -38 30 -31 -21 -18 -56 -11 -37 19 -43 -20 -27 2 2 -11 -64 -3 19 30 51 -81 -33 35
7601 35 4 23 12 17 61 -2 6 -21 -36 -72 11 -12 -39 -2 28 -17 -35 -27 -8 22 36 42 74 -1 -4 -14 -18 27 -33 -21 -21 -37 -5 -11
7635 -11 5 35 1 30 4 -53 -29 -19 -18 11 6 -42 -48 6 30 24 -18 -7 10 41 45 -35 10 21 29 -3 14 -97 -73 -43 9 -41 37
7668 37 -32 15 8 -26 30 -70 3 23 50 49 -41 32 19 73 6 -39 -39 -14 3 -3 -28 -27 2 -71 20 44 -19 1 31 -49 -16 -24 9
7701 9 44 19 26 14 -7 -30 -42 10 6 -61 66 -15 4 -11 13 -5 3 3 -45 28 -28 -49 -20 -52 -26 54 -60 42 -6 15 9 -10
7733 -10 0 -28 25 26 45 6 4 34 -6 -20 23 -55 9 -3 -29 22 10 15 17 -4 33 -16 -21 -7 6 12 3 -39 -14 18 12 56 -12 -6 38
7768 38 8 -26 -44 -21 -47 21 7 54 14 13 -53 -16 35 -51 -18 88 21 19 -40 35 -21 16 35 -13 7 71 -4 -6 -17 26 59
7799 59 -43 34 -2 -26 -51 -21 6 37 25 14 -57 -51 -54 1 12 -25 -42 -38 -43 -4 8 25 17 21 -60 -44 20 -16 -7 -10 -21 -5 -34 -31
7833c1O0k8Kn0L9%K0j7Kk2K7l9M2Pj7M2j2k5L0k3J1k7J1Rj2P0n2j8P2n9k0N6k5
7866B3K3n4N2r0n7J38q0Q6k5kk7n2J06m3K3n6K3mk0M5M2p9l6O8MM0k2r4P3OL0
7897D1k3L6m9r1R4j2k8N5r7N3L4K1J7m0J4%kl6nQmM9r3Q8m7l1Q7n6j0N7l9N2m5
7930bj6N3k8l4l7L2j9M0K2mk3jOk8O5l8L1r2K2qO9m9O1kl8P8j06N7J2n9J08j09
7962c7jN6l2J0O7k2r1J02o8O5q5O2K8j0o3JJ2l5N5l1N2j4k4k3j1K3K2m6N2k8n6
7993g0N3ln9R5j6l6L7K4k1RK1n3K0l1P0n4m6K5J2K2L3q4J21n4K0J0n3j9Mm5M3
8024b5K6M2m2L2p8K1M3k0K9m3l1K6O1j10RO2J2o3Q3q0M9OM5j18M2RqJ4k5O4k5
8055Gl7M1k3k1M0m3P5p6L3J4q1j5L3L7K6Ko2K8n2P0j6N2k6l0j6R4p4L0j3kj4p
$$ plain form
7833 -31 29 1 3 -47 -8 -8 12 -5 -3 -25 2 -37 5 12 -5 37 25 0 30 7 18 -9 2 11 -1 69 17 -1 71 12 -8 48 23
7866 23 46 -8 44 -46 -103 35 -45 41 16 14 -13 -65 41 -2 21 -35 -12 -16 -36 9 51 -28 -64 4 8 48 26 -68 5 11 41
7897 41 18 54 5 -86 8 -4 -32 23 -74 -21 13 34 51 11 25 25 23 -13 -18 -10 -14 35 -58 30 -17 -48 39 -17 -27 30 -9 43 -2
7930 -2 -18 35 7 -27 -64 -32 -51 -11 11 7 -16 -17 -11 -39 26 -12 19 -73 -51 -59 10 -39 22 20 -18 60 -46 11 23 -36 72 -37
7962 -37 -38 18 -14 -4 63 41 -50 52 -16 49 -36 26 54 44 -19 -18 -6 -41 14 -17 35 21 -3 -26 -37 -14 8 -38 14 -14 -70
7993 -70 -17 -20 -79 16 0 -36 1 25 4 13 34 -19 1 -30 40 -14 -60 -35 -23 -1 32 -52 69 15 35 45 -8 -27 -23 -68 -25
8024 -25 1 43 1 33 -45 -24 19 -1 28 -15 -46 -20 41 -69 -60 2 14 -49 34 -46 3 9 54 -64 -22 -13 -21 -7 -32 32 7
8055 7 -30 11 -12 -33 7 -36 39 -37 -4 10 -71 -86 -53 -16 10 12 -50 -22 -74 -4 -20 32 6 -24 -40 54 -20 10 -3 -5 -19 -26
8087b6k3L7J03o3nl2k0K5J9j8j1RJ8nk4J2P9r4K4j5n2M0O3p3l9K6O0K3n4n1M1
8118b6k1P1%o0K3M0p1N8l1L%L8ml6L1%J9m8kjP0j9J2n2L6j1K5j8j1M1q2L4K2o
8152B4n4M0km8N5J9j8m2L0Kl2%mkj8J0L0K1Kpp2P3P2j01mPO0rj9m4k0Q0o1K1r
8187b0mJ3k4N0
$$ plain form
8087 -26 -49 -12 91 28 23 -9 -29 -4 15 -3 -14 -5 13 8 -16 -4 75 -19 5 -10 -62 -22 41 -32 -71 -45 15 38 -16 -67 -26
8118 -26 -47 24 24 -36 -13 27 -44 14 -17 -14 -14 24 20 -16 15 15 34 -14 -16 -17 53 34 46 -6 30 19 44 26 15 56 -26 8 30 24
8152 24 -30 10 8 -40 15 34 16 -26 4 6 -26 -26 -30 -32 -50 -40 -10 11 13 6 -66 7 79 -22 -26 -19 41 32 13 -31 -51 29 -32 -11 -20
8187 -20 -24 -11 -35 15
8191A5
$$ Imaginary data points
##PAGE= N=2
##DATA TABLE= (X++(I..I)), XYDATA
0@%%%%%%%%%%%%%%%%%%%%%%%%%%%jLqJ2j2J3j5J6j6J6j7K0k5K8k8L0l5M1m5M7
47B4n4O1o7P6q7J02j17J37j69K15k89M32q04L179J1020m792j2299n794P252J1310
67I336K919q458q571R68Q067N560j650o532m261K094N236K700j672m440l676Q32
83a548M909L023k422n484l046K319N334J475m450m860j76L400K781o53l203k023
99d624M61J134Q13J449l3k822l053O78M869M081k255p581l120O458Q668K39q772
116c410p339L618J0990M984p171r962l53Q951P797j944q854m926M477P599K358
131F815m141n805j825L937N484J360l884n455j632M469O440K83o761n813J849
146d679P259M208m272p820j410O199N224j708n702k571K808L894j32k757p26J120
$$ plain form
0 0 0 0 0 0 0 0 0 0 0 0 0 0 0 0 0 0 0 0 0 0 0 0 0 0 0 0 0 -1 2 -6 6 -6 7 -8 8 -8 8 -9 11 -14 14 -14 16 -19 22 -23 24
47 24 -30 31 -36 40 -47 55 -62 75 -94 121 -168 264 -540 2639 13659 8867 -3432 -9226 -1974 9336
67 9336 12255 3797 -4774 -3806 4261 9821 8171 1639 -2622 -528 4708 7408 5736 1296 -2380 -1548
83 -1548 3361 6384 3962 -1522 -4568 -2249 3085 4560 110 -4750 -4926 -1526 1255 602 -2601 -4624
99 -4624 -4163 -3029 -2216 -767 -800 -3622 -6675 -5997 -1128 2953 698 -6883 -10003 -3545 5123 5362 -3410
116 -3410 -10749 -7131 3859 8843 1672 -8290 -8643 308 8105 6161 -2693 -7619 -3142 4457 6815
131 6815 2674 -3131 -4956 -1019 4465 5825 1941 -3514 -5146 -677 5763 6046 -715 -6528 -4679
146 -4679 2580 6788 2516 -5304 -6714 -515 4709 3001 -2701 -5272 -2464 1430 1298 -1459 -2185 -1065
162a065j79j184M08K449J308k694m296M02N887L688l818o621j343N908O376j344
178C882p434m172M061O601J622m230n327o13M339M196J52l405m036j050L904N450
194C940N29n654n709R79P474N732l885r210k836P135Q271n79q609n944M286Q457
210D377K057o089n623J028N352K969k364l682k21J941Q47k86L26K72j044j719
226a859k25K584K561j372m273j340L205L507k14l526k905J280L489J183j543k001
242a449r93K27J767J883K76k148l093n82M135M404j410o268l458M175P309J526
258F301o894o952K350Q668L940n132p652q93O777N853k102o561k719L378M627
273B989J142l020l335j71K246K064O51j239k505j476J809L126R74k476l533m52
$$ plain form
162 -1065 -1244 -2428 -2020 429 1737 -957 -5253 -4851 1036 4724 906 -5715 -7058 -1150 5226 3882
178 3882 -3552 -7724 -3663 2938 4560 330 -4997 -5610 -1271 2925 3077 -328 -4364 -5414 -1510 3940
194 3940 4469 -1185 -6894 -5915 1559 7291 3406 -5804 -8640 -1505 6766 6187 -2422 -8366 -4080 4377
210 4377 6434 345 -5278 -4250 1102 4071 1707 -1975 -2196 -255 592 306 632 904 -140 -1859
226 -1859 -2084 500 3061 1689 -2584 -3924 -719 2788 2574 -952 -3857 -2577 912 2095 552 -1449
242 -1449 -2442 -2215 -448 1435 1711 -437 -3530 -4112 23 4427 3017 -3251 -6709 -2534 4775 6301
258 6301 -593 -7545 -5195 3473 7413 2281 -5371 -6264 513 6366 4264 -2297 -5016 -1638 2989
273 2989 4131 1111 -2224 -2395 -149 1915 2566 1327 -1178 -2654 -845 2281 3255 779 -2754 -3206
289c206L741L008j478l859j290K206K673J6k321j224J032R10n01j51J056L43j493
306e38j931N70L494K156l120m702J63N180L864k281o080k316M821N871n26n725
322a100l850K167N431K442l257m693o85L351L357M25k794l359k92L032L168J37
338C480l349l625M93M599L170k329n024j714L558M711o3m811l173K139M149J005
354C216k802k851M63K617R14j465r48N99M48n17o40O99J517m3k302j646J874K928
372B061L49k871k594P62L621J888k232l238o10K402K661K53k469k407K92K493
388C61K051o8k556k734N50L655K513j539m226k056K891M975N79m649m137J446
404b944N097K692k953n137p73M258L601j137l887k108J901L247N95k268j790K23
$$ plain form
289 -3206 535 3543 2065 -1794 -3084 -878 1795 1811 -510 -1734 -702 208 -293 -444 612 955 -538
306 -538 -2469 -1899 1595 3751 631 -4071 -3908 1272 5136 2855 -3225 -5541 -720 5151 4625 -1100
322 -1100 -4950 -2783 2648 5090 1833 -2860 -3545 -194 3163 3588 794 -2565 -2857 175 3343 3480
338 3480 131 -3494 -3001 1598 4768 2439 -2585 -4299 -741 3970 3907 -904 -4077 -1938 2211 3216
354 3216 414 -2437 -1974 643 1557 92 -856 -257 191 -326 -966 -267 1250 1207 -1095 -2741 -867 2061
372 2061 2410 -461 -3055 -2293 1328 3216 984 -2254 -2864 -462 2199 2452 -17 -2424 -2132 361
388 361 2412 2344 -212 -2946 -2396 1259 3772 2233 -1993 -4049 -1158 3817 4396 -253 -4390 -2944
404 -2944 2153 4845 1892 -3245 -4018 240 3841 2704 -1183 -3291 -1390 1857 2452 184 -1606 -1383
420a383J192R11L9p15o65l25O1P71J101k10j544r70O08J543P90p70j655m37J056
439f02J095K17m01r87q62M42J474J078m20j994j690J343L226J120k608l410N2
456b927L661L361j553m676j884L183M346L67l867l647J149M370K123k319l651
471a964q19K434K932J30k566k092M51J974J615l31k130j502O33K020J132q06k115
488a004j008J377K030K5j640j292K76J397P78p99r94J57N31r7j15K92M04o9r96
507g47q01J099J919l0k110j595J008K671J335j981l062K5L120K278j061l089j472
524b493J941L175N15k520k332J68K424K182n85k664j673J145K470J394j403k874
540a130j019K201K692J1k544k349N28K888J722j722k802n84K011K105k90k280
$$ plain form
420 -1383 -191 720 759 44 -621 -946 -885 -114 987 777 -767 -1737 -1129 414 1204 434 -1221 -1658 -602
439 -602 493 710 309 -678 -1540 -1098 376 1454 1034 -960 -2650 -1307 1919 3039 431 -2979 -2927
456 -2927 734 4095 2542 -2134 -4018 -835 3511 3878 11 -3636 -2487 1883 4006 1687 -1964
471 -1964 -2783 -349 2583 2713 147 -1945 -1494 480 2095 1764 -366 -1868 -1235 785 1917 1111 -1004
488 -1004 -2012 -635 1395 1420 -220 -1512 -1236 161 939 140 -854 -697 -166 -263 -378 -86 318 249 -747
507 -747 -1548 -449 1470 1440 -670 -2265 -1257 1414 2749 768 -2294 -2269 851 3129 2068 -1021 -2493
524 -2493 -552 2623 3138 618 -1714 -1546 878 3060 2475 -189 -1862 -717 1753 3147 1744 -1130
540 -1130 -2149 52 2744 2755 211 -2138 -1610 1278 3000 1278 -1524 -2108 -97 2008 1718 -562
556e62j295J132J594R2q83p32J45N09J02l24K20M33k40q57o0Q64J073j46j395
575c30j014R36J807M86j293j467j95J537J673k05j888j232O01J832J340p72k400
592e84j031J430K359O90j925k729j08K805K284j077l131j484J727L031O47k642
608B62k680N97K782J520j276k467q23J815J827j35j528j130L98J176P88m98q81
625b53k20L58M17M67o6m94k40J57K07M00J15l92l26K7J50L47L54j62p56m97L47
646f0Q61O56o19j538n45J388J580k07j815j669P39K385J027j800k372k42K152
663g9K104n95k640j494J449K417O37j735k142k2K047J730n61k035r72Q08J872
680G89Q18j124j673j47J298J345mj239j194L98J487O11o75j014k86P14Q89j44
$$ plain form
556 -562 -1857 -725 869 961 78 -654 -509 0 102 -222 -2 431 191 -666 -726 138 1211 1065 -330
575 -330 -1344 -408 1399 1885 592 -875 -1070 467 2140 1935 47 -1185 -584 1248 2588 1816 -584
592 -584 -1615 -185 2174 2864 939 -1790 -1898 907 3191 2114 -1017 -2501 -774 2257 2904 262
608 262 -2418 -1821 961 2481 1205 -1262 -2085 -270 1557 1422 -106 -1236 -838 338 1126 628 -253
625 -253 -473 -115 302 769 703 209 -31 126 333 733 848 456 130 157 307 654 1008 846 90 -407 -60
646 -60 801 1457 838 -700 -1245 143 1723 1516 -299 -1968 -1229 1156 2183 383 -1989 -2231 -79
663 -79 2025 1430 -1210 -2704 -1255 1162 1799 64 -2078 -2100 -53 1677 1116 -919 -1891 -1083 789
680 789 1607 483 -1190 -1337 -39 1306 1302 63 -1131 -733 754 1365 690 -324 -610 104 993 849
698H49p40k44K87J91j07o6P9J53j77n87j82P88O63m93j092o18P98J458J30j508
718d18j378M41J718R98q98j983o03J450J779m1j645j519L06K014J220q70k025
735a454o73J232J838M40j662j752K51J902J337p17j878q68J217J747K50j526j252
752a568L12J414R06p72j201k72Q90P48m1o72m52J99O08N4l40pK10p8j14L4O0M37
774C55L9n73m46M59O44J98m91p83k01R70Q65l37j115p16M66J361O38j152j432
793a251j19J302J344l63j698j232R03J778N44j349j580k67J719J433n74j819r57
810b186R50J656N30j338j460J34J389J057m51j192o74O78J240K43p72p45J78N96
828a67O87j46o02k38M38K87Q0j06r7L6J02j15q8M04K41k05n10k80L98P04K43q52
$$ plain form
698 849 109 -135 152 343 236 170 249 402 225 -362 -544 244 907 414 -678 -1296 -498 960 1090 -418
718 -418 -1796 -1355 363 1361 463 -1520 -2123 -673 1106 1065 -580 -2099 -1793 221 1441 571 -1454
735 -1454 -2127 -895 943 1383 -279 -2031 -1780 122 1459 742 -1136 -2004 -787 960 1210 -316 -1568
752 -1568 -1256 158 1064 292 -909 -1181 -291 457 416 -256 -708 -509 99 153 -187 -194 16 -62 -176 -142 -82 355
774 355 394 -179 -625 -166 478 676 185 -598 -799 171 1036 699 -416 -1132 -666 695 1333 181 -1251
793 -1251 -1370 -68 1276 913 -785 -2017 -1114 664 1208 -141 -1721 -1988 -269 1164 590 -1229 -2186
810 -2186 -1236 420 950 -388 -1848 -1714 -325 732 281 -911 -1585 -907 333 576 -196 -941 -763 -167
828 -167 520 374 -228 -466 -28 259 339 233 136 172 274 159 71 475 716 511 1 -279 119 823 1066 214
850B14q98K09R98N68l99j343n67R79J199L9j268j165J33J550R12q57j602m20J066
869f52J391J31j439j248M79J496P79p06j424m53J052J339k1j110q84L53J166O13
887H62m95j109j19Q83O58n1o45m59L20O88J64m37l05J70J36J72j23j97J05K53
907D71j71l39J34L14J84j98n59k48O06N31j00q38m80L32Q80M68q31j122M3R96
927G3Q92k79j260p70P34J374K52j097j080j4J258J004m87j363n38P70J264K73
945A006j004j084O2J280Q35n16j036m76O84J040J49r17o64K28O80N27l45o49k07
964d07M98L66n7k36k67J75K27o7k70J10K48m7l08j47K28K91J90l97n88J03O30
985B75L67l00p80l05N82Q86M5r71p06K07J022P57p11j173k73R12R66nr94j001
$$ plain form
850 214 -684 -475 523 1091 692 -651 -1218 -239 960 999 -269 -1434 -1301 249 1161 304 -1298 -1718 -652
869 -652 739 870 -569 -1817 -1338 158 937 231 -1193 -1646 -594 745 724 -386 -1270 -917 249 862
887 862 367 -742 -861 22 680 629 -16 -475 -155 533 697 260 -45 125 261 433 310 113 218 471
907 471 300 -39 95 409 593 395 -164 -412 194 725 625 -213 -693 -361 519 987 156 -966 -923 73
927 73 965 686 -574 -1344 -610 764 1016 -81 -1161 -1175 83 1087 600 -763 -1301 -531 733 1006
945 1006 2 -1082 -1020 260 1095 579 -457 -933 -249 791 940 23 -641 -413 267 794 449 -200 -407
964 -407 91 457 400 164 -103 72 299 232 -38 72 320 273 -35 -182 46 337 527 130 -458 -355 275
985 275 642 342 -438 -743 -161 725 770 -201 -907 -700 322 1079 368 -805 -1078 -166 800 795 -199 -1200
1005a200L93J282N65p91r60l49R50R93j31j071o58M85R66L48n87q93o0Q40O07
1024G29j92p14l04K84O37J09m64l58R6L30J59j25l56P2K83P1k69l2J04K08p0k98
1046a00j45J48M50k6m80k93K46N30K99m81p32m4P16N57k18p72n89N54R62J59p78
1067c7q56J21Q86Q09m76j082l23O74R39J36q78p80J67R32O20m46r07k85N14Q61
1087E89P8p17o17L04N78L92k61o51j93N41L83j08l43k03Q7L55P4l23j01J86J77
1108B27j36q4r6K99Q4k30l60P3L99K91k37m38l40M54O14j9n90m78J64O93L87l94
1130B83q01j79O29P17m8o90o90L16R08L39n74p96j49O87Q32j62q16n63M67P78
1150D88J98n60o17l9O95N24k60o32k01L10N52O8n03l07J55M40L0j81k51r0L47
$$ plain form
1005 -1200 -807 475 1040 249 -711 -1060 -110 883 752 -319 -977 -492 474 822 235 -658 -718 122 729
1024 729 537 -177 -481 -197 440 549 85 -273 -177 153 312 187 -169 -97 186 257 -12 -44 60 268 198 -100
1046 -100 -245 -97 353 327 -153 -446 -200 330 629 148 -584 -628 88 645 427 -345 -934 -380 582 741 -37
1067 -37 -893 -772 114 923 447 -635 -958 -284 655 791 -87 -867 -700 232 852 406 -501 -786 -272 589
1087 589 667 -50 -667 -363 215 607 346 -305 -498 43 426 318 -25 -228 -141 214 288 -35 -136 50 227
1108 227 91 7 -89 210 294 64 -296 -223 176 467 230 -208 -548 -94 520 501 -89 -567 -403 290 677 283
1130 283 -518 -697 -68 649 601 -89 -779 -463 445 784 210 -586 -735 -48 784 622 -194 -757 -290 488
1150 488 686 126 -491 -530 165 689 429 -203 -404 -94 458 526 23 -284 -129 311 341 160 -91 -181 166
1171A66J44k03j42Q1Q8Q1j21k54J70K52M2k64k32O8L78J74j90n35k4M76L59j77
1193C37m94l36K61O81J68n86n56J18O36M54l34p28l11N91P10Qo84n33J04Q18M45
1214G69m31p66p7N02N72Po14m83K82N72K33l03m56j19M28L57j69l41j45J10L56
1235B84P1k23k44J14K52o0j48k1RJ71m3k21j00K61K06o4l00j51R5M77J6m11l70
1258d00J61L88L54k89o88j5M73N14r3n83m00K35O97K10n52m88l6N24M98j95o42
1279c27k63L74N48R0m62m35O4N61L73l41m50p1K82M74J21n77l04K75L23J11k51
1300A15k74lK72J95j26k41l3J96J04j06j70k7J99J56k05j83M3J62R2p8l56mK92
1323B0K41j65l22k10K60L97Q8m69k69M7M01L28k68n07j46M69M07k6m42m60K04
$$ plain form
1171 166 310 107 -35 46 134 215 94 -160 10 262 304 40 -192 -124 254 428 238 -297 -321 155 514 337
1193 337 -157 -493 -232 449 617 31 -525 -407 229 683 349 -379 -690 -99 611 619 -65 -598 -494 324 769
1214 769 338 -428 -505 -3 569 576 -38 -521 -239 333 566 263 -193 -312 116 473 304 -37 -182 -72 284
1235 284 355 132 -112 2 254 194 46 25 34 205 162 -59 -159 102 308 244 -56 -207 -112 365 381 -30 -400
1258 -400 -239 149 503 214 -474 -489 -16 498 405 -178 -578 -343 354 564 12 -476 -512 12 510 315 -327
1279 -327 -590 -216 332 422 -40 -475 -411 150 523 182 -268 -339 -57 417 538 -39 -343 -68 255 366 115
1300 115 -159 -162 110 305 179 -62 -95 101 205 99 -71 -98 101 257 52 -131 -88 74 166 88 -268 -272 20
1323 20 261 96 -226 -436 -176 221 309 -160 -429 -382 19 347 79 -428 -574 -105 302 276 -166 -626 -422
1344d22O45K52l71n11o5L82N18k9o16l30K85N81Q5l67l19kL58L06k15l78n7J78
1366i2L23l8k26k12J94J62k4j54l3P8J18j2k27JJ28O9k4j43j25O1K81L6k39k66
1390c64J35K79J64r4l98j02L35K92m7m06j89P6N40J52l70l52o2M53L76k01n21
1411c04k37L75M35P1m48k83Q8M83J81k58m95N2L19K22K8l49k47J75L43l6j65j46
1433a96q1K68J65j67j84l4J30J89K4k59n3J90J05j21j53j1K25J01j10j82l8J64
1455b8K55j22j62j15L9K96R4k81k76J38K92K02j16n03q6M17L17j29l60k02J24
1476b06M75R9l26l82L4L14L18j41l77k52K46M35Nk53k80j0L72J81j78l56j4J93
1498a03K25O9k03k98K28J36N3k10q5N2J51J19j70j19R8J35k9p6j29P1J85K8j20
$$ plain form
1344 -422 223 475 104 -407 -472 -90 428 399 -217 -547 -262 319 404 37 -282 -284 74 380 165 -213 -270 -92
1366 -92 231 193 -33 -245 -51 111 87 -67 -100 -22 96 84 -143 -142 -14 55 31 -112 -237 -176 105 141 -98 -364
1390 -364 -229 50 214 120 -278 -380 -45 247 200 -206 -395 -319 221 373 3 -349 -411 42 418 217 -304
1411 -304 -541 -166 269 340 -108 -391 -303 180 361 103 -392 -340 -21 201 229 -120 -367 -192 151 115 -50 -196
1433 -196 -277 -9 156 -11 -195 -229 -99 90 114 -145 -198 -8 97 -24 -177 -188 37 138 28 -154 -192 -28
1455 -28 227 105 -57 -172 -133 163 257 -24 -300 -162 130 332 216 -287 -373 44 361 232 -128 -330 -206
1476 -206 269 368 42 -340 -306 8 326 185 -192 -444 -198 237 242 -11 -291 -301 71 252 74 -282 -296 -103
1498 -103 122 191 -12 -310 -82 54 107 -103 -188 -136 15 134 -36 -155 -57 78 49 -27 -156 -85 100 128 8
1521Hj28J1L02Qm2l38q6L79J49p7k64j99K19L07Q8l08k56Q0K01K69j08l29j86
1544c00K09L72J8l51k20Q7L18K24k67l35oK29K10m7k81j70K13K58J3k29j63N7
1566a61K70J49k49j64oJ86Q4n4j29j65K32O0j9r0m8M8J29M8j39r0K08M8m4j19
1590a5p6O7J76O4j90k08P1K83Q2j26k68n0K18K57r1k65j16L6L36J77l65k65P8
1613a90K56K13j38l12j42K45K94Pl29j39M8K93J25j86k54l0K87N6Nk08j21J04
1635a16K19Rj37o9l7J59R8j33j77J96K8N2p8j18P8O7J09n4j62P9J45k7Pk05r2
1660a59J97J37k6k15j11J22J71O4j93j63L1K41Q6p9k29j11K51J81j22j32j92J24
1682a27K45N5j93k17N5J93J28r7j16j25Q3K32j4j35j08lK38L4p2j62m0K34N7n6
$$ plain form
1521 8 -120 -109 193 201 159 -179 -265 114 263 186 -78 -277 -58 249 337 29 -227 -147 54 323 215 -114 -300
1544 -300 -91 281 299 -52 -272 -185 133 357 90 -245 -251 -22 188 141 -140 -310 -97 161 174 -55 -218 -161
1566 -161 109 258 9 -155 -161 25 109 55 -74 -239 -7 53 34 -56 -104 -56 73 121 -18 -108 100 148 104 -15
1590 -15 -91 -24 152 216 26 -182 -111 172 254 128 -140 -190 28 285 194 -71 -187 -151 185 362 -3 -268 -190
1613 -190 66 279 141 -171 -313 -68 226 233 -96 -235 -187 106 231 45 -209 -239 48 104 109 -99 -220 -116
1635 -116 103 112 -25 -94 -131 28 126 -7 -184 12 40 92 14 -104 -26 41 150 96 -66 13 158 131 138 -67 -159
1660 -159 38 175 149 -66 -177 -55 116 180 -13 -176 -145 96 182 103 -126 -237 14 195 73 -59 -251 -127
1682 -127 118 173 -20 -237 -182 11 139 42 -74 -199 -116 116 102 -33 -141 -144 94 128 56 -106 -146 88 145 89
1706H9j66M8J9J17k2j29k0R5Q2k5j29m6P5R9j4j55K8QJ35P9j74j04Q5J54j2o7
1732E0k38J7J58J84j13j88k0Q6J60M0j63k36Q5K08J85j38k33n5J32L11l7k42j17
1755a64K6J80J34j33k14j2K69N5n5j14j13J41J30j8r3j24P3P5Q8p0j75P6N0R4
1779A06q3o7k8J47K5o8j30R1P2j5j5j38PL4J87p6q2m4K1J52J9j84o0P1J52K4q9
1806B9j51k6K09J19j58j11m8P0J96m1m9k06P1J52O7p3j04j08K17J19j21j39MJ6
1830f6J82O2j44j07J3J13N6l1j04m7R1N1K0j03o8Q0Q2J4j19p3O9L0O1r7mj9J24
1857F6k4j01k2N0N4L4L2j18q8J98K5l5j87Q0K1J33L7j66j16J03J11R6j31j64Q
1882a04J39J60m0k24q1J18J65Nj02j51K6J89J0r7p1l3P0J50n0j04n6N3J31m1p4
$$ plain form
1706 89 -77 -29 -10 107 85 -44 -64 31 113 88 -41 -87 -12 87 73 -82 -54 -46 89 168 -6 -110 -25 129 117 50
1732 50 -188 -171 -13 171 58 -130 -150 -64 96 136 -27 -263 -178 30 215 77 -156 -211 -79 232 195 -47 -164
1755 -164 -138 42 176 43 -171 -183 86 141 86 -28 -141 0 130 112 19 -105 -32 43 131 61 -114 -38 12 106
1779 106 23 -44 -72 75 100 32 -98 -7 65 50 35 -103 -96 -62 125 49 -33 -77 -56 96 115 -69 -129 -58 94 118 29
1806 29 -122 -148 61 180 22 -89 -137 -67 129 88 39 -167 -96 56 123 50 -54 -162 55 174 53 -86 -82 -66
1830 -66 116 178 34 -73 -60 53 109 78 -26 -73 18 69 89 -14 -82 -2 80 94 -25 -98 -29 1 62 -35 -39 -58 66
1857 66 42 -59 -81 -31 23 57 89 -29 -117 81 106 71 -116 -36 -15 118 155 -11 -127 -24 87 183 52 -112 -104
1882 -104 35 195 155 -69 -150 -32 133 138 36 -115 -89 100 110 13 -58 -91 -21 129 79 -25 -81 -28 103 62 -12
1907a2m9L4R2om8j22K0J30Qn6l3NQ5Qpj4p2J0Q6n6n4k6K9R6O2j97k8N4J73Lr0
1938B5r7n6J47J35p0j47mK4J54p0o3j08K9K09K8j41o4L1Q2P6j07q6o2O4J04Q2
1964A15j28q7J1K20l8p9p1k8O6J99q5k03J7R6P5m2j06L2RN7o9j8L0J6N5n2j8n4
1992h0Q0K2J9o4j0r0J28J14j28p7N9O7P2n4j11p7M3J73K0j16j27J14O5J7n1p8
2018g0m0nJ47J5r2p3Q6N9L7o3r0R0J6P9mj94oR4Q3J0p9r2j4J56M3j20k1k3R4O3
2048H6n1l6m9Q5L6k0p7K3J5Q7l5j58Q8n1R0l3Km9NM5J6Rj25N1M8M3m9m6k4R4P
2079B7K1j18k0J6J55k1j40J2o3J07O2j7p6n2J43N2L0j50n3L4J05L7j52J1j03K33
2105H0j6n3q8l6J19L3On1o4N2L1K6q3L5J6j3NM8m4k7M0J6n4j9j0K5Q5p2l4pP6
$$ plain form
1907 -12 -61 -27 65 59 11 -111 -91 39 47 -9 -42 -37 48 56 49 35 -37 -27 59 3 -51 -77 -48 48 110 -87 -115 -61 112 115 25
1938 25 -72 -128 19 154 84 -63 -67 -43 111 41 -22 -130 -101 108 136 -5 -69 -38 44 120 13 -73 -135 -71 33 115
1964 115 -13 -100 -89 131 93 14 -57 -85 -19 180 95 -108 -91 5 80 38 -68 -36 -27 30 -39 -57 -27 -11 44 -8 -26 -80
1992 -80 0 22 41 -23 -33 -123 5 119 -9 -86 -27 40 112 58 -53 -130 -87 86 106 -10 -137 -23 42 59 8 -70
2018 -70 -110 -115 32 47 -45 -118 -32 27 64 1 -89 1 17 96 92 -102 -108 -14 69 79 0 -92 -106 50 93 -27 -48 -71 23 86
2048 86 35 -1 -50 35 71 51 -26 -3 12 99 64 -94 -6 -57 33 0 2 -47 -42 3 19 28 -97 -46 2 45 -4 -50 -74 20 27
2079 27 48 -70 -90 -74 81 60 -80 -68 -131 -24 38 21 -55 -107 36 88 118 -32 -85 -51 54 91 -61 -50 -153 80
2105 80 64 11 -77 -113 6 39 45 -6 -70 -18 13 39 -44 -9 7 -6 -1 47 3 -24 16 32 -22 -41 -51 -26 59 -13 -47 -54 22
2136B2P8m5j05m5O3J08J4j05p3M3Q1Q6q2j15K0P6O7n3n5j4L9O1jo9n6J9P9Rok
2166C9j24R8K6K3l2p8Q1k0N4n2k2m3M4L7J4p1K4k2P1jlj32JJ55p7jn5KM9L3n2
2197c4K0J6J2J08k25J6Q5OR6j14n5k3K9J21n9m5l6O3R8On7r5Q1J5M7pj23k3J23
2226D6M0qr7mN3O3j1l6n9j8N7N3n8p8j0R3K4N5l0j43P3RM2q6l5N7M3M8j03o0O9
2257a1k1N6j6j40L4J40Rn0q3N5L9L5j8k3l3N0K0Jj08L8J6M3KK1o0l7J10J8m6k7
2287A4p6L5J69l9q0o0L7mJ19j43n6l3J43O1l6l7p0J42k0l1k5n6K1R1pj18L5L1
2315Gj4J9m8OP0n5k9O7j0j4MPk6l7M1QM3j6l1o0j8R5R2l5m4n8K5R4p2n5o3Q6R3
2348G2j0l9m2j3J24po4q0M8N8P9j15o0J0J7O2L1j44pJ17m4N8oo5K7o1J10r7N6
$$ plain form
2136 22 100 55 -50 -95 -32 76 90 -15 -88 -45 36 122 40 -75 -55 21 88 35 -20 -34 5 66 65 -4 -60 -41 38 47 41 39
2166 39 -85 13 39 62 30 -48 33 13 67 15 -7 -50 -6 31 45 -26 -2 -24 47 46 43 -89 -88 67 -10 -11 -66 -64 -15 18 -34
2197 -34 -14 2 14 122 -103 -87 -2 4 100 -14 -69 -92 -63 58 -1 -46 -82 -19 79 85 28 -67 14 29 76 69 -54 -77 46
2226 46 86 78 -19 -23 30 93 82 46 -13 -31 26 79 21 -57 -67 26 50 105 75 -68 5 14 56 -30 -65 -8 35 83 -20 -80 -11
2257 -11 -32 24 8 -132 -98 42 51 1 -82 -27 12 47 29 6 -27 23 43 44 -64 -26 -10 33 35 56 -4 -41 69 87 41 14
2287 14 -62 -27 142 103 23 -37 0 -4 115 -28 -84 -117 26 87 51 14 -56 86 66 35 10 -46 -25 66 59 -59 -24 7
2315 7 -7 12 -36 -30 40 -15 -44 23 13 -1 3 10 -16 -53 -12 -4 39 23 -8 -68 -86 9 101 66 22 -36 -11 83 11 -44 -107 -21 72
2348 72 62 23 -19 -32 92 85 21 -59 -11 47 126 11 -49 -39 -22 40 71 -73 -80 37 -7 51 45 -20 7 -54 56 -41 15
2377A5o4L9NP3n0%m5P0KK7j76Q6k9J65j14m3rO6Q1q3r9pJ06L9n6o1O0rJ07q8m
2408Dq7J63kp0l9qN1P1L9j15kk3L4N2n2n3Qk0J01m1L2j02K2K6J05k6n0n1QO5J
2439D1p8L9m9PJ37p8o8J7N1K3o6j1LK2O5n1k8m4Q9M7o7n5K5Q0M6o2j4q8N4P9l3
2470C3j6r2P3N1l3m1J5L7oN1p8J0l3npN5M9j46K3P9P7n2o2l9N8Q3l3q8j13J09
2500d1N4L9o7m6K9Q9l3l9l9k5M3R8j3j57m7J45J12n5l0j3k8K6Lk8L8m4rK7K6L8
2530E3l2m7R9m8k9J2J0J8mj5q4L8N6K4n2n5J3L9M8r6kj2N1Q9l8j07j4L0R3l5j5
2561a2m4K5O1M9j31K1J5lJ2%%o0P6k0O1j5n5j0pO0M5m2n9J8O3j1q7L8m2Q4K7o8
2593a1q4J32m8J04p1j05N7O8K1n0p1l6J16K1l4p6N4N0M4j00o9O9J9L7oq8K8mP3
$$ plain form
2377 15 -49 -10 -5 68 18 18 -27 43 45 72 -104 -18 -47 118 4 -39 -48 18 99 16 -83 -90 16 55 -1 -62 -2 -11 96 8 4
2408 4 -83 80 78 8 -31 -39 12 83 122 7 5 -18 16 68 16 -37 -29 -49 52 11 43 -59 -37 -11 94 68 18 -33 -25 40 41
2439 41 -37 2 -47 -40 97 19 -49 -32 19 42 -24 -35 -32 -10 55 4 -24 -68 21 68 1 -54 -29 51 97 35 21 -67 -13 66 33
2470 33 17 -75 -2 49 16 -25 -10 27 21 72 -6 4 -29 -34 -41 14 63 -83 -60 19 96 44 -18 -57 1 84 51 -37 -150 -41
2500 -41 13 52 -15 -61 -32 57 24 -15 -54 -79 -36 62 49 -108 -155 -10 102 47 17 4 -24 2 5 -23 15 -29 -38 -11 15 53
2530 53 21 -26 73 25 -4 8 18 36 32 17 -67 -29 27 51 -1 -56 -43 -4 44 -52 -54 -66 -15 74 36 -71 -85 -55 38 3 -12
2561 -12 -56 -31 30 79 -52 -31 -16 -19 -7 -7 -7 -67 9 -11 50 35 -20 -30 -37 23 68 26 -33 -15 48 37 -50 -12 -54 30 57 -11
2593 -11 -95 37 -11 93 22 -83 -26 42 63 13 -58 -94 22 43 9 -67 -13 37 81 -19 -88 -19 0 37 31 -57 -29 -33 40
2622D0m7Ql2L2M3Om7k0n6J12K4j7oq8N1N0jM0j11l0lP0k4m0J3Q1Nj1r3k7P2J22
2654A16o6j27k1M1Q2J5j31P6k5J16l7p0l5P3k8oJ1n0pJ61n7m6N1j09N8L0l7J01
2682G9q2m9jJ5O9m1r8N5L8Q5k3j03JJ25L1j01n9K9Q5L9m8p6j8Q2K9m1Pl6L9K7
2712E9j6k5m7N3O4po1k7Mk2nMN3p3k6M4M9ol8Ro8Q1O6q8m7N0N5qj33L8L8O2k7
2745Ek2l8N2Q9o7k4o9J31K3j8n4q5Q1M0qpj07Q7mR2n0k4mj2L0nn3m0Q0l2P8o9
2777dL8p7K3O8m4K7m0j3n1J12m0o1j2R1JL5j05k8J8O0L3r6RL9P5j4n6l2K5R3q5
2808a1j6J0J8J13l8n2n1N2j9Kqn1L8Q0l4K4q4J2rN1j1k8Qk2pM8Q4r3n6J2R9k4
2840C7n2m6O5Q4l1m4o0k2J39rn2m8%R7K7kj14j0J05m1k8l3J0l7M8O7o8J1K6J4
$$ plain form
2622 40 -7 1 -31 1 44 50 3 -17 -73 39 63 46 40 -48 3 53 52 92 -19 -49 -52 18 -6 -46 -33 48 53 42 -51 -78 -6 116
2654 116 50 -77 -98 -57 25 40 -91 -15 -40 76 39 -31 -66 7 -21 -27 -16 -66 -73 88 31 -15 36 -73 -15 15 -22 79
2682 79 -3 -52 -53 -38 31 -10 -108 -53 -15 70 47 -56 -55 70 101 0 -59 -30 55 94 46 -30 -48 34 63 22 29 -7 32 59
2712 59 43 18 -29 24 88 81 20 -7 -3 -25 -30 -26 27 -46 -72 -28 21 15 -23 -14 -82 -1 65 -23 -70 -20 35 27 -106 -68 -30 32 5
2745 5 -17 -55 -3 86 19 -5 -74 57 80 62 8 -77 4 44 36 29 -78 9 5 97 47 23 19 7 37 32 -21 -61 19 -13 65 -4
2777 -4 34 -43 -20 48 4 31 -9 -22 -73 39 -1 -62 -74 17 18 53 -52 -80 -62 -2 31 -65 -56 -17 58 44 -12 -44 -19 74 -11
2808 -11 -27 -17 1 114 76 24 -27 25 6 8 0 -51 -13 67 33 57 -27 -15 -24 27 16 -12 -4 -26 -33 15 99 6 -50 -38 61 37
2840 37 -15 -61 4 88 57 13 -47 -69 70 61 9 -39 -39 58 85 83 -31 -41 64 23 -5 -38 -28 -65 -17 50 -18 -7 19 33
2870C3l1l6M5j8k1M4j1k8K9j4rJ3j5k2K3M1Njq6l0J04JK4n5p5O4J06Nj67nJ07
2901B0J4nQo1j8O1P2l5j08QP6Pk9q8j6J35n2J3k2kk7M5lN1m1J0j08J35j3kn8L9
2933Fj7O8k5j08P5mL2l1l7mM0P4l2r2lR0L3p3m8L9N7M4l8j18q1J60L4k0n3m1L4
2964c9J5N4k6q3O4L9L3k4k3m1r8J70L5j7j2q1N1P0j02jJ4Q4o8rm4L3l1O1J4L8
2994G6j37KM9O2J9j17jJ5K7n8R0m9m0L6O2j06L2J3P6j20PO7l8K5L3m7%O4l7k8
3024b3NjJOLQn9J4N9%L1J7j23O2ML1K3n1QK0nm6pl6P9K7K4n5mL9j0K9p0k0j2P0
3060C8Om2q7P1L5n6K1L5o9K2L3on9j9N0N9K3j50M1K3J7L9rp2J2j5P7o4L7l4O4
3091B1j5N4o4j5j0M5L8m5J8q6J33l8Ko5j1N1J8k1j00P2L8J2Jop4K8n1J14j3q3
$$ plain form
2870 33 2 -34 11 -7 -28 16 5 -23 6 -8 -17 -4 -19 -41 -18 23 28 27 -59 -89 15 16 40 -15 -90 -26 80 85 -82 -87 20
2901 20 34 29 37 -24 -42 19 91 56 -52 -44 32 39 10 -78 -94 41 -11 2 -20 -22 -49 -4 -7 44 3 13 -95 40 27 25 -33 6
2933 6 -11 57 32 -76 -1 -5 27 -4 -41 -45 -5 69 37 -55 -58 32 65 -8 -56 -17 40 84 46 -72 -153 7 41 21 -32 -73 -39
2964 -39 -24 30 4 -79 -15 24 57 33 10 -31 -129 41 76 59 47 -34 17 87 -15 -16 -2 82 14 5 -39 -6 -37 24 38 76
2994 76 -61 -59 -10 52 71 -46 -47 -32 -5 -63 27 -22 -62 -26 36 -70 -38 -25 51 -69 -62 5 -33 -8 25 -22 -22 42 5 -23
3024 -23 -18 -19 -18 -12 -9 -1 -60 -46 13 13 44 61 -62 0 4 35 58 7 15 35 30 -16 -23 -59 20 47 71 16 12 51 41 70 0 -20 -32 38
3060 38 44 2 -85 -14 21 -35 -14 21 -48 -26 7 1 -58 -77 -27 32 55 -95 -54 -31 -14 25 16 -56 -44 -59 18 -46 -9 -43 21
3091 21 6 60 -4 -19 -29 16 54 9 27 -59 74 36 38 -27 -38 13 31 10 -90 -18 20 32 33 27 -47 -19 -70 44 31 -52
3121e2Q3j4M6mj05J7j5J9L3jn1K8N8L7m0j0Rp9N5K8m9j9K0MN0Mr3P2J4rj3o7M3
3154arL0Nm0o7L7P6p0poO1N0o2n8j5O0P3k5n9L3n6L3Mm5R9j04qO9Q4q2k5OO8m3
3188FPK6o9P1L0r1oK3KL4ln6l1O5QK4q1J5Q3r8N5o1N7M9k5l8pn0l0Q8K8n9J0o
3222c0K5M2k4n6RQJM4JJ2r0L3O3j4j9K3k5j1L8j5n4LJ07m0k1q5J7J00Kn5OJ6j7
3255fpO7r4J4L3M7l6ppK9ro5P1m2pj5J5K0l6p2O3O1j2l3L7m7K2M9k3on8O1L3k2
3289A8n9K6Qk4Mj6NJ5L1M8q8k8Q1k6J7n9%K6Q1l5l0l9j8K7K5M5k9k4M5M1p9mL5
3322B0L1J0mq4L4m2J0N5J7j20K1R8l5L6k6%Km1O2l9J5l6K9k3Kp5J8k4J09j9n9
3353e8j5KO5M8m8l2K6qNJ1k3L8lM7k4l6l8O0k%l3k9K4Ql4R4j06PmJ01r4jP6n7
$$ plain form
3121 -52 31 17 63 59 -46 -29 -44 -25 8 7 -44 -16 42 79 39 29 38 -41 14 42 -7 -26 -6 -2 48 52 -41 31 45 36 23 -44 -1
3154 -1 -10 20 25 -15 -82 -45 31 -39 -46 -52 9 59 -3 -61 -76 -16 57 32 -27 6 -50 -17 -13 -58 41 -63 -71 -2 82 0 -25 -19 49 6
3188 6 13 39 -30 41 71 -20 -26 -3 -1 33 30 -26 -57 8 16 40 -41 -26 57 -41 14 -47 10 59 34 -4 -11 -61 -91 -3 25 -34 -24 -30
3222 -30 -5 37 13 -43 -34 -26 -25 19 20 32 -58 -25 38 24 5 28 3 -8 30 15 -39 -36 71 31 10 -75 -58 42 44 -11 -5 11 -6
3255 -6 -13 54 -40 -26 7 54 18 11 4 33 24 -41 30 -12 -19 -34 -19 1 -35 -107 -44 17 5 -28 9 -38 -16 33 10 4 -54 7 40 18
3289 18 -41 -15 -7 -31 -27 -43 -38 -23 8 56 -32 -60 21 -5 12 -47 -47 -21 60 25 -5 -44 -62 -35 -10 35 6 -18 27 68 -11 -15 20
3322 20 51 61 57 -27 7 -35 -25 30 47 -73 -52 46 11 47 21 21 23 -18 44 5 20 -16 13 -10 -8 -83 -65 -89 20 1 -58
3353 -58 -73 -71 -6 42 -6 -38 -12 -20 -15 -4 -27 11 8 55 31 -5 -43 17 15 15 -18 -47 -23 -15 -49 45 -61 -54 -58 43 -51 -52 24 -33
3387c3Q9n1Mm2M0%M9o1J4l4P0q7N9o6j9O3J9l7k4k0Q7l8O8p3k7O9j2Nm8PjJ3J0
3420gK2o0oK6N9k3Pk4o6Q0K1m8ok7R8j0m0jl0M6P1p0q2O1k3M8M0m8n3j2R3jl3
3453Bj0J9J7M4j14Q2l1L6Qq4j1K1J4N4j6m8j5J8L5k7M3l9j0K2n0N5o8K8J5j0M6
3484B6l0k8P2k2L2q6l7kK6Q9o9QK1Ql7R2m4o4L5L3Oj11N8L8mO9q4P1l5k5J3Lj2
3517A0k3L3M5l7pk5j3J18p5n1l2K7M3l1P4m1l8n8J54o9k1L9o4rR3j9o5N7K4l4
3547Ek3j0K6L6L9p6m4J9qL1j8K3l1j3R7j2j0l6mK4O2j3n5m4J32j11O9j41P4KR5
3578H5p9Jk2nL9J1l7L6Pl3ll9pR6l8J7j6J0j07N1N8Nq1lO7K8k6p7R1q8P7p6RL8
3612a1l0j5K4J3k6M3K3J5m2k6K5l5J12m3mq1L1QP3l8m9N8klmK5o0L%O7r1L6K0
$$ plain form
3387 -33 56 5 9 -33 7 7 56 -5 9 -25 45 -42 17 -49 -68 -5 14 -23 -47 -67 20 -18 50 -23 -50 19 7 12 -36 -29 -30 -17 -7
3420 -7 15 -45 -51 -25 34 11 18 -6 -72 8 29 -19 -25 -52 46 36 -4 -5 -35 11 82 12 -70 -9 -32 16 56 8 -45 -57 36 35 2
3453 2 -8 11 28 72 -42 40 9 45 53 -31 -42 -21 -7 47 31 -17 -32 -14 21 -6 37 -2 -12 10 -40 15 -53 -25 -10 -20 26
3484 26 -4 -32 40 18 50 -36 -73 -75 -49 40 -29 -21 0 8 -29 63 19 -45 -10 23 29 -82 -24 14 10 79 -5 66 31 6 19 22 10
3517 10 -13 20 65 28 21 -4 -17 101 26 -25 -57 -30 13 -18 56 15 -23 -81 73 4 -17 22 -42 -51 42 23 -42 15 39 5
3547 5 -18 -28 -2 34 73 -3 -47 -28 -36 -5 -23 0 -31 -44 53 41 31 -5 -9 15 77 64 9 -35 97 -14 55 -86 -12 -10 85
3578 85 6 7 -15 -20 19 30 -7 29 36 3 0 -39 -46 50 12 29 13 23 -84 -33 25 30 -51 -54 13 41 15 -62 29 -59 18 -58 -49 -11
3612 -11 -41 -56 -32 -19 -45 -2 21 36 -6 -32 -7 -42 70 27 23 -58 -27 -19 54 16 -33 25 23 20 16 41 -19 -16 -16 51 -40 -4 16
3645A6m4N5r0M5J6n2Q1O0j28k0L0J35m3k9n4M5Kj2l6MM6L3p1KJ7j04Q4L1L1m9
3675Aj4kK2O4l5r4k0L2p2J16oj8P7o5pN1q2P9L6j0p8K6QJ2l1l4K7o2J28q7M5j7
3707a0m2O1M6q9J7nm1J04l5J1K7p8kP5ln7k6J15m1qK8k5k9n7O0Ok3L7j5K1l5l0
3739d3N6J9No5K5l6J5M1j3K1k9N1m2nm3P3k9l7O5j4L3j2Pj2KJk5k9M3N3o5j4J8
3772A5m0R1r1m2K0K1K9l8Pj0MM0Qn8N6l2O5l1n7p1J41j2N4j24P2L0j0k3oN2o8
3803hM0J8Kp0N2%j2L6j3j39P6L3pO7m8n0KK0m9N9J1m5PO3j0m1K4nj1Ll6M8l8M7
3837B6k3l6m3M0QqJ8k1J1L8M7q7K8j6Q1n3J9n6J8K8N3q4PJ4O5q4J6M5n6n5Q2J2
3869C4J0l0J0k6N7j8l8M2mJ9l3p0RN3k2K4m2j1L7J7J2o4L9k3L1n8J00m2k9N1p0
$$ plain form
3645 16 -28 27 -63 -18 -2 -54 27 87 -41 -61 -31 104 61 32 -22 23 25 13 -23 -19 27 60 -11 -9 8 -96 -12 19 50 1
3675 1 -13 -15 7 71 36 -58 -78 -46 -118 -2 -8 -26 51 -14 -21 30 -52 27 63 53 -25 1 9 21 -10 -44 -17 -79 49 -38 7 -10
3707 -10 -52 9 55 -34 -17 -22 -63 41 6 17 44 -34 -36 39 36 -21 -47 68 27 19 47 22 -7 -64 -4 2 -21 16 1 22 -13 -43
3739 -43 13 32 37 -28 -3 -39 -24 17 4 25 -4 47 5 0 -43 30 1 -36 29 15 48 36 43 31 33 34 9 -20 23 76 11 -3 15
3772 15 -25 66 -25 -67 -47 -26 3 -35 -28 -38 -34 6 14 -44 12 -20 45 14 -43 -114 27 15 69 -55 17 47 37 14 8 60 -8
3803 -8 32 50 52 -18 34 34 22 58 45 -94 -18 15 8 75 27 -23 -21 -1 -50 9 20 -25 -18 45 35 -6 18 13 2 5 -31 17 -21 26
3837 26 3 -33 -76 -36 -28 -36 -18 -39 -28 10 57 -30 -2 -18 63 10 29 -27 -9 19 72 -12 -5 9 74 -10 6 51 -5 -60 22 34
3869 34 44 14 24 -2 55 37 -1 41 37 56 23 -47 -38 15 -7 17 -25 -36 1 18 30 -34 5 -18 13 -45 55 13 -16 35 -35
3900c5L5Nj7n2L4PJ4j8oJ0lML9k3M7o3J5P0m8M5k1j3j0m0L9Qk4k1L1J3j8lj6K8
3934A3l8L2K2l8Rm4MN4j1Lj8L6J2OQl7j1K4m3P1p8K3J7Po3M3l6%R2m0k0m4O0l5
3968b0Q2o9j2OJ5N7q1l0O6m3K1R2r0N6j18N9N8l7o0K5N6m5K1J6Jk9n4O3Rm2L6
3999Ij8J8k1pK6k6M4k1K7n1j1J7nj3K0k7K6M2n8omK3P8j05K2j1M3k3M1l3LN7o9
4032a3P6k1l4j1K5n6M2j6OK2nJ2K1m2kO8j01MJ1N2k9j5m6N0k1J5j3ojo8J16m5
4064b5M1oq9L5P7l8j2J1l6L1kM5j6p0J04Ll5J9nj1j4k0qp4P7P5q7M8On2M6N8l3
4097D3j27J11M4q1L0k0p7J25j6q5L0M5o8L9oL6l1%j4J4Pq8Q9P2k1m3n9O4oJ5n8
4128c6K2K0J2l4n2L2P2l3M3n2Ok9j3L8Rnl4Q6n4j4j2J0L1j2J7rQl4N1m7J9m0R
$$ plain form
3900 -35 0 5 -12 -64 -30 -23 -9 -27 -33 -23 -26 -22 17 -6 41 -22 -7 63 15 60 39 26 16 -24 15 23 -1 -22 9 22 4 1 -15 13
3934 13 -25 7 29 -9 0 -44 -40 14 3 6 -12 24 36 42 50 13 2 26 -17 54 -24 -1 16 23 -40 3 -33 -33 59 19 -1 -45 15 -20
3968 -20 62 -7 -19 -13 2 59 -22 -52 14 -29 -8 84 -6 50 -68 -9 49 12 -48 -23 33 -12 9 25 26 -3 -57 6 15 -27 9
3999 9 -9 9 -12 -19 7 -19 25 4 31 -20 -31 -14 -19 -32 -12 -39 -13 29 -29 -35 -39 -16 62 -43 -21 -32 11 -12 29 -4 -1 56 -13
4032 -13 63 42 8 -3 22 -34 8 -8 -2 20 15 27 48 6 4 72 -29 -25 -14 38 9 -6 -52 -2 -23 -8 -21 -27 -28 -96 20 -25
4064 -25 16 10 -79 -44 33 -5 -17 -6 -42 -11 -13 32 16 -54 50 53 18 37 32 21 7 -13 -21 -95 -18 57 -30 18 24 -28 18 76 43
4097 43 -84 27 71 -10 20 0 -77 48 32 -53 -23 22 -46 -7 -13 23 -8 -8 -22 -8 -1 -89 0 72 51 8 -51 13 7 22 -36
4128 -36 -14 6 18 -16 -68 -36 36 3 46 -6 0 -29 -42 -4 5 0 -34 52 -2 -16 -28 -18 13 1 18 9 17 -17 34 -13 6 -34 -25
4161b5N4L9m4J3n2O8l8m8j7N6j4M7p1J2N1q8j9M0N0j1O3l7m0k6L1Jl9Q5o3n3Q7
4192A2L9r0R4q0K5k2j7N9Ml6J7k1M3l2kJ1l8J21p6o0P5m5N9n1K3p8J4M1KN2o0
4223a7O0r2N1O9jj4j23R6O6o6j5o5K5M1k7Q4r1kk8P4Nn0K8k4J2j7L9j7L1m2L5
4254B5o2N3j1Kj4N0km2n8J02n6l7M7J8j8K8%m4L3J1m7Q0m6N3Qol0k3m8P1NMn6
4287a0K6n7K6L5p3N7MOj1k4K9n5K6n7K7N4m3O2k6Nl5l5N3N2K5p7k7oM8NqL2k0
4320Hl5L9n7R3o8J3NN6r0L1PK4l4j9K1qL5m9Q8n2ln9mJ13n6KJj2m4J02K3q0ol1
4354d6J9N3m5NKoL8l8J9L0m2M0o7K8M7o6Q8o0K5k3mK0Mn4J5M5Loj07J37n8nJ0
4387AL0j8Jj2k8L0k5R1j02M8l4J6l6M7l1K1JK8%m1kJ9J0L2j3J4l9J0j7j7R4p5
$$ plain form
4161 -25 29 68 24 37 -15 53 15 -33 -50 6 -8 39 -32 -20 31 -57 -76 -36 14 3 66 29 -11 -37 -6 -5 -44 41 -22 -75 12
4192 12 51 -39 55 -25 0 -22 -39 20 24 -12 5 -16 27 -5 -7 4 -34 87 11 -49 26 -19 40 -11 12 -66 -52 -11 -9 43 -17
4223 -17 43 -49 2 71 70 56 -67 29 95 29 14 -51 -26 15 -12 72 -19 -21 -49 25 30 -20 8 -16 -4 -21 18 1 32 -10 25
4254 25 -37 16 5 7 -7 43 41 -1 -59 43 -13 -50 -3 15 -3 25 25 -19 14 25 -22 58 12 65 73 67 37 14 -34 37 42 46 -10
4287 -10 16 -41 -15 20 -53 4 8 14 3 -21 8 -47 -21 -78 -51 3 -40 22 -4 1 -34 -69 -16 36 61 -16 -43 -49 -1 4 -4 28 8
4320 8 -27 12 -45 48 -20 -7 -2 54 -36 -5 2 26 -8 -27 -6 -14 21 -28 60 8 5 -54 -58 55 -1 1 2 -10 -54 48 71 -9 -15 -46
4354 -46 -27 26 -19 -14 -12 -18 20 -18 1 31 -11 29 -38 -10 37 -29 59 -1 24 1 -3 17 21 -33 -18 27 30 24 -83 54 -4 -9 1
4387 1 31 13 14 2 -26 4 -21 70 -32 16 -18 -2 -38 9 -22 -1 0 28 28 -13 -15 4 14 46 33 47 8 18 1 -16 78 3
4419Cqm0k9J14o1n7L7J6R2l2l5Lj8%k4J8K2l4M0jl5Q3l8j5no1J03p3Q3m0K6m2
4451hKN0J5k6l4KK3J5n0N2o7J6K2j7KLOP2m8Mj08R0nmm1j8P5pL1j6o2N3J5Nj0
4486C2rrmjM6j23O3J5j7L8oK0l4J7l0M6l8Pk2J5n4M4%m8M1Ol3P2j05P6Lk9J4m7
4520e4L8qJ01q3Oo4K7J19j77Q2r0N8J8k0Q1j08J15o3J3O2j17mJ23n8N4j07P0k2
4548hK9N2l3k4l5M0l0J4n0Q2j7M8K2p2k4ol3J12q3K4J1j7m3N5J0p9N5J7jj8l0
4579c2M7p2J7R0k0m9L4J1QJ9l8k8J2J8k1K6oRp1O9L1o1K4OM5q4J6qJ3K6o7%K2
4612a4MP6j06N3L9j9Mq4P2J7n7M4l3K5j7N2m8M0k4k0nQJ0J1k2k1M4o6K6m6O1k1
4644a7Lj2j2M6n0Q4j00N3j3N9Pl8Nl3K4j6Q9j34N8k3K5M4l1k9j7M1Op5O0n1L5
$$ plain form
4419 3 -5 -45 -74 40 -21 -78 -41 -25 67 35 0 3 -15 -15 -39 -21 1 -33 7 6 -29 54 16 1 -4 -65 38 -35 48 8 34 -8
4451 -8 -6 44 59 33 -1 1 24 39 -11 41 -26 -10 12 -5 -3 0 6 78 30 34 -74 16 11 7 -34 -52 23 16 47 31 -31 22 37 42 32
4486 32 23 14 10 9 55 -68 -5 10 -7 31 25 45 11 28 -2 44 6 13 -9 6 -48 -4 -4 -52 -11 -5 -38 34 -71 5 8 -21 -7 -54
4520 -54 -16 -24 77 -6 0 -64 -37 82 -95 -13 -103 -45 -27 -47 34 -74 41 -22 -9 53 -64 -68 55 -3 51 -56 14 -8
4548 -8 21 73 40 16 -19 21 -9 5 -45 37 20 68 90 18 -6 -12 -45 67 -16 8 19 2 -41 14 24 -55 0 17 16 -2 -32
4579 -32 15 -57 -40 50 30 -19 15 26 34 53 15 -13 -1 17 -4 22 16 25 -46 23 54 -7 17 23 68 -16 0 -8 5 31 -36 -36 -14
4612 -14 -10 66 -40 13 52 33 37 -47 25 42 -15 29 -4 21 4 56 8 48 24 4 -1 7 17 28 6 -15 29 -37 -11 -57 4 -17
4644 -17 -14 -26 -38 8 -42 42 -58 -5 -18 41 48 10 15 -18 6 -10 79 -55 3 -20 5 49 18 -11 -28 13 19 -56 4 -47 -12
4675a2pK3N9j06N0l6J83j77M3OK3l9k3J5OJ1QJ6q8K3j8N6%l0j5N5k4M2o6k4O2
4706A6k5J8j7Rj1J7K4kk0m9j3P6j7m9k1R1K7q0pJ8lL1L1l1L5n5pL3q8N9j2J6O4
4739E8p0n9P9P3j40P2Nl6%QN0K9n2j4l1L4o1J6J2N1o4K%j3N0pl6K8K1n1M4Pj4
4772iQk3L2k5LmK7Ol2N5l5K4l4KMJ2N3p8j1JL8PrnOK5k8J0j02O0L2L8n2nj2J1
4808a0k7Nj0J2L5J3o4R7p6O2J5j15M8K7m2LM1k9M0nj2K6Np9J6kM3l8N1o4o2J06
4840A0Rp5O2o8R4j2l2l7Q0m3K7QJJk0k4O4m8k5M6oj2Jj1L9k7L0n4L2l4N8o4M7
4873A7rk7n7M7QM2%l6j4L4J9L9n7j1ll1N0Om7J9Nk5Q1m6mj8oJ6J8j0l6J3QJ1M0
4908C6l2L7j01N9Jqkj6RJ8L5k6jM4l9J1k2k6L1J8Ll4l2O3m3L9j1k4K4q2J04r3
$$ plain form
4675 -12 -19 4 63 -43 7 -29 154 -23 20 26 49 10 -13 2 8 19 27 43 -45 -22 -40 16 16 -14 -29 26 2 44 -22 -46 16
4706 16 -9 9 -8 1 -10 7 31 29 9 -40 -53 23 6 -43 -64 27 54 -26 -33 -15 -18 13 44 13 48 -7 -14 19 -69 -10 -22 -6 58
4739 58 -12 -71 8 81 -59 13 18 -18 -18 -10 40 69 17 3 -28 6 -55 -39 -27 24 -40 -38 -38 -51 -1 -8 -44 -16 5 -46 -2 5 -9
4772 -9 -1 -24 8 -17 -14 -18 9 15 -17 38 3 27 -7 -5 -1 11 64 -14 -25 -24 14 21 12 7 13 38 10 20 -82 -22 10 48 -4 -9 -21 -10
4808 -10 -37 -32 -42 -30 5 18 -46 51 -25 37 52 -63 -15 12 -30 -27 14 -15 25 20 8 34 39 -40 -24 -26 17 -21 30 -34 -96 10
4840 10 19 -56 6 -62 32 20 -12 -49 31 -12 15 23 24 25 5 -19 45 -3 -28 18 12 0 1 -10 29 2 32 -22 10 -24 34 -30 17
4873 17 8 -19 -76 -29 -21 21 21 -15 -29 5 24 63 6 -5 -8 -39 11 17 -30 -11 -6 -31 50 4 0 -18 -24 -8 10 0 -36 -23 -15 -4 36
4908 36 4 41 -60 -1 0 -8 -10 -26 -17 1 36 10 9 53 14 25 3 -23 8 26 29 -5 -37 26 -17 22 11 -13 11 -71 33 -60
4940f0P7k2j0L0j2k5N6l5lj3N1or6J8K5J10j14M3L2n6J8j2M0p0K4M1k5Pj5k1M4
4971B1m3N6n7j6L4Jkl1RL4RK2o8L6k0J4L3n5O6k0l4L3m8K6j8J8ommK6j9K7k2r
5005a1q7N4qN4l3N2p3J3L2LL0Rp2J8NL6o1M1M8Rq7N6ml4L2j1p2N1l0M9l3JP8n3
5039BL8Kl4m9K9Q7m1mk2m2N4KLl0ppO3J9q2m2L0%pN9p8J6L5m3k2R9n2L2O8j26
5073e0j3O0N0p3M6p0N1J4j0J8%Qn6P5m2j9K4Mk5M0n0P6j9q4M7L9n0K1Mn3LM8j6
5106bLj1K3K1o0QQK7nn7j8O3l2J07j85M1M0P4J7j09J06o9kM0m9L5o0JO6J5k8L
5138A1Ml5K0j7qJ4M6NJ6k3q8M9%Ok7Ml3K4N6J6mp2Q3k9l4Ll0nK5L0L3kp5L0Ko
5174a1o9K2P2o3O5n5L0K0n4M6L8r5R0j1k9J2l5KM9p0R4q2K5n0P2rl3OL6oLJ7k0
$$ plain form
4940 -60 17 -5 -15 15 3 -22 34 -1 -4 -17 34 28 -68 -50 -25 85 -29 14 46 -10 8 -4 36 -34 -10 31 6 13 -2 -23 21
4971 21 -22 34 -23 -39 -5 -4 -6 -37 -28 6 15 37 -31 5 -15 -1 32 -23 43 23 -11 22 -26 0 -18 0 -6 -10 -14 12 -7 20 -2 -11
5005 -11 -98 -44 -52 2 -31 21 -52 -39 -7 -4 26 35 -37 -19 -14 22 -39 2 50 59 -28 28 24 -10 22 11 -61 -10 -40 9 -24 -23 55 2
5039 2 40 42 8 -41 -12 75 34 30 8 -34 20 22 25 -5 -12 -19 44 63 -19 -61 -31 -31 -38 21 -57 -41 -6 -49 -71 28 -24 8 76 -50
5073 -50 -63 -3 47 -26 20 -50 1 15 5 23 23 31 -25 50 8 -11 13 17 -8 32 -18 58 39 -45 2 41 -9 12 16 -37 -34 14 -2
5106 -2 1 -10 13 34 -26 -18 -10 17 12 -45 -63 0 -32 75 -110 -69 -29 45 62 -47 59 -10 -12 28 -21 14 -46 -45 21 36 8 11
5138 11 15 -20 0 -17 -25 -11 35 40 56 33 -55 -6 -6 0 -27 -23 -56 -32 24 40 36 -36 47 18 -16 -13 -43 -48 -23 7 40 38 -37 -7 -5 -11
5174 -11 -80 -58 14 -49 16 -39 -9 11 -43 3 41 -54 36 25 -4 8 -27 -25 24 -46 48 -34 -9 -59 13 4 -29 -23 13 7 10 27 7
5207Gl6R1l1k1J9j6L0m2rP5k3p9N4Om0k1P0j9J9l4j9k4J4j3N2P0p5M9m1L4n4L
5239dj2K5k4L0m0j0N5K3n5k4O5p3P6m1N6pk7o1Q9p8J2j0N3K1l0q3P9J7k7K9k3
5270Aj1ML8Nk9K4nj4mk5J7J6moj6lnL0l1pJ4pn7P6N7n5KJj5O3j34P6J0L5q3lK3
5307b2j2N8K0m2nj2n5M2J8NK6j4l3N1J4l3J9prj9l2P4l4jqj9OM7j4l1J6ll7O9
5341B3k8Lj6K4n4L7M0m2K7n1L4rNK3J6n3mk2K8JM8Mm1ll7N7knoPm0K8k5M1lp2
5377f7K6M0l2M7L2q8N9n5N6K8pl3j5L6n7k7J3LP7k9OJ9L9q9P5pn6M9n4JLkrPJ4
5412Cm1NP2k8Jk1j2j5N8M6j04RK9p1O9M7o2J4K1j3l4J6j4l7P0Pn0O5k2lM2j08
5444f1M7J6L6j9M9k7m2j6N0Ol2M7n3p1P4j0m5L6OL5o0K4J9Jj0k5k6Q9l8o7Q9J2
$$ plain form
5207 7 -29 62 31 10 29 13 43 1 -8 67 44 -35 19 25 -15 -36 34 15 34 0 -19 -43 -29 -42 10 80 5 54 13 47 -7 -4
5239 -4 -16 9 -15 15 -25 -35 20 43 -12 -36 29 -44 32 -9 47 40 13 -48 41 -37 -25 -35 18 39 9 -74 5 22 -5 24 1
5270 1 -10 -6 32 37 8 32 27 13 9 -16 1 17 13 7 -9 -12 -17 13 -18 -25 -11 -18 -75 1 58 3 5 6 -9 54 -80 -4 6 41 -42 -45 -22
5307 -22 -34 24 44 2 -3 -15 -70 -28 -10 -5 21 7 -26 25 39 6 25 18 9 -10 -42 32 -2 -3 -11 -30 -24 23 9 -22 -6 -9 -46 23
5341 23 -5 -2 -18 6 -48 -11 29 -13 14 -37 -3 -12 -7 16 32 -21 -25 -47 -19 -18 30 34 -7 -10 -47 10 8 3 -3 4 -36 -8 -33 8 5 -67
5377 -67 -41 -1 -33 14 46 -42 17 -38 18 46 39 6 -9 27 -30 -57 -44 -41 36 7 13 32 71 -18 57 50 -6 43 -11 -10 -7 -9 -18 -11 3
5412 3 -38 -33 39 11 12 -9 -21 -36 22 68 -36 -27 2 -69 0 47 -15 -1 20 7 -27 -11 -25 -62 8 15 -35 30 8 5 47 -61
5444 -61 -14 2 38 19 68 41 -1 -17 33 39 7 54 1 -70 4 -6 -51 -15 -9 26 -34 -10 9 10 0 -25 -51 38 0 -67 22 34
5476C4k5k7Q0r2J2L7k7j8J0l0k3O5l0J6J3J0J9n9Q1k3l8l6M4J0J3n2K0l9N3M9
5506D7j04O2J1mo4J7O1j1ko3M7KJ8K4l7L1p7N2J5k2J8nk5l0Q9nn6pM8j8q6J03
5538B9j3n3QM6J9p6J12p9L1o4J7N3k8L4q9L1J4m2K6QL9nk1J7pK8r7L3N2o4K6M1
5570B6J7p8m2J02k8L3n9J8k3J2K0ml2qkP6n4qKN5k0nNn5M3j1l9R3L1j12k9Q2J8
5603B4Ql2Mm6JJ22j04N5m3ql5M8jR4m8q1O9l4M8n0j8K8J8K9p1j4P4m2N2p3pN3
5635B0n2JL8Rqn8Q7j5rn2j4MM7qN8Qm6l7K1J6Lr1M5Oj8N6n4Q6ol8knk9J03r3J
5671b6M8n1N9j7j9J4k9k7J01m4J5k1m3Q9j8k1lK3p1K3Q5q2%J8k4M0Mm2J4lpj1
5703b6J4L9n0L2m8J5K7j04R3m2N1L8m7j2k2N4K5j7n6M5l2N0o4L3PK8j1J9o8K0
$$ plain form
5476 34 9 -18 62 -30 -18 19 -8 -26 -16 -46 -69 -4 -34 -18 -5 5 24 -35 46 23 -15 -51 -7 3 16 -36 -16 -55 -2 47
5506 47 -57 5 16 12 -52 -35 26 15 13 -50 -3 -1 17 41 4 35 -42 10 25 3 21 16 -9 -39 50 45 -11 -18 30 12 -74 29
5538 29 16 -37 -29 17 36 -40 72 -7 24 -40 -23 30 2 36 -53 -22 -8 -50 -24 -16 23 18 -3 14 7 35 -62 -29 23 -41 -15 26
5570 26 43 -35 -77 25 -3 30 -29 -11 -34 -22 -2 -6 -38 -46 -48 28 -26 -34 -32 23 3 -2 3 -52 -9 -20 -59 34 65 -47 -76 6 24
5603 24 32 0 4 -42 -41 81 -23 32 -11 -19 -54 -6 -7 87 39 -42 27 -7 41 -9 -27 1 19 48 -23 -37 37 -5 47 -26 -33 20
5635 20 -32 -31 7 16 8 -50 37 22 13 -39 -53 -49 -2 -10 48 56 10 -27 -6 10 13 -78 -33 -27 -45 11 -43 43 37 -1 -3 -8 -37 66 -27 -26
5671 -26 22 -29 30 13 -6 8 -21 -48 53 9 24 3 -40 49 31 10 7 30 -41 -18 67 -15 -15 3 -21 19 23 -19 -5 -8 -15 -26
5703 -26 -12 27 -23 9 -39 -24 3 -101 -8 -50 1 39 -8 -20 -42 12 37 20 -36 9 -23 27 -37 -4 3 31 20 39 -29 -9
5733iL9ll8M9L2p2J7k5K6j6J7mK7l9Qj9PpJ4K9j4n0L3o4M9O2j30P8l1J2L2J4m4
5766b0K5k5l5NjP4o0K3N8o1R3j31K8N9r1M0rl5L3N6on0M6Ml4Ljj0K9l1N8o3pQ3
5800D7k6K6p9N3Rj2nJ7j5L8l8l2k1Q4n3KKm1o9P4P2Rj3o8M5k4N6K6j26L3L6l2
5832b5K4K6k4k6K7j0k8L3j9k7P6n2kJ6n8J3J19p8L1J5m5M8m2K6pJ1l0j3l4N6l8
5863c7N9L3j38O0L2N7n9O3l3p5P3j9r3P7j3L0j8L5%%q8nJ7J7Lj3k2M4j0J3j9M2
5895A3j6L4rn5L0L8K3Qj8k0m2m2O2QJ7j6L2k3mm0K6Nq5Q4N8n6m4L0j1J6m9RM1
5928DJ4M1l5m4L4k3J3j5K1J1k4j1o7P4K7j4n6N7j6k8oM6Nl8J3O1o0L7p7L2L3N1
5960F0r6M1nM5r3M4L7j2k4m1O4j8N3J2l1j3l2mM1m4P5q4M6l2J7k6J8jk9lJ2n9
$$ plain form
5733 -9 30 27 -11 38 70 -2 15 -10 16 0 17 13 40 1 9 -10 -3 -10 4 33 19 -31 2 -62 -13 49 -81 -3 -34 -22 10 24 -20
5766 -20 5 -20 -55 -50 -51 23 -37 -14 44 -17 76 -55 -27 32 -59 -19 -28 -63 -30 26 20 -30 16 20 -14 -11 -12 -22 7 -24 34 -29 -36 47
5800 47 21 47 -32 21 30 18 13 30 15 53 15 -17 -38 46 -7 -5 -3 -44 -113 -39 33 42 29 -39 6 -18 38 64 -62 -29 7 -25
5832 -25 -1 25 1 -25 2 -8 -36 -3 -22 -49 27 -25 -27 -11 -69 -56 63 -15 16 31 -14 34 -8 18 11 22 -8 -21 -55 1 -37
5863 -37 22 55 -83 -23 9 66 7 70 37 -38 35 16 -77 0 -13 17 -1 34 34 34 -54 -59 -42 -25 -22 -35 -57 -13 -23 -10 -29 13
5895 13 -3 31 22 -33 -3 35 58 66 48 28 -14 -56 6 14 31 15 47 24 20 -20 6 11 -74 10 68 12 -32 -2 -13 3 -46 -37 4
5928 4 18 59 24 -20 14 -9 4 -11 10 21 -3 -14 -81 -7 20 6 -50 7 -9 -37 -43 3 8 -30 -17 44 -16 21 -56 -24 9 60
5960 60 -36 5 0 45 -48 -4 33 21 -3 -44 20 2 55 67 36 23 -9 -13 28 -16 59 -25 21 -11 6 -20 -2 -3 -32 -35 -23 -82
5992h2J4L2N5J0q9M1m7P0j2J5k3J5m5K4O2q2J44j70M2JJ7J8PL1n9o3Q8l4L1jk
6023HK5n4M8r5O8M5k2k5KlrJ4J3l5J6M7mp3N3m8n4N9O5ql4j9N7l8L3n5K6k5L2
6056A0J5j7l5K5J1l8J0L5k4J2j4j1QJ4k5k9N0J0L3J4k2n9LN0n1J7K1k9K2j0mP4
6088F6k2k7l7l8J13n5K5o0P9j08Q8j02R2J0o7N3jj1J4o2O2k3j8L0J9J4m7j4nJ4
6118a8n1J3J8L5l8M1K4o2K1J8k5j0nK0L0l9l8J10l8QL0k1rn2J5O3J1l3J8k8%j2
6150dk0L3M7o4NM4n8NN3l2P1j41J1M6pK4l3P9k4l7j1J0K2n6K9QRL4l8P3j09K1
6182a0J3j2nO1l4j6J4j3K1L3k0rk8k9J6L4l7LK1l5K3J9Jk1JJ9J5m9NL3po5NQ5
6216C2k5Jl8j3N4Qn1o8J06oO9j13K5J2L4JJk6j3J4N0r2N1Jk9nkO9p4QM3l0l0N4
$$ plain form
5992 -82 -68 -36 19 29 -60 -19 -66 4 -8 7 -16 -1 -46 -22 40 -42 102 -68 -26 -25 -8 10 17 48 -11 -74 14 -20 11 10 8
6023 8 33 -21 27 -68 0 45 23 -2 0 -3 -12 2 15 -20 -4 43 39 -34 19 -29 -83 -24 41 33 -1 -20 37 -1 32 -23 3 -22 10
6056 10 25 8 -27 -2 9 -29 -19 16 -8 4 -10 -21 -13 1 -24 -53 -3 7 40 54 32 -27 -24 26 -25 -8 13 -16 6 -4 -8 66
6088 66 44 17 -20 -58 55 0 25 -35 44 -64 24 -78 14 24 -43 10 9 -2 12 -50 12 -11 -29 1 20 34 -13 -27 -32 -18
6118 -18 -69 -56 -38 -3 -41 0 24 -38 -17 1 -24 -34 -39 -19 11 -28 -66 44 6 14 44 23 14 -38 -23 40 51 18 36 8 8 -4
6150 -4 -24 9 56 -8 -3 41 -17 -12 41 9 80 -61 -50 -4 -11 13 -20 59 35 -2 -13 -3 19 -37 -8 0 9 43 5 78 -31 -10
6182 -10 3 -9 -14 47 13 -3 11 -2 19 52 32 23 -5 -34 -18 16 -21 -18 3 -32 -9 10 11 -10 -9 10 25 -24 -19 14 7 -58 -53 32
6216 32 7 8 -30 -43 11 19 -32 -100 6 0 69 -44 -19 -7 27 28 29 3 -10 4 54 -38 13 14 -15 -20 -22 47 -27 -19 24 -6 -36 18
6250A8l2ON5p7M4M3n4QpK7ko9M3K3j7l5L8J3k8l5K1N2k3J8RRj4l1k3K6O5q2NJ4
6284HJ2j5K1q9J04p8L8pK1k3p0J02p6N8j2MK3Kk0k5n4Q1o9N0n3Q9jm4K1J6Nm2
6316b3N2l9M3l6L3k5J6M9j31J44m9p5M1L5j01P8j1m1K9k6L7m3K5LM8J9k3m5J3
6345cp2O3L8k1K2lp0O5k6nM5km9kRl0O3k3K9o1L8JLm1K6o3P9M3lq0J1P0M0n0j0
6380C1pj5k0j5N2l1J4n0Q9n0k6P5k3n7P3m7j2q3R6j1j8k0P9jp7K9N8o8PK7m1P5
6412C3qL1n4K1N2q8Q5q4J3M5n2K8k1J9l1jMPoj3L8PqK3k4nm6O1qm9K4K6K2nn2
6447a6O2k0m4M1l5J7Nk5k4P8Lj06j9J27o7L8L1l4P4j08Q2n6jk0j1O9n6J1K8k9
6477eO4q2NN9l5K8o4M8l6jK5K1k0J3k4M1q0K2nO2o3K2J2ROqK1J9n5N4l3j9L1k5
$$ plain form
6250 18 -14 -8 47 -30 14 57 3 11 4 31 29 -40 3 26 9 -26 12 25 -3 -38 -17 35 12 30 39 48 34 3 -20 6 71 -11 -6 8
6284 8 20 5 26 -63 41 -37 1 -6 15 -8 -78 24 -52 6 -6 -2 21 23 3 -22 -76 5 -64 -14 -67 22 21 -23 -2 14 19 -23
6316 -23 29 -10 33 -3 30 5 21 70 -61 83 34 -41 0 35 -66 12 1 -40 -11 -37 0 -43 -18 -15 33 52 29 -16 -3
6345 -3 -75 -12 26 5 27 24 -46 19 -7 -12 33 31 -18 -20 -11 -41 22 -1 28 -33 5 6 9 -32 -6 -69 10 53 50 -30 -19 51 91 41 31
6380 31 24 9 -11 -26 26 -5 9 -41 48 -2 -28 47 24 -33 40 -7 -19 -102 -6 -17 -35 -55 24 23 -54 -25 33 -35 -28 -1 -42 33
6412 33 25 56 2 23 75 -13 72 -12 1 46 -6 22 1 20 -11 -12 -8 -1 -7 -20 18 25 17 40 16 11 -35 26 18 -31 -7 19 41 36 -16
6447 -16 46 26 -18 23 -12 5 10 -15 -39 39 42 -64 -83 44 -23 15 46 12 86 -22 60 4 3 -17 -28 41 -15 -4 24 -5
6477 -5 59 -23 -18 41 6 34 -30 18 -18 -19 6 27 7 20 -4 37 -43 -21 -26 36 -27 -5 7 16 22 14 35 54 -1 53 20 1 32 7
6511Gn0P6k0n8L4M7o6L0J8K1k4k9kKL7j3K2p9N7kl9L0Kj2L7L5k1mo5j6O2k1L8
6544C4Nk6L7m2m6O1k3K6l3k1Q3l9J3j8j1J2qqj8J4J9j0M0m0L6l9N6o8n9J06p2
6575c9QQ8l8Op6M1K2Rn0M9p7M4j2L5J9Ko6j1L0pN0k6O2q6J2J4Jj1K0J1m0LK5K7
6609C9j4Lk6j3J7M1n0pQ6q5j9M3ok0L4K3Nm0j7qJ2K1j4j6PPJ7o0N5m2J6k3Q1n9
6643a2Lk4N7J1n2L5j8q5J38Rl3o0N3jj15R9m4Q7%m5rKm7P3LN9k9n8llQk1K1J2
6677A1l9L6J4nm3L2Ll7N4jj6%L3pn1L5K2j6o0N6mn8N9p9M8j7OqJ9l1K7m2M3rM
6712b1Km8N3K5%J8o7L8%J2k0L1M7p2j6J5L4pM4o6n0N7Lj8%m6J35o0j17J34n0J0
6744@k9k4M8K7Ll0l2L8L2n0K5J9k2l1L7Ok3j0K5M6q8l4R6l8J5m2K9N3j9m0J4m4
$$ plain form
6511 7 -43 33 13 -45 -11 36 -30 0 18 39 15 -14 -16 -14 23 10 32 -47 10 8 -31 -1 1 -11 26 61 40 36 -29 -45 17 -4 34
6544 34 39 13 50 8 -38 23 0 26 -7 -28 55 16 29 11 0 12 4 -4 -22 -8 11 1 41 1 37 -2 54 -14 -73 33 -39
6575 -39 -31 57 19 25 -51 -10 12 21 -29 20 -57 -13 -25 10 29 31 -35 -46 -16 -23 27 1 63 -23 -11 3 4 -7 13 24 -16 -13 12 39
6609 39 25 28 2 -11 6 47 -3 -10 76 -9 -28 15 9 -11 23 46 51 11 -6 -14 -2 19 5 -11 -4 3 20 -40 15 -27 -11 -34 47 -12
6643 -12 -9 -33 24 35 -17 18 0 -85 53 62 29 -31 22 21 -94 5 -39 48 48 3 -6 -4 -51 22 25 84 55 -3 -6 -9 -1 -22 -1 11
6677 11 -28 8 22 17 -26 6 9 -28 26 25 9 9 42 35 -16 19 41 25 -35 21 17 -41 18 -61 -13 -30 -24 -32 -13 -44 -17 -59 -16 -25 -21
6712 -21 -19 -67 -14 11 11 29 -38 0 0 12 -8 23 70 -2 -18 -3 31 24 68 2 -48 9 12 -6 -6 -52 83 23 -94 40 -10 0
6744 0 -29 -53 -5 22 25 -5 -37 1 33 -17 8 27 5 -26 11 17 -6 -16 9 55 -33 -67 29 -9 6 -36 -7 46 27 -13 1 -43
6776d3O7j2l3M0o7JR2p8K8K6j2j1k9O5n3oj2R9o0j2P0l5l3M7l1M7Jj22O0L9q4
6807e1Q3j2M0m6ro0M1JP9l1n3l2K1R8r8K8j8QK3nKM0m5Jm3P8o6J9p7P9K7N4q9
6840a3J3L4%n9%O2K3m9J2Ll4Jn7M9MJj8R0p7N4O0j39N3k4nj2O5m5J3K0l9R2j76
6873i8M6LO6j2l4K8J4L4k1j3rNN3l3j00N1RJ8O8o1o2PN3p0Q7n4M2m0M3k0J0KK1
6906C3k1l5K0l4J23q4M6j11L0K8K5Kq5M2K9k0J4Ok5NQN2k0jNL1q6K5J6o2K0J9
6938ejn7L3N6L1l6k0J0L3p6m0J18n0j3L3j3M2m8lNl8O4k6K2l4L6m4M3l3K2l2Q
6970a3J2p0J39n2m7O5q1K6J0J5J9j5J5k3k1J9k6k4L0PM0j5m2M3k4k9J23r4k8j5
7000e6M1o4Q5JL5rl2l2J7L5k2JJ4lRk8j2J8K5L7l4k2jL0j8J7rNK5l2Rm0j7L8M0
$$ plain form
6776 -43 24 12 -21 19 -48 -47 45 -33 -5 21 9 -2 -31 34 -19 -25 -37 62 2 -10 60 25 -8 39 8 55 56 -66 -6 33 -51
6807 -51 32 20 60 14 5 -55 -14 -13 66 35 -18 -50 -29 69 -29 -1 -19 -11 12 7 9 49 4 5 -38 40 -26 -7 -84 -5 22 76 -13
6840 -13 0 34 34 -25 -25 37 60 11 23 26 -8 -7 -64 -15 -11 -10 -28 62 -15 39 99 -40 13 -11 -16 -28 37 -8 5 25 -14 78 -98
6873 -98 -52 -49 17 5 -29 -1 13 47 26 13 4 9 62 29 -71 -20 -11 7 75 14 -48 -41 12 -58 29 -25 17 -23 20 0 10 12 33
6906 33 12 -23 -3 -37 86 2 48 -63 -33 -5 20 22 -63 -21 8 -12 2 8 -17 -12 -4 48 28 27 32 63 -23 2 18 -44 -24 -5
6938 -5 -6 -63 -30 26 57 21 1 11 44 -32 -72 46 -4 -17 16 3 45 -3 -6 -1 -39 25 -1 21 -13 23 -21 22 -11 11 -21 -13
6970 -13 -1 -71 68 16 -31 34 -47 -21 -11 4 23 8 23 0 -21 -2 -28 -52 -22 -15 25 10 -32 11 -13 -42 81 -13 -41 -56
7000 -56 -15 -79 6 7 42 33 1 -31 -14 21 -1 0 14 11 20 -8 -20 -2 23 60 26 4 3 33 15 32 23 28 53 21 30 -10 -27 11 51
7035E1q9L8K5K8j6k7j9Jj9L6nL4n9m0j4K8O8k3nM1Jo2OP9r5M6l6P4qj5j0PK4n2
7069gnP9o8J2n9J1N0L4k8M4p1k7K6M4L2o3OK3r6L8%M7k5O1j7k8j7jn7N0k2J5n4
7102g3N4pQl4L7j6M3Rk3Km0N9l1j8l5K1O7n5J0OMj9N8Ol5k2L5k2M8o2K8m3J9K6
7136Ek0j5k7Q2K2j1l3K9n3J8NkMM2r2M6J5M7n8k0JO7j4k8Jj8k8M5k3K8k4J3o6
7169f2P3nK5m2rPL6rm2%M0k5j9R5j7n6Qm9O8k2J1NOj2k4%J8N1j7M3o6k2m0PO4
7204A9j2prJ4k6J8k2R4p7K0oK1K7o7L0m3N8j9l4l5j1N3k4J23j01n6P0j5kk4O2
7235A9L5m5Oqp0N8M7j7j6N2o0M2j5l4N4L5p3Mo9J22k7j6k3m1O8m7kRL4o1Pk1N7
7268DkNK4p2j7L8J7K7k2K5o0Q2n4qJ4qKk9P5r0P3m9N9m8j3P%J4Ol9J07p8m3N2
$$ plain form
7035 51 -38 0 25 53 37 10 -9 -8 -27 9 4 38 -21 -61 -75 -47 21 -2 -7 34 35 -27 -21 58 -37 9 -27 47 39 24 14 21 45 -7
7069 -7 -12 67 -1 11 -48 -37 13 47 19 63 -8 -35 -9 35 67 4 10 33 -63 -25 -25 22 -3 58 41 13 -4 -5 -62 -12 -34 -19 -73
7102 -73 -19 -26 -18 -52 -15 -31 12 21 -2 0 -40 19 -12 -30 -65 -44 23 -32 -22 -16 -12 -31 27 33 -2 -24 11 -11 37 -25 3 -40 -21 5
7136 5 -15 -30 -57 25 47 36 3 32 -21 -3 2 0 4 46 -46 0 15 62 4 -16 -15 52 38 10 11 -7 -35 10 -13 15 -9 4 -62
7169 -62 11 6 31 -11 -20 -13 23 14 -28 -28 12 -13 -32 63 46 -10 -2 -51 17 -5 6 11 17 5 -19 -19 -1 50 33 76 10 -12 -52 -45 19
7204 19 7 0 -9 5 -21 -3 -25 69 -8 12 6 27 54 -13 17 -26 32 13 -21 -56 -67 -14 -38 85 -16 -72 -2 -17 -19 -43 19
7235 19 54 9 15 7 -63 -5 42 25 9 61 1 43 28 -6 48 83 10 14 -55 67 40 24 1 -40 28 -19 -21 -12 22 -39 -32 -53 4
7268 4 2 7 31 -41 -58 -20 -3 24 2 27 -33 49 -5 -13 1 -7 -5 -34 41 -49 24 -25 34 -14 -27 -20 -20 -6 0 -39 68 -10 -53 -1
7302aj9lkNL9J0l4L0j1Qor8R3J8l4L2p0M2p6K4N4NM4n6M2Mj26N6L0k8N2J7m3m6
7336d8N6LK9p7J6oj8j7J04Om1N1p0K1poj0M1j7K0p0l3nO3P5m9l4RKoJ9rK7pK3
7371C5k1jj3L4rm5J9L0l1n2K7K6M1j4M9m5j4k0N3l8m3K2m1K2PL2Pkk5QM9p5J7
7404a1M7L0l7n4n2N8k2O5j0k0j0p7J17l8K4J8O8q9K0j1nj7K3j7K1j6K7k8k9O1
7434C6n0M8m7M4m5KK8Klj0q6O2RlL3nj0J0Nn2J11j17M6JK7Oj4k1j3l6L4k7Qk0
7468d7O4Om1l7P4l5OmpP7K0q2j5K8l2K3M6j03O2rK4ooM3m0p3Q3M4r0K4j7j2J1
$$ plain form
7302 -1 -20 -23 -25 -20 19 29 -5 25 14 22 16 -82 11 29 -5 27 -43 -1 -77 -53 1 6 50 -6 36 40 -86 -30 0 -28 24 41 -2 -48
7336 -48 8 11 40 -37 -21 -27 -45 -62 42 48 7 58 -12 9 2 -4 -14 27 10 30 -40 -73 -78 -15 60 11 -23 -14 -12 -18 1 -8 19 12 35
7371 35 14 13 0 34 25 -20 -1 29 -2 -54 -27 -1 40 26 75 30 16 -4 49 11 -32 -10 -51 -29 -22 10 17 15 -10 -2 47 -28 -11
7404 -11 36 66 29 -25 -77 -19 -41 24 14 -6 -16 -93 24 -14 10 28 96 7 27 16 11 -6 17 0 21 5 32 4 -25 36
7434 36 -14 34 -13 31 -14 -12 16 18 15 5 -81 -19 -10 -13 20 15 5 15 20 -32 79 -38 8 9 36 42 28 7 -6 -42 -8 -35 -27 -47
7468 -47 17 23 -18 -55 19 -16 -10 -14 -21 56 76 -6 -21 7 -25 -2 44 -59 3 -6 18 12 6 49 9 -64 19 63 -27 -3 -20 -32 -21
$$ [...]
8191E
##END NTUPLES=NMR FID
##END=
