##TITLE=1H_EC-3204-P
 DMSO, 8 sc, 
 23.3.2020
##JCAMPDX= 6.0         $$ Bruker NMR JCAMP-DX V2.0
##DATA TYPE= NMR FID
##DATA CLASS= NTUPLES
##ORIGIN= UXNMR, Bruker Analytische Messtechnik GmbH
##OWNER= root
$$ XWIN-NMR		Version 3.5
$$ Mon Mar 23 13:57:18 2020 Russian Standard Time (UT+4h)  she@DPX200
##.OBSERVE FREQUENCY= 200.1315
##.OBSERVE NUCLEUS= ^1H
##.DELAY= (6, 6)
##.ACQUISITION MODE= SIMULTANEOUS
##.ACQUISITION SCHEME= undefined
##.AVERAGES= 8
##.DIGITISER RES= 18
##SPECTROMETER/DATA SYSTEM= spect
##.PULSE SEQUENCE= zg30
##.SOLVENT NAME= D2O
##.SHIFT REFERENCE= (INTERNAL, D2O, 0, 15.7039)
##AUDIT TRAIL= $$ (NUMBER, WHEN, WHO, WHERE, WHAT)
$$ ##TITLE= Audit trail, XWIN-NMR		Version 3.5
$$ ##JCAMPDX= 5.01
$$ ##ORIGIN= Bruker BioSpin GmbH
$$ ##OWNER= she
$$ F:/spectra/data/she/nmr/H-F/1/audita.txt
$$ ##AUDIT TRAIL=  $$ (NUMBER, WHEN, WHO, WHERE, WHAT)
(   1,<2020-03-23 13:56:26.42 +0400>,<she>,<DPX200>,
      <created by zg, POWCHK disabled, PULCHK disabled
       configuration hash MD5:
       00 E9 B6 7A A2 85 ED C7 34 08 36 98 17 FE 4E 26
       data hash MD5: 16K
       91 23 BD D8 44 96 D6 8C B7 EB 94 60 AE 61 62 9F>)
$$ ##END=
$$ 
$$ hash MD5
$$ 5C B3 E6 4A 10 C1 48 50 33 F0 50 B6 F4 91 DE E1
##$RELAX= 
##$RELAX= 
##$RELAX= 
##$RELAX= 
##$RELAX= 
##$RELAX= 
$$ Bruker specific parameters
$$ --------------------------
##$DU= <F:/spectra>
##$EXPNO= 1
##$NAME= <H-F>
##$PROCNO= 1
##$TYPE= <nmr>
##$USER= <she>
##$AMP= (0..31)
100 100 100 100 100 100 100 100 100 100 100 100 100 100 100 100 100 100 
100 100 100 100 100 100 100 100 100 100 100 100 100 100 
##$AQSEQ= 0
##$AQ_mod= 1
##$AUNM= <au_zg>
##$AUTOPOS= <>
##$BF1= 200.13
##$BF2= 200.13
##$BF3= 200.13
##$BF4= 200.13
##$BF5= 200.13
##$BF6= 200.13
##$BF7= 200.13
##$BF8= 200.13
##$BYTORDA= 1
##$CFDGTYP= 0
##$CFRGTYP= 5
##$CHEMSTR= <none>
##$CNST= (0..31)
1 1 145 1 1 1 1 1 1 1 1 1 1 1 1 1 1 1 1 1 1 1 1 1 1 1 1 1 1 1 1 1 
##$CPDPRG= <>
##$CPDPRG1= <>
##$CPDPRG2= <>
##$CPDPRG3= <>
##$CPDPRG4= <mlev>
##$CPDPRG5= <mlev>
##$CPDPRG6= <mlev>
##$CPDPRG7= <mlev>
##$CPDPRG8= <mlev>
##$CPDPRGB= <>
##$CPDPRGT= <>
##$D= (0..31)
0 1.2 0 0 0 0 0 0 0 0.06 0 0.03 0 0 0 0 0.0002 0 0 0 0 0 0 0 0 0 0 0 0 
0 0 0 
##$DATE= 1584957385
##$DBL= (0..7)
120 120 120 120 120 120 120 120 
##$DBP= (0..7)
150 150 150 150 150 150 150 150 
##$DBP07= 0
##$DBPNAM0= <>
##$DBPNAM1= <>
##$DBPNAM2= <>
##$DBPNAM3= <>
##$DBPNAM4= <>
##$DBPNAM5= <>
##$DBPNAM6= <>
##$DBPNAM7= <>
##$DBPOAL= (0..7)
0.5 0.5 0.5 0.5 0.5 0.5 0.5 0.5 
##$DBPOFFS= (0..7)
0 0 0 0 0 0 0 0 
##$DE= 6
##$DECBNUC= <off>
##$DECIM= 24
##$DECNUC= <off>
##$DECSTAT= 4
##$DIGMOD= 1
##$DIGTYP= 9
##$DL= (0..7)
0 120 120 120 120 120 120 120 
##$DP= (0..7)
150 150 150 150 150 150 150 150 
##$DP07= 0
##$DPNAME0= <>
##$DPNAME1= <>
##$DPNAME2= <>
##$DPNAME3= <>
##$DPNAME4= <>
##$DPNAME5= <>
##$DPNAME6= <>
##$DPNAME7= <>
##$DPOAL= (0..7)
0.5 0.5 0.5 0.5 0.5 0.5 0.5 0.5 
##$DPOFFS= (0..7)
0 0 0 0 0 0 0 0 
##$DQDMODE= 0
##$DR= 18
##$DS= 0
##$DSLIST= <SSSSSSSSSSSSSSS>
##$DSPFIRM= 0
$$ [...]
##$SUBNAM2= <"">
##$SUBNAM3= <"">
##$SUBNAM4= <"">
##$SUBNAM5= <"">
##$SUBNAM6= <"">
##$SUBNAM7= <"">
##$SUBNAM8= <"">
##$SUBNAM9= <"">
##$SW= 24.9337058887773
##$SWIBOX= (0..15)
0 0 2 0 0 0 0 0 0 0 0 0 0 0 0 0 
##$SW_h= 4990.01996007984
##$TD= 16384
##$TD0= 1
##$TE= 0
##$TE2= 300
##$TE3= 300
##$TEG= 300
##$TL= (0..7)
0 120 120 120 120 120 120 120 
##$TP= (0..7)
150 150 150 150 150 150 150 150 
##$TP07= 0
##$TPNAME0= <>
##$TPNAME1= <>
##$TPNAME2= <>
##$TPNAME3= <>
##$TPNAME4= <>
##$TPNAME5= <>
##$TPNAME6= <>
##$TPNAME7= <>
##$TPOAL= (0..7)
0.5 0.5 0.5 0.5 0.5 0.5 0.5 0.5 
##$TPOFFS= (0..7)
0 0 0 0 0 0 0 0 
##$TUNHIN= 0
##$TUNHOUT= 0
##$TUNXOUT= 0
##$USERA1= <user>
##$USERA2= <user>
##$USERA3= <user>
##$USERA4= <user>
##$USERA5= <user>
##$V9= 5
##$VALIST= <valist>
##$VCLIST= <CCCCCCCCCCCCCCC>
##$VD= 0
##$VDLIST= <DDDDDDDDDDDDDDD>
##$VPLIST= <PPPPPPPPPPPPPPP>
##$VTLIST= <TTTTTTTTTTTTTTT>
##$WBST= 1024
##$WBSW= 4
##$XGAIN= (0..3)
0 0 0 0 
##$XL= 0
##$YL= 0
##$YMAX_a= 177876
##$YMIN_a= -132887
##$ZGOPTNS= <>
##$ZL1= 120
##$ZL2= 120
##$ZL3= 120
##$ZL4= 120
##$ABSF1= 10
##$ABSF2= 0
##$ABSG= 5
##$ABSL= 3
##$ALPHA= 0
##$AQORDER= 0
##$ASSFAC= 0
##$ASSFACI= 0
##$ASSFACX= 0
##$ASSWID= 0
##$AUNMP= <proc_1d>
##$AZFE= 0.1
##$AZFW= 0.1
##$BCFW= 1
##$BC_mod= 2
##$BYTORDP= 1
##$COROFFS= 0
##$CY= 11.3945322036743
##$DATMOD= 1
##$DC= 2
##$DFILT= <>
##$DTYPP= 0
##$F1P= 16.9975609425685
##$F2P= -3.02152046262296
##$FCOR= 0.5
##$FTSIZE= 0
##$FT_mod= 4
##$GAMMA= 1
##$GB= 0.15
##$INTBC= 1
##$INTSCL= 1
##$ISEN= 128
##$LB= 0.24
##$LEV0= 0
##$LPBIN= 0
##$MAXI= 10000
##$MC2= 0
##$MEAN= 0
##$ME_mod= 0
##$MI= 1.114404
##$NCOEF= 0
##$NC_proc= 0
##$NLEV= 6
##$NOISF1= 3.799351
##$NOISF2= 2.8
##$NSP= 1
##$NTH_PI= 0
##$NZP= 0
##$OFFSET= 15.70392
##$PC= 1
##$PHC0= -9789.02
##$PHC1= 14.00082
##$PH_mod= 1
##$PKNL= yes
##$PPARMOD= 0
##$PSCAL= 0
##$PSIGN= 0
##$REVERSE= no
##$SF= 200.130013532006
##$SI= 16384
##$SIGF1= 3
##$SIGF2= 2
##$SINO= 400
##$SIOLD= 16384
##$SREGLST= <1H.CDCl3>
##$SSB= 0
##$STSI= 0
##$STSR= 0
##$SW_p= 3612.71676300578
##$SYMM= 0
##$S_DEV= 0
##$TDeff= 0
##$TDoff= 0
##$TI= <>
##$TILT= no
##$TM1= 0
##$TM2= 0
##$TOPLEV= 0
##$USERP1= <user>
##$USERP2= <user>
##$USERP3= <user>
##$USERP4= <user>
##$USERP5= <user>
##$WDW= 1
##$XDIM= 8192
##$YMAX_p= 0
##$YMIN_p= 0
$$ End of Bruker specific parameters
$$ ---------------------------------
##NTUPLES= NMR FID
##VAR_NAME=  TIME,          FID/REAL,        FID/IMAG
##SYMBOL=    X,             R,               I
##VAR_TYPE=  INDEPENDENT,   DEPENDENT,       DEPENDENT
##VAR_FORM=  AFFN,          ASDF,            ASDF
##VAR_DIM=   8192,          8192,            8192
##UNITS=     SECONDS,       ARBITRARY UNITS, ARBITRARY UNITS
##FACTOR=    0.0002004,     1,               1
##FIRST=     0,             0,               0
##LAST=      1.6414764,     0,               0
##MIN=       0,             -132887,         0
##MAX=       1.6414764,     177876,          0
$$ Real data points
##PAGE= N=1
##DATA TABLE= (X++(R..R)), XYDATA
$$ plain form
0 0 0 0 0 0 0 0 0 0 0 0 -8 8 -8 8 -16 16 -16 24 -24 32 -33 41 -48 56 -65 73 -81 93 -107 119 -135 152 -170
33 -170 190 -214 238 -264 294 -327 361 -400 443 -492 543 -603 670 -741 827 -922 1033 -1165
51 -1165 1323 -1514 1755 -2068 2491 -3101 4066 -5822 10090 -46100 -6581 75936 -312 -98678
65 -98678 -132887 -46025 49282 49029 -51578 -108754 -63929 17983 38781 -1363 -53745 -54929 -10778
78 -10778 25064 16384 -3805 -15958 -17584 -3103 27244 35680 14732 -7601 -6091 18438 50949
91 50949 53496 15633 -11852 13731 59475 74755 45229 2048 -4172 46666 96624 77676 14765
104 14765 -10916 28760 89853 104345 48469 -14522 -119 74515 113086 71301 3903 -15810
116 -15810 35980 100237 93512 23406 -19004 10880 64700 81197 49427 1699 -10920 24673
$$ packed form
0@%%%%%%%%%%qJ6j6J6k4L2l2M0m8N6o5P4q9J04j21J38j54J74k00K26k54K87l22
33a70L60m04M52n02N58o21O88p61Q43r35J035j146J273j411J568j749J955k198
51a165K488k837L269l823M559n592P167r888J5912n6190L9519Q2517p6248r8366
65i8678l4209Q6862R5307k53j00607n7176M4825Q1912K0798m0144n2382j184M4151
78a0778L5842q680k0189j2153j626J4481L0347Q436k0948k2333J510K4529L2511
91E0949K547l7863k7485K5583M5744J5280k9526m3181o220N0838M9958j8948o2911
104A4765k5681L9676O1093J4492n5876o2991J4403P4634L8571m1785o7398j9713
116a5810N1790O4257o725p0106m2410K9884N3820J6497l1770m7728j2619L5593
$$ plain form
128 24673 59206 51232 18988 -3283 -4551 15872 39056 35984 8198 -13888 -14387 4704 31753
141 31753 31700 -6870 -39621 -25528 15182 35345 13111 -34240 -54541 -15388 36477 31171 -23688
154 -23688 -60762 -39630 15532 42106 3123 -56663 -58767 -1707 39249 19734 -31553 -57856
166 -57856 -27021 27027 36208 -9401 -46610 -32635 7610 30805 15798 -20407 -34785 -8293
178 -8293 22551 23611 4417 -12751 -16530 -183 22546 25597 6881 -9794 -12182 2718 27380
191 27380 34242 7352 -21830 -15208 18447 42539 30393 -10799 -34195 -4987 42952 46336 2538
204 2538 -35073 -25472 20856 52077 25042 -29976 -42085 749 41536 33882 -10637 -43088 -25814
217 -25814 21548 37691 2735 -35004 -33712 -3378 21733 15755 -16327 -36383 -20779 4865
$$ packed form
128B4673L4533p974l2244k2271j268K0423K3184l072k7786k2086m99J9091K7049
141C1753n3l8570l2751J4093M0710K0163k2234m7351k0301L9153N1865n306n4859
154b3688l7074K1132N5162K6574l8983n9786k104N7060M0956j9515n1287k6303
166e7856L0835N4048R181m5609l7209J3975M0245K3195j5007l6205j4378K6492
178h293L0844J060j9194j7168l779J6347K2729L051j8716j6675k388J4900K4662
191B7380O862k6890k9182O622L3655K4092j2146m1192k3396K9208M7939L384m3798
204B538l7611R601M6328L1221k7035n5018j2109M2834M0787p654m4519l2451J7274
217b5814M7362J6143l4956l7739J292L0334K5111n978l2082k0056J5604K5644
$$ plain form
229 4865 10125 -2501 -19450 -28912 -19200 1138 7484 -5316 -21421 -29013 -19801 3581 14370
242 14370 -6136 -33340 -32930 -7013 17352 14282 -18389 -43547 -24410 18091 29341 -1464 -35982
255 -35982 -35858 1996 36097 22275 -24386 -41671 -9885 29450 32598 -162 -32834 -24825 16539
268 16539 38313 15641 -17689 -23168 -293 25993 28374 3028 -18122 -9189 13642 23681 17519
281 17519 1627 -11277 -5044 14591 23868 15035 -762 -11142 -5498 16128 28901 13525 -12367
294 -12367 -17550 2136 26295 29097 623 -27504 -16709 19845 34957 12426 -20470 -28843 9
307 9 33505 28172 -11412 -33413 -13151 20571 30970 6223 -26799 -27211 5698 29056 15418
320 15418 -13552 -24734 -10927 13748 22179 2748 -19355 -17144 822 13157 12010 -1797 -16374
$$ packed form
229D865N260j2626j6949r462R712K0338O346j2800j6105p592R212K3382J0789
242A4370k0506k7204M10K5917K4365l070l2671k5158J9137M2501J1250l0805l4518
255c5982J24L7854L4101j3822m6661j7285L1786L9335L148l2760l2672Q009M1364
268A6539K1774k2672l3330n479K2875K6286K381k5346k1150Q933K2831J0039o162
281A7519j5892j2904O233J9635R277q833j5797j0380N644K1626J2773j5376k5892
294a2367n183J9686K4159K802k8474k8127J0795L6554J5112k2531l2896q373K8852
307IL3496n333l9584k2001K0262L3722J0399k4747l3022m12L2909K3358j3638
320A5418k8970j1182J3807K4675Q431j9431k2103K211J7966J2335j147j3807j4577
$$ plain form
333 -16374 -14422 2425 13436 9616 -3856 -16763 -14681 5611 20725 9448 -13966 -22055 -7507
346 -7507 15658 23191 734 -27122 -22787 8729 27601 13434 -17226 -30418 -8381 24863 26248
359 26248 -6583 -30139 -18599 11171 26407 10228 -20634 -28022 -2533 22199 16678 -7238
371 -7238 -22166 -14865 7605 19319 5704 -14969 -17702 -4409 8568 12341 1722 -14189 -15748
384 -15748 -879 10868 9687 -1356 -14621 -16037 941 17236 10644 -9967 -20750 -11234 10834
397 10834 21203 4081 -21953 -22033 2829 21884 14398 -10886 -27065 -12934 17396 24517 -744
410 -744 -24493 -19925 4256 22581 13633 -13788 -25494 -7094 16046 16868 -1283 -18520 -17175
423 -17175 2361 17191 8844 -10226 -16338 -7591 5600 12378 4396 -11204 -15579 -4349 8169
$$ packed form
333a6374J952J6847J1011l820j3472j2907K082K0292J5114j1277k3414q089J4548
346g507K3165P533k2457k7856M335L1516J8872j4167l0660j3192K2037L3244J385
359B6248l2831k3556J1540K9770J5236j6179l0862p388K5489K4732n521k3916
371g238j4928P301K2470J1714j3615k0673k733J3293J2977L773j0619j5911j559
384a5748J4869J1747j181j1043j3265j416J6978J6295o592k0611j0783R516K2068
397A0834J0369j7122k6034q0K4862J9055p486k5284j6179J4131L0330P121k5261
410g44k3749M568K4181J8325q948k7421j1706J8400K3140Q22j8151j7237J345
423a7175J9536J4830q347j9070o112Q747J3191O778p982j5600m375J1230J2518
$$ plain form
436 8169 10683 1452 -12993 -16433 -1089 14815 11763 -5729 -17527 -12251 6870 20283 8190
449 8190 -16250 -20076 -357 18832 17506 -3128 -20947 -12500 13925 24469 7047 -14540 -15874
462 -15874 2019 21517 19514 -3160 -17546 -5211 15602 21059 8725 -7365 -10906 4022 20236
475 20236 17348 1320 -7549 -3057 9336 19101 14171 -870 -7566 799 13183 18287 11342 -3133
489 -3133 -9426 2839 18919 18442 3762 -9496 -8052 8973 22920 14278 -7721 -15088 -894
502 -894 17179 19710 2553 -16230 -13669 8807 21463 9422 -11111 -17436 -4134 14565 16502
515 16502 -2587 -18489 -12270 5264 13673 5650 -10143 -17680 -6703 8971 9568 -2963 -13397
528 -13397 -13221 -3091 8362 6847 -6801 -15398 -10260 1252 8165 4122 -9696 -17168 -7550 7617
$$ packed form
436H169K514r231j4445l440J5344J5904l052j7492j1798N276J9121J3413j2093
449H190k4440l826J9719J9189j326k0634j7819Q447K6425J0544j7422k1587j334
462a5874J7893J9498k003k2674j4386J2335K0813N457j2334j6090l541J4928J6214
475B0236k888j6028q869M492J2393R765m930j5041o696Q365J2384N104o945j4475
489c133o293J2265J6080m77j4680j3258J444J7025J3947q642k1999p367J4194
502h94J8073K531j7157j8783K561K2476J2656j2041k0533o325J3302J8699J937
515A6502j9089j5902O219J7534Q409q023j5793p537J0977J5674N97j2531j0434
528a3397J76J0130J1453j515j3648q597N138J1512O913m043j3818p472R618J5167
$$ plain form
542 7617 9907 -1498 -14219 -15292 -1490 13436 9189 -9246 -18432 -8421 8052 14383 2379
555 2379 -15439 -16300 1908 15748 9498 -7613 -16751 -8439 9600 15882 1591 -14644 -12757 1901
569 1901 12560 9675 -4713 -14323 -7686 7356 11382 2441 -8579 -11941 -3830 8457 9590 -2365
583 -2365 -12451 -9689 541 8514 7050 -5625 -15012 -7983 5745 10112 1708 -10857 -14708 -3530
597 -3530 11010 9489 -5480 -15654 -9954 4699 13142 4939 -11718 -15942 -1540 12421 10207
610 10207 -3441 -13457 -9370 6397 14813 5520 -9074 -10994 -207 11075 12472 1175 -10439
623 -10439 -6661 7249 13764 8113 -2070 -7749 -1860 10725 14487 4920 -5344 -5533 2865 12718
637 12718 12717 1378 -8765 -4053 8248 13988 8371 -3771 -9785 -1456 12742 13681 171 -10448
$$ packed form
542G617K290j1405j2721j073J3802J4926m247j8435r186J0011J6473O331j2004
555B379j7818q61J8208J3840o250j7111r138Q312J8039O282j4291j6235J887J4658
569A901J0659k885j4388r610O637J5042M026q941j1020l362Q111J2287J133j1955
583b365j0086K762J0230P973j464j2675r387P029J3728M367q404j2565l851J1178
597c530J4540j521j4969j0174N700J4653Q443q203j6657m224J4402J3961k214
610A0207j3648j0016M087J5767Q416r293j4594j920J0787J1282J397j1297j1614
623a0439L778J3910O515n651j0183n679N889J2585L762r567j0264j89Q398R853
637A2718jj1339j0143M712J2301N740n617j2142o014Q329J4198R39j3510j0619
$$ plain form
651 -10448 -8217 3894 13187 7785 -7451 -14232 -4072 8627 9164 -1516 -13304 -13110 -226 9172
665 9172 2679 -10805 -15361 -9153 1810 5227 -3296 -16026 -15936 -5175 3123 -226 -9364 -17013 -13740
680 -13740 -2405 3045 -4522 -13991 -16035 -10004 76 2733 -6559 -17060 -14680 -3925 4045 543
694 543 -9821 -16788 -10262 2960 6556 -3066 -12801 -12705 -2493 8363 6721 -6418 -13106 -5815 6093
709 6093 10110 3106 -7642 -9904 1379 12049 9901 -1261 -7252 -3159 7530 13504 7609 -3972
723 -3972 -5597 3147 11597 12069 4163 -4031 -3413 7174 13945 9195 -188 -4469 -107 9394 13398
738 13398 5591 -4677 -4771 3789 11044 10043 780 -7446 -4224 7435 11875 4442 -5455 -8011 -714
753 -714 8567 9529 -1434 -9861 -5958 3829 9035 4333 -6119 -11005 -2907 7199 7361 -1367 -8911
$$ packed form
651a0448K231J2111R293n402j5236o781J0160J2699N37j0680j1788J94J2884R398
665I172o493j3484m556O208J0963L417q523j2730R0J0761Q298l349r138p649L273
680a3740J1335N450p567r469k044O031J0080K657r292j0501K380J0755P970l502
694E43j0364o967O526J3222L596r622r735R6J0212J0856j642j3139o688P291J1908
709F093M017p004j0748k262J1283J0670k148j1162n991M093J0689N974n895j1581
723c972j625Q744Q450M72p906q194O18J0587O771m750r383m281M362R501M004
738A3398p807j0268r4Q560P255j001r263q226L222J1659M440p433r897k556P297
753g14R281R62j0963q427L903R787N206m702j0452m886Q098J0106J62q728p544
$$ plain form
768 -8911 -7994 1005 8683 5197 -5617 -9374 -3268 5736 7867 2004 -6607 -7697 1348 9226 6964
783 6964 -945 -6193 -3713 5636 11633 6345 -3590 -5236 1904 10437 11457 4013 -4419 -2470 7897
798 7897 13797 8802 245 -3241 1872 11941 14370 5787 -2562 -1162 7457 13459 11650 2331 -4131
813 -4131 1373 11244 13067 6497 -950 -2460 4374 12394 11120 1552 -4085 -698 6772 10941 6650
828 6650 -2647 -5666 948 8511 8182 717 -5558 -5405 2507 8483 4525 -4607 -8427 -3681 3805 6247
844 6247 -97 -8871 -9176 -1151 5180 2686 -5251 -10879 -8024 1424 5392 -1604 -9966 -10363 -3964 2893
860 2893 2893 -5072 -12069 -8494 358 3738 -653 -7923 -11137 -5559 3036 3587 -4048 -10056 -8317 -1572
876 -1572 3883 2006 -6223 -10668 -4979 2613 4377 -827 -7696 -8593 -1654 5275 3421 -4709 -8518
$$ packed form
768h911R17Q999P678l486j0814l757O106R004K131n863q611j090R045P878k262
783F964p909n248K480R349N997n288r935j646P140Q533J020p444q432J949J0367
798G897N900m995q557l486N113J0069K429q583q349J400Q619O002j809r319o462
813d131N504R871J823o570p447j510O834Q020j274r568n637L387P470M169m291
828F650r297l019O614P563l29p465o275J53P912N976l958r132l820M746P486K442
844F247o344q774l05Q025O331k494p937n628K855R448L968o996q362l97O399O857
860B893%p965o997L575Q852L380m391p270l214N578Q595N51p635o008J739O745
876a572N455j877q229m445N689P592J764n204o869q97O939O929j854q130l809
$$ plain form
891 -8518 -5134 1565 5589 1772 -6797 -8233 -1737 5007 4242 -1716 -7271 -6135 1932 6932 2276
906 2276 -5260 -7161 -2439 3869 6415 -170 -7491 -5866 1358 5916 3476 -3142 -7441 -3895 4175
921 4175 6735 414 -5803 -5948 -427 5849 5439 -2051 -7278 -3480 3558 6146 2521 -4205 -6636 -1105
937 -1105 6198 5792 -525 -5703 -4029 2052 7398 4465 -3196 -6073 -751 5623 6532 1375 -4456 -4858
953 -4858 2132 7494 5029 -1424 -4696 -1989 4426 7735 3036 -4066 -4332 1642 6474 6066 632 -4945
969 -4945 -2847 4486 7487 3234 -2628 -4305 -101 5981 7214 906 -4766 -2866 3001 7000 4589
984 4589 -1542 -5243 -1238 5636 6555 1222 -3857 -4130 959 6703 5039 -1648 -5612 -1892 3647 5714
1000 5714 2451 -3960 -5179 290 5818 4788 -613 -5069 -3827 2459 6565 2700 -3910 -5246 -792
$$ packed form
891h518L384O699M024l817q569j436O496O744p65n958n555J136Q067N000m656
906B276p536j901M722O308K546o585p321J625P224M558k440o618m299L546Q070
921D175K560o321o217j45N521O276m10p490n227L798P038K588l625o726k431N531
937a105P303m06o317n178J674O081N346k933p661k877N322O374R09n157n831m02
953d858O990N362k465o453l272K707O415L309m699p102k66N974M832m08n434n577
969d945K098P333L001m253n862j677M204O082J233o308n672J900N867L999k411
984D589o131l701M005O874R19n333n079k73N089N744j664o687l964L720N539K067
1000E714l263o411j219N469N528j030n401m456J242O286M106l865o610j336M454
$$ plain form
1015 -792 4206 4938 251 -5352 -4786 1627 5551 3066 -2785 -5409 -2484 3323 5514 535 -5449 -4830
1031 -4830 -34 4062 3682 -1931 -6241 -3716 2815 4742 923 -4161 -5522 -1211 3956 4031 -2011 -5793
1047 -5793 -4236 1050 4299 2310 -3883 -6327 -2266 3318 3661 -712 -4999 -4996 45 4581 2455 -3233
1063 -3233 -5685 -2651 2415 3967 547 -4988 -5458 -159 4326 2831 -1674 -5240 -3726 1908 5086
1078 5086 1344 -4088 -4741 -723 3784 4191 -283 -5076 -3873 2040 4802 2073 -1958 -4516 -1547
1093 -1547 3846 5148 133 -3881 -2960 765 4610 3793 -1491 -4946 -1808 3290 4503 1491 -2876
1108 -2876 -4095 71 4785 4361 -1143 -4276 -2544 1684 4829 2416 -2948 -4584 -900 4169 3589
1123 3589 -103 -3991 -3913 1411 4491 2633 -2664 -4682 -1661 2624 4400 476 -4570 -4276 673 3799
$$ packed form
1015g92M998P32m687n603N66O413L924k485n851k624K925N807K191m979n984O19
1031d830M796M096l80n613m310K525O531J927l819n084j361M311N167P5o042l782
1047e793J557N286L249j989o193k444M061N584L43m373m287LN041M536k126n688
1063c233k452L034N066J552l420n535m70N299M485j495m505l566J514N634L178
1078E086l742n432o53M018M507M07m474m793J203N913K762k729m031k558K969
1093a547N393J302n015m014R21L725L845q17n284l455L138N098J213l012m367
1108b876j219M166M714m24n504l133J732M228L145k413n364j636L684N069n80
1123C589l692l888P8N324L080j858n297k018L021M285J776l924n046K94M949L126
$$ plain form
1139 3799 2817 -1397 -4414 -2587 2309 4404 765 -3366 -3743 -368 3856 4245 -481 -4430 -2335 2549
1155 2549 4107 2200 -2008 -3842 -574 4439 4556 78 -2768 -2412 1575 5183 3467 -1419 -3723
1170 -3723 -696 3488 4207 1461 -2375 -3011 1003 5067 3255 -822 -3228 -1327 2199 4851 2218
1185 2218 -2476 -3431 405 3449 3402 42 -3608 -2588 1793 4049 1765 -2344 -3607 -1356 2611 3802
1201 3802 -215 -4099 -3544 428 2878 1934 -2404 -4795 -2295 2315 3187 -293 -3886 -4032 -724 2436
1217 2436 2387 -2006 -4712 -2437 875 2930 485 -3326 -4498 -1283 2721 2321 -1149 -3537 -3191 598
1233 598 3433 1422 -2769 -4146 -1102 2290 2908 321 -3614 -3273 770 3683 2207 -1370 -3253 -1869
1249 -1869 2351 4007 820 -2885 -2639 379 3437 3195 -594 -3184 -1780 2568 4024 1489 -1790
$$ packed form
1139C799r82m214l017J827M896K095l639m131l77L375M224L89m726l949K095M884
1155B549J558j907m208j834L268N013J17m478k846L56L987L608j716m886k304
1170c723L027M184P19k746l836o36M014M064j812m077k406J901L526K652k633
1185B218m694r55L836L044m7l360l650J020M381K256k284m109j263K251L967J191
1201C802m017l884N55L972K450r44m338k391K500M610Q72l480l593j46L308L160
1217B436m9m393k706K275L312K055k445l811j172L215M004m00l470k388L46L789
1233E98K835k011m191j377L044L392O18k587l935L41M043K913j476l577j883J384
1249a869M220J656l187l705K46L018L058k42l789k590J404M348J456k535l279
$$ plain form
1264 -1790 -2965 -471 2938 3517 -349 -3298 -2188 835 2996 2250 -1874 -4117 -1220 2426 2813 -223
1280 -223 -2898 -2998 -97 2761 1740 -1889 -4124 -2056 828 2361 336 -3629 -3985 -474 2689 1886
1296 1886 -1412 -3797 -3178 787 3261 524 -3065 -3813 -1170 1547 2219 -682 -4164 -3070 671 2761
1312 2761 1207 -1765 -3256 -1576 2242 3000 257 -2972 -2366 385 2753 2497 -944 -2867 -1002 2278
1328 2278 3169 1487 -1408 -2454 338 3403 3180 102 -1969 -992 2087 3836 2455 -1095 -2288 455
1344 455 3575 3357 1141 -1791 -1969 1331 4112 2620 -878 -2154 -397 2599 3467 1136 -2237 -2077
1360 -2077 735 3200 2089 -463 -2606 -1577 1741 3154 740 -2537 -2680 -376 1940 2163 -437
1375 -437 -3204 -2141 712 2303 848 -1851 -3222 -1511 1892 1894 -290 -2928 -2536 -111 2198 1546
$$ packed form
1264a790j175K494L409N79l866k949J110L023K161p46m124k243K897L646L87l036
1280b23k675j00K901K858j021l629k235K068K884J533k025l965l56L511L163q03
1296A886l298k385O19L965K474k737l589p48K643K717O72k901l482J094L741K090
1312B761j554k972j491J680L818P58k743l229O06K751K368k56l441j923J865L280
1328B278Q91j682k895j046K792L065k23l078k071R77L079J749j381l550j193K743
1344D55L120k18k216k932j78L300K781j492l498j276J757K996Q68k331l373J60
1360b077K812K465j111k552k143J029L318J413k414l277j43K304K316K23k600
1375d37k767J063K853J591j455k699j371J711L403Kk184k638L92K425K309o52
$$ plain form
1391 1546 -1727 -3179 -1604 1538 2157 540 -2261 -2923 -125 2553 1993 -1036 -2676 -1813 1003 2949
1407 2949 1292 -1989 -2431 287 2359 2790 302 -1891 -1714 1470 3340 1650 -915 -1772 -163 2318
1423 2318 2889 955 -1761 -1311 1646 2942 2316 27 -1792 -877 2377 3213 997 -1139 -1489 126
1439 126 3028 2602 -104 -2109 -1014 1791 2785 1630 -1197 -2385 -297 2611 2203 -64 -2126 -1890
1455 -1890 469 2729 1586 -1024 -2311 -466 1854 1921 320 -2108 -2254 202 2223 1446 -1162 -2010
1471 -2010 -1232 1333 2361 556 -1956 -1940 -207 1996 1806 132 -2356 -1550 887 2484 975 -1357
1487 -1357 -2053 -974 1801 2479 -138 -2359 -1814 415 2285 1486 -650 -2180 -652 1933 2182 328
1503 328 -1444 -2044 -68 2319 1559 -844 -2215 -1141 958 1995 802 -1500 -2496 -564 2091 1367
$$ packed form
1391A546l273j452J575L142O19j617k801o62K798K678n60l029j640Q63K816J946
1407B949j657l281m42K718K072M31k488k193J77L184J870j690k565q57J609K481
1423B318N71j934k716M50K957J296o26k289j819R15L254Q36k216k136l50J615
1439A26K902m26k706k005J095K805R94j155k827j188K088K908m08k267k062K36
1455a890K359K260j143k610j287J845K320O7j601k428j46K456K021p77k608q48
1471b010P78K565J028j805k512J6J733K203j90j674k488Q06K437J597j509k332
1487a357o96J079K775O78k617k221N45K229J870p99k136j530J528K585K49j854
1503C28j772o00J976K387p60k403j371J074K099J037j193k302r96J932K655p24
$$ plain form
1519 1367 -402 -2210 -1776 436 2235 791 -1841 -2298 -640 1050 1659 177 -2570 -2179 183 1822
1535 1822 734 -1194 -2570 -1438 843 1793 -237 -2006 -2171 -366 1475 1288 -1031 -2661 -1694 788
1551 788 1661 74 -1658 -2418 -559 1418 1660 -596 -2183 -1401 107 1676 955 -1265 -2186 -520 1535
1568 1535 1324 -293 -1716 -1414 260 1783 1298 -882 -1971 -664 993 2036 786 -1463 -1649 161
1584 161 1767 1361 -208 -1793 -1298 1085 2232 869 -1465 -1563 -209 1401 2128 62 -1702 -1113 1046
1601 1046 2388 1411 -651 -1706 -453 1559 2134 431 -1172 -1393 266 1955 1608 -222 -1724 -579
1617 -579 1380 1763 644 -1043 -1465 -84 1649 1492 -251 -1551 -875 574 1935 1016 -877 -1538 1
1634 1 1221 1674 334 -1355 -1338 503 2078 852 -878 -1429 -594 900 1871 404 -1459 -1302 415
$$ packed form
1519A367j769j808M34K212J799j444k632m57J658J690O09j482k747L91K362J639
1535A822j088j928j376J132K281R50k030j769j65J805J841j87k319j630R67K482
1551G88Q73j587j732p60J859J977K42k256j587P82J508J569p21k220r21J666K055
1568A535k11j617j423L02J674J523m85k180j089J307J657J043j250k249j86J810
1584A61J606m06j569j585M95K383J147j363k334r8J354J610P27k066j764N89K159
1601A046J342r77k062j055J253K012N75j703j603k21J659J689l47j830j502J145
1617e79J959L83j119j687m22J381J733j57j743j300O76J449J361r19j893o61J539
1634AJ220M53j340j689J7J841J575j226j730n51Q35J494R71j467j863J57J717
$$ plain form
1651 415 1619 1181 -381 -1747 -1039 1200 1702 498 -1209 -1572 -516 1130 1418 -352 -1795 -1041 604
1668 604 1632 672 -1263 -1808 -763 1546 1608 -432 -1529 -1541 113 1481 1086 -1058 -2083 -664 745
1685 745 1150 584 -1250 -1705 -341 1653 781 -674 -1615 -1117 597 1455 634 -1630 -1568 -305 856 1236
1703 1236 -63 -1711 -1045 324 1729 230 -806 -1687 -695 966 1157 52 -1408 -1349 380 1233 870
1720 870 -570 -1743 -880 1007 1284 160 -1193 -1195 -152 1368 1306 -772 -1674 -871 477 1143 794 -949
1738 -949 -1561 30 1450 925 57 -1197 -945 308 1447 590 -782 -1432 -472 820 1315 378 -1173
1755 -1173 -1327 142 1625 593 -338 -1217 -910 741 1514 448 -867 -996 20 1034 1101 24 -1245
1772 -1245 -947 654 1339 740 -663 -1173 -243 1060 1246 14 -1050 -680 210 1300 1080 -661 -1569
$$ packed form
1651D15J204m38j562j366P08K239N02j204j707l63J056J646K88j770j443P54J645
1668F04J028r60j935n45J045K309O2k040j097j2J654J368l95k144j025J419J409
1685G45M05n66j834m55J364J994q72j455r41M98J714Q58q21k264O2J263J161L80
1703A236j299j648O66J369J405j499j036q81R92J661J91j105j460N9J729Q53l63
1720H70j440j173Q63J887K77j124j353kJ043J520o2k078r02Q03J348O66l49j743
1738i49o12J591J420n25q68j254K52J253J139q57j372o50R60J292M95r37j551
1755a173j54J469J483j032r31q79L07J651P73j066j315j29J016J014O7j077j269
1772a245K98J601O85n99j403n10R30J303J86j232j064L70Q90J090k20j741r08
$$ plain form
1789 -1569 -260 1072 1394 18 -878 -920 256 1474 1301 -580 -1043 -283 946 1283 518 -927 -1260
1806 -1260 -8 1220 1016 -308 -1152 -841 267 1574 721 -964 -1525 -281 696 1194 79 -1542 -1177
1823 -1177 -127 1240 475 -756 -1349 -938 745 1346 -208 -864 -930 -157 975 709 -417 -1436 -851
1840 -851 411 917 269 -813 -1149 -325 780 924 -382 -1044 -907 223 829 412 -638 -1434 -293 986
1858 986 723 362 -843 -1041 121 1162 669 -473 -1053 -631 692 1373 359 -835 -974 226 1179
1875 1179 887 -290 -771 -919 665 1438 404 -904 -942 -28 1076 1229 -32 -883 -604 703 1246 709
1893 709 -305 -1070 -671 1040 1299 218 -627 -926 108 859 913 -474 -931 -427 387 927 365 -679
1911 -679 -850 111 1024 694 -349 -835 -429 443 1078 928 -544 -950 -9 909 968 111 -1084 -903 385
$$ packed form
1789a569J309J332L22j376q96m2J176J218j73j881m63P60J229L37p65j445l33
1806a260J252J228k04j324q44L11J108J307q53j685n61J244R77M98j115j621L65
1823a177J050J367p65j231n93M11J683O01j554o56o6P73J132k66j126j019N85
1840h51J262N06o48j082l36Q24J105J44j306o62J37J130O06m17j050p96J141J279
1858I86k63l61j205j98J162J041m93j142n80M22J323O81j014j194j39J200R53
1875A179k92j177m81j48J584P73j034j308l8R14J104J53j261q51K79J307N43n37
1893G09j014p65L99J711K59j081q45k99J034P51N4j387m57N04Q14N40n62j044
1911f79j71R61R13l30j043m86M06Q72O35j50j472m06R41R18N9q57j195J81J288
$$ plain form
1930 385 1000 521 -668 -897 -252 729 1065 135 -930 -533 144 1190 747 -65 -1053 -623 433 1056 280
1949 280 -492 -697 -189 859 921 -138 -801 -411 323 790 479 -561 -834 -171 738 592 -318 -808 -812 286
1969 286 1030 68 -478 -813 -238 457 1028 340 -488 -928 -72 718 652 -370 -776 -1056 588 719 513 -916
1989 -916 -1029 -15 562 705 134 -1123 -917 285 984 113 -248 -883 -333 890 777 -280 -666 -590 65
2008 65 1064 478 -383 -1033 -101 488 853 -72 -759 -464 -70 566 615 -421 -811 -232 494 943 539 -592
2028 -592 -1060 -92 578 432 -56 -644 -450 241 703 212 -591 -823 -375 687 631 68 -780 -690 161 843
2048 843 501 -327 -971 -499 316 880 106 -946 -797 123 584 701 -175 -1135 -589 446 439 211 -572 -721
2068 -721 -309 763 607 -304 -492 -421 287 643 390 -544 -822 -249 627 690 117 -199 -648 143 666 394
$$ packed form
1930C85O15m79j189k29O45R81L36r30j065L97O77J046m43q12r88M30J056O23p76
1949B80p72k05N08J048O2j059o63L90P34M67l11j040k73O63R09j46r10m90mJ098
1969B86P44r62n46l35N75O95N71o88q28m40Q56P90o6j022m06k80J644J31k06j429
1989i16j13J014N77J43n71j257K06J202O99q71l61o35N50J223j13j057l86P6O55
2008F5R99n86q61o50R32N89L65r25o87K95L94O36M9j036l90N79P26M49m04j131
2028e92m68R68O70j46m88n88J94O91M62m91q03k32M48J062n6n63q48R0Q51O82
2048H43l42q28o44M72Q15N64p74j052J49R20M61J17q76r60N46J035pk28p83j49
2068g21M12J072j56r11j88P1P08L56k53r34k78N73Q76O3n73l16m49P91N23k72
$$ plain form
2088 394 -631 -911 -141 636 548 45 -723 -576 364 616 503 113 -652 -579 371 829 454 -524 -564 126 531
2109 531 629 273 -474 -447 457 971 306 -256 -817 -58 580 483 21 -325 -458 240 397 737 104 -499 -143
2130 -143 791 735 231 -392 -631 -5 815 589 -179 -519 -506 287 831 471 -530 -494 -180 370 499 -164 -717
2151 -717 -654 275 595 373 -485 -666 -146 671 914 57 -524 -470 243 444 161 -371 -720 -151 412 338 -122
2172 -122 -813 -609 -177 287 607 -74 -821 -341 -38 570 298 -362 -891 -262 281 704 -320 -362 -498 -210
2192 -210 455 452 -429 -781 -271 494 538 -25 -539 -700 -73 963 174 -54 -763 -611 362 833 388 -534 -473
2213 -473 -110 560 457 11 -535 -243 100 832 340 -348 -608 -442 550 692 93 -370 -415 -54 512 444 -293
2234 -293 -631 -468 717 365 231 -253 -543 66 695 734 12 -573 -358 136 182 134 -517 -362 46 690 186
$$ packed form
2088C94j025k80P70P77q8n03p68J47R40K52j13l90p65P3R50M58l75r78m0O90M05
2109E31R8l56p47K7R04N14o65n62n61P59O38r7m62l46j33O98J57L40o33o03L56
2130a43R34n6n04o23k39O26Q20k26p68l40J3P93N44l60j001L6L14N50J29o63n53
2151g17O3R29L20k22q58j81N20Q17K43q57n81N4P13K01k83n32l49N69N63p4m60
2172a22o91K04M32M64L20o81p47M80L03O08k72o60n29O29N43M23j024m2j36K88
2192b10O65lq81l52N10P65M4n63n14j61O27J036p89k28p09J52R73M71m45r22O1
2213d73L63O70j03m46n46K92L43P32m92o88k60J66R92J42n99m63m5L61N66o8p37
2234b93l38J63J185l52j34m84k90O09O29L9p22n85K15M94M6m8o51J55M08O44n04
$$ plain form
2255 186 -17 -451 -224 159 685 22 -356 -250 466 162 526 -138 -170 -288 105 620 143 -96 -572 -225
2275 -225 212 423 312 -440 -67 -14 531 233 -78 -728 -225 389 414 81 9 -567 -377 471 485 -42 -423
2296 -423 -203 142 394 410 -432 -346 -163 462 411 -54 -353 -564 -55 500 -130 -90 -507 -104 342 268 156 -400
2318 -400 -345 -42 411 312 -37 -461 -230 153 300 186 -182 -424 235 297 389 -58 -377 -512 -65 405 344 64
2340 64 -574 -335 151 221 -37 -430 -307 64 209 266 -370 -513 -91 134 396 240 -604 -503 -32 508 414
2361 414 91 -428 -125 118 303 303 -333 -235 217 627 171 185 -319 -607 22 250 263 -209 29 -101 261 480
2383 480 167 -388 -199 -62 425 546 -133 -317 -311 332 648 -53 -300 -398 47 422 217 -224 -545 -152 33
2404 33 416 167 -207 -384 -87 407 190 -91 -352 38 131 301 237 -316 -598 -4 -43 243 16 -378 -364 -23
$$ packed form
2255A86k03m34K27L83N26o63l78J06P16l04L64o64l2j18L93N15m77k39m76L47
2275b25M37K11j11p52L73N3N45k98l11o50N03O14K5l33p2n76J90Q48J4n27l81
2296d23K20L45K52J6q42Q6J83O25n1m65k99k11N09N55o30M0m17M03M46p4j12n56
2318d00N5L03M53r9l49m24K31L83J47j14l68k42O59O2R2m47l19j35M47M70o1k80
2340F4o38K39M86P0k58l93J23L71J45N7o36j43M22K25K62j56q44J01M71N40r4
2361D14l23n19L03K43J85%o36R8M52M10m56J4n04k88O29K28J3m72K38j30L62K19
2383D80l13n55J89J37M87J21o79j84OO43L16p01k47r8M45L75k05m41l21L93J85
2404C3L83k49l74j77K97M94k17k81k61L90R3J70o4n53k82N94l9K86k27l94J4L41
$$ plain form
2426 -23 547 215 -310 -111 -54 150 386 -82 -385 -138 -219 673 150 92 -196 -191 230 488 401 -90 -383 -67
2448 -67 388 346 -221 -408 -395 324 453 329 -119 -199 86 374 459 -280 -302 -56 198 485 249 68 -212 30
2470 30 58 263 117 -129 -138 -373 277 292 394 -10 -193 93 358 242 22 -250 -203 19 620 -99 -443 -269
2492 -269 -219 327 253 -242 -231 -161 342 277 222 -231 77 178 323 232 -4 -453 16 234 275 -4 -362 -7 165
2515 165 123 85 -141 -120 -306 160 423 178 -207 -252 -119 224 268 243 -309 -242 -42 247 96 -280 -148 -327
2537 -327 149 556 5 -181 -175 -144 324 412 310 -270 -72 362 156 158 33 -149 -179 359 128 -260 -483 -241
2559 -241 316 301 38 -172 -149 -18 41 -19 -451 -376 -499 -26 218 98 -84 -288 3 312 260 162 4 -333
2581 -333 44 453 410 -60 -108 -295 368 382 91 28 -123 169 407 206 111 -194 -301 417 301 16 -505 -125
$$ packed form
2426b3N70l32n25J99N7K04K36m68l03K47q1Q92n23n8k88NM21K58q7m91k93L16
2448f7M55m2n67j87J3P19J29j24m48q0K85K88Q5p39k2K46K54K87k36j81k80K42
2470C0K8K05j46k46rk35O50J5J02m04j83K86K65j16k20k72M7K22O01p19l44J74
2492b69N0N46p4m95J1P0N03o5n5m53L08J01J45r1k36m49M69K18M1k79l58L55J72
2515A65m2l8k26K1j86M66K63k45l85m5J33L43M4k5n52O7K00K89j51l76J32j79
2537c27M76M07n51j86OL1M68Q8j02n80J98M34k06Kj25j82l0N38k31l88k23K42
2559b41N57j5k63k10K3J31N9o0m32P5j23M73K44j20j82k04K91L09n2r8j58l37
2581c33L77M09m3m70m8j87O63J4k91o3j51K92K38k01r5l05j07P18j16k85n21L80
$$ plain form
2603 -125 148 155 292 -65 15 -119 133 120 -102 -230 -234 -197 479 490 -67 -188 -196 -70 56 163 -40 -264 166
2626 166 50 310 -29 107 -487 -221 44 285 -169 -354 -462 -74 196 133 -244 -499 73 187 139 -105 -224
2647 -224 -406 -124 151 83 -195 -216 -125 13 220 -133 -387 32 372 -19 310 -151 -55 -332 19 156 -192
2668 -192 -136 -93 6 -138 454 -103 -73 -177 -107 39 -111 -52 -346 -438 0 -13 -27 -190 -436 -116 238 132 -231
2691 -231 -267 -283 327 69 244 -258 -57 -62 114 433 -174 -191 -388 93 228 68 7 -61 56 222 77 -106
2713 -106 -393 120 94 310 264 -248 -70 -156 -60 -110 -126 -139 -82 -64 91 82 6 -148 -100 237 402 105 -140 -257
2737 -257 79 227 336 -101 -456 -90 -12 401 206 -2 -527 -202 70 -87 483 72 -176 183 442 102
2757 102 -141 -258 147 334 167 -232 -212 -105 -106 96 211 41 -228 102 -67 118 -69 -164 -142 -212 10 36
$$ packed form
2603a25K73PJ37l57Q0j34K52j3k22j28mL7O76J1n57j21qJ26J26J07k03k24M30
2626A66j16K60l39J36n94K66K65K41m54j85j08L88K70o3l77k55N72J14m8k44j19
2647b24j82K82K75o8k78k1R1J38K07l53k54M19L40l91L29m61R6k77L51J37l48
2668a92N6M3R9j44N92n57L0j04P0J46j50N9k94r2M38j3j4j63k46L20L54j06l63
2691b31l6j6O10k58J75n02K01nJ76L19o07j7j97M81J35j60o1o8J17J66j45j83
2713a06k87N13k6K16m6n12J78q6R6n0j6j3N7J8J55rp6j54M8L37J65k97k45j17
2737b57L36J48J09m37l55L66P8M13j95k08n25L25K72j57N70m11k48L59K59l40
2757A02k43j17M05J87j67l99K0J07jK02J15j70k69L30j69J85j87r5K2p0K22K6
$$ plain form
2779 36 -104 -365 -49 -123 90 -75 -128 -186 -37 30 266 -71 -247 -293 400 190 -74 -107 -314 -171 240 39
2801 39 -148 -42 -122 165 162 158 -164 -109 -220 89 107 -7 -17 -84 120 120 87 53 -24 -191 -116 197 -197 -43 -557
2826 -557 -231 319 168 231 -122 -383 -223 124 196 121 -197 -261 150 225 -76 -159 -156 15 2 45 -209 -187 -154 473
2850 473 249 145 67 -134 33 155 16 -313 -36 26 -19 156 -174 -320 -236 121 -11 -180 -216 -226 -104 221
2872 221 216 32 153 -443 -231 159 225 -218 -164 -131 159 -18 131 202 -234 -293 263 66 -77 84 -409 305
2894 305 171 246 60 -564 -178 -143 312 -15 -272 -477 -107 166 239 73 -144 -360 198 -89 72 -131 -410
2915 -410 408 -26 133 88 68 -84 -65 -261 4 24 121 136 407 400 280 -68 -139 -24 266 -33 -1 145 157 262
2939 262 668 256 97 -135 -8 235 70 -211 -191 -66 292 255 -97 -338 -190 172 136 272 -105 -339 40
$$ packed form
2779C6j40k61L16p4K13j65n3n8J49O7K36l37j76m6O93k10k64l3k07J43M11k01
2801C9j87J06q0K87lml22N5j11L09J8j14j0o7K04%l3l4p7j67P5L13l94J54n14
2826e57L26N50j51O3l53k61J60L47P2p5l18o4M11P5l01q3LJ71j3M3k54K2L3O27
2850D73k24j04p8k01J67J22j39l29K77O2m5J75l30j46Q4L57j32j69l6j0J22L25
2872B21nj84J21n96K12L90O6m43N4L3K90j77J49P1m36n9N56j97j43J61m93P14
2894C05j34P5j86o24L86L5M55l27k57k05L70K73P3j66k17k16N58k87J61k03k79
2915d10Q18m34J59m5k0j52J9j96K65K0R7J5K71pj20l48p1J15K90k99L2J46J2J05
2939B62M06m12j59k32J27K43j65k81K0J25L58l7l52k41J48L62l6J36l77k34L79
$$ plain form
2960 40 -50 -244 180 -89 -19 -33 121 32 59 13 -64 -2 204 37 264 -160 -177 -39 273 200 -154 173 -157 -86
2984 -86 218 -88 -176 -185 158 224 219 101 -86 54 214 310 -47 -122 -177 -58 233 148 112 -113 -63 263 4 -70 -125
3009 -125 -34 -31 -113 -75 -94 7 -143 43 170 50 -141 -109 78 183 22 -124 -310 -122 18 -76 145 -423 55
3032 55 -299 -321 111 -119 -254 -318 343 114 -67 44 -123 -307 261 223 239 -203 -42 -118 -2 42 -100 -308
3054 -308 -40 157 -101 222 -2 -340 9 87 -47 96 -79 -234 173 -114 -60 -187 -6 -260 121 41 125
3075 125 -142 -190 -146 168 81 95 205 -44 31 -139 197 -522 -197 304 101 115 133 -106 33 260 124 206 31
3098 31 -254 -63 -176 129 -69 -190 -15 -115 187 73 -329 -357 -145 173 154 -133 67 -8 -67 29 341 139
3120 139 -70 -223 457 -4 -64 84 -396 40 214 209 -26 -254 -185 -177 223 -52 67 53 176 217 -130 -229 -14
$$ packed form
2960D0r0j94M24k69P0j4J54q9K7m6p7O2K06j67K27m24j7J38L12p3l54L27l30P1
2984h6L04l06q8rL43O6nj18j87J40J60R6l57p5n5J19K91q5l6k25N0L26k59p4n5
3009a25R1Lq2L8j9J01j50J86J27j20j91L2J87J05j61j46j86J88J40r4K21n68M78
3032E5l54k2M32k30j35o4O61k29j81J11j67j84N68l8J6m42J61p6J16M4j42k08
3054c08K68J97k58L23k24l38L49P8j34J43j75j55M07k87N4j27J81k54L81q0Q4
3075A25k67m8M4L14q7J4J10k49P5j70L36p19L25N01k03J4J8k39J39K27j36Q2j75
3098C1k85J91j13L05j98j21J75j00L02j14m02k8K12L18j9k87K00p5n9R6L12k02
3120A39k09j53O80m61o0J48m80M36J74nk35k28O9QM00k75J19j4J23M1l47r9K15
$$ plain form
3143 -14 -338 16 9 94 292 -223 -163 101 -3 -61 -88 3 204 66 345 25 -532 -260 214 320 47 -236 -156
3166 -156 115 16 -63 -87 20 188 -18 -72 -97 -217 -131 -117 -162 195 -403 -196 -9 -212 -142 85 23 -216 23
3189 23 0 64 -122 -248 74 -4 -61 199 -92 -135 -201 128 -81 120 70 17 217 115 118 153 -222 62 150 185 -48
3214 -48 -33 359 83 -196 260 67 28 304 -45 397 10 269 51 -2 46 193 -80 34 245 -30 253 89
3236 89 -167 -111 73 82 34 -118 -45 36 154 181 38 142 -261 -171 -187 62 -178 14 26 -123 311 -247 -52 -138
3260 -138 69 -4 174 -34 31 -188 -183 -12 79 -1 22 -301 -211 256 77 64 -20 32 88 -94 -281 -165 7 -65
3284 -65 -41 97 -30 67 -111 84 11 -62 265 -176 120 204 -246 -5 -40 87 -146 236 9 166 -26 -120 67
3307 67 83 -159 -38 -158 205 30 -138 33 -49 53 25 83 -120 159 155 -164 -126 -42 151 69 -250 -11 6 148
$$ packed form
3143a4l24L54pQ5J98n15O0K64j04n8k7R1K01j38K79l20n57K72M74J06k73k83Q0
3166a56K71r9p9k4J07J68k06n4k5j20Q6J4m5L57n98K07J87k03P0K27o2k39K39
3189B3k3O4j86j26L22p8n7K60k91m3o6L29k09K01n0n3K00j02LL5l75K84Q8L5k33
3214d8J5L92k76k79M56j93l9K76l49M42l87K59k18n3M8J47k73J14K11k75K83j64
3236H9k56N6J84Rm8j52P3Q1J18K7j43J04m03R0j6K49k40J92J2j49M34n58J95q6
3260a38K07p3J78k08O5k19NJ71R1q0K3l23R0M67j79j3q4N2N6j82j87J16J72p2
3284f5K4J38j27R7j78J95p3p3L27m41K96Q4m50K41l5J27k33L82k27J57j92r4J87
3307F7J6k42J21j20L63j75j68J71q2J02k8N8k03K79ml19L8Q4J93q2l19K39J7J42
$$ plain form
3331 148 70 101 -412 285 216 -137 -61 176 165 11 164 10 -163 -313 18 31 -186 -220 -267 198 233 -184 -14
3354 -14 -202 62 177 -11 113 -125 207 -161 40 286 -19 24 -148 -97 44 -72 -22 206 -138 12 198
3375 198 -254 44 -104 185 55 226 -201 122 55 -71 283 33 219 -97 208 -223 -16 -193 -174 -413 177
3396 177 17 53 17 -345 40 122 55 131 -90 31 -223 -87 -108 -32 -197 -442 -162 -97 82 81 168 86 396 251
3420 251 -173 -240 63 183 -108 105 -156 -86 172 -81 82 -40 -60 -51 -138 235 149 -59 -181 117 123 186 -34
3443 -34 -36 13 -96 240 -6 -141 -305 107 -7 93 17 -14 -39 -109 284 -196 208 195 -97 30 84 10 -31 -275
3467 -275 -376 71 -204 -25 -101 167 266 -56 252 245 -120 81 -18 -17 -138 -148 69 -102 -1 -125 72 -126 -23
3490 -23 -139 255 75 5 -52 121 162 119 89 -12 98 -95 2 161 -186 -149 -21 107 31 148 -108 177 280
$$ packed form
3331A48p8L1n13O97o9l53P6K37j1j54J53j54j73j50L31J3k17l4m7M65L5m17J70
3354a4j88K64J15j88J24k38L32l68K01K46l05M3j72N1J41j16N0K28l44J50J86
3375A98m52K98j48K89j30J71m27L23o7j26L54k50J86l16L05m31K07j77J9k39N90
3396A77j60L6l6l62L85Q2o7P6k21J21k54J36k1P6j65k45K80O5J79jQ7q2L10j45
3420B51m24o7L03J20k91K13k61P0K58k53J63j22k0Rq7L73q6k08j22K98OO3k20
3443c4kM9j09L36k46j35j64M12j14J00p6l1k5p0L93m80M04j3k92J27N4p4m1k44
3467b75j01M47k75J79p6K68R9l22L08pl65K01r9Jj21j0K17j71J01j24J97j98J03
3490b3j16L94j80p0n7J73M1m3l0j01J10j93R7J59l47L7J28J28p6J17k56K85J03
$$ plain form
3513 280 -78 267 -66 -163 -65 100 -53 -125 -87 -172 -29 70 55 75 -50 121 -111 78 -9 -96 -107 0 -282 287
3537 287 82 67 -117 134 456 -150 197 -190 77 125 88 -356 -206 104 173 4 5 31 89 -95 99 -264 -198
3560 -198 221 138 -4 46 29 227 -271 -37 72 -26 -278 -168 99 -127 428 71 -32 99 92 -84 120 -14
3582 -14 -5 -118 -180 -11 -77 -84 -172 -190 44 8 -56 -149 86 74 208 305 41 -66 -149 89 343 94 141 131 -10 -145
3608 -145 76 251 -24 9 -92 -115 205 1 -113 -219 -178 -107 34 -159 -147 -151 9 -123 7 50 -140 -41 125
3631 125 382 -6 322 -176 206 116 -437 -57 -116 -19 -54 -10 -176 -19 138 -27 69 -267 -355 -37 114 -27
3653 -27 -13 -269 -285 -334 -109 121 -55 -272 68 -90 -148 -198 5 -277 15 59 -157 -93 -45 55 -200 181 4
3676 4 -179 -173 75 95 119 16 162 -13 -39 -18 56 357 -48 -51 -13 -113 22 -63 -305 148 219 74 99 -140 132
$$ packed form
3513B80l58L45l33r7R8J65j53p2L8q5J43R9j5K0j25J71k32J89q7q7j1J07k82N69
3537B87k05j5j84K51L22o06L47l87K67M8l7m44J50L10O9j69JK6N8j84J94l63O6
3560a98M19q3j42N0j7J98m98K34J09r8k52J10K67k26N55l57j03J31pj76K04j34
3582a4Rj13o2J69o6pq8j8K34l6o4r3K35j2J34R7k64j07q3K38K54k49M7j0j41j35
3608a45K21J75k75L3j01k3L20k04j14j06M1P1J41j93J2mJ60j32J30M3j90R9J66
3631A25K57l88L28m98L82r0n53L80n9R7l5M4j66J57J57j65R6l36q8L18J51j41
3653b7J4k56j6m9K25K30j76k17L40j58n8n0K03k82K92M4k16O4M8J00k55L81j77
3676Dj83OK48K0K4j03J46j75k6K1P4L01m05lL8j00J35q5k42M53P1j45K5k39K72
$$ plain form
3701 132 74 267 -40 27 8 220 20 197 58 -119 -163 -70 159 96 -129 83 43 -9 15 -53 70 -24 139 117
3725 117 241 -38 -280 171 -22 165 233 -35 61 -4 24 52 171 -157 -205 -54 235 -81 126 -278 165 87
3747 87 -12 8 -193 11 179 345 -119 -328 20 10 147 348 -16 -65 29 262 217 115 104 -100 -362 97 5
3770 5 151 101 39 121 143 85 29 33 -172 -22 -173 -139 41 -317 108 -102 50 -130 -204 -11 87 229 -183 -231 -161
3795 -161 -100 -29 -225 117 -166 48 87 -179 154 -82 -100 -135 68 95 58 232 350 -13 194 251 58 121 144
3818 144 168 172 -138 -154 79 95 66 -59 48 -14 32 59 71 -492 9 31 -54 -21 224 -43 -203 -69 -83 27 -83
3843 -83 5 71 -165 -184 266 319 -250 50 20 -1 -162 -76 -67 70 -1 65 -64 -74 238 42 63 -29 -134 4 -27
3868 -27 107 -83 416 210 5 -9 126 207 86 -301 -182 126 155 223 -20 83 -126 6 -229 -184 133 -238
$$ packed form
3701A32n8J93l07O7j9K12k00J77j39j77m4R3K29o3k25K12m0n2K4o8J23r4J63k2
3725A17J24k79k42M51j93J87O8k68R6o5K8K8J19l28m8J51K89l16K07m04M43p8
3747H7r9K0k01K04J68J66m64k09L48j0J37K01l64m9R4K33m5j02j1k04k62M59r2
3770EJ46n0o2Q2K2n8n6Mk05J50j51L4J80l58M25k10J52j80p4J93R8J42m12m8P0
3795a61O1P1j96L42k83K14L9k66L33k36j8l5K03K7l7J74J18l63K07N7j93O3K3
3818A44K4Ml10j6K33J6k9j25J07o2M6K7J2n63N01K2q5L3K45k67j60J34j4J10j10
3843h3Q8O6k36j9M50N3n69L00l0k1j61Q6RJ37p1O6j29j0L12j96K1r2j05J38l1
3868b7J34j90M99k06k05j4J35Q1j21l87J19L08K9O8k43J03k09J32k35M5L17l71
$$ plain form
3890 -238 -167 289 -69 6 110 280 238 46 149 -196 168 8 -61 -16 80 34 -14 49 -317 170 -21 -4 -172
3913 -172 15 310 324 -167 -186 37 113 106 128 -143 50 132 92 63 -169 205 133 141 -248 23 -25 7 -191 72 -20
3938 -20 41 -91 72 268 224 -207 -112 62 9 192 122 12 67 -136 -252 -222 -300 -168 109 -44 -317 173 -34
3961 -34 -197 -92 138 29 -3 -40 202 91 276 94 5 179 -124 173 304 -136 -23 61 115 -61 -136 21
3983 21 -83 -121 156 294 -187 -207 4 25 224 -84 -59 -80 -9 219 -72 3 -104 36 203 213 39 236 150
4006 150 103 166 267 -351 76 241 -19 225 108 -202 -140 -9 306 -219 -268 -5 -59 46 -32 72 -382 36
4028 36 -47 -252 96 188 -19 123 85 35 -101 -212 -192 250 66 -46 180 -31 -23 19 -2 -139 37 129 -103 -99
4052 -99 91 -5 -130 -60 275 -18 6 -34 219 -32 115 -196 93 -66 88 70 -151 121 116 -63 151 73 -44
$$ packed form
3890b38P1M56l58P5J04J70m2j92J03l45L64j60o9M5R6m6m8O3l66M87j91J7j68
3913a72J87K95J4m91j9K23P6pK2k71J93Q2m0k9k32L74p2Ql89K71m8L2j98K63r2
3938b0O1j32J63J96m4m31R5J74n3J83p0j10N5k03j16L0p8J32K77j53k73M90k07
3961c4j63J05K30j09l2l7K42j11J85j82q9J74l03K97J31m40J13Q4N4j76p5J57
3983B1j04l8K77J38m81k0K11K1J99l08K5k1P1K28k91P5j07J40J67J0j74J97q6
4006A50m7O3J01o18M27J65k60K44j17l10O2J31L15n25m9K63n4J05p8J04m54M18
4028C6q3k05L48R2k07J42l8n0j36j11K0M42j84j12K26k11QM2k1j37J76R2k32M
4052i9J90r6j25P0L35k93K4m0K53k51J47l11K89j59J54j8k21K72nj79K14p8j17
$$ plain form
4075 -44 8 -222 20 -9 -103 -222 25 74 -142 62 49 300 -140 -162 122 -43 -75 -501 28 220 192 -332 68
4098 68 -47 195 33 -195 -33 -45 -18 -142 56 174 184 165 62 -100 112 -87 251 201 200 -28 -52 -101 230
4121 230 206 -56 276 37 -112 -71 -13 -60 -152 128 18 -115 19 -211 -14 -193 -111 220 -28 -382 -126 -9
4143 -9 -78 -32 -19 -142 -47 177 -51 -32 320 200 80 233 -85 -29 -32 -75 -265 -127 -102 -283 -138 -55 187 -137
4167 -137 143 -76 92 191 278 -8 3 66 103 238 -252 -73 -140 -144 95 49 19 -58 211 90 -6 80 -126 -169 -121
4192 -121 258 167 3 120 -185 19 -317 -31 49 -22 56 76 206 27 233 -15 57 -24 -180 -29 0 55 -33
4215 -33 157 109 -2 -130 279 69 -20 -279 -225 -109 -37 -274 -74 86 -121 -66 -9 -67 135 -150 -207 94 -29
4238 -29 -250 9 42 -128 319 21 212 165 80 -148 77 26 -40 153 -45 178 -15 -43 -110 343 -79 9 -120
$$ packed form
4075d4N2k30K42k9r4j19K47M9k16K04j3K51m40k2K84j65l2m26N29J92k8n24M00
4098F8j15K42j62k28J62j2K7j24J98J18J0j9j03j62K12j99L38n0jk28k4m9L31
4121B30k4k62L32k39j49M1N8m7r2K80j10j33J34k30J97j79Q2L31k48l54K56J17
4143io9M6J3j23R5K24k28J9L52j20j20J53l18N6lm3j90J38K5j81J45Q3K42l24
4167a37K80k19J68R9Q7k86J1O3L7J35m90J79o7mK39m6l0p7K69j21r6Q6k06m3M8
4192a21L79r1j64J17l05K04l36K86Q0p1P8K0J30j79K06k48P2q1j56J51K9N5q8
4215c3J90m8j11j28M09k10q9k59N4J16P2k37K00J60k07N5N7n8K02k85n7L01j23
4238b9k21K59L3j70M47k98J91m7q5k28K25n1o6J93j98K23j93k8o7M53m22Q8j29
$$ plain form
4261 -120 186 -257 -166 -383 -92 61 -21 -108 -268 46 231 -28 -106 -78 -156 -118 -47 34 -233 -154 129 -114 52
4284 52 11 13 129 -52 -223 -134 9 -194 103 83 95 -18 -189 282 233 9 -254 -23 38 -115 33 305 300 97
4308 97 17 -21 72 -132 -334 -113 -41 249 -61 -4 -19 111 120 234 73 -30 69 32 8 70 -94 -314 -241 77 -226
4333 -226 147 -205 -53 -5 -139 61 2 200 160 37 118 -149 -110 -65 28 -122 88 -371 -40 -94 200 -18 215
4356 215 269 -164 -13 -163 361 -52 33 139 233 39 -77 19 57 61 56 57 0 16 -143 -144 -175 -68 -65 -131 177 -349
4382 -349 144 -120 -221 -105 -12 205 60 37 15 8 64 37 -129 -43 -94 9 61 365 -28 147 -288 -51 -81 85
4406 85 -72 -66 103 -74 181 35 -182 86 298 -83 135 100 6 -260 31 396 -15 64 3 321 -101 -89 23
4429 23 -256 -311 12 -28 47 -114 -134 -277 -29 147 39 -92 -55 -42 157 -62 -92 109 -48 383 137 32 1
$$ packed form
4261a20L06m43R1k17K91J53q2q7j60L14J85k59p8K8p8L8P1Q1k67P9K83k43J66
4284E2m1KJ16j81j71Q9J43k03K97k0J2j13j71M71m9k24k63K31O1j53J48K72nk03
4308I7q0l8R3k04k02K21P2K90l10N7j5J30RJ14j61j03R9l7k4O2j64k20P3L18l03
4333b26L73l52J52M8j34K00n9J98m0j23Q1k67L9M5R3j50K10m59L31n4K94k18K33
4356B15N4m33J51j50N24m13Q5J06R4j94j16R6L8MnJn7J6j59jl1J07Lo6L08n26
4382c49M93k64j01J16R3K17j45k3k2pN6k7j66Q6n1J03N2L04l93J75m35K37l0J66
4406H5j57OJ69j77K55j46k17K68K12l81K18l5r4k66K91L65m11P9o1L18m22J2J12
4429B3k79n5L23m0P5j61k0j43K48J76j08j31L7J3J99k19l0K01j57M31k46j05l1
$$ plain form
4452 1 7 38 226 -50 -138 -141 -161 -206 423 55 186 -52 -75 -73 -198 111 -163 -40 98 -204 -15 24 -111 -27 162
4477 162 72 -287 113 128 345 202 54 -92 -255 -70 141 -35 -63 -15 -271 87 -162 -173 74 108 1 -33
4499 -33 -149 43 -52 -47 56 -199 53 88 60 -387 -63 -111 -22 46 -192 -175 60 -219 32 -153 -90 -165 31 -46
4523 -46 -430 88 -152 -259 97 105 9 100 41 66 147 -50 193 -338 26 415 -101 186 51 -204 -225 26 -188
4546 -188 39 37 -214 -3 10 -137 -112 -254 -6 90 -44 -218 -246 -117 335 -131 -73 41 -206 179 74 228
4568 228 33 -150 -324 73 181 13 -48 -171 -90 154 312 -388 42 -451 30 -50 -107 259 62 196 -23
4589 -23 -81 85 -48 -220 -138 136 16 197 126 67 4 -29 289 8 53 59 -86 159 60 -42 142 -94 -299 128
4613 128 -99 -207 289 53 50 121 -60 32 215 -58 23 61 -88 213 29 220 116 148 -146 118 39 -183 -90
$$ packed form
4452AOL1J88k76q8lk0m5O29l68J31k38k3Kj25L09k74J23J38l02J89L9j35Q4J89
4477A62r0l59M00J5K17j43j48j46j63J85K11j76k8M8k56L58k49j1K47L4j07l4
4499c3j16J92r5NJ03k55K52L5k8m47L24m8Q9O8k38J7K35k79K51j85O3p5J96p7
4523d6l84N18k40j07L56Qr6R1n9K5Q1j97K43n31L64L89n16K87j35k55k1K51k14
4546a88K27kk51K11J3j47K5j42K48R6j34j74k8J29M52m66N8J14k47L85j05J54
4568B28j95j83j74L97J08j68o1j23Q1K44J58p00M30m93M81q0n7L66j97J34k19
4589b3n8J66j33j72Q2K74j20J81p1n9o3l3L18k81M5Oj45K45r9j02J84k36k05M27
4613A28k27j08M96k36lP1j81R2J83k73Q1L8j49L01j84J91j04L2k94K64p9k22R3
$$ plain form
4636 -90 82 131 -165 192 167 -87 102 109 -175 5 -54 -168 68 -206 12 210 -90 -78 151 -189 -76 -14 -47
4659 -47 -214 3 -94 20 208 -55 -167 115 -43 83 39 119 47 43 105 162 -139 55 -115 379 -36 -184 0
4682 0 -142 63 -134 103 74 -243 37 216 81 -152 -164 109 179 -124 422 -60 124 12 41 -272 -39 -38 -238
4705 -238 133 -24 -164 -289 -306 66 -173 27 -133 -4 87 -116 -132 -84 316 73 13 -51 59 -90 -14 -235
4727 -235 -11 -70 143 -76 -18 62 -154 -62 62 -15 115 -78 -32 -7 320 -46 -72 -125 32 10 -114 -63 -33 -36 106
4752 106 239 -124 27 204 5 52 -89 -9 160 55 104 -102 101 -96 63 28 27 69 -32 21 -167 136 73
4775 73 0 223 -243 82 143 3 -66 -81 -280 -407 -79 -20 20 -102 -61 159 -272 -183 -92 -35 328 45 -188 -250
4799 -250 -15 -37 105 -204 -62 92 -230 -294 -61 -204 -68 -232 -93 -31 -338 75 -101 135 62 6 -66 -3
$$ packed form
4636i0J72M9k96L57k5k54J89Pk84J80n9j14K36k74K18J98l00J2K29l40J13O2l3
4659d7j67K17r7J14J88k63j12K82j58J26m4Q0p2mO2N7l01J94j70M94m15j48J84
4682@j42K05j97K37k9l17K80J79j35k33j2K73P0l03N46m82J84j12K9l13K33Jk00
4705b38L71j57j40j25j7L72k39K00j60J29R1k03j6M8M00k43o0o4J10j49P6k21
4727b35K24n9K13k19N8Q0k16R2J24p7J30j93M6K5L27l66k6n3J57k2j24N1L0lJ42
4752A06J33l63J51J77j99M7j41Q0J69j05M9k06K03j97J59l5jM2j01N3j88L03o3
4775G3p3K23m66L25O1j40o9j5j99j27L28N9M0j22M1K20m31Q9R1N7L63k83k33o2
4799b50K35k2J42l09J42J54l22o4K33j43J36j64J39O2l07M13j76K36p3n6p2O3
$$ plain form
4821 -3 -103 -62 110 -141 -107 341 -198 10 -111 -127 -22 266 -176 -124 15 107 -5 -101 -177 -373 240 -282 -152
4844 -152 144 122 211 -321 113 249 -145 272 31 -157 188 -10 -36 -67 124 -261 -58 2 109 -149 57 -44
4866 -44 -322 114 -187 21 40 -34 5 -111 133 66 -100 241 103 -91 -312 66 24 32 -129 43 -201 95 101
4889 101 -50 18 115 57 -210 69 68 102 47 -270 -131 144 105 15 199 239 263 -120 -3 150 59 -156 -58 51
4913 51 -281 -215 -123 -354 -85 61 -192 23 116 -11 334 187 110 -313 -323 -156 133 160 -321 -346 4 -37 -18
4936 -18 -32 -79 154 -3 254 91 -21 -112 -180 -21 207 230 -141 -141 -35 -2 -38 54 -31 316 -38 110 -62 -135
4960 -135 -91 102 110 -186 5 238 36 112 -109 -167 24 -179 220 42 -14 99 22 -322 -154 126 -53 -296
4982 -296 31 -91 -4 68 -232 82 -318 -24 213 8 186 56 249 -50 -122 174 -78 115 66 7 -222 206
$$ packed form
4821cj00M1J72k51L4M48n39K08j21j6J05K88m42N2J39R2j12r6p6j96O13n22J30
4844a52K96k2Q9n32M34J36l94M17k41j88L45j98k6l1J91l85K03O0J07k58K06j01
4866d4k78M36l01K08J9p4L9j16K44o7j66L41j38j94k21L78m2Qj61J72k44K96O
4889A01j51O8R7n8k67K79jL4n5l17J39K75l9r0J84M0K4l83J17J53r1k15R8J09
4913E1l32O6R2k31K69J46k53K15R3j27L45j47p7m23j0J67K89K7m81k5L50m1J9
4936a8j4m7K33j57K57j63j12r1o8J59K28K3l71%J06L3l6R2q5L47l54J48j72p3
4960a35M4J93Qk96J91K33k02P6k21n8J91k03L99j78n6J13p7l44J68K80j79k43
4982b96L27j22Q7P2l00L14m00K94K37k05J78j30J93k99p2K96k52J93m9n9k29M28
$$ plain form
5004 206 157 -302 215 -272 24 -88 35 106 -15 -169 -120 -35 23 38 90 -107 67 112 -161 -72 -10 -23 -93 -38
5028 -38 -2 -130 43 -174 -23 -224 45 -139 125 180 11 41 152 147 -14 -118 165 -289 -57 -63 196 148 -44
5051 -44 68 -184 -146 -130 -107 155 91 -52 4 -90 -60 216 -138 -135 106 103 -34 0 40 127 174 8 -90 168 178 193
5077 193 212 24 -60 103 47 80 332 71 -47 -258 73 -78 117 69 -185 75 -91 -109 54 18 -88 152
5099 152 134 117 -217 -199 -175 29 -225 -38 -42 -97 -125 170 -115 -107 -25 58 85 133 76 -168 -66 -98 73 278 363 6
5125 6 -106 -232 88 -128 -141 145 32 -90 232 -114 -126 -20 -118 313 -80 191 126 -238 93 143 -257 263
5147 263 -122 -295 180 -18 -107 228 61 20 -63 -40 -276 -60 -301 -105 -32 106 -61 -1 37 -52 212 -145 -107
5170 -107 -45 -233 -427 -144 63 -134 95 149 -16 72 172 -10 -180 -132 169 -422 -113 -48 227 49 -355 38
$$ packed form
5004B06m9m59N17m87K96j12J23P1j21j54M9Q5N8J5N2j97J74M5k73Q9O2j3p0N5
5028c8L6j28J73k17J51k01K69j84K64N5j69L0J11nj61j04K83m54K32oK59m8j92
5051d4J12k52L8J6K3K62o4j43N6r4L0K76l54LK41lj37L4M0Q7M7j66r8K58J0J5
5077A93J9j88q4J63n6L3K52k61j18k11L31j51J95m8k54K60j66j8J63l6j06K40
5099A52j8j7l34J8K4K04k54J87mn5k8K95k85QQ2Q3K7M8n7k44J02l2J71K05Q5l57
5125Fj12j26L20k16j3K86j13j22L22l46j2J06r8M31l93K71o5l64L31N0m00N20
5147B63l85j73M75j98q9L35j67m1q3K3k36K16k41J96P3J38j67O0L8q9K64l57L8
5170a07O2j88j94K83K07j97K29N4j65Q8J00j82j70M8L01n91L09O5K75j78m04L93
$$ plain form
5192 38 -24 -142 196 37 86 235 34 -113 140 141 184 0 18 46 -70 17 -25 -43 -249 -99 -43 -113 171 206 50
5217 50 -264 148 289 -337 30 289 -28 -182 -113 -70 -76 114 -97 -98 90 -25 59 7 33 5 -52 270 134 -230
5241 -230 185 14 154 80 272 -83 55 142 -19 -74 -178 -155 143 -91 -23 302 -198 -80 -3 91 -167 -56
5263 -56 24 -210 -25 208 334 2 150 211 -218 206 -40 -81 28 -127 -46 68 -91 445 -132 116 89 81 62
5286 62 41 401 -86 25 106 -14 152 -45 41 302 360 219 -3 10 -248 -98 59 99 233 153 146 179 -81 104
5310 104 60 239 278 174 -173 52 -132 173 -150 139 44 -45 -23 205 234 -13 76 93 -35 -60 57 -42 319
5333 319 36 58 121 -223 -86 -186 64 21 139 150 -125 303 113 -84 148 81 -17 42 -176 8 126 106 105
5356 105 -253 12 -171 8 -102 178 -40 -33 -191 45 28 93 -304 130 100 34 130 -182 -295 -116 4 369
$$ packed form
5192C8o2j18L38j59M9J49k01j47K53JM3j84J8K8j16Q7m2j8k06J50N6p0K84L5j56
5217E0l14M12J41o26L67K59l17j54O9M3oJ90k11jJ88j15Q4n2K6k8n7L22j36l64
5241b30M15j71J40p4J92l55J38Q7j61n5j04K3K98k34O8L25n00J18P7R4k58J11
5263e6Q0k34J85K33J26l32J48O1m29M24k46m1J09j55Q1J14j59N36n77K48k7qj9
5286F2k1L60m87J11Q1j20J66j97Q6K61N8j41k22J3k58J50J57M0J34q0pL3k60J85
5310A04m4J79L9j04l47K25j84L05l23K89r5q9K2K28K9k47Q9J7j28k5J17r9L61
5333C19k83K2O3l44J37j00K50m3J18J1k75M28j90j97K32o7r8N9k18J84J18k0j
5356A05l58K65j83J79j10K80k18Pj58K36j7O5l97M34l0o6R6l12j13J79J20L65
$$ plain form
5378 369 138 -85 -13 -86 -49 115 -30 47 170 190 162 -221 -78 -151 85 -108 -12 -55 85 142 188 -333 -352 -88
5402 -88 -55 -162 178 52 223 105 -146 -90 -275 -4 140 157 183 -43 127 -191 -44 -358 106 149 -25 372
5424 372 88 -300 -40 192 -395 101 333 -153 -11 60 -380 -66 35 -236 166 -56 -123 -19 31 91 224
5445 224 55 -105 221 255 -2 57 -128 137 2 -97 -232 -222 63 -39 -46 220 110 10 -290 123 61 47 -157
5468 -157 -238 -24 -147 -233 -86 221 84 -36 -26 80 2 -2 242 214 21 147 -27 -32 26 -114 45 273 19
5491 19 78 96 -9 127 138 159 -149 240 30 -46 -173 158 50 -184 59 -198 157 -50 56 -108 -22 9 191
5514 191 -245 -163 -217 95 -95 -151 48 35 18 8 318 181 -158 -25 -71 104 -8 2 51 -16 19 176 129 -43
5538 -43 73 165 -105 -96 51 59 49 -63 5 30 -132 -160 276 87 237 92 -240 151 -159 148 -60 80 -205
$$ packed form
5378C69k31k23P2p3L7J64j45P7J23K0k8l83J43p3K36j93R6m3J40N7M6n21j9K64
5402h8L3j07L40j26J71j18k51N6j85K71J44J7K6k26J70l18J47l14M64M3j74L97
5424C72k84l88K60K32n87M96K32m86J42P1m40L14J01k71M02k22o7J04N0O0J33
5445B24j69j60L26L4k57N9j85K65j35r9j35J0K85j02pK66j10j00l00M13o2j4k04
5468a57q1K14j23q6J47L07j37j20J0J06p8mK44k8j93J26j74nN8j40J59K28k54
5491A9N9J8j05J36J1K1l08L89k10p6j27L31j08k34K43k57L55k07J06j64Q6L1J82
5514A91m36Q2n4L12j90n6J99j3j7j0L10j37l39J33m6J75j12J0M9o7L5J57m7j72
5538d3J16R2k70RJ47Qj0j12O8K5j62k8M36j89J50j45l32L91l10L07k08J40k85
$$ plain form
5561 -205 -27 -28 -325 73 -231 227 -238 83 261 310 -72 108 12 -16 -296 320 136 25 135 -54 10 140
5583 140 60 -82 271 88 129 215 -191 2 -325 123 -28 -89 165 -185 -1 3 205 -153 -66 114 -35 -221
5605 -221 -27 100 35 -105 -4 166 -153 85 66 -403 157 -189 163 192 146 -67 -124 57 -24 201 133 -23
5627 -23 20 -326 -144 -65 -146 -58 -95 -155 9 -39 23 -303 313 -80 -70 -20 -45 174 152 -257 243 47 21 30 57 217
5653 217 43 299 -260 132 -106 17 238 -20 154 -294 109 -35 168 -55 167 -67 4 282 66 216
5673 216 -130 79 -27 -24 73 -269 72 400 -53 -111 143 -80 155 153 -72 -160 -209 74 -218 -91 -239 64 -59
5696 -59 -66 224 3 203 137 -57 147 -144 115 -34 -66 -291 220 238 -143 -161 104 -21 158 9 29 79 155
5719 155 -68 29 127 -134 -114 47 252 -99 59 -68 -45 204 -100 101 -142 -124 -33 -45 16 23 -220 50 139 124
$$ packed form
5561b05J78jk97L98l04M58m65L21J78M9l82J80r6k8k80O16j84j11J10j89O4J30
5583A40q0j42L53j83M1Q6m06J93l27M48j51o1K54l50J84MK02l58Q7J80j49j86
5605b21J94J27o5j40J01J70l19K38j9m69N60l46L52K9m6k13n7J81q1K25o8j56
5627b3M3l46J82P9q1Q8l7o0J64m8O2l26O16l93J0N0k5K19k2m09N00j96k6RK7J60
5653B17j74K56n59L92k38J23K21k58J74m48M03j44K03k23K22k34P1K78k16J50
5673B16l46K09j06LR7l42L41L28m53n8K54k23K35kk25q8m9K83k92J27j48L03j23
5696e9pK90k21K00o6j94K04k91K59j49l2k25N11J8l81j8K65j25J79j49K0N0P6
5719A55k23R7R8k61K0J61K05l51J58j27K3K49l04K01k43J8R1j2O1Pk43K70Q9j5
$$ plain form
5743 124 -93 65 -16 -92 -1 92 137 131 -234 -102 -43 286 -58 196 277 -121 -327 139 85 38 -323 -4 150 51
5767 51 182 -57 -78 -251 -263 -331 71 125 -129 -13 -104 108 -46 -237 -51 90 206 -303 252 131 -21 -43
5789 -43 -11 -182 71 -164 -181 4 10 7 -78 -137 56 85 155 -155 -136 -24 191 -31 -215 -136 -97 148 -184 -198 -286
5814 -286 335 -9 -301 -101 -120 -128 -56 209 20 83 192 73 -49 -57 13 -26 -20 -113 103 204 106 38 -87 -138 181
5839 181 3 33 166 -140 261 -29 164 -1 14 -128 94 168 -97 -67 257 -18 -137 232 -40 -85 52 138
5861 138 146 -110 -85 360 118 -166 9 -165 -47 170 -193 -220 185 80 -19 -14 169 62 24 158 85 -70 179
5884 179 127 78 45 -35 -57 24 20 279 248 -12 -92 84 61 60 21 -57 45 -120 121 147 -173 87 34 194 223 -5
5910 -5 18 1 147 -65 -253 -108 388 -159 -72 0 29 -362 -48 -174 -315 161 6 -53 346 316 -160 -28 -359
$$ packed form
5743A24k17J58q1p6R1R3M5ol65J32N9L29l44K54Q1l98k06M66n4m7l61L19J54r9
5767E1J31k39k1j73j2o8M02N4k54J16r1K12j54j91J86J41J16n09N55j21j52k2
5789d3L2j71K53k35j7J85Olq5n9J93K9P0l10J9J12K15k22j84P9L9K45l32j4q8
5814b86O21l44k92K00j9qP2K65j89O3J09j19j22qP0l9Or3K16J01r8o8j25n1L19
5839A81j78L0J33l06M01k90J93j65J5j42K22P4k65L0L24k75j19L69k72m5J37Q6
5861A38Qk56K5M45k42k84J75j74J18K17l63k7M05j05r9NJ83j07l8J34p3j55K49
5884A79n2m9l3q0k2Q1mK59l1k60q0J76k3jl9p8J02j65K41K6l20K60n3J60K9k28
5910eK3j7J46k12j88J45M96n47Q7P2K9l91L14j26j41M76j55n9L99l0m76J32l31
$$ plain form
5933 -359 -203 -196 -126 309 147 114 27 -17 -17 -278 42 280 -241 45 38 -149 -26 16 42 -187 -125 -241 167 -217
5957 -217 -181 309 94 -118 -290 22 -23 -186 365 192 37 -202 -83 211 -145 -97 123 -171 233 81 -72
5978 -72 -127 -256 -16 -22 133 -150 -247 -116 49 102 -179 13 -85 -47 -355 48 -252 -150 -223 -203 219 -258 -204 -31
6002 -31 -57 239 76 -39 -245 -64 -72 -115 175 217 33 -6 -181 -69 109 -193 132 109 -109 -233 27 -83 119
6025 119 142 26 382 285 0 -71 -21 -328 90 151 -51 -166 -129 -70 -247 54 -279 91 -302 -219 -33 335 180
6048 180 93 12 -20 -139 -351 -182 -120 228 -298 -48 -2 123 -117 -84 -174 20 -7 9 -268 -171 53 -43 78 4
6072 4 -86 -52 -216 20 97 -210 -114 25 -81 53 -115 -100 -33 -123 189 -208 9 -90 -178 -5 14 -18 87 -112
6096 -112 -102 192 129 72 111 -29 -344 -94 -232 -2 67 101 -85 -61 149 251 174 0 -42 318 31 -107 61
$$ packed form
5933c59J56PP0M35j62l3q7m4%k61L20K38n21K86pj87J23M2K6k29O2j16M08l84
5957b17L6M90k15k12j72L12m5j63N51j73j55k39J19K94l56M8K20k94M04j52j53
5978g2n5j29K40oJ55k83r7J31J65N3k81J92r8L8l08M03l00J02p3K0M22m77N4J73
6002c1k6K96j63j15k06J81qm3K90M2j84l9j75J12J78l02L25k3k18j24K60j10K02
6025A19K3j16L56r7k85p1N0l07M18O1k02j15L7N9j77L01l33L70l93Q3J86L68j55
6048A80q7q1l2j19k12J69O2L48n26K50M6J25k40L3r0J94k7J6k77R7K24r6J21p4
6072Dr0L4j64K36P7l07R6J39j06J34j68J5O7r0L12l97K17r9q8J73J9l2J05j99
6096a12J0K94o3n7L9j40l15K50j38K30O9L4j86K4K10J02p7j74m2L60k87j38J68
$$ plain form
6119 61 -252 -185 8 68 -117 -262 164 -121 -132 -60 -228 -228 56 146 -99 -20 -55 128 126 253 50 -82 -41 8 -217
6144 -217 -108 -211 128 106 241 -112 -168 15 55 73 154 -133 -201 176 152 172 -222 -312 289 220 48 -22 52 10
6168 10 -388 -131 -7 46 -173 144 -159 -2 -34 110 -148 62 61 267 -70 -55 -238 -107 277 222 324 -60
6190 -60 -53 60 65 -7 30 43 -102 199 -293 -46 -67 65 146 112 -21 -52 -123 -29 -65 40 -23 -100 248 400 40 -140
6216 -140 181 302 13 321 -125 -118 46 -156 -108 43 144 32 -180 -155 -14 108 -62 35 80 222 -265 -81
6238 -81 -307 -31 -5 116 22 407 -74 95 49 38 -97 -182 56 -130 114 -39 -67 139 -209 14 214 80
6260 80 104 -323 -110 -125 98 152 -42 12 -77 57 -234 194 75 -161 -25 112 41 -97 -78 160 -55 13 212
6283 212 44 252 -43 -1 -191 -436 -15 -135 -110 -50 39 1 285 87 -99 69 -61 -98 -8 121 209 -125 -44
$$ packed form
6119F1l13O7J93O0j85j45M26k85j1P2j68%K84R0k45P9l5J83kJ27k03j32M1M9k25
6144b17J09j03L39k2J35l53n6J83M0J8Q1k87o8L77k4K0l94r0O01o9j72p0P4m2
6168A0l98K57J24N3k19L17l03J57l2J44k58K10jK06l37J5j83J31L84n5J02l84
6190f0PJ13Np2L7J3j45L01m92K47k1J32Q1l4j33l1p1R4l6J05o3p7L48J52l60j80
6216a40L21J21k89L08m46PJ64k02M8J51J01j12k12K5J41J22j70R7M5J42m87J84
6238h1k26K76K6J21r4L85m81J69m6j1j35q5K38j86K44j53k8K06l48K23K00j34
6260H0K4m27K13j5K23N4j94N4q9J34k91M28j19k36J36J37p1j38J9K38k15O8J99
6283B12j68K08k95M2j90k45M21j20K5O0Q9l8K84j98j86J68j30l7R0J29Q8l34Q1
$$ plain form
6306 -44 -237 -105 359 134 -72 -99 -244 26 -15 -135 89 26 -17 -246 12 50 -123 -9 28 -39 -201 42 93
6329 93 8 -37 16 274 45 -69 174 149 -96 -200 -233 -176 211 95 -16 -39 322 -9 271 74 -205 150 -126
6352 -126 -152 -78 -141 2 121 61 -223 -59 237 -250 -126 -108 131 88 -166 -43 0 -104 -33 -2 116 -116 329
6375 329 178 64 217 182 104 -15 53 -164 -105 171 -184 60 -139 -327 35 233 83 -13 -201 -14 63 294
6397 294 248 102 25 -14 -151 -78 101 -36 -52 28 23 -427 21 1 -204 -324 -135 22 156 138 -2 146 184 153
6421 153 -77 -32 227 -213 56 23 -48 -115 30 184 -105 -21 -84 -238 -185 -49 114 53 61 337 75 -81 7 43
6445 43 255 -167 362 -27 -81 10 -2 -69 -85 161 27 76 59 -270 2 -332 -87 143 -48 28 130 -132 43
6468 43 33 -165 -158 -117 37 8 -40 -86 166 -57 123 -241 48 200 196 15 124 -13 197 175 -74 64 -159 -201
$$ packed form
6306d4j93J32M64k25k06k7j45K70m1j20K24o3m3k29K58L8j73J14L7o7j62K43N1
6329I3q5m5N3K58k29j14K43k5k45j04l3N7L87j16j11k3L61l31K80j97k79L55k76
6352a26k6P4o3J43J19o0k84J64K96m87J24J8K39m3k54J23M3j04P1L1J18k32M45
6375C29j51j14J53l5p8j19O8k17N9K76l55K44j99j88L62J98j50r6j88J87P7K31
6397B94m6j46p7l9j37P3J79j37j6Q0nm50M48k0k05j20J89J57J34j8j40J48L8l1
6421A53k30M5K59m40K69l3p1o7J45J54k89Q4o3j54N3J36J63o1QK76k62j56Q8L6
6445D3K12m22N29l89n4R1j2o7j6K46j34M9j7l29K72l34K45K30j91P6J02k62J75
6468D3j0j98PM1J54k9m8m6K52k23J80l64K89J52mj81J09j37K10k2k49J38k23m2
$$ plain form
6492 -201 -80 71 -5 -86 -135 421 -76 -305 -182 133 7 269 -50 181 392 160 -218 197 -56 86 34
6513 34 -266 117 -31 238 71 173 -45 -179 -28 221 220 60 -115 174 2 53 98 -384 262 26 -58 110
6535 110 -12 35 151 70 -67 -28 -206 -24 -10 -143 -1 110 175 74 183 -227 -151 2 -186 132 -109 13
6557 13 -5 -3 -65 25 16 -5 -67 85 -390 133 111 18 377 -23 278 -94 -81 132 -77 -17 -107 123 -27 51 58 -214
6583 -214 -76 -44 55 -106 -69 222 -17 -59 12 -284 -3 61 137 -107 -123 62 110 -118 317 5 141 86 -82
6606 -82 112 187 -221 104 -89 -86 57 -198 -44 -172 351 -38 63 -21 317 -36 19 28 -268 133 -21 -253 86
6629 86 115 -140 111 -118 45 -173 -61 -238 167 26 -194 -121 292 -70 -241 -183 69 79 -104 -312 137 123
6651 123 -223 -237 -10 253 -163 -90 -298 -202 -227 -203 -49 160 96 -51 78 175 5 -83 -38 -94 65 -178 91
$$ packed form
6492b01J21J51p6q1m9N56m97k29J23L15j26K62l19K31K11k32l78M15k53J42n2
6513C4l00L83j48K69j67J02k18j34J51K49jj60j75K89j72N1M5m82O46k36q4J68
6535A10j22M7J16q1j37L9j78J82J4j33J42J11O5j01J09m10P6J53j88L18k41J22
6557A3j8Ko2R0rk1o2J52m75N23k2r3L59m00L01l72J3K13k09O0r0K30j50P8Pk72
6583b14J38L2R9j61L7K91k39m2P1k96K81O4P6k44j6J85M8k28M35l12J36n5j68
6606h2J94P5m08L25j93LJ43k55J54j28N23l89J01q4L38l53N5Rk96M01j54k32L39
6629H6K9k55K51k29J63k18J12j77M05j41k20P3M13l62j71N8K52J0j83k08M49j4
6651A23l46j4K27K63m16P3k08R6k5K4J54K09o4j47J29R7j70q8M5n6J59k43K69
$$ plain form
6674 91 -25 -304 240 60 232 -116 22 83 377 -139 -129 142 -163 -27 -48 -184 -41 -103 -154 96 67 -51
6696 -51 189 125 310 227 -92 25 -255 -128 101 -50 -110 -60 -134 15 91 77 -275 -91 -250 -40 -80 82 -129
6719 -129 57 -230 -3 -83 77 45 -191 236 -156 -62 -114 -14 -25 -199 122 -355 -141 204 185 12 -51 81
6741 81 -60 -282 -101 159 15 36 60 -183 -4 137 -36 -10 9 24 132 41 -60 63 -116 -166 92 34 48
6764 48 -11 16 -120 -129 83 -29 84 -243 177 -102 38 -38 101 -90 -271 -5 41 -73 -130 8 -101 -36 71
6787 71 -86 -32 -176 -213 138 437 116 -41 96 175 -175 -189 26 -52 -61 -108 3 -84 -105 -322 6 -69 -108 -186 -35
6812 -35 131 -107 90 23 -176 42 78 49 -173 12 -171 -347 -464 145 -19 119 19 58 153 -34 74 118
6834 118 251 136 -136 -63 254 -133 10 51 -205 77 -10 -23 -133 -359 -278 200 63 -25 -190 117 62 146 19
$$ packed form
6674I1j16k79N44j80J72l48J38O1K94n16J0K71l05J36k1j36J43o2n1K50k9j18
6696e1K40o4J85q3l19J17k80J27K29j51o0N0p4J49P6j4l52J84j59K10m0J62k11
6719a29J86k87K27q0J60l2k36M27l92R4n2J00j1j74L21m77K14L45j9j73o3J32
6741H1j41k22J81K60j44K1K4k43J79J41j73K6J9J5J08r1j01J23j79n0K58n8J4
6764D8n9K7j36rK12j12J13l27M20k79J40p6J39j91j81K66M6j14n7J38j09O5J07
6787G1j57N4j44l7L51K99l21j57J37P9l50j4K15p8rm7J11q7k1k17L28p5l9p8J51
6812c5J66k38J97o7j99K18L6k9k22J85j83j76j17O09j64J38j00L9R5j87J08M4
6834A18J33j15k72P3L17l87J43M1k56K82q7j3j10k26Q1M78j37q8j65L07n5Q4j27
$$ plain form
6857 19 188 -27 -163 -209 -219 -222 -129 -67 -249 224 160 -228 37 107 164 -357 -89 195 127 -2 -139 103 -65 -18
6881 -18 -95 -9 101 -45 138 -72 -195 -182 -317 137 -9 12 273 133 -70 -50 105 -98 130 53 165 -333
6903 -333 148 51 -79 -6 -78 -219 -149 -168 -105 78 18 246 -44 -45 -19 77 444 212 8 61 79 -80 114 -140
6927 -140 -30 280 -85 149 192 78 335 30 -43 -364 -108 18 45 -102 -289 -28 -6 97 -1 -74 -89 75
6949 75 -117 -57 -155 -76 -216 38 102 88 174 -75 179 17 -86 -15 130 -148 72 -118 229 -13 -133 -34 -63
6972 -63 26 -68 -19 -60 -31 117 -224 121 -69 -257 -332 241 -67 -87 65 149 -89 -25 -25 -81 74 -95 74 152 -89
6997 -89 -217 -483 -196 74 -41 -50 168 -101 -409 -110 -109 -2 -155 90 80 -65 32 134 -51 50 271 -33
7019 -33 -38 15 -7 116 240 325 -155 37 -279 303 101 -327 -113 -6 255 78 -47 -148 -331 62 140 -63
$$ packed form
6857A9J69k15j36m6j0lR3O2j82M73o4l88K65P0N7n21K68K84o8j29j37K42j68M7
6881a8p7Q6J10j46J83k10j23J3j35M54j46K1K61j40k03K0J55k03K28p7J12m98
6903c33M81r7j30P3p2j41P0j9O3J83o0K28k90jK6R6L67k32k04N3J8j59J94k54
6927a40J10L10l65K34M3j14K57l05p3l21K56J26K7j47j87K61K2J03r8p3j5J64
6949G5j92O0r8P9j40K54O4j4Q6k49K54j62j03P1J45k78K20j90L47k42j20R9k9
6972f3Q9r4M9m1K9J48l41L45j90j88p5N73l08k0J52Q4k38O4%n6J55j69J69P8k41
6997h9j28k66K87K70j15rK18k69l08K99JJ07j53K45j0j45R7J02j85J01K21l04
7019c3nN3k2J23J24Q5m80J92l16N82k02m28K14J07K61j77j25j01j83L93P8k03
$$ plain form
7041 -63 -112 -11 73 -230 -100 207 -227 109 -284 -101 -131 -200 -133 -29 19 -155 45 65 108 149 151 -138 143 -97
7065 -97 -102 -100 106 35 -159 -79 -141 -24 81 41 162 -119 220 -91 -161 -13 70 103 38 165 14 207 2 40 128
7090 128 -29 49 -9 -174 279 48 -49 79 -299 106 172 -381 167 86 -71 316 -135 158 39 -88 66 178
7112 178 -121 14 145 -115 236 25 175 -154 297 -240 -50 -134 186 -112 177 -194 -331 150 -51 120
7132 120 -84 -40 -117 -66 -163 -88 -89 -37 60 -14 -122 -269 -5 154 -70 -75 -47 133 161 -192 -106 -5 -46 149 300
7157 300 66 39 310 -92 39 -19 109 -290 -78 -288 -242 -152 75 -210 -340 -188 -171 -257 -34 48 -381 338
7179 338 75 -135 -193 -231 -296 -68 189 -333 -128 47 308 -109 -266 -192 378 161 -171 -200 -87 185 -44 -70
7201 -70 -229 252 35 -37 -11 107 79 -121 13 -170 -70 -188 260 51 37 -6 173 92 171 35 173 -59 -75
$$ packed form
7041f3m9J01Q4l03J30L07m34L36l93J83l0o9O7J04M8j74K00K0M3M1Kk89K81k40
7065i7nKK06p1j94Q0o2J17J05m0J21k81L39l11p0J48Q3L3o5J27j51J93k05L8Q8
7090A28j57P8n8j65M53k31r7J28l78M05O6n53N48q1j57L87m51K93j19j27J54J12
7112A78k99J35J31k60L51k11J50l29M51n37J90q4L20k98K89l71j37M81k01J71
7132A20k04M4p7N1r7P5jN2R7p4j08j47K64J59k24nK8J80K8l53Q6J01m1J95J51
7157C00k34k7K71m02J31n8J28l99K12k10M6R0K27k85j30J52J7q6K23Q2m29P19
7179C38k63k10n8l8o5K28K57n22K05J75K61m17j57P4N70k17l32k9J13K72k29k6
7201g0j59M81k17p2K6J18k8k00J34j83J00j18M48k09j4m3J79q1P9j36J38k32j6
$$ plain form
7224 -75 13 12 114 64 159 75 67 -68 -78 7 136 42 -286 65 -247 -222 -197 -185 -159 158 -175 109 -6 361 56
7249 56 18 -65 -142 -112 -186 154 -74 75 0 59 310 193 -46 -171 211 298 -138 -9 -131 -108 -282 95 78 139
7273 139 -14 -148 -8 88 214 217 -108 103 -112 115 369 154 -78 342 141 240 -29 -335 39 62 -255 12
7295 12 -75 98 117 -26 130 61 -166 80 149 -28 155 63 13 -171 -81 25 145 143 113 35 55 -60 25 -169 156
7320 156 84 247 105 -16 214 -132 -35 87 21 68 -284 251 7 -110 -52 -115 363 215 -58 -149 145 -29
7342 -29 -110 85 -94 -182 88 69 -142 -185 22 73 -202 -97 -50 314 102 -122 -124 53 -128 -49 -2 -200 -21 -92
7366 -92 -217 -66 -115 305 117 374 50 44 -227 -81 177 -57 258 114 156 -30 65 269 -233 -57 191 60
7388 60 11 -104 -156 -218 -35 157 -5 147 54 234 40 -84 137 -44 -108 215 306 -31 360 351 62 182 68
$$ packed form
7224g5Q8jJ02n0R5q4qj35j0Q5J29r4l28L51l12K5K5J2K6L17l33K84j15L67l05
7249E6l8q3p7L0p4L40k28J49p5N9K51j17k39j25L82Q7m36J29j22K3j74L77j7O1
7273A39j53j34J40R6J26Ll25K11k15K27K54k15k32M20k01R9k69l06L74K3l17K67
7295A2q7J73J9j43J56o9k27K46O9j77J83r2n0j84R0J06J20kl0p8K0j15Q5j94L25
7320A56p2J63j42j21K30l46R7J22o6M7l52N35k44j17N8o3M78j48k73r1K94j74
7342b9q1J95j79q8K70j9k11m3K07N1k75J05M7L64k12k24kJ77j81P9M7j98J79p1
7366i2j25J51m9M20j88K57l24ok71J46K58k34L15j44M2j86R5K04n02J76K48j31
7388F0m9j15n2o2J83J92j62J52r3J80j94j24K21j81o4L23R1l37L91rk89J20j14
$$ plain form
7411 68 -13 50 -44 -195 -267 28 213 -75 119 -133 342 -192 -168 31 79 -184 94 8 -133 -131 -53 220 -6 -24
7435 -24 -32 -13 107 -26 283 35 -30 -76 -165 50 13 109 120 108 -9 -60 98 40 -43 276 187 146 52 145 -49 87
7461 87 100 35 -321 225 102 -101 114 9 369 -140 -338 8 -82 73 -209 -37 -10 11 34 384 -213 -270 168
7484 168 -167 90 -124 24 -138 -137 134 -144 125 217 -341 92 -120 -392 -57 -23 -266 25 -61 -5 -171 -183
7506 -183 124 -118 -6 -181 -197 -34 -100 -52 265 -185 -102 -104 109 -164 53 82 -76 -25 175 -215 -96 62 -24
7529 -24 -282 -221 164 125 142 154 -138 -146 -134 49 -50 170 -109 -48 103 39 201 266 196 45 -41 110 156 235 170 70
7555 70 27 -159 142 -1 181 43 3 7 -89 168 23 -25 26 -190 -175 -21 -81 167 125 -177 -30 113 -79 -22
7579 -22 -210 3 -214 -44 214 -62 43 -96 109 99 -74 -341 38 84 212 166 134 198 68 34 110 47 270
$$ packed form
7411F8q1O3r4j51p2K95J85k88J94k52M75n34K4J99M8k63K78q6j41KP8K73k26j8
7435b4qJ9J20j33L09k48o5m6q9K15l7R6J1j2j17n1J58n8q3L19q9m1r4R3j94J36
7461H7J3o5l56N46j23k03K15j05L60n09j98L46r0J55k82J72K7K1K3L50n97n7M38
7484A68l35K57k14J48j62JK71k78K69R2n58M33k12k72L35L4k43K91q6N6j66j2
7506a83L07k42J12j75j6J63o6M8L17m50Q3kK13k73K17K9j58N1K00l90J19J58q6
7529b4k58O1L85l9J7J2k92qJ2J83r9K20k79O1J51o4J62O5p0j51q6J51M6P9o5j00
7555G0m3j86L01j43J82j38m0Mr6K57j45m8N1k16J5J54o0K48m2l02J47J43j92N7
7579b2j88K13k17J70K58k76J05j39K05j0j73k67L79M6J28m6l2O4j30l4P6o3K23
$$ plain form
7602 270 19 -184 -116 -20 170 -77 -154 79 59 11 -53 46 168 -14 -131 -28 208 -21 -45 223 -98 141 -92
7625 -92 29 84 -120 -124 -104 2 18 64 -69 179 -276 34 36 121 -283 -156 111 108 64 36 135 131 -52 112 5 -395
7651 -395 -238 202 4 -339 175 145 125 45 20 43 -37 176 8 17 8 -149 50 -241 -17 -147 -54 -236 -148 -25
7675 -25 132 -144 -42 -192 -236 241 10 -221 -322 -90 92 113 -93 232 -107 73 337 -26 94 -92 289
7696 289 -129 -163 245 -126 -39 -219 128 -209 -129 -70 -112 44 -9 -36 167 262 40 88 248 36 60 362 -3
7719 -3 -81 -240 -37 -10 58 112 102 264 -199 -84 -122 -264 -4 -323 -1 46 186 52 37 120 -124 164 -248 23
7743 23 -97 -13 -148 -5 117 -52 4 -102 66 108 -110 107 54 110 -97 7 -141 -65 58 -56 -2 105 -92
7766 -92 91 -97 -280 -46 3 11 36 41 80 236 69 168 103 -71 -9 -70 -244 -6 -20 -99 -160 24 -58 -73 45 -97
$$ packed form
7602B70k51k03O8R6J90k47p7K33k0m8o4R9J22j82j17J03K36k29k4K68l21K39k33
7625i2J21N5k04mK0J06J6M6j33K48m55L10KQ5m04J27K67lm4k8R9mj83J64j07m00
7651c95J57M40j98l43N14l0k0q0k5K3q0K13j68Rrj57J99k91K24j30R3j82Q8J23
7675b5J57k76J02j50m4M77k31k31j01K32J82K1k06L25l39J80K64l63J20j86L81
7696B89m18l4M08l71Q7j80L47l37Q0N9m2J56n3k7K03R5k22M8J60k12K4L02l65
7719cp8j59K03K7O8N4j0J62m63J15l8j42K60l19L22M7J40j34j5Q3k44K88m12K71
7743B3j20Q4j35J43J22j69N6j06J68M2k18K17n3N6k07J04j48P6J23j14N4J07j97
7766i2J83j88j83K34M9QK5NL9J56j67R9o5j74O2o1j74K38j4p9o1J84q2j5J18j42
$$ plain form
7792 -97 -31 -48 -235 53 212 -42 51 -100 -171 -40 -235 161 -15 -215 -242 -206 186 -190 -108 203 -87 -22 -90
7815 -90 67 69 -329 -24 -87 62 -70 226 75 93 201 -15 -44 2 12 63 61 149 -153 50 225 102 -98 -55
7839 -55 63 267 66 -133 33 81 55 -82 162 -102 -14 89 -15 -3 100 -18 -161 32 162 -78 -115 198
7861 198 278 317 -60 -70 -174 -255 -149 -180 -49 -153 -166 152 138 -138 -109 113 167 64 115 185 -30 340 65 -128
7885 -128 144 -103 82 -149 308 135 96 1 87 136 138 -99 -22 116 -341 45 -113 56 124 -21 -1 -103 -149
7908 -149 -139 98 -267 99 235 134 -38 53 -134 -50 263 77 54 -85 -277 90 -166 -50 70 115 148 -156
7930 -156 -16 163 124 -34 99 -93 -146 -136 -107 -281 34 45 -121 75 167 -58 198 -303 168 239 48 99 28
7953 28 212 222 -153 -79 -126 85 -48 -231 137 143 22 76 178 -166 -99 178 40 -80 70 152 124 -38 -44 41
$$ packed form
7792i7O6j7j87K88J59k54R3j51p1J31j95L96j76k00k7L6L92l76Q2L11k90O5o8
7815i0J57Kl98L05o3J49j32K96j51J8J08k16k9M6J0N1kQ8l02K03J75j23k00M3
7839e5J18K04k01j99J66M8k6j37K44k64Q8J03j04J2J03j18j43J93J30k40l7L13
7861A98Q0L9l77j0j04q1J06l1J31j04j3L18j4k76K9K22N4j03N1P0k15L70k75j93
7885a28K72k47J85k31M57j73l9r5Q6M9Kk37P7J38m57L86j58J69O8j45K0j02m6
7908a49J0K37l65L66J36j01j72R1j87Q4L13j86k3j39j92L67k56J16J20M5L3l04
7930a56J40J79l9j58J33j92n3J0K9j74L15J1j66J96R2k25K56n01M71P1j91N1p1
7953B8J84J0l75P4m7K11j33j83L68Oj21N4J02l44O7K77j38j20J50Q2k8j62oQ5
$$ plain form
7977 41 314 6 39 -20 46 112 106 -353 -26 194 -87 -158 -17 163 -77 -189 35 28 18 -135 -88 -66 -23 146 -24
8002 -24 -54 36 47 100 46 -168 -201 0 27 75 -132 5 28 -46 -18 -17 23 -136 52 143 -211 -142 -102 -120 386 -365
8028 -365 -163 -108 101 321 98 -20 193 -179 230 -66 -70 75 10 105 10 2 177 174 83 143 169 108 -76 163 351
8053 351 -283 15 -39 -94 356 -175 242 -275 -81 215 131 108 186 -47 58 -32 -166 170 160 56 -317 55
8075 55 63 -84 -188 -35 8 158 155 63 -124 -63 205 -72 127 152 -57 6 69 41 -42 -72 71 263 -228 4 -59
8100 -59 -166 -185 -189 -83 179 15 10 -59 -72 126 -94 -56 -77 90 47 -160 65 377 -303 -66 120 31 -163 -23
8124 -23 -23 -308 34 -23 192 -153 101 91 -110 31 113 182 87 160 -130 -178 115 152 -129 -123 27 -24 -209 -177 91
8149 91 29 204 -335 -112 -178 -58 143 176 197 -159 27 -210 3 17 245 56 169 -4 84 416 48 -175
$$ packed form
7977D1K73l08L3n9O6O6om59L27K20k81p1J41J80k40j12K24pj0j53M7K2M3J69j70
8002b4l0R0J1N3n4k14l3K01K7M8k07J37K3p4K8JM0j59J88R1l54O9M0j8N06p51
8028c65K02N5K09K20k23j18K13l72M09k96mJ45o5R5r5qJ75lr1O0K6o1j84K39J88
8053C51o34K98n4n5M50n31M17n17J94K96q4k3P8k33J05r0j34L36j0j04l73L72
8075E5Qj47j04J53M3J50lr2j87O1K68k77J99K5k09O3O3k8q3l0J43J92m91K32o3
8100e9j07j9mJ06K62j64no9j3J98k20L8k1J67m3k07K25L12o80K37J86q9j94J40
8124b3%k85L42n7K15l45K54j0k01J41Q2O9r5P3k90m8K93L7k81OJ50n1j85L2K68
8149I1o2J75n39K23o6J20K01L3K1l56J86k37K13J4K28j89J13j73Q8L32l68k23
$$ plain form
8171 -175 -204 283 76 -132 -118 -145 -126 -107 108 -30 52 -19 -177 -50 78 -28 -83 73 31 128
$$ packed form
8171a75k9M87k07k08J4k7J9J9K15j38Q2p1j58J27J28j06n5J56m2R7
8191A28
$$ Imaginary data points
##PAGE= N=2
##DATA TABLE= (X++(I..I)), XYDATA
$$ plain form
0 0 0 0 0 0 0 0 0 -6 8 -8 8 -8 16 -16 19 -24 30 -32 40 -48 56 -65 75 -86 99 -113 129 -148 166 -189 212
31 212 -238 267 -300 334 -369 414 -459 510 -564 625 -692 766 -846 941 -1042 1159 -1291 1442
49 1442 -1618 1828 -2079 2387 -2779 3291 -3998 5036 -6719 9920 -18217 85724 177876 28689
63 28689 -26069 6228 104404 139363 100983 13644 -8843 41381 106459 106309 59902 5565 6324
76 6324 54629 95110 70110 23521 5570 24099 50118 63408 43143 12021 3766 20430 35423
89 35423 43072 33659 2890 -16610 8010 45206 44869 5549 -32296 -25386 28379 63036 22806
102 22806 -45190 -50027 10506 60091 41162 -26867 -67141 -24256 50305 58630 -5701 -60489
114 -60489 -46316 16684 59381 29242 -40301 -60796 -9323 42814 39008 -5914 -43501 -35799
$$ packed form
0@%%%%%%%oJ4j6J6j6K4l2L5m3N4o2P2q8J04j21J40j61J85k12K42k77L14l55M01
31B12m50N05n67O34p03P83q73R69j074J189j317J458j612J787j983K201k450K733
49A442l060L446l907M466n166O070p289R034j1755J6639k8137J03941R2152j49187
63B8689n4758L2297R8176L4959l8380q7339k2487N0224O5078j50m6407n4337P59
76F324M8305M0481k5000m6589j7951J8529K6019J3290k0265l1122q255J6664J4993
89C5423P649r413l0769j9500K4620L7196l37l9320l7845O910N3765L4657m0230
102B2806o7996m837O0533M9585j8929o8029m0274M2885P4561Q325o4331n4788
114f0489J4173O3000M2697l0139o9543k0495N1473N2137l806m4922l7587P702
$$ plain form
126 -35799 10956 40153 17170 -21813 -31815 -13688 12062 25552 10531 -18447 -28021 -12903
138 -12903 9921 24107 12683 -23281 -41739 -13107 26677 30208 -5476 -44000 -42748 4823
150 4823 43640 18505 -41168 -59016 -17187 32537 34173 -17714 -64858 -45098 17677 40079
162 40079 -965 -51789 -55869 -11633 31183 20007 -33970 -60192 -28926 13793 20017 -9652
174 -9652 -42908 -43462 -8996 17168 4292 -23527 -34364 -25178 -5578 10112 2824 -20206 -30591
187 -30591 -20880 -1942 13745 9165 -19164 -37482 -17672 17403 27257 1877 -33093 -37901 1618
200 1618 40989 26973 -22417 -43961 -14161 31943 44210 4348 -41582 -33655 19941 48929
212 48929 21854 -24001 -37963 -4355 39672 39294 -5195 -35088 -16200 21263 35050 15158
$$ packed form
126c5799M6755K9197k2983l8983j0002J8127K5750J3490j5021k8978r574J5118
138a2903K2824J4186j1424l5964j8458K8632L9784L531l5684l8524J252M7571
150D823L8817k5135n9673j7848M1829M9724J636n1887m7144J9760O2775K2402
162D0079m1044n0824m080M4236M2816j1176n3977k6222L1266M2719O224k9669
174i652l3256n54L4466K6164j2876k7819j0837R186J9600J5690p288k3030j0385
187c0591R711J8938J5687m580k8329j8318J9810L5075R854k5380l4970m808L9519
200A618L9371j4016m9390k1544K9800M6104J2267l9862m5930P927N3596K8988
212D8929k7075m5855j3962L3608M4027l78m4489k9893J8888L7463J3787j9892
$$ plain form
224 15158 -16845 -25193 513 25597 20688 -788 -14452 -13446 1716 18625 16752 -2895 -16493
237 -16493 -13496 1147 17864 18165 -7290 -28274 -16352 13100 25902 8805 -22845 -34167 -5392
250 -5392 30863 26063 -13861 -38458 -21696 18151 36821 7867 -35621 -37184 5588 36651 21667
263 21667 -17593 -37196 -14647 25942 34259 40 -30375 -21461 9439 27934 17539 -10918
275 -10918 -24267 -5633 19394 21364 5620 -9316 -12764 -462 17744 20272 4158 -9892 -10554
288 -10554 1474 19719 23220 2090 -18774 -12646 12655 28253 18383 -10533 -27069 -5330 29141
301 29141 31215 -1348 -27864 -19923 13290 35665 16776 -23313 -32381 -698 29747 24379 -8003
314 -8003 -31960 -19551 16080 29254 3804 -24977 -24153 -1407 18325 15416 -8698 -26081 -14395
$$ packed form
224A5158l2003q348K5706K5084m909k1476j3664J006J5162J6909j873j9647j3598
237a6493K997J4643J6717L01k5455k0984J1922K9452J2802j7097l1650j1322K8775
250e392L6255m800l9924k4597J6762L9847J8670k8954m3488j563M2772L1063j4984
263B1667l9260j9603K2549M0589Q317l4219l0415Q914L0900J8495j0395k8457
275a0918j3349J8634K5027J970j5744j4936l448J2302J8206K528j6114j4050o62
288a0554J2028J8245L501k1130k0864O128K5301J5598r870k8916j6536K1739L4471
301B9141K074l2563k6516P941L3213K2375j8889m0089r068L1683L0445n368l2382
314h003k3957J2409L5631J3174k5450k8781Q24K2746J9732k909k4114j7383J1686
$$ plain form
327 -14395 6859 13588 2815 -12127 -20064 -11249 6629 11917 -541 -14684 -19144 -9845 8749
340 8749 15312 -2213 -23633 -21417 70 17249 13215 -12244 -30803 -16069 16536 24337 -823
353 -823 -27246 -26844 2405 27487 16267 -19282 -32910 -8801 20731 23080 -2218 -26973 -22392
366 -22392 8600 26588 9567 -17197 -22569 -5471 15206 18413 -1081 -19338 -13839 4743 14286
379 14286 9714 -4076 -15270 -9726 7082 15082 6133 -6970 -13644 -7716 9576 18876 5523
392 5523 -14545 -16466 83 18437 18841 -2884 -22563 -12919 15302 25967 8276 -16286 -20809
405 -20809 843 26482 22570 -7145 -23913 -7898 18168 26392 7701 -16999 -18607 6563 26149
418 26149 16743 -5880 -16184 -5545 14715 22801 7364 -11302 -11004 4854 15652 14651 2491
$$ packed form
327a4395K1254O729j0773j4942p937Q815J7878N288j2458j4143m460R299J8594
340H749O563j7525k1420K216K1487J7179m034k5459j8559J4734L2605P801k5160
353h23k6423M02K9249K5082j1220l5549j3628K4109K9532K349k5298k4755M581
366b2392L0992J7988j7021k6764n372J7098K0677L207j9494j8257N499J8582R543
379A4286m572j3790j1194N544J6808Q000q949j3103o674N928J7292R300j3353
392E523k0068j921J6549J8354M04k1725j9679R644K8221J0665j7691k4562m523
405b0809K1652K5639l912k9715j6768J6015K6066Q224j8691k4700j608K5170J9586
418B6149r406k2623j0304J0639K0260Q086j5437j8666K98J5858J0798j001j2160
$$ plain form
431 2491 -10022 -8286 7135 16597 11339 -1452 -10480 -7255 9033 19806 9001 -9461 -14496
444 -14496 -1907 15023 19061 1188 -18755 -14561 9261 22078 9957 -12121 -20888 -5145 19092
457 19092 20138 -3919 -21828 -13402 8464 20139 9032 -14162 -21185 -2119 17592 14715 -4268
470 -4268 -16427 -11657 6211 17042 6714 -10576 -14100 -2600 9169 12311 3167 -10558 -11800
483 -11800 1196 12427 10374 -335 -11097 -10557 4521 16722 9740 -7439 -14425 -5298 11693
496 11693 18072 4186 -15495 -14611 4930 18532 12271 -6956 -19227 -8592 14015 19220 584
509 584 -18052 -14997 3280 16563 10212 -10672 -20839 -7892 10470 11693 -2361 -16614 -16419
522 -16419 -1846 10482 4714 -11094 -17669 -11084 283 6008 -651 -14666 -19042 -8599 2844
$$ packed form
431B491j2513J736J5421R462n258j2791r028L225J6288J0773j0805j8462n035
444a4496J2589J6930M038j7873j9943M194K3822J2817j2121k2078q767J5743K4237
457A9092J046k4057j7909Q426K1866J1675j1107k3194p023J9066J9711k877j8983
470d268j2159M770J7868J0831j0328j7290l524J1500J1769L142r144j3725j242
483a1800J2996J1231k053j0709j0762N40J5078J2201o982j7179o986R127J6991
496A1693O379j3886j9681Q84J9541J3602o261j9227j2271J0635K2607N205j8636
509E84j8636L055J8277J3283o351k0884j0167J2947J8362J223j4054j4253J95
522a6419J4573J2328n768j5808o575O585J1367N725o659j4015m376J0443J1443
$$ plain form
535 2844 3416 -5378 -17322 -18718 -5599 6671 2604 -11799 -20378 -14604 507 9379 -315 -18554
549 -18554 -20602 -4895 9368 7624 -7822 -20447 -14046 6201 15353 1586 -15148 -15987 -1474
562 -1474 13679 13007 -4061 -15924 -6789 10504 16121 6822 -6718 -9972 1971 16484 15184 1983
576 1983 -5910 -2956 8029 17322 13514 472 -5674 2374 13782 16844 10319 -1741 -5648 5320
590 5320 17680 16036 3731 -5529 -3420 9498 19387 12241 -4563 -9944 1547 14449 15521 2748
604 2748 -11293 -9488 7099 16561 7148 -8307 -13743 -4408 9612 11758 -2713 -15919 -12144 1508
618 1508 8552 3089 -9996 -16851 -9065 4440 5974 -4643 -14487 -14484 -5986 4147 2989 -9294 -17001
633 -17001 -12141 -1116 4347 -138 -12262 -17555 -8365 4211 5074 -4897 -14298 -14256 -2433 8602
$$ packed form
535B844N72q794j1944j396J3119J2270m067j4403q579N774J5111Q872r694j8239
549a8554k048J5707J4263j744j5446j2625O401K0247R152j3767j6734q39J4513
562a474J5153o72j7068j1863R135J7293N617r299j3540l254J1943J4513j300j3201
576A983p893K954J0985R293l808j3042o146Q048J1408L062o525j2060l907J0968
590E320J2360j644j2305r260K109J2918R889p146j6804n381J1491J2902J072j2773
604B748j4041J805J6587R462r413j5455n436R335J4020K146j4471j3206L775J3652
618A508P044n463j3085o855P786J3505J534j0617r844LQ498J0133j158j2283p707
633a7001M860J1025N463m485j2124n293R190J2576Q63r971r401M2J1823J1035
$$ plain form
647 8602 4861 -9849 -15867 -7142 5714 9933 771 -12475 -12782 1523 12464 7631 -5025 -11534
661 -11534 -5306 8141 13943 3385 -8995 -7918 2981 11922 10686 -55 -8848 -4023 8817
674 8817 13506 6046 -3533 -6446 668 11514 12388 1961 -6518 -3820 5025 11847 9676 -1406 -8370
689 -8370 -1934 9713 12118 4070 -5720 -7696 1274 12338 10547 -1750 -9401 -4536 6756 12373
703 12373 5970 -7044 -10268 1005 11349 9355 -950 -9210 -6399 5416 12776 5767 -6424
716 -6424 -8502 -92 9616 10639 1564 -8446 -5742 5631 11610 7162 -1529 -6552 -1522 9063
730 9063 12631 4299 -4496 -4273 4291 11341 11247 1797 -5988 -1841 8680 13307 7676 -1697 -5500 1729
746 1729 12742 13182 2632 -4956 -2652 6636 13651 9794 -1698 -6736 1213 11151 11740 3866 -5243
$$ packed form
647H602l741j4710o018Q725J2856M219r162j3246l07J4305J0941m833j2656o509
661a1534O228J3447N802j0558j2380J077J0899Q941j236j0741q793M825J2840
674H817M689p460r579k913P114J0846Q74j0427q479K698Q845O822k171j1082o964
689h370O436J1647K405q048r790j976Q970J1064j791j2297p651M865J1292N617
703A2373o403j3014l224J1273J0344j994j0305q260K811J1815P360p009j2191
716f424k078Q410R708J023r075j0010K704J1373N979m448q691n023N030J0585
730I063L568q332q795K23Q564P050r4r450p785M147J0521M627n631r373l803P229
746A729J1013M40j0550p588K304R288P015l857j1492n038P949R938N89p874r109
$$ plain form
761 -5243 -5219 4387 12576 7920 -2548 -6701 -1596 7038 10251 3790 -6853 -7199 2295 8900 6823
776 6823 -1574 -8398 -5877 4007 8816 2472 -6749 -8433 -2629 5778 7453 -1023 -9728 -7414 1569
791 1569 6813 3591 -5171 -10567 -5523 4950 7155 -921 -8750 -8586 -656 6961 5147 -4667 -10684
806 -10684 -5127 3994 6733 1223 -7381 -9645 -1583 7166 5440 -3641 -9204 -6021 2049 7206 2377
821 2377 -7106 -9203 -2259 4798 5022 -1630 -8962 -8120 358 6345 2245 -6163 -9619 -5603 2461 5608
837 5608 -1189 -9569 -9482 -1948 4131 2564 -5196 -11566 -7812 1231 4589 -1751 -9213 -10968 -5198 2733
853 2733 3365 -5178 -12131 -8542 -547 3457 -236 -8191 -12005 -5917 2911 3081 -4004 -10057 -9134 -1957
869 -1957 4419 1976 -6611 -10311 -5170 2336 4620 -408 -7644 -8355 -1041 5602 3907 -3016 -7406
$$ packed form
761e243K4R606Q189m656j0468m153N105Q634L213o461j0643l46R494O605k077
776F823q397o824K521R884M809o344r221j684N804Q407J675q476q705K314Q983
791A569N244l222q762n396N044J0473K205q076p829J64P930P617j814r814o017
806a0684N557R121K739n510q604k264Q062Q749j726r081n563L183Q070N157m829
821B377r483k097O944P057K24o652p332Q42Q478N987m100q408l456M016Q064L147
837E608o797q380Q7P534O079j567p760o370L754R043L358o340p462j755N770P931
853B733O32q543o953L589P995M004l693p955l814O088Q828J70p085o053R23P177
869a957O376k443q587l700N141P506K284n028p236p11P314O643j695o923m390
$$ plain form
884 -7406 -4818 3032 7699 3023 -5080 -5972 133 6648 6796 1225 -5624 -4012 4635 9220 5134 -1486
900 -1486 -4386 -160 7883 10018 2957 -3982 -2449 4130 9019 7776 754 -4459 -417 7876 9540
915 9540 4240 -2113 -3013 2387 9218 8407 671 -4246 -1106 5482 8635 5385 -2222 -5191 1238 7583
931 7583 7118 1091 -4441 -3796 2992 8310 5175 -2848 -5604 -1191 4906 6601 1703 -5281 -5199 1709
947 1709 6479 4160 -1943 -6109 -3570 3784 6743 1428 -5119 -5287 -371 4698 5102 -1594 -6478 -4472
963 -4472 2902 5745 2092 -3497 -6050 -1992 4820 5783 -774 -6033 -4558 1076 5096 3803 -3271
978 -3271 -6895 -2296 4186 5220 352 -4671 -5813 -36 5580 4044 -2711 -5832 -3212 2348 5302
993 5302 1871 -4911 -6227 -228 4627 3957 -1159 -5987 -4762 1764 5748 2025 -4536 -6088 -2156
$$ packed form
884g406K588P850M667m676q103q92O105O515J48n571o849J612Q647M585m086o620
900a486k900M226Q043K135p061o939J533O579M889j243p022n213M042Q293J664
915I540n300o353r00N400O831q11p736m917L140O588L153l250p607k969O429O345
931G583m65o027n532O45O788N318l135q023k756M413O097J695m898o984Q2O908
947A709M770k319o103m166K539P354K959n315o547j68M916N069M04o696m884K006
963d472P374K843l653n589k553M058O812R63o557n259J475N634M020j293p074
978c271l624M599O482J034m868n023j142N777N616j536o755l121K620N560K954
993E302l431o782j316N999M855o70n116m828J225O526L984l723o561j552L932
$$ plain form
1008 -2156 3291 4818 -444 -6298 -5298 1052 4804 2505 -2755 -6549 -3315 3138 5150 282 -5140
1023 -5140 -5235 -498 4166 4014 -2464 -6804 -3426 2304 4268 1570 -3849 -5824 -1500 4563 4325 -1428
1039 -1428 -5349 -4025 978 4998 2835 -3646 -6031 -1502 3688 4082 266 -4666 -4956 716 5295
1054 5295 2925 -2351 -4937 -2696 2637 5073 1193 -4302 -4918 117 4546 3657 -984 -5046 -3545
1069 -3545 2523 5127 1452 -3228 -4731 -1016 3409 4685 -613 -5350 -3135 1540 4605 2920 -2041
1084 -2041 -5025 -1715 3987 5183 435 -3527 -3519 541 5048 4116 -1669 -4671 -1456 3323 5115 1927
1100 1927 -2823 -3993 499 5327 4261 -453 -3575 -2331 2416 5791 2907 -2621 -3404 -26 4100
1115 4100 4849 960 -3532 -3090 2379 5384 3033 -1355 -3504 -1105 3696 5173 1061 -3548 -3262 1061
$$ packed form
1008b156N447J527n262n854J000O350L752k299n260l794L234O453K012m868n422
1023e140r5M737M664j52o478m340L378N730J964k698n419j975M324O063k38n753
1039a428l921J324N003M020k163o481k385M529N190L94l816m932k90N672M579
1054E295k370n276k586K241N333K436l880n495o16N035M429q89m641m062J501
1069c545O068K604l675m680j503L715M425J276n298m737K215M675L065j685m961
1084b041k984L310N702J196m748l962QM060M507r32n785l002L215M779J792l188
1100A927m750j170M492M828j066m714l122J244M747L375k884n528p83L378M126
1115D100P49l889m492M42N469L005k351m388k149K399M801J477m112m609K86M323
$$ plain form
1131 1061 4258 3542 -904 -4550 -2316 2834 4492 1131 -2849 -3905 -786 3703 3746 -1309 -4714 -3090
1147 -3090 1186 3756 1725 -3048 -5286 -1628 2837 2971 -840 -4358 -4095 -201 3645 1937 -2993
1162 -2993 -5131 -2042 2052 3375 356 -4293 -4705 -235 3360 2137 -1813 -4240 -3197 1481 4120
1177 4120 893 -3467 -4047 -463 2809 3380 -401 -4125 -3127 1759 3694 1839 -1875 -3512 -1362 3207
1193 3207 4081 307 -3198 -2537 1331 3815 3299 -1468 -4024 -1504 2952 3957 1001 -2585 -3370 47
1209 47 4050 3334 -1312 -3531 -1848 1696 3583 1871 -2787 -4095 -784 3324 2664 -574 -3752 -3376
1225 -3376 889 3613 980 -2806 -4186 -1733 1750 3073 50 -4297 -3819 106 2574 1543 -2139
1240 -2139 -4203 -2775 1655 3140 68 -3516 -3818 -1057 2320 2563 -1250 -4176 -2245 1327 3091
$$ packed form
1131A061L197p16m446l646K234N150J658l361l980j056L119M489M3n055l405J624
1147c090M276K570k031m773k238L658M465J34l811l518K63L894L846j708m930
1162b993k138L089M094J323l019m649m12M470L595j223l950k427J043M678K639
1177D120l227m360n80L584L272N71l781l724R98M886J935j855l714j637K150M569
1193C207Q74l774l505O61L868K484n16m767k556K520M456J005k956l586p85L417
1209D7M003p16m646k219J683L544J887j712m658j308L311M108o60l238l178L76
1225c376M265K724k633l786j380K453L483J323l023m347M78L925K468j031l682
1240b139k064J428M430J485l072l584l02K761L377K43l813k926J931L572J764
$$ plain form
1255 3091 1264 -2263 -3591 -1126 2987 3115 -157 -3242 -2421 987 3330 2392 -1574 -3256 -470 3053
1271 3053 3390 1160 -2016 -2536 1077 4202 2831 -634 -2211 -957 2379 4274 2049 -2051 -2354 939
1287 939 3810 3341 625 -2374 -1597 2075 3995 1850 -1608 -2488 -444 3030 3636 375 -2909 -1849
1303 -1849 1122 3326 2075 -1082 -3527 -1283 2676 3367 348 -2589 -2372 42 2708 2559 -1337 -3399
1319 -3399 -1555 1607 2589 886 -2329 -3117 -163 2595 2148 -763 -2675 -1933 600 3087 1567 -2128
1335 -2128 -2993 -322 2255 2565 537 -2524 -2588 898 3074 2124 -1184 -2723 -914 2045 3552 807
1351 807 -2339 -2417 400 2960 2515 -360 -2944 -1470 2452 3091 933 -1659 -2337 -29 2782 2771 -199
1368 -199 -2568 -1537 1233 2864 1853 -1512 -3038 -718 2414 2722 68 -1862 -2483 298 2627 1847
$$ packed form
1255C091j827l527j328K465M113J28l272l085Q21L408K343r38l966j682K786L523
1271C053L37k230l176n20L613L125j371l465j577J254L336J895k225m100l03L293
1287I39K871m69k716k999P77L672J920k145l458q80K044L474O06l261l284J060
1303a849K971K204j251l157k445K244L959O91l019k937K17K414K666j49l896k062
1319c399J844L162R82j703l215p88K954K758m47k911j912P42K533K487j520l695
1335b128q65K671K577L10k028l061o4L486K176r50l308j539J809K959J507k745
1351H07l146p8K817K560m45k875k584J474L922O39k158k592o78K308K811j1k970
1368a99k369J031K770J631j011l365j526K320L132L08k654j930o21K781K329p80
$$ plain form
1384 1847 -1404 -2917 -1306 1358 2319 614 -2291 -2719 -180 2136 1560 -700 -2825 -2105 972 2648
1400 2648 708 -2140 -2860 -620 1850 2002 -105 -2915 -2290 926 2712 1157 -1290 -2322 -935 1705
1416 1705 2694 -36 -2457 -1992 560 2553 1932 -669 -2648 -909 1817 2808 1176 -1242 -2251 10
1432 10 2601 2282 -509 -2032 -1069 1327 3108 1763 -1162 -2260 -138 2483 2415 471 -1706 -1800 670
1449 670 3010 1555 -1400 -2118 -513 1608 2294 566 -2049 -2300 69 2153 1438 -818 -2608 -1694
1465 -1694 1334 2200 316 -2323 -2636 -674 1648 1405 -770 -3078 -2353 415 1353 428 -2163 -2851 -1572
1482 -1572 1151 1548 -860 -2696 -2413 -346 1385 1251 -1690 -3072 -1398 1107 1424 204 -2329 -2805
1498 -2805 -424 1896 1017 -1369 -2510 -1432 677 1964 705 -2166 -2457 -349 1703 1528 -422 -2155
$$ packed form
1384A847l251j513J611K664R61j705k905m28K539K316n76k260k125P20L077J676
1400B648j940k848p20K240K470J52k107k810O25L216J786j555k447j032J387K640
1416A705R89k730k421M65K552J993o21k601j979J739K726R91j632k418j009K261
1432A0K591l19k791j523R63K396J781j345k925j098K122K621o8j944k177r4K470
1449F70K340j455k955p18J605K121O86j728k615k51K369K084p15k256j790R14
1465a694L028Q66j884k639l13J962K322k43k175k308P25K768R38r25k591o88J279
1482a572K723L97k408j836K83K067J731j34k941j382J674K505L17j220k533m76
1498b805K381K320q79k386j141J078K109J287j259k871k91K108K052j75j950j733
$$ plain form
1514 -2155 -1721 871 2403 971 -1385 -2072 -518 1491 2359 476 -1972 -1561 769 1706 1766 -372 -1921
1531 -1921 -802 1295 2298 626 -1269 -1390 369 1730 2136 -305 -2004 -1167 1355 1860 996 -972
1547 -972 -2134 -279 1878 1934 -96 -1270 -1158 486 2147 1229 -1091 -2033 -378 1483 1708 550 -1502
1564 -1502 -1579 296 2204 1551 -467 -1531 -743 1330 2200 616 -1276 -1717 491 1820 1480 146 -1599
1581 -1599 -1137 1066 2014 690 -843 -1697 -205 1794 1987 80 -1612 -1203 957 2153 1470 -618
1597 -618 -1920 -718 1468 1728 144 -1370 -1643 46 1955 1646 -707 -1609 -769 963 1949 820 -1112
1614 -1112 -1889 -2 1690 1517 -181 -1773 -1178 303 2039 646 -1379 -1451 -408 858 1463 199
1630 199 -1685 -1710 482 1639 568 -841 -1803 -1108 668 1840 -100 -2002 -1484 -79 1154 1354 -919
$$ packed form
1514b155M34K592J532j432k356o87J554K009Q68j883k448M11K330R37O0k138j549
1531a921J119K097J003j672j895j21J759J361M06k441j699Q37K522N05q64j968
1547i72j162J855K157N6k030j174J12J644J661r18k320r42J655J861K25j158k052
1564a502p7J875J908o53k018j064P88K073Q70j584j892m41K208J329l40j334j745
1581a599M62K203R48j324j533q54J492J999J93j907j692M09K160J196o83k088
1597f18j302J202K186K60j584j514k73J689J909l09k353r02Q40J732R86j129j932
1614a112p77J887J692j73j698j592N95J481J736j393k025p2J043J266O05j264
1630A99j884k5K192J157j071j409r62O95J776J172j940j902N18J405J233K00k273
$$ plain form
1647 -919 -2137 -1224 892 1513 212 -1379 -1815 -481 1279 1433 -804 -1626 -1183 102 1249 899 -1226
1664 -1226 -1919 -670 1041 1295 9 -1540 -1477 -67 1519 1126 -994 -1539 -990 841 1647 337 -1478
1681 -1478 -1756 56 1399 983 -423 -1567 -1064 760 1735 250 -1124 -1270 -521 1030 1516 -124 -1690
1698 -1690 -1126 752 1520 526 -626 -1514 -790 1246 1769 -119 -1268 -1176 278 1596 1313 -863 -1382
1715 -1382 -425 1078 1333 489 -936 -1103 -8 1586 1627 -384 -820 -865 807 1772 880 -936 -1054 -249
1733 -249 1521 1527 61 -944 -790 667 1786 658 -843 -1038 -236 608 1677 466 -1316 -1102 290
1750 290 1230 644 -55 -1178 -939 703 1344 361 -875 -1298 109 1400 1407 -251 -1214 -921 646 1142
1768 1142 510 -884 -1627 -503 1021 1147 -351 -1215 -687 170 1324 889 -586 -1601 -339 787 1207
$$ packed form
1647i19j218R13K116O21j301j591m36J334J760J54k237q22M43J285J147l50k125
1664a226o93J249J711K54j286j549O3J410J586l93k120n45N49J831Q06j310j815
1681a478k78J812J343m16j406j144N03J824R75j485j374j46P49J551M86j640j566
1698a690N64J878P68r94j152q88P24K036N23j888j149R2J454J318k83k176n19
1715a382R57J503K55q44j425j67J095J594M1k011m36m5J672R65q92j816j18Q05
1733b49J770Oj466j005J54J457J119j128j501j95Q02Q44J069j211j782K14J392
1750B90R40n86o99j123K39J642O41r83j236m23J407J291Pj658r63K93J567M96
1768A142o32j394p43J124J524J26j498q64N28Q57J154m35j475j015J262J126M20
$$ plain form
1785 1207 113 -1340 -1487 68 1474 898 -707 -1396 -1026 486 1364 545 -1238 -1323 -258 996 1029
1802 1029 134 -1124 -1133 543 1568 558 -853 -1218 -473 871 1322 -83 -1180 -893 575 1305 785
1819 785 -447 -1559 -699 764 985 -47 -945 -957 -163 1127 1203 -282 -982 -639 623 1161 479 -665
1837 -665 -1438 43 1323 739 -9 -989 -682 141 1536 420 -944 -1242 -1 731 870 68 -1033 -957
1855 -957 211 1173 805 -452 -1380 -741 806 1351 350 -964 -1013 -11 943 962 -60 -1036 -694 908
1873 908 1182 582 -491 -757 -145 1017 1162 282 -868 -277 568 1069 807 -441 -1131 -371 942 1181
1891 1181 256 -1075 -956 98 1210 820 -111 -749 -549 774 952 567 -506 -1175 86 894 824 -94
1909 -94 -840 -687 462 1115 270 -684 -912 -393 926 895 -161 -926 -902 282 938 486 -339 -1002 -587 440
$$ packed form
1785A207j094j453j47J555J406n76j605o89L70J512Q78q19j783q5J065J254L3
1802A029q95j258rJ676J025j010j411l65P45J344M51j405j097K87J468P30n20
1819G85j232j112Q60J463K21j032q98j2P94J290P6j485p00L43J262N38o82j144
1837f65p73J481J280n84p48r80L07Q23J395j116j364k98J241P32J39q02j101P6
1855i57J168R62l68j257r28O39J547N45j001j314m9J002R54J9j022r76L42J602
1873I08K74o00j073k66O12J162J45q80j150N91Q45N01k62j248o90P60J313K39
1891A181r25j331J19J054J112l90r31o38K00J323J78l85j073o69J261Q08p0r18
1909i4p46J53J149O53q45r54k28N19J319l1j056p65K4J184O56m52q25o63M15J027
$$ plain form
1929 440 842 -157 -1184 -767 81 746 690 -444 -765 -504 85 812 108 -823 -1255 -20 713 513 -509
1948 -509 -1355 -935 519 639 300 -852 -1371 -282 590 816 -200 -815 -1037 412 1036 661 -634 -991
1966 -991 -321 640 1026 169 -1023 -690 177 994 491 -148 -778 -746 62 799 513 -621 -637 -278 605 845
1986 845 -171 -928 -698 383 907 426 -512 -968 -168 604 733 -168 -681 -729 71 1034 678 -355 -949
2005 -949 -128 431 937 486 -370 -673 125 732 365 -138 -762 -485 427 985 263 -613 -655 -80 641 822
2025 822 113 -949 -574 292 808 176 -451 -820 -331 310 866 -76 -702 -648 160 766 393 -430 -889 -364
2045 -364 702 750 32 -581 -711 -203 777 545 -166 -752 -553 231 753 393 -397 -941 -120 927 756 -204
2065 -204 -673 -519 315 853 289 -488 -844 147 498 1097 22 -472 -562 439 605 814 -442 -579 -336
$$ packed form
1929D40M02r99j027M17Q48O65n6j134l21K61N89P27p04r31m32J235P33k00j022
1948e09q46M20J454J20l39j152n19J089Q72K26j016o15k22J449O24l75j295l57
1966i91O70R61L86q57j192L33Q67Q17n03o39o30L2Q08P37k86j134j6L59Q83K40
1986H45j016p57K30J081N24m81r38m56Q00P72J29r01n13m8Q00R63l56j033n94
2005i49Q21N59N06m51q56l03P98O07l67n03o24K77R12N58p22q76m2N75P21J81
2025H22p09j062L75Q66N16o32o27l69M89O41N56r42o26N4Q08O06l73q23m59N25
2045c64J066M8p18o13j30N08R80k32p11n86J99P84N22l60p90n44Q21J047j71r60
2065b04m69J54Q34N38n64p77l56R91L51N99j075m94r0J001J66K09j256j37K43
$$ plain form
2084 -336 622 999 121 -346 -664 22 719 412 105 -548 -243 379 835 310 -272 -662 -214 963 650 -49
2104 -49 -803 -364 224 668 263 -174 -643 -435 548 462 114 -721 -554 85 621 511 -298 -369 -160 137 746
2125 746 179 -146 -580 -329 733 624 -175 -683 -343 292 550 157 -802 -597 -357 681 444 -26 -726
2144 -726 -739 230 557 274 -552 -874 -543 402 507 -157 -855 -325 -182 494 259 -82 -750 -165 278 420
2164 420 41 -314 -553 -96 394 541 -454 -735 -159 92 487 416 -393 -769 -127 602 676 29 -509 -380 210
2185 210 625 24 -89 -444 -453 484 711 261 -450 -589 -15 901 527 -159 -436 -369 432 869 206 -502 -592
2206 -592 -20 780 570 -299 -523 -411 228 587 -34 -350 -279 222 555 431 122 -333 -377 12 900 461 -162
2227 -162 -411 -496 430 237 152 -378 -534 -104 540 560 -123 -321 -380 119 577 257 -459 -587 78 351 357 209
$$ packed form
2084c36R58L77q78m67l18O86O97l07l07o53L05O22M56n25n82l90M48J177l13o99
2104d9p54M39N88M44m05m37m69K08R83q6l48q35J67O39N36j10q09p1K09K97O09
2125G46n67l25m34K51J062j09p99n08L40O35K58l93r59K05K40J038k37m70p00
2144g26j3R69L27k83q26l22L31R45J05o64o98N30J43O76k35l41o68N85M43J42
2164D20l79l55k39M57M90J47r95k81N76K51L95p1q09l76O42P29P4o47n38J29N90
2185B10M15o01j13l55rR37K27m50p11j39N74R16l74o86k77O7Q01M37o63p08r0
2206e92N72Q00k10q69k24J12O39L59o21l16P1N01L33j24l09m55m4L89Q88m39o23
2227a62k49q5R26j93q5n30j56M30O44K0o83j98n9M99M58l20p16j28O65K73Oj48
$$ plain form
2249 209 -261 -286 249 407 187 -489 -391 -196 386 422 153 -415 -132 145 469 49 -320 -151 -113 219 305 212
2271 212 -507 -373 185 470 115 191 -581 -114 177 154 510 -151 -515 -79 449 351 40 -423 -413 -214 502
2292 502 440 -424 -748 -201 498 406 -144 -440 -699 -45 393 223 -361 -457 -400 -41 631 118 -474 -549 110 503
2314 503 238 -165 -663 -104 136 408 75 -74 -166 -63 210 235 -238 -381 -229 199 398 353 -390 -373 -250
2335 -250 275 120 105 -442 -315 14 341 367 -283 -209 -384 177 432 -53 -390 -308 188 732 450 -301 -340 -367
2357 -367 308 399 539 -356 -464 142 279 234 -232 -594 -285 357 350 448 -116 -92 -308 58 488 222 -280 -205
2379 -205 6 114 290 -63 -386 -160 413 422 39 -234 -393 9 710 210 -117 -573 -291 61 609 112 -137
2400 -137 -295 66 325 377 145 -348 -382 184 617 267 -422 -362 7 352 51 144 -413 -254 -45 44 1 -163
$$ packed form
2249B09m70k5N35J58k20o76R8J95N82L6k69n68K83K77L24m20l69J69L8L32Q6r3
2271B12p19J34N58K85l55P6p72M67K91k3L56o61l64M36N28r8l11m63J0J99P16
2292E02o2q64l24N47O99r2n50k96k59O54M38j70n84r6N7L59O72n13n92p5O59L93
2314E03k65m03m98N59K40K72l33j49r2J03K73K5m73j43J52M28J99m5p43J7J23
2335b50N25j55j5n47J27L29L27K6o50P4j75N61K55m85l37Q2M96N44k82p51l9k7
2357c67O75R1J40q95j08O06J37m5m66l62L09O42pR8n64K4k16L66M30k66n02P5
2379b05K11J08J76l53l23K26N73Rl83k73j59M02P01n00l27m56K82L52N48m97k49
2400a37j58L61K59N2k32m93l4N66M33l50o89O0L69L45l01R3n57J59K09Q9m3j64
$$ plain form
2422 -163 -355 -355 284 197 229 -486 -408 53 -167 246 -308 -419 -276 49 311 231 -310 -485 -300 232 643 -1
2444 -1 -489 -627 -19 502 98 219 -164 6 216 339 190 -217 -386 21 252 114 -51 -462 -1 61 314
2465 314 -196 -358 -298 -74 129 257 223 -324 -193 33 200 209 -61 -611 22 294 220 351 -260 -382 -128 143
2487 143 221 280 -675 -190 -30 80 -20 -481 -446 130 242 204 -302 -468 -110 199 88 -191 -123 -312 93 99
2509 99 116 113 -274 54 107 142 130 -92 -307 -1 436 284 177 -436 -124 -317 409 136 10 -493 -164 158
2531 158 513 102 -144 -139 -61 272 231 168 -113 103 436 586 -78 -157 -289 63 402 430 -192 -486 -137 242
2553 242 328 291 -181 -388 -31 346 601 -112 -392 25 268 277 34 50 238 -37 288 -97 33 -4 -60 -57 274
2576 274 205 -88 -216 -399 -100 363 253 -181 -205 -68 197 281 -22 -186 -322 -87 326 193 -88 -213 -233
$$ packed form
2422a63j92%O39q7L2p15P8M61k20M13n54j11J43L25K62q0n41j75J85N32M11o44
2444am88j38O08N21m04J21l83J70K10J23j49m07j69M07K31j38j65m11M61O2K53
2465C14n10j62O0K24K03J28l4n47J31K26J67Rk70n50O33K72p4J31o11j22K54K71
2487A43P8N9r55M85J60J10j00m61L5N76J12l8n06j66L58L09j11k79O8j89M05O
2509I9J7ll87L28N3L5j2k22k15L06M37j52j07o13L12j93P26k73j26n03L29L22
2531A58L55m11k46NP8L33m1o3k81K16L33J50o64p9j32L52L39K8o22k94L49L79
2553B42Q6l7m72k07L57L77K55p13k80M17K43Rk43J6J88k75L25l85J30l7n6LL31
2576B74o9k93j28j83K99M63j10m34k4J37K65Q4l03j64j36K35M13j33k81j25k0
$$ plain form
2597 -233 235 482 -197 -562 -247 -16 91 72 -361 -522 250 363 200 -63 -83 -66 53 -8 247 -142 -200 -119
2619 -119 116 253 88 -203 -541 -36 63 98 99 -258 -154 -7 275 129 -205 -264 -147 58 303 12 -240 -317
2641 -317 112 117 151 -100 -395 -213 89 430 -135 -377 -304 -118 384 284 -73 -283 -279 261 245 -466 -362 -391 69
2664 69 351 84 52 -135 -120 -224 83 -36 -349 -370 180 458 337 -72 -302 33 -73 463 178 226 79 -153
2686 -153 201 431 156 -40 -500 29 338 114 -144 -10 33 298 286 71 -273 16 12 361 422 -105 -152 9
2708 9 456 137 76 -15 -274 144 325 295 224 -41 -192 94 247 10 280 -115 -53 165 165 218 -63 -446 77
2731 77 94 223 -27 -402 -100 -248 332 220 -79 -28 220 241 69 11 -298 -357 1 24 -155 -157 -261 -46 300
$$ packed form
2597b33M68K47o79l65L15K31J07j9m33j61P72J13j63k63k0J7J19o1K55l89n8Q1
2619a19K35J37j65k91l38N05R9L5Jl57J04J47K82j46l34n9J17K05K45k91k52p7
2641c17M29NL4k51k95J82L02L41n65k42P3J86N02j00l57k10MN40j6p11J04k9M60
2664F9K82k67l2j87J5j04L07j19l13k1N50K78j21m09k30L35j06N36k85M8j47k32
2686a53L54K30k75j96m60N29L09k24k58J34M3K65j2k15l44K89mL49O1n27m7J61
2708IM47l19o1r1k59M18J81l0p1k65j51K86J53k37K70l95O2K18%N3k81l83N23
2731G7J7J29k50l75L02j48N80j12k99N1K48K1j72n8l09n9L58K3j79kj04K15L46
$$ [...]
8191b3
##END NTUPLES=NMR FID
##END=
