##TITLE=1H_EC-3203
 DMSO, 8 sc, 
 24.7.2019
##JCAMPDX= 6.0         $$ Bruker NMR JCAMP-DX V2.0
##DATA TYPE= NMR FID
##DATA CLASS= NTUPLES
##ORIGIN= UXNMR, Bruker Analytische Messtechnik GmbH
##OWNER= root
$$ XWIN-NMR		Version 3.5
$$ Wed Jul 24 15:36:12 2019 Russian Standard Time (UT+4h)  she@DPX200
##.OBSERVE FREQUENCY= 200.13155
##.OBSERVE NUCLEUS= ^1H
##.DELAY= (6, 6)
##.ACQUISITION MODE= SIMULTANEOUS
##.ACQUISITION SCHEME= undefined
##.AVERAGES= 8
##.DIGITISER RES= 18
##SPECTROMETER/DATA SYSTEM= spect
##.PULSE SEQUENCE= zg30
##.SOLVENT NAME= DMSO
##.SHIFT REFERENCE= (INTERNAL, DMSO, 0, 15.7039)
##AUDIT TRAIL= $$ (NUMBER, WHEN, WHO, WHERE, WHAT)
$$ ##TITLE= Audit trail, XWIN-NMR		Version 3.5
$$ ##JCAMPDX= 5.01
$$ ##ORIGIN= Bruker BioSpin GmbH
$$ ##OWNER= she
$$ F:/spectra/data/she/nmr/H-F/1/audita.txt
$$ ##AUDIT TRAIL=  $$ (NUMBER, WHEN, WHO, WHERE, WHAT)
(   1,<2019-07-24 15:35:18.89 +0400>,<she>,<DPX200>,
      <created by zg, POWCHK disabled, PULCHK disabled
       configuration hash MD5:
       00 E9 B6 7A A2 85 ED C7 34 08 36 98 17 FE 4E 26
       data hash MD5: 16K
       03 03 6E 66 29 4B 1C 7A A5 3E AC 41 99 69 03 4C>)
$$ ##END=
$$ 
$$ hash MD5
$$ 99 5E 6A FF 9F 12 EA F2 2B 72 37 6A 1D 7F BB E4
##$RELAX= 
##$RELAX= 
##$RELAX= 
##$RELAX= 
##$RELAX= 
##$RELAX= 
$$ Bruker specific parameters
$$ --------------------------
##$DU= <F:/spectra>
##$EXPNO= 1
##$NAME= <H-F>
##$PROCNO= 1
##$TYPE= <nmr>
##$USER= <she>
##$AMP= (0..31)
100 100 100 100 100 100 100 100 100 100 100 100 100 100 100 100 100 100 
100 100 100 100 100 100 100 100 100 100 100 100 100 100 
##$AQSEQ= 0
##$AQ_mod= 1
##$AUNM= <au_zg>
##$AUTOPOS= <>
##$BF1= 200.13
##$BF2= 200.13
##$BF3= 200.13
##$BF4= 200.13
##$BF5= 200.13
##$BF6= 200.13
##$BF7= 200.13
##$BF8= 200.13
##$BYTORDA= 1
##$CFDGTYP= 0
##$CFRGTYP= 5
##$CHEMSTR= <none>
##$CNST= (0..31)
1 1 145 1 1 1 1 1 1 1 1 1 1 1 1 1 1 1 1 1 1 1 1 1 1 1 1 1 1 1 1 1 
##$CPDPRG= <>
##$CPDPRG1= <>
##$CPDPRG2= <>
##$CPDPRG3= <>
##$CPDPRG4= <mlev>
##$CPDPRG5= <mlev>
##$CPDPRG6= <mlev>
##$CPDPRG7= <mlev>
##$CPDPRG8= <mlev>
##$CPDPRGB= <>
##$CPDPRGT= <>
##$D= (0..31)
0 1.2 0 0 0 0 0 0 0 0 0 0.03 0 0 0 0 0 0 0 0 0 0 0 0 0 0 0 0 0 0 0 0 
##$DATE= 1563968118
##$DBL= (0..7)
120 120 120 120 120 120 120 120 
##$DBP= (0..7)
150 150 150 150 150 150 150 150 
##$DBP07= 0
##$DBPNAM0= <>
##$DBPNAM1= <>
##$DBPNAM2= <>
##$DBPNAM3= <>
##$DBPNAM4= <>
##$DBPNAM5= <>
##$DBPNAM6= <>
##$DBPNAM7= <>
##$DBPOAL= (0..7)
0.5 0.5 0.5 0.5 0.5 0.5 0.5 0.5 
##$DBPOFFS= (0..7)
0 0 0 0 0 0 0 0 
##$DE= 6
##$DECBNUC= <off>
##$DECIM= 24
##$DECNUC= <off>
##$DECSTAT= 4
##$DIGMOD= 1
##$DIGTYP= 9
##$DL= (0..7)
0 120 120 120 120 120 120 120 
##$DP= (0..7)
150 150 150 150 150 150 150 150 
##$DP07= 0
##$DPNAME0= <>
##$DPNAME1= <>
##$DPNAME2= <>
##$DPNAME3= <>
##$DPNAME4= <>
##$DPNAME5= <>
##$DPNAME6= <>
##$DPNAME7= <>
##$DPOAL= (0..7)
0.5 0.5 0.5 0.5 0.5 0.5 0.5 0.5 
##$DPOFFS= (0..7)
0 0 0 0 0 0 0 0 
##$DQDMODE= 0
##$DR= 18
##$DS= 0
##$DSLIST= <SSSSSSSSSSSSSSS>
##$DSPFIRM= 0
$$ [...]
##$SUBNAM2= <"">
##$SUBNAM3= <"">
##$SUBNAM4= <"">
##$SUBNAM5= <"">
##$SUBNAM6= <"">
##$SUBNAM7= <"">
##$SUBNAM8= <"">
##$SUBNAM9= <"">
##$SW= 24.9336996594482
##$SWIBOX= (0..15)
0 0 2 0 0 0 0 0 0 0 0 0 0 0 0 0 
##$SW_h= 4990.01996007984
##$TD= 16384
##$TD0= 1
##$TE= 0
##$TE2= 300
##$TE3= 300
##$TEG= 300
##$TL= (0..7)
0 120 120 120 120 120 120 120 
##$TP= (0..7)
150 150 150 150 150 150 150 150 
##$TP07= 0
##$TPNAME0= <>
##$TPNAME1= <>
##$TPNAME2= <>
##$TPNAME3= <>
##$TPNAME4= <>
##$TPNAME5= <>
##$TPNAME6= <>
##$TPNAME7= <>
##$TPOAL= (0..7)
0.5 0.5 0.5 0.5 0.5 0.5 0.5 0.5 
##$TPOFFS= (0..7)
0 0 0 0 0 0 0 0 
##$TUNHIN= 0
##$TUNHOUT= 0
##$TUNXOUT= 0
##$USERA1= <user>
##$USERA2= <user>
##$USERA3= <user>
##$USERA4= <user>
##$USERA5= <user>
##$V9= 5
##$VALIST= <valist>
##$VCLIST= <CCCCCCCCCCCCCCC>
##$VD= 0
##$VDLIST= <DDDDDDDDDDDDDDD>
##$VPLIST= <PPPPPPPPPPPPPPP>
##$VTLIST= <TTTTTTTTTTTTTTT>
##$WBST= 1024
##$WBSW= 4
##$XGAIN= (0..3)
0 0 0 0 
##$XL= 0
##$YL= 0
##$YMAX_a= 50735
##$YMIN_a= -92157
##$ZGOPTNS= <>
##$ZL1= 120
##$ZL2= 120
##$ZL3= 120
##$ZL4= 120
##$ABSF1= 10
##$ABSF2= 0
##$ABSG= 5
##$ABSL= 3
##$ALPHA= 0
##$AQORDER= 0
##$ASSFAC= 0
##$ASSFACI= 0
##$ASSFACX= 0
##$ASSWID= 0
##$AUNMP= <proc_1d>
##$AZFE= 0.1
##$AZFW= 0.1
##$BCFW= 1
##$BC_mod= 2
##$BYTORDP= 1
##$COROFFS= 0
##$CY= 11.3945322036743
##$DATMOD= 1
##$DC= 2
##$DFILT= <>
##$DTYPP= 0
##$F1P= 18.9103706918063
##$F2P= -1.10871071338519
##$FCOR= 0.5
##$FTSIZE= 0
##$FT_mod= 4
##$GAMMA= 1
##$GB= 0.15
##$INTBC= 1
##$INTSCL= 1
##$ISEN= 128
##$LB= 0.24
##$LEV0= 0
##$LPBIN= 0
##$MAXI= 10000
##$MC2= 0
##$MEAN= 0
##$ME_mod= 0
##$MI= 1.114404
##$NCOEF= 0
##$NC_proc= 0
##$NLEV= 6
##$NOISF1= 3.799351
##$NOISF2= 2.8
##$NSP= 1
##$NTH_PI= 0
##$NZP= 0
##$OFFSET= 15.70392
##$PC= 1
##$PHC0= -8859.092
##$PHC1= 8.800961
##$PH_mod= 1
##$PKNL= yes
##$PPARMOD= 0
##$PSCAL= 0
##$PSIGN= 0
##$REVERSE= no
##$SF= 200.130013532006
##$SI= 16384
##$SIGF1= 3
##$SIGF2= 2
##$SINO= 400
##$SIOLD= 16384
##$SREGLST= <1H.CDCl3>
##$SSB= 0
##$STSI= 0
##$STSR= 0
##$SW_p= 3612.71676300578
##$SYMM= 0
##$S_DEV= 0
##$TDeff= 0
##$TDoff= 0
##$TI= <>
##$TILT= no
##$TM1= 0
##$TM2= 0
##$TOPLEV= 0
##$USERP1= <user>
##$USERP2= <user>
##$USERP3= <user>
##$USERP4= <user>
##$USERP5= <user>
##$WDW= 1
##$XDIM= 8192
##$YMAX_p= 0
##$YMIN_p= 0
$$ End of Bruker specific parameters
$$ ---------------------------------
##NTUPLES= NMR FID
##VAR_NAME=  TIME,          FID/REAL,        FID/IMAG
##SYMBOL=    X,             R,               I
##VAR_TYPE=  INDEPENDENT,   DEPENDENT,       DEPENDENT
##VAR_FORM=  AFFN,          ASDF,            ASDF
##VAR_DIM=   8192,          8192,            8192
##UNITS=     SECONDS,       ARBITRARY UNITS, ARBITRARY UNITS
##FACTOR=    0.0002004,     1,               1
##FIRST=     0,             0,               0
##LAST=      1.6414764,     0,               0
##MIN=       0,             -92157,          0
##MAX=       1.6414764,     50735,           0
$$ Real data points
##PAGE= N=1
##DATA TABLE= (X++(R..R)), XYDATA
$$ plain form
0 0 0 0 0 0 0 0 0 0 0 0 8 -8 8 -8 8 -15 16 -16 24 -24 30 -33 40 -46 49 -57 66 -77 88 -97 112 -126 140 -158
34 -158 176 -194 217 -240 268 -296 327 -364 402 -448 495 -548 609 -678 759 -850 958 -1088
52 -1088 1246 -1444 1703 -2054 2560 -3365 4837 -8453 39185 10488 -71989 -34752 27674 50735
66 50735 7338 -20348 -12377 8640 -1046 -11155 -268 18856 6010 -21640 -26910 1178 20857
79 20857 8138 -17803 -18602 -930 6573 -2799 -6161 1132 4065 -6696 -12894 -1616 14682 10421
93 10421 -10081 -17240 -247 16757 10916 -8326 -13587 375 12228 5391 -7860 -8148 2701
106 2701 6254 -1400 -7509 -3649 1728 765 -3822 -4304 -1621 -2997 -4561 -281 4005 -1756 -10534 -6882
122 -6882 7485 11551 -3598 -15922 -3892 17760 15046 -9416 -17482 4894 24616 11328 -14478
$$ packed form
0@%%%%%%%%%%Qj6J6j6J6k3L1l2M0m8N4o3P3q6R5j06J23j43J65j85K09k38K66k98
34a58L34l70M11m57N08n64O23o91P66q50R43j043J157j287J437j609J808k046
52a088K334k690L147l757M614n925Q202j3290M7638k8697q2477L7237O2426K3061
66E0735m3397k7686P971K1017r686j0109J0887J9124j2846k7650n270K8088J9679
79B0857j2719k5941p99J7672P503r372l362P293K933j0761o198J1278J6298m261
93A0421k0502p159J6993J7004n841j9242n261J3962J1853o837j3251k88J0849
106B701L553p654o109L860N377r63m587m82K683j376j564M280M286n761q778L652
122f882J4367M066j5149j2324J2030K1652k714k4462q066K2376J9722j3288k5806
$$ plain form
135 -14478 -12886 14036 24464 2550 -16592 -3596 19236 15821 -6721 -12736 5074 16611 3564
148 3564 -11928 -5468 10489 8275 -8195 -11025 3683 10795 -1775 -14540 -6219 10456 8682
161 8682 -9831 -15407 1091 14008 4267 -13702 -12448 6387 15144 842 -14767 -8124 10304
174 10304 13379 -2342 -13428 -4229 11114 10332 -4992 -11712 -1108 9405 4829 -6360 -8309
187 -8309 82 4752 63 -5589 -4344 -456 -893 -3103 -1651 -276 -3228 -5589 -1886 3330 1166
202 1166 -6404 -6845 2543 7805 -37 -8181 -3396 7706 7990 -2296 -6535 1994 9477 4184 -3876
217 -3876 -1635 6580 6220 -897 -1943 4315 6777 43 -4376 1732 8841 3235 -7061 -5194 6909
232 6909 9599 -2346 -11377 -3225 10473 8366 -7575 -12732 556 12321 5155 -9982 -10739 3693
$$ packed form
135a4478J592K6922J0428k1914j9142J2996K2832l415k2542o015J7810J1537j3047
148C564j5492O460J5957k214j6470k830J4708P112j2570j2765Q321J6675j774
161H682j8513n576J6498J2917r741j7969J254J8835Q757j4302j5609O643J8428
174A0304L075j5721j1086R199J5343p82j5324o720J0604J0513m576j1189j949
187h309Q391M670m689n652J245L888m37k210J452J375k952k361L703N216k164
202A166p570m41R388N262p842q144M785J1102K84j0286m239Q529P483n293q060
217c876K241Q215l60p117j046O258K462o734m419O108P109n606j0296J867J2103
232F909K690j1945r031Q152J3698k107j5941n157J3288J1765p166j5137p57J4432
$$ plain form
246 3693 12089 2643 -10609 -7940 6217 10544 -230 -9501 -4184 7314 8104 -2501 -7825 -618
260 -618 6988 3531 -4570 -4466 2250 4038 -1611 -4960 -588 3490 -421 -6177 -3272 3543 2634 -5466
276 -5466 -7744 69 5930 145 -8713 -6145 3857 6080 -2531 -8376 -2417 5314 3973 -3114 -4980
291 -4980 208 4465 2079 -1043 -648 963 1286 1770 2798 1719 -1198 -1478 3062 6001 1675 -4548
307 -4548 -2783 5088 7259 -678 -6797 -2390 6388 6482 -2673 -7534 -908 6848 4466 -4295 -6230 702
323 702 6057 2679 -4171 -4264 2141 5126 763 -3437 -1405 2925 2880 -984 -2053 1513 3395 -14
339 -14 -3221 163 4438 2274 -3758 -3991 2527 6066 -293 -7494 -3843 5589 5724 -4244 -9232 -1578
355 -1578 7363 3657 -7215 -8760 942 7253 574 -8086 -5825 2621 4737 -1451 -5869 -2631 2247
$$ packed form
246C693Q396r446j3252K669J4157M327j0774r271N317J1498P90j0605n324P207
260f18P606l457q101J04O716J788n649l349M372M078l911n756K905O815r09q100
276e466k278P813N861n785q858K568J0002K223q611n845N959P731j341p087j866
291d980N188M257k386l122L95J611L23M84J028j079k917k80M540K939m326o223
307d548J765P871K171p937o119M407Q778R4r155m861O626P756k382q761j935O932
323G02N355l378o850r3O405K985m363m200K032M330m5l864j069L566J882l409
339a4l207L384M275k164o032k33O518L539o359p201L651R432J35r968m988P654
355a578Q941l706j0872j545R702O311o679q660K261Q446K116o188m418L238M878
$$ plain form
370 2247 1936 -1365 -2161 -227 559 113 577 959 -160 -1237 -111 2673 2450 -833 -2608 410 3936
387 3936 2112 -1782 -2277 1061 3474 1493 -1814 -1665 1153 2338 726 -993 -793 322 935 596
403 596 -75 -279 -154 -114 494 1318 462 -804 -981 1023 2720 1427 -1806 -2043 1766 4582 1744 -3284
421 -3284 -2931 2579 5703 992 -5034 -3309 4024 5720 -1194 -6154 -2031 4918 4104 -3081 -6010 -518
437 -518 4426 1325 -4366 -3973 841 2339 -1288 -3316 -1551 1063 -273 -2200 -1442 892 -10 -2178
453 -2178 -1440 1409 1660 -1100 -2709 -318 2679 1732 -1769 -2288 793 2689 1060 -1684 -1692 784 2471
470 2471 1353 -1172 -1465 283 2089 1597 -692 -2090 -505 1903 1735 -579 -1960 -724 1462 1997
486 1997 -66 -1819 -873 1337 2062 466 -1120 -1402 835 2791 1596 -1191 -1764 807 3220 1705
$$ packed form
370B247l11l301p96J934P86m46M64L82j119j077J126K784k23l283j775L018L526
387C936j824l894m95L338K413j981l307J49K818J185j612j719K00J115O13l39
403E96o71k04J25M0O08Q24q56j266j77K004J697j293l233k37L809K816k838n028
421c284L53N510L124m711o026J725P333J696o914m960M123O949q14p185k929N492
437e18M944l101n691L93M814J498l627k028J765K614j336j927P58K334r02k168
453b178P38K849K51k760j609K391K997r47l501n19L081J896j629k744qK476J687
470B471j118k525k93J748J806m92k289j398J585K408j68k314j381J236K186N35
486A997k063j753R46K210P25j596j586k82K237J956j195k787n73K571K413j515
$$ plain form
502 1705 -1509 -2293 1424 3547 1082 -2206 -1305 1960 2730 -278 -2224 -567 1614 865 -1199 -1264 382
519 382 94 -1392 -1261 427 512 -1508 -2650 -251 1972 171 -2994 -2611 1176 2394 -723 -3391 -1724
536 -1724 1804 2359 -1067 -3097 -848 2276 1836 -701 -2069 -671 1792 1757 -616 -1744 -658 1323
552 1323 1553 175 -1359 -1017 891 1597 167 -1248 -922 361 1008 348 -814 -721 3 629 699 17
570 17 -776 -722 642 1511 853 -1157 -880 1070 1944 790 -1162 -619 1183 1783 279 -692 -146 1017
588 1017 1148 613 -148 40 106 144 836 925 -459 -1342 -413 1699 963 -1734 -2219 -238 2132 774 -2564
607 -2564 -2827 461 2094 31 -2708 -2123 809 1686 -255 -2076 -1215 825 1296 67 -1086 -955 167
624 167 888 433 -388 -634 -247 612 531 5 -635 -479 426 557 166 -343 -657 -274 421 380 -348 -1158 -737
$$ packed form
502A705l214p84L717K123k465l288R01L265P70l008j946J657K181p49k064o5J646
519C82k88j486J31J688Q5k020j142K399K223j801l165L83L787J218l117k668J667
536a724L528N55l426k030K249L124m40k537j368J398K463l5k373j128J086J981
552A323K30j378j534L42J908P06j430j415L26J283O47o60j162R3P24O26P0o82
570A7p93N4J364Q69o58k010K77J950Q74j154j952N43J802O00j504r71N46J163
588A017J31n35p61J88O6L8O92Q9j384q83R29K112p36k697m85J981K370j358l338
607b564k63L288J633k063k739N85K932Q77j941j821Q61K040M71j229j153J31J122
624A67P21m55q21k46L87Q59q1n26o40J56R05J31l91n09l14L83O95m1p28q10M21
$$ plain form
645 -737 323 1187 22 -1385 -1014 992 1676 -293 -1632 -551 1205 1664 -99 -1358 -141 1280
661 1280 1351 50 -633 -125 969 1058 655 23 -115 327 878 1392 367 -846 -388 1145 1529 -423 -1532
680 -1532 -465 1171 1196 -651 -1626 -540 1106 624 -891 -1047 -319 360 478 -305 -682 -446 -105 104
698 104 335 -386 -719 -340 565 1003 -82 -878 -347 588 912 -241 -760 -543 498 741 39 -615 -589 18
718 18 442 192 -953 -1118 -349 955 675 -761 -1533 -145 1248 725 -1015 -1365 87 1205 564 -804
736 -804 -946 507 759 520 -337 -76 56 620 567 293 14 -198 386 1015 886 -236 -723 345 1217 559
756 559 -590 -625 336 929 351 -620 -563 1 559 187 -216 -540 -459 4 526 203 -592 -991 24 725 540
777 540 -948 -734 423 1100 271 -983 -774 544 814 95 -700 -663 182 665 32 -284 -368 -71 375 347
$$ packed form
645g37J060Q64j165j407L71K006O84j969j339J081J756M59j763j259J217J421
661A280P1j301o83N08J094Q9m03o32j38M42N51N14j025j213M58J533L84j952j109
680a532J067J636K5j847r75J086J646m82j515j56P28O79J18p83l77K36L41K09
698A04K31p21l33L79R05M38j085p96N31R35L24j153n19K17J041K43p02o54K6O07
718A8M24k50j145j65P69J304k80j436p72J388J393n23j740l50J452J118o41j368
736h04j42J453K52k39q57K61J32N64n3k74k79k12N84O29j29j122m87J068Q72o58
756E59j149l5R61N93n78r71N7N64N58l72m03l24Q1M63N22l23p95l99J015P01j85
777E40j488K14J157O77q29j254K09J318K70p19p95L7Q45M83o33l16q4K97M46k8
$$ plain form
797 347 62 -392 -572 37 544 142 -916 -826 120 808 58 -880 -631 190 714 -42 -631 -479 240 399
817 399 346 -395 -364 60 319 697 -84 -284 -222 620 904 179 -315 45 687 620 55 -402 -131 560 563 86
839 86 -264 -327 -36 343 335 -27 -649 -456 441 917 -247 -663 -357 730 905 -333 -898 -216 569 483 -431
860 -431 -697 -170 580 499 -86 -444 99 106 327 211 -232 -327 -318 262 293 -129 -604 -250 311 532 -323 -872 -446
883 -446 410 392 -370 -692 -416 302 261 -98 -534 -368 -66 375 156 -380 -609 126 794 310 -269 -365 -38
904 -38 649 385 -447 -294 182 336 239 -266 1 92 176 338 271 23 -281 -81 538 524 -315 -406 54 534 472
927 472 -470 -688 55 838 290 -745 -457 412 642 -1 -386 -154 312 277 191 -30 95 -28 -118 137 138 -133
949 -133 -414 8 439 348 -117 -423 -4 555 312 -191 -690 -279 373 115 -274 -295 -228 396 145 -399 -615
$$ packed form
797C47k85m54j80O09N07m02j058R0R46O88p50r38K49Q21N24p56n89J52P19J59
817C99n3p41L1M24K59L78p81k00O2Q42K84p25m94L60O42o7n65m57K71O91Lm77
839H6l50o3K91L79ql62o22J93Q97M76j164m16L06J087J75j238n65O82P85q6r14
860d31k66N27P50q1n85l58N43PK21j16m43r5RN80L1m22m75L54N61K21q55n49M26
883d46Q56j8p62l22K76P18m1l59m36J66L02M41k19n36k29P35O68m84n79r6L27
904c8O87k64q32J53M76J54r7n05K67R1Q4J62o7k48l04K00O19j4q39r1M60M80o2
927D72r42k18P43P83n48j035K88Q69K30o43l85K32M66l5q6k21J25j23r0K55Jk71
949a33k81M22M31r1m65l06M19N59k43n03m99M11O52k58l89k1O7O24k51n44k16
$$ plain form
970 -615 -216 -31 164 -134 -638 -220 229 286 -130 -298 -62 287 216 88 -192 -2 1 175 24 21 -158 -134 187
993 187 659 82 -494 -456 413 635 100 -349 -373 339 721 28 -530 -88 545 262 -284 -313 309 558 88
1014 88 -26 24 14 -27 -91 208 377 -187 -164 57 426 189 -369 -178 347 740 184 -512 -212 409 431 31
1036 31 -378 -300 247 237 -159 -327 -174 194 -14 -147 -326 -182 150 61 159 -81 -271 -61 -54 21 -242 -109 -146
1059 -146 -8 95 353 81 -148 -72 206 85 -142 -178 -220 425 598 -74 -427 -21 595 351 -278 -447 282
1080 282 544 165 -82 -492 214 197 -78 -185 19 39 -112 -25 30 41 -232 -99 -93 427 84 -251 -276 316 580
1103 580 -70 -240 -147 241 291 -255 -495 96 371 205 -205 -294 -83 217 231 -204 -266 30 217 193 -124 -49
1125 -49 -145 94 211 -62 -233 -198 -213 256 -65 -55 -128 -50 49 43 -63 -172 -252 97 264 -17 -244 -389 140 450
$$ packed form
970f15L99J85J95k98n04M18M49N7m16j68K36L49p1j28k80J90LJ74j51lj79K4L21
993A87M72n77n76L8Q69K22n35m49k4P12L82o93n58M42O33k83n46k9O22K49m70
1014H8j14N0j0m1o4K99J69n64K3K21L69k37n58J91N25L93n56o96L00O21K2m00
1036C1m09P8N47j0l96j68J53L68k08j33j79J44L32q9R8k40j90K10PP5k63J33l7
1059a46J38J03K58k72k29P6K78j21k27l6m2O45J73o72l53M06O16k44o29j69P29
1080B82K62l79k47m10P06j7k75j07K04K0j51Q7N5J1k73J33ON20l43l35k5N92K64
1103E80o50j70R3L88N0n46k40N91K75j66m10q9K11L00J4m35o2K96J87k4l17P5
1125d9r6K39J17k73j71L5j5M69l21J0p3P8R9oj06j09q0L49J67k81k27j45N29L10
$$ plain form
1149 450 -18 -455 -334 327 472 34 -511 -54 456 67 -61 -161 -17 7 -12 -33 -68 147 -99 -196 99 293
1171 293 0 -298 -91 364 77 -100 -244 132 504 143 -217 -220 44 455 194 -208 84 170 115 81 -257 -157
1193 -157 -103 205 146 -158 -157 36 71 263 -13 -175 -215 133 30 -3 -236 -159 36 158 134 262 -87 -89 333 48
1217 48 -75 -55 18 175 215 34 -321 -292 161 79 58 -217 -59 417 400 -61 -317 195 195 -40 -25 37 73 -351
1241 -351 -139 290 138 -194 -226 91 145 -74 -204 -180 170 216 -268 -115 10 6 171 -64 -261 -15 116 114 -78
1264 -78 -168 48 207 -54 -296 -160 17 79 82 24 7 44 65 212 101 62 -39 21 -172 11 203 -234 -181 -44
1288 -44 218 -63 -155 -113 -41 231 113 -100 -111 255 210 -136 -132 -36 146 106 95 -29 19 53 177 235 -23 18 25 -82
1314 -82 -317 177 52 -105 -59 -138 244 -174 -229 24 83 169 -145 -240 64 224 130 -181 -50 244 282 44 69
$$ packed form
1149D50m68m37J21O61J45m38n45M57N10l89j28j00J44K4j9k1l5K15k46r7K95J94
1171B93k93k98K07M55k87j77j44L76L72l61l60lK64M11k61m02K92Q6n5l4l38J00
1193a57N4L08n9l04JJ93L5J92k76j62m0L48j03l3k33P7J95J22k4J28l49kM22k85
1217D8j23K0P3J57M0j81l55K9M53q2k1k75J58M76j7m61k56N12%k35J5O2L6m24
1241c51K12M29j52l32l2L17N4k19j30K4L50M6m84J53J25mJ65k35j97K46J31kj92
1264g8r0K16J59k61k42J36J77O2Ln8j7L7K1J47j11l9j01O0j93J83J92m37N3J37
1288d4K62k81r2M2P2K72j18k13j1L66m5l46MR6J82m0j1j24M8L4J24N8k58M1Pj07
1314h2k35M94j25j57M6p9L82m18n5K53N9Q6l14r5L04J60r4l11J31K94L8k38K5
$$ plain form
1337 69 -2 115 363 -106 -76 15 -45 37 -9 118 -61 -156 -163 -34 146 -30 -218 58 -54 -166 -85 -153 0 -31
1361 -31 143 128 -89 -195 136 12 61 -41 -154 289 116 -109 -101 -88 44 -13 -109 -15 -187 -45 -120 -84 -1 -80
1385 -80 12 62 28 92 -31 -52 -8 -21 89 -69 -148 -30 199 -40 -16 -161 -41 134 5 -361 -92 232 86
1408 86 -77 -244 -100 65 -29 -166 -49 140 76 37 50 -94 1 -36 110 -19 -126 -151 -34 8 61 -179 -191 -54
1432 -54 -10 57 -15 41 -38 12 79 17 -143 -173 -119 150 -24 -11 -28 -161 96 32 -399 -94 39 17 106 -48 -93 -82
1458 -82 103 42 93 31 12 -59 73 26 -56 -39 80 105 158 64 -56 188 120 18 -20 -82 208 37 49 -47 41 119
1484 119 40 -109 168 175 155 75 53 148 0 27 -101 108 -113 -10 55 -196 66 -119 -195 5 194 99 23 -83
1508 -83 -83 105 48 171 127 -127 11 239 -90 56 37 -36 160 65 -152 60 -98 -45 -30 32 -203 -181 66 -84
$$ packed form
1337F9p1J17K48m69L0R1o0Q2m6J27j79r5pJ29J80j76j88K76j12j12Q1o8J53l1
1361c1J74j5k17j06L31j24M9j02j13M43j73k25QJ3J32n7r6R4j72J42p5L6Q3p9
1385h0R2N0l4O4j23k1M4j3J10j58p9J18K29k39K4j45J20J75j29l66K69L24j46
1408H6j63j67J44J65r4j37J17J89o4l9J3j44R5l7J46j29j07k5J17M2N3k40j2J37
1432e4M4O7p2N6p9N0O7o2j60l0N4K69j74J3j7j33K57o4m31L05J33k2Q9j54m5J1
1458h2J85o1N1o2j9p1J32m7q2J7J19K5N3r4j20K44o8j02l8o2K90j71J2r6Q8P8
1484A19p9j49K77Pk0q0k2R5j48K7j28K09k21J03O5k51K62j85p6K00J89r5p6j06
1508h3%J88n7J23m4k54J38K28l29J46j9p3J96r5k17K12j58N3J5O2k35K2K47j50
$$ plain form
1532 -84 -35 71 -12 -58 -31 72 41 75 -96 -70 62 74 -106 -70 -33 85 14 -34 -7 151 205 159 -144 -194 146 -24
1558 -24 55 -121 -72 -42 -77 -65 198 3 2 -42 -67 114 115 -127 6 -43 165 -106 -84 227 70 118 57 -138 -191 39
1584 39 96 -121 44 -27 82 151 -107 -19 43 74 -95 21 -87 16 150 -81 -167 34 29 -52 -91 -34 -25 -78 -106 24
1610 24 37 63 -155 -135 7 126 74 -42 -16 23 92 -107 164 112 217 43 -86 56 135 -141 -134 -62 -94 -73 60
1635 60 -136 -25 128 -61 -85 -40 -117 -161 -119 -179 32 -49 118 103 277 110 108 -94 -176 29 159 6 -27 -77 -286
1660 -286 -41 61 -3 -114 -15 78 -178 27 55 -32 83 -284 -87 -229 15 61 34 7 -71 168 -24 -33 -115 -3
1684 -3 -176 -56 212 62 -94 -88 167 -80 35 -16 -97 33 -44 110 -42 -125 56 -95 202 -176 -127 -27 77
1707 77 98 -8 43 -9 -22 95 231 6 46 64 142 -14 -5 100 -19 -97 22 31 148 -58 21 274 -74 14 141
$$ packed form
1532h4M9J06q3m6K7J03l1L4j71K6J32J2j80L6L7J18p1m8K7J58N4m6l03n0L40j70
1558b4P9j76M9L0l5J2K63j95jm4k5J81Jk42J33m9K08k71K2L11j57M8o1j95n3K30
1584C9N7k17J65p1J09O9k58Q8O2L1j69J16j08J03J34k31q6K01nq1l9N7Rn3k8J30
1610B4J3K6k18K0J42J19n2j16K6L9O9j99K71n2J05j74j29J42P9k76PP2l2K1J33
1635F0j96J11J53j89k4M5p7m4M2o0K11q1J67j5J74j67kk02q2K05J30j53l3n0k09
1660b86K45J02o4j11R9R3k56K05K8q7J15l67J97j42K44M6k7k7p8K39j92rq2J12
1684cj73J20K68j50j56OK55k47J15n1q1J30p7J54j52q3J81j51K97l78M9J00J04
1707G7K1j06N1n2j3J17J36k25M0J8P8j56RJ05j19p8J19RJ17k06P9K53l48Q8J27
$$ plain form
1732 141 -48 -65 1 115 -44 4 -39 -166 -96 -25 -214 31 -16 63 130 43 -64 83 172 -26 -99 48 33 43 -43
1757 -43 -14 78 -71 91 -29 -21 60 53 204 123 -107 33 4 -10 -170 -107 102 23 -90 50 -79 11 225 164 -100
1782 -100 247 -81 55 -67 -189 10 33 72 -81 -55 77 -22 -2 -181 -114 -166 -141 132 -118 -181 -120 67 92 -69
1806 -69 -9 9 -143 132 -16 4 -266 -244 -12 11 -5 55 -14 -52 46 221 59 76 65 -54 184 71 -30 69 -117
1831 -117 -16 -106 -10 -73 -220 -102 27 -104 -67 215 97 -20 56 -60 -141 -117 211 -134 -87 -216 91 -85 -174
1854 -174 -130 -2 -24 -19 -6 54 29 -120 -130 50 22 -23 -177 -35 3 152 282 37 208 167 0 73 99 84 93 9
1880 9 60 25 -49 -156 12 164 93 1 -173 -429 121 -12 -77 -38 -140 -124 7 163 35 46 -50 159 -89 -42
1904 -42 -13 -113 38 -119 80 101 30 -104 -21 56 88 -75 48 -190 51 -13 -39 32 -93 0 -62 -30 137 60 -160
$$ packed form
1732A41j89j7O6J14j59M8m3j27P0P1j89K45m7P9O7q7j07J47Q9j98p3J47j5J0q6
1757d3K9R2j49J62j20QQ1pJ51q1k30J40k9j4j60O3K09p9j13J40j29R0K14o1k64
1782a00L47l28J36j22j22J99K3L9j53K6J32r9K0j79O7n2K5K73k50o3O1J87K5j61
1806f9O0J8j52K75j48K0k70K2K32K3j6O0o9l8R8J75j62J7j1j19K38j13j01R9j86
1831a17J01r0R6o3j47J18J29j31L7K82j18j17P6j16q1K4L28l45M7j29L07j76q9
1854a74M4J28k2NJ3O0k5j49j0J80k8m5j54J42L8J49J30k45J71m1j67P3K6j5Rq4
1880IN1l5p4j07J68J52p1r2j74k56N50j33o5L9j02J6J31J56j28J1r6K09k48M7
1904d2K9j00J51j57J99K1p1j34Q3P7L2j63J23k38K41o4k6P1j25R3o2L2J67p7k20
$$ plain form
1929 -160 8 -87 -95 129 -201 114 -38 -112 168 -11 -58 93 80 181 -344 -74 122 13 199 -59 -75 48
1951 48 -140 -69 -177 87 136 -140 128 114 -141 102 82 53 53 11 19 -73 71 -1 -25 77 -91 -354 -143 138 153
1976 153 -91 -66 -164 -245 -117 126 64 -39 -240 72 191 113 -100 -140 -216 163 -187 -3 -103 -240 166 -70
1998 -70 -11 -83 -72 -96 38 -127 -17 0 -52 84 107 -107 51 -90 -148 96 -138 42 -131 -73 -34 96 -43 105
2022 105 -139 -69 275 120 -55 -39 102 92 -79 -76 -60 51 -28 -154 -102 -78 22 -104 24 49 -2 82 -65 -100
2046 -100 37 -115 183 -54 -47 67 -96 184 -28 -125 -57 -6 38 140 23 107 118 -72 -130 -138 -65 7 17 12 60 163
2072 163 -107 57 172 57 -196 139 85 -59 180 168 -139 -68 11 210 -12 45 119 70 -234 67 -8 -74 -7
2095 -7 -76 -104 -71 115 139 -53 19 -94 58 221 136 187 -160 105 20 40 113 33 -66 -88 -45 128 -182 -96 122 69
$$ packed form
1929a60J68r5qK24l30L15j52p4K80j79m7J51j3J01n25K70J96j09J86k58j6J23
1951D8j88P1j08K64M9k76K68j4k55K43k0k9%m2Qr2J44p2k4J02j68k63K11K81J5
1976A53k44K5r8q1J28K43o2j03k01L12J19p8k13m0p6L79l50J84j00j37M06k36
1998g0N9p2J1k4J34j65J10J7n2J36K3k14J58j41n8K44k34J80j73N8L9J30j39J48
2022A05k44P0L44j55j75J6J41j0j71LJ6J11p9j26N2K4J00j26J28K5n1Q4j47l5
2046a00J37j52K98k37PJ14j63K80k12r7O8N1M4J02j17Q4J1j90n8qP3P2J0nM8J03
2072A63k70J64J15j15k53L35n4j44K39j2l07P1P9J99k22N7P4m9l04L01p5o6O7
2095go9k8L3J86K4j92P2j13J52J63q5N1l47K65q5K0P3q0r9k2M3J73l10Q6K18n3
$$ plain form
2121 69 78 31 51 -27 -55 -92 -15 -12 205 52 -176 -110 121 -166 -115 145 65 -135 78 201 138 129 -54 99 -105 35
2147 35 78 33 18 -43 -81 29 -68 -38 -28 -86 -21 -113 53 -45 80 -128 56 -162 -65 50 74 -215 -34 -16 220
2172 220 33 -5 -24 -106 -16 -62 101 120 74 -108 -76 82 36 -114 -91 -28 127 -7 -31 84 192 203 65 -167
2196 -167 -151 -29 -65 -77 -134 70 81 69 157 22 118 -92 77 -8 -97 79 142 -6 -99 -155 -24 132 5 79 150
2221 150 -34 -20 -113 162 110 -25 -88 92 -142 -4 -16 -8 36 -114 -17 -97 -163 -93 -114 -63 102 115 12 12 -45 2
2247 2 -48 -35 -33 24 -153 42 -144 10 -51 -82 -10 1 -17 51 -118 54 25 -103 173 174 129 -27 -98 -51 -117 105 -108
2274 -108 -100 64 139 -33 -312 41 18 -91 100 -8 -9 -61 -21 104 82 67 -47 3 16 -126 -9 -73 -69 165 40
2299 40 95 7 -11 0 93 -104 -89 61 116 100 -14 -15 -50 -234 -78 -160 69 130 -68 111 95 125 -16 -241 -45
$$ packed form
2121F9Rm7K0p8k8l7P7LK17j53k28O6K31k87N1K60q0k00K13J23o3rj83J53k04J40
2147C5M3m5j5o1l8J10r7L0J0n8O5r2J66r8J25k08J84k18R7J15K4k89J81J8K36
2172B20j87l8j9q2R0m6J63J9m6j82L2J58m6j50K3O3J55j34k4J15J08J1j38k32
2196a67J6J22l6j2n7K04J1j2Q8j35R6k10J69q5q9J76O3j48r3n6J31J56j27P4P1
2221A50j84J4r3K75n2j35o3J80k34J38j2QM4j50R7q0o6P0k1N1J65J3j03%n7M7
2247Bn0J3KN7j77J95j86J54o1l1P2J1j8O8j69J72k9j28K76Jm5j56p1M7o6K22k13
2274a08QJ64P5j72k79L53k3j09J91j08jn2M0J25k2j5j14N0J3j42J17o4MK34j25
2299D0N5q8j8J1R3j97J5J50N5j6j14jl5j84J56q2K29O1j98J79j6L0j41k25J96
$$ plain form
2324 -45 -33 52 85 23 -143 -151 188 26 52 25 0 12 131 -20 -51 -4 -37 -6 77 163 143 -41 -85 -108 36 75 27
2351 27 -75 103 -183 56 -68 14 29 -70 -39 -190 -189 71 -64 103 -130 -129 -201 -130 66 -79 30 -80 102 -179
2375 -179 -122 -113 -163 54 -117 -2 -130 2 40 -48 132 14 59 -54 23 5 -26 21 112 88 -106 24 -56 -124 -85
2400 -85 -57 -129 53 -117 100 22 -219 -43 -39 -137 -77 -103 -71 -13 -143 -72 120 284 10 86 -69 -98 17 3 122
2425 122 54 45 -29 -159 197 48 -15 -107 195 -6 -150 39 105 35 -58 -262 25 53 149 96 65 55 410 -44 -20
2450 -20 -61 69 -153 -198 72 13 43 -85 11 104 66 -15 -133 -97 101 -152 37 -192 -22 18 -90 -101 1 62
2474 62 26 73 -143 -88 -63 -17 -33 -19 51 102 -78 17 -11 -212 -77 -28 -140 5 -156 15 153 269 -35 -84 168
2499 168 143 -54 48 -75 29 -175 137 104 -147 -56 -45 39 155 192 30 13 -68 -204 -146 -119 1 0 -62 -93 133
$$ packed form
2324d5J2Q5L3o2j66qL39j62K6k7k5J2J19j51l1M7l3L1Q3Q6k0j84m4k3J44L9m8
2351B7j02J78k86K39j24Q2J5r9L1j51JK60j35J67k33Jp2P1J96j45J09j10J82k81
2375a79N7Rn0K17j71J15j28J32L8q8J80j18M5j13P7j8l1M7R1k4j94J30q0o8L9
2400h5K8p2J82j70K17p8k41J76Mr8O0k6L2N8j30P1J92J64k74P6j55k9J15j4J19
2425A22o8rp4j30L56j49o3r2L02k01j44J89O6p0r3k04K87K8R6n3l1j0L55m54K4
2450b0m1J30k22m5K70n9L0j28R6R3l8q1j18L6J98k53J89k29J70M0j08j1J02O1
2474F2l6M7k16N5K5M6j6J4P0N1j80R5k8k01J35M9j12J45j61J71J38J16l04m9K52
2499A68k5j97J02j23J04k04L12l3k51R1J1Q4J16L7j62j7q1j36N8K7J20jo2l1K26
$$ plain form
2524 133 -174 36 70 81 52 -44 -8 33 40 -120 -161 -249 -5 -47 -51 139 -26 -28 -47 178 -89 -92 83 102 -39 -128 97
2551 97 14 -26 -160 77 104 -39 -38 18 -122 -39 1 -24 -68 -182 -14 -26 -8 77 -231 -17 25 47 168 -21 1 -115
2577 -115 12 4 145 -65 46 -32 -121 -75 67 -64 -42 37 -30 -80 -100 -60 -91 -193 35 -197 -15 37 -36 -17 152
2602 152 -40 -56 -116 154 -251 -62 -17 -17 132 58 -52 -5 107 12 -62 -25 -15 174 28 41 -303 81 -78 52
2626 52 42 -10 -160 -73 -219 57 54 95 71 -151 -87 29 232 -18 -27 -48 -50 5 -181 92 77 3 -36 -75 -97 89 164
2653 164 -31 209 -128 23 -39 -174 26 -25 254 76 -46 5 -39 -15 37 5 56 32 -61 113 -15 -69 -132 -30
2677 -30 59 -7 -152 -62 -33 -140 -51 -110 -14 199 24 126 156 -89 54 -195 83 -44 167 115 3 -40 -61 -37
2701 -37 -117 -99 79 166 -175 108 5 -95 177 177 163 16 -73 -131 138 -183 43 -38 -180 -42 129 -74 -15 113
$$ packed form
2524A33l07K10L4J1k9r6L6M1Pj60m1q8K44m2mJ90j65kj9K25k67lJ75J9j41q9K25
2551I7q3m0j34K37K7j43JN6j40Q3M0k5m4j14J68j2J8Q5l08K14M2K2J21j89K2j16
2577a15J27qJ41k10J11p8q9M6J42j31K2P9o7n0k0M0l1j02K28k32J82N2p3J9J69
2602A52j92j6o0K70m05J89M5%J49p4j10M7J12r5p4L7J0J89j46J3l44L84j59J30
2626E2j0n2j50Q7j46K76lM1k4k22O4J16K03k50rk1kN5j86K73j5p4l9l9k2J86P5
2653A64j95K40l37J51o2j35K00n1K79j78j22N1m4K4N2l2N1k4r3J74j28n4o3J02
2677c0Q9o6j45R0K9j07Q9n9R6K13j75J02L0k45J43k49K78j27K11n2j12m3k1K4
2701c7q0J8J78Q7l41K83j03j00K72%j4j47q9n8K69l21K26q1j42J38J71k03N9J28
$$ plain form
2725 113 12 -22 191 -22 -88 -139 -10 180 -51 -17 35 27 102 -69 43 -180 16 70 114 -23 -84 -62 -35 -81 -154
2750 -154 -126 90 -153 -153 -38 -45 -19 96 219 -18 -36 28 106 106 7 -245 15 93 7 122 -37 30 -64 78 155 -156
2776 -156 179 -146 123 12 95 176 145 105 52 -30 -28 -126 -45 143 22 227 -97 4 -25 -61 15 69 42 17 18 48
2802 48 -2 -141 33 -252 84 115 -102 -13 -32 83 88 -81 120 -27 149 -15 -6 51 -162 67 -106 -43 -101 59
2826 59 -257 116 18 -144 53 99 77 63 108 -82 -48 -22 -13 -31 53 -186 -106 183 -13 33 70 8 -203 60 -178
2851 -178 -76 82 86 -61 -120 77 -66 -46 130 -29 131 123 -36 135 -48 -143 -27 51 79 122 -102 -154 -88 135
2875 135 34 112 -87 -148 -24 20 47 144 -27 -113 -101 -22 -273 10 86 -42 -24 21 -12 44 32 -162 -15 -133 151
2900 151 -17 143 31 -27 168 -38 51 71 69 -58 40 -36 -63 1 45 97 -114 -25 -38 -26 -127 -113 -118 87 -12 44
$$ packed form
2725A13j01l4K13k13o6n1J29J90k31L4N2qP5j71J12k23J96N4M4j37o1K2K7m6p3
2750a54K8K16k43%J15pK6J15J23k37j8O4P8%r9k52K60P8q6J15j59O7r4J42P7l11
2776a56L35l25K69j11Q3Q1l1m0n3q2Kr8Q1J88j21K05l24J01k9l6P6N4k7k5JL0
2802D8n0j39J74k85L36L1k17Q9j9J15Nj69K01j47J76j64RN7k13K29j73O3n8J60
2826E9l16L73r8j62J97M6k2j4M5j90L4K6Rj8Q4k39Q0K89j96M6L7o2k11K63k38
2851a78J02J58Mj47n9J97j43K0J76j59J60qj59J71j83r5J16P8K8M3k24n2O6K23
2875A35j01P8j99o1J24M4K7R7j71q6J2P9k51K83P6j28J8M5l3N6j2j94J47j18K84
2900A51j68J60j12n8J95k06Q9K0kj27R8p6k7O4M4N2k11Q9j3J2j01J4nK05r9N6
$$ plain form
2926 44 -70 -174 -53 -131 81 111 22 -245 -57 -145 33 -70 -141 -26 115 49 55 74 -34 -135 -39 1 35 213
2950 213 -69 110 27 199 -197 -86 9 -118 125 163 49 -89 205 63 54 -144 71 -30 -1 -197 128 74
2972 74 -112 -49 66 102 27 -10 84 -109 -106 -101 -152 5 -101 -162 206 35 -75 -98 -23 -158 -8 89 -132 68 0
2997 0 -32 -3 164 -6 111 -12 87 -183 -81 -94 -74 -141 0 0 -11 -81 -21 -135 -59 48 139 110 76 -123 14 -29
3023 -29 131 -79 -59 -33 128 -133 -29 -93 83 -10 9 7 84 -15 82 -33 39 60 17 -24 25 -5 -143 183 165 34
3049 34 -221 -44 153 113 162 -55 -90 156 -70 -144 92 -29 -239 -49 -22 -70 63 56 49 50 59 14 35 118 -172 -17
3075 -17 70 59 126 -11 -199 19 -40 -15 114 -103 57 55 -102 111 142 65 16 -19 -15 -204 -158 52 121 86 -79 -12
3101 -12 30 151 134 -113 -36 127 51 88 116 12 44 12 -141 128 -179 69 35 88 207 -149 118 -229 -162 -21
$$ packed form
2926D4j14j04J21p8K12L0q9k67J88q8J78j03p1J15J41o6OJ9j08j01R6M0L4J78
2950B13k82J79q3J72l96J11R5j27K43L8j14j38K94j42rj98K15j01K9j96L25n4
2972G4j86O3J15L6p5l7R4j93LNn1J57j06o1L68j71j10k3P5j35J50R7k21K00o8
2997@l2K9J67j70J17j23R9k70J02j3K0o7J41%j1p0O0j14P6J07R1k9l4j99J37m3
3023b9J60k10K0K6J61k61J04o4J76r3J9kP7r9R7j15P2K1m3m1M9l0j38L26j8j31
3049C4k55J77J97m0M9k17l5K46k26p4K36j21k10J90K7m8J33ppJRm5K1Q3k90J55
3075a7Q7j1O7j37j88K18n9K5J29k17J60kj57K13L1p7m9l5Mj89M6K10O9l5j65O7
3101a2M2J21j7k47P7J63p6L7K8j04L2l2j53K69l07K48l4N3J19l56K67l47O7J41
$$ plain form
3125 -21 133 119 -104 85 3 62 -163 81 -67 -65 50 -42 131 -128 56 -21 -120 187 67 39 168 -128 -103 55
3149 55 43 71 -73 24 36 120 41 -17 30 156 -83 34 -5 -87 3 -92 -99 74 -49 -21 -164 18 10 141 16 -146
3175 -146 27 -56 -2 -44 223 -32 -4 -40 -95 -154 -48 -139 87 105 -20 -121 106 -107 -38 -48 88 -43 -36 105
3199 105 151 12 -62 -18 15 -39 -112 192 -20 66 -69 -21 -19 -115 -393 12 108 -107 -78 90 109 138 50 -105 -58 -199
3225 -199 94 123 109 -14 46 -60 -15 -43 -109 256 97 -159 20 21 -9 -31 -87 150 69 2 100 -25 -30 135 57 -45
3251 -45 128 -116 189 -142 -63 -28 19 -45 -46 -288 -60 146 172 229 -147 157 27 -29 67 -92 -32 -56 48 167
3275 167 -42 50 58 23 279 48 -27 -8 52 -16 -12 -109 29 95 -46 -9 162 5 -65 -7 56 13 -73 79 -295 239
3301 239 -188 -264 21 -149 -212 -53 -132 13 56 182 -110 -35 -83 45 -41 -41 53 67 123 -116 85 -193 26 144
$$ packed form
3125b1J54j4k23J89q2N9k25K44j48KJ15r2J73k59J84p7r9L07j20k8J29k96K5J58
3149E5j2K8j44R7J2Q4p9n8M7J26k39J17l9q2R0r5pJ73j23K8j43J82qJ31j25j62
3175a46J73q3N4m2K67k55K8l6n5n9J06r1K26J8j25j01K27k13O9j0J36j31PJ41
3199A05M6j39p4M4L3n4p3L04k12Q6j35M8Kr6k78M05R6k15K9J68J9K9q8j55M7j41
3225a99K93K9j4j23O0j06M5k8o6L65j59k56J79Jl0k2n6K37q1o7R8j25nJ65p8j02
3251d5J73k44L05l31P9L5M7o4jk42K28K06K6N7l76L04j30n6R6j59O0k4J04J19
3275A67k09R2Ql5K56k31p5J9O0o8Mr7J38O6j41L7J71j57p0N8O3m3q6J52l74N34
3301B39m27p6K85j70o3J59p9J45M3J26k92P5m8J28q6%R4J4N6k39K01k78K19J18
$$ plain form
3325 144 -16 -23 82 11 -45 -11 177 71 181 137 9 -129 -76 -88 -13 85 -12 26 -149 -124 -31 40 20 3 106 108
3351 108 -14 -5 76 11 88 75 70 -157 -3 46 24 154 -60 -70 -28 90 -35 208 34 48 95 30 -29 -55 108 -68
3377 -68 -12 76 196 -61 102 -116 28 -158 121 -28 284 -317 25 63 -219 146 -9 18 -10 -12 -36 83 80 119
3401 119 -123 55 -26 78 41 -36 24 17 -54 47 -37 -114 7 -19 -58 98 -279 -1 -87 -65 44 42 -95 -129 -51 13
3427 13 67 -80 12 108 53 11 130 141 29 15 90 160 -179 72 31 71 126 45 -40 11 76 -59 -75 -188 -87 52
3453 52 46 -217 78 5 94 52 146 13 -78 -97 44 62 74 -97 187 -103 -126 -13 26 -50 15 -129 -155 123 -165
3478 -165 -25 74 28 -21 -118 -81 30 -80 -88 24 33 91 100 11 -66 -112 29 -93 181 -22 -331 189 22 181 -3
3503 -3 81 122 232 -20 -44 -52 -126 -76 -65 89 66 85 52 -123 -65 -68 -58 -96 41 113 -76 138 26 53 104 35 4 -18
$$ packed form
3325A44j60pJ05p1n6L4J88j06J10m4j28j38N3j2P5R8r7L8j75K5R3P1k0j7J03K
3351A08j22RQ1o5P7j3nk27J54M9k2J30k14j0M2J18j25K43j74J4M7o5n9k6J63j76
3377f8N6Q8J20k57J63k18J44j86K79j49L12o01L42L8k82L65j55K7k8kk4J19lL9
3401A19k42J78q1J04l7p7O0pp1J01q4p7J21k6l9J56l77K78q6K2J09kj37l4P8O4
3427A3N4j47R2R6n5m2J19J1j12j4P5P0l39K51m1M0N5q1q5N1O5j35j6j13J01J39
3453E2ok63K95p3Q9m2R4j33r1j9J41J8J2j71K84k90k3J13L9p6O5j44k6K78k88
3478a65J40R9m6m9r7L7J11j10qJ12RN8Rq9p7m6J41j22K74k03l09N20j67J59j84
3503cQ4M1J10k52k4qp4N0J1J54k3J9l3j75N8lJ0l8J37P2j89K14j12K7N1o9l1k2
$$ plain form
3531 -18 58 115 114 -116 70 -5 166 114 -60 49 6 -154 -8 -79 -147 -71 -51 -69 -31 235 -112 -90 84 -73 66
3556 66 -177 50 -61 27 15 80 181 113 151 -133 35 15 92 45 -54 192 -267 12 114 94 -35 7 21 -48 58
3581 58 -67 156 -84 -203 -112 -47 44 163 26 108 51 -191 -15 -150 -58 86 7 -51 42 74 -27 60 45 -88
3605 -88 -76 25 -17 205 -62 38 -124 3 -111 -103 -41 38 -33 -66 3 130 -116 -3 -31 31 149 -84 -249 -34
3629 -34 -15 -62 -16 70 -46 -208 84 130 171 142 33 -27 -19 221 -13 -3 230 -106 152 -150 26 26 9 89 -54
3654 -54 4 -35 19 112 7 151 -78 37 49 66 -147 -6 22 70 101 187 -55 247 9 -21 -43 -167 233 22
3678 22 -43 6 -74 -51 -43 -59 -17 126 229 -70 208 112 44 3 60 -116 35 -72 41 106 162 -14 -76 135 -73
3703 -73 60 207 247 73 -50 -79 -32 65 279 17 52 208 -32 96 -113 15 -50 -5 142 -59 131 46 178
$$ packed form
3531a8P6N7jk30J86p5J71n2j74J09m3j60J46p1o8P6K0j8L8K66l47K2J74j57J39
3556F6k43K27j11Q8j2O5J01o8L8k84J68k0P7m7r9K46m59K79J02k0j29M2J4o9J06
3581E8j25K23k40j19R1O5R1J19j37Q2n7k42J76j35R2J44p9n8R3L2j01Q7j5j33
3605h8J2J01m2K22k67J00j62J27j14QO2P9p1l3O9J27k46J13k8O2J18k33j65K15
3629c4J9m7M6Q6j16j62K92M6M1k9j09o0QK40k34J0K33l36K58l02J76%j7Q0j43
3654e4N8l9N4R3j05J44k29J15J2J7k13J41K8M8L1Q6k42L02k38l0k2j24M00k11
3678B2o5M9q0K3Qj6M2J43J03k99K78r6o8m1N7j76J51j07J13O5N6j76o2K11k08
3703g3J33J47M0j74j23k9M7R7K14k62L5J56k40J28k09J28o5M5J47k01J90q5J32
$$ plain form
3726 178 -190 140 143 -9 227 16 -4 28 151 64 35 -27 -146 -117 -124 -42 26 129 306 59 66 -202 122 176 -27
3751 -27 -44 -180 -9 16 -97 78 41 62 27 -20 56 -52 3 -129 -7 69 -69 94 27 7 -85 38 -171 32
3775 32 -152 -22 -63 31 97 -173 -135 -26 -30 -60 34 47 -34 -102 134 75 22 132 8 -98 -48 84 -46 174 -14
3800 -14 4 190 -5 43 -76 37 -186 76 -164 26 163 -75 -28 -32 -28 -77 -32 0 -95 9 44 -105 78 -104
3824 -104 30 -92 -147 109 -66 37 75 25 -44 63 130 -51 -37 -23 -140 -9 49 25 60 48 66 18 -48 -41 47 -86
3850 -86 -20 7 2 9 30 -45 180 71 56 54 75 -76 -80 116 14 -108 50 50 84 140 7 -45 57 74 320 -108 -110 88
3878 88 29 -16 15 223 29 -28 -125 186 41 8 7 34 191 -17 -115 -36 -23 -93 48 31 -67 106 99 -121 4 40
3904 40 0 42 -58 120 43 -300 -134 14 40 35 191 79 -135 -60 -98 9 102 80 -79 -146 298 -5 33 -176
$$ packed form
3726A78l68L30Lj52K36k11k0L2J23q7k9o2j19K9pQ2O8J03J77k47Pk68L24N4k03
3751b7j7j36J71K5j13J75l7K1l5m7P6j08N5j32J22P6j38J63o7k0r2J23k09K03
3775C2j84J30m1R4O6k70L8J09ml0R4J3q1o8K36n9n3J10j24j06N0J32j30K20j88
3800a4J8J86j95M8j19J13k23K62k40J90J37k38M7mMm9M5L2r5J04L5j49J83j82
3824a04J34j22n5K56j75J03L8n0o9J07O7j81J4J4j17J31N8k4L5j2J8m8o6PQ8j33
3850h6O6K7nPK1p5K25j09j5kK1j51mJ96j02j22J58%L4N6j33n2J02J7K46m28kJ98
3878H8n9m5L1K08j94n7r7L11j45l3jK7J57k08r8P9J3p0J41j7r8J73pk20J25L6
3904D0m0M2j00J78p7l43J66J48K6nJ56j12k14P5l8J07R3k2j59o7M44l03L8k09
$$ plain form
3928 -176 -41 117 -115 -11 -2 -73 17 161 148 -87 160 75 -9 -148 -148 74 -56 83 -165 -28 14 -17 31 -47
3952 -47 -89 13 -197 -43 11 17 -9 -94 14 -75 266 44 66 139 -17 47 90 -125 -12 -80 -128 -95 57 -20 193
3977 193 112 -45 -78 -115 -84 -23 -210 119 21 22 109 -24 -10 218 -122 -109 112 47 23 97 96 -4 -18 -120 31 61
4003 61 -72 -29 -85 94 -115 -221 25 28 179 -73 198 -52 6 -51 -46 39 99 5 90 0 -137 54 195 20 27
4028 27 -7 13 239 120 -87 -13 88 -95 99 -44 -111 52 39 147 -94 -139 -162 34 67 113 145 33 174 -202
4052 -202 -77 4 -45 3 7 63 133 -13 70 111 -70 167 -190 50 39 91 -35 180 -147 22 -183 -2 110 17
4076 17 111 104 115 -96 -21 -101 69 -204 109 -54 -81 -14 40 12 146 109 -218 -33 93 33 14 -136 150 42 -54
4101 -54 15 148 124 141 83 -174 -83 105 -77 2 -148 94 -78 -200 57 31 -27 123 6 23 -2 -35 -36 22 -82
$$ packed form
3928a76J35J58k32J04Rp1R0J44j3k35K47q5q4j39%K22j30J39k48J37M2l1M8p8
3952d7m2J02k10J54N4Ok6q5J08q9L41k22K2P3j56O4M3k15J13o8m8L3J52p7K13
3977A93q1j57l3l7L1O1j87L29r8JQ7j33J4K28l40J3K21o5k4P4jj00j4j02J51L0
4003F1j33M3n6J79k09j06K46LJ51k52K71k50N8n7NQ5O0r4Q5r0j37J91J41j75P
4028B7l4K0K26j19k07P4J01j83J94j43o7J63j3J08k41m5k3J96L3M6L2j12J41l76
4052b02J25Q1m9M8MN6P0j46Q3M1j81K37l57K40j1N2j26K15l27J69k05J81J12r3
4076A7R4pJ1k11P5q0J70k73L13j63k7O7N4k8J34l7l27J85J26o0j9j50K86j08r6
4101e4O9J33k4J7n8k57R1J88j82P9j50K42j72j22K57k6n8J50j17J7k5l3jN8j04
$$ plain form
4126 -82 -54 61 21 33 138 116 -94 36 -179 -8 16 36 -94 69 -82 156 63 70 80 135 164 42 -46 151 39
4151 39 -6 173 2 48 -51 -192 -9 120 146 -72 -68 -28 18 -42 -1 114 -71 1 163 237 135 -44 88 -210
4175 -210 176 -71 -49 37 26 70 -102 300 112 -158 20 -91 -15 -98 -137 -25 -54 -86 41 7 -19 -35 120 281
4199 281 -82 -97 -145 18 89 129 -93 92 -95 205 111 29 76 78 -105 -58 -48 -68 319 157 90 49 89 -78 -95
4224 -95 -169 -243 -270 -13 77 -143 -291 -64 -55 83 -61 -43 58 92 -35 234 -10 -181 -177 -168 -38 -96 -44 -41 -94 -127
4250 -127 -56 105 -15 43 44 -164 -16 16 20 -25 54 -140 -218 37 32 -67 -52 -29 51 -35 -45 55 94 -90 21 -114
4276 -114 21 -60 26 143 -70 180 181 112 11 92 -55 101 -18 13 -175 -38 -55 107 -182 37 252 -284 176
4299 176 1 165 107 -8 -13 -46 11 33 -188 -81 -19 -94 -72 129 -33 26 190 121 43 -5 8 96 -191 -71 -88
$$ packed form
4126h2K8J15m0J2J05k2k10J30k15J71K4K0j30J63j51K38r3PJ0N5K9j22q8J97j12
4151C9m5J79j71M6r9j41J83J29K6k18MM0M6o0M1J15j85P2J62P4j02j79J32k98
4175b10L86k47K2Q6j1M4j72M02j88k70J78j11P6q3l9J12k9l2J27l4k6j6J55J61
4199B81l63j5m8J63P1M0k22J85j87L00r4q2M7Kj83M7J0k0L87j62o7m1M0j67j7
4224i5p4p4k7K57R0k20j48K27RJ38j44J8J01L4j27K69k44j71MRJ30n8N2Ln3l3
4250a27P1J61j20N8Jk08J48L2Mm5P9j94p8K55nr9J5K3Q0q6j0J00L9j84J11j35
4276a14J35q1Q6J17k13K50Jo9j01Q1j47J56j19L1j88J37j7J62k89K19K15n36M60
4299A76j75J64n8j15nl3N7K2k21J07O2p5K2K01j62N9J64o9p8m8J3Q8k87J20j7
$$ plain form
4324 -88 -132 341 0 -11 69 48 68 157 -85 -32 139 -173 -76 78 -37 212 63 -145 165 -23 -2 50 63 -37
4348 -37 -134 -188 32 40 48 231 -91 -11 -51 -4 -208 -25 98 85 155 196 86 -5 -3 -75 170 237 -182 113 -134 -91
4374 -91 30 -68 -60 -19 63 -61 -31 -84 124 106 93 -30 39 -185 -106 -112 56 -62 -101 -20 27 8 59 -50 187 -125
4400 -125 -90 23 -149 86 1 -6 -74 133 266 -131 -81 -5 24 -18 -121 -150 104 -40 205 -191 30 95 -89 -150
4424 -150 100 27 78 -91 -29 70 -64 -7 132 239 59 30 196 31 26 89 45 131 -14 -13 -151 -89 43 177 -115
4449 -115 -56 -9 -219 123 33 32 -41 81 -117 16 198 -145 -129 -63 -3 38 -11 -39 97 53 160 -52 144 -113
4473 -113 176 -25 128 -132 -89 56 -212 -2 33 -99 -178 -129 -3 -29 -169 145 -126 31 -220 -44 190 63
4495 63 131 -7 -93 85 -83 219 218 -215 73 -147 -17 -11 -123 -8 233 -35 113 -14 -37 -18 -43 -45 17 244
$$ packed form
4324h8m4M73l41j1Q0k1K0Q9k42N3J71l12R7J54j15K49j49k08L10j88K1N2J3j00
4348c7r7n4K20QQJ83l22Q0m0M7k04J83J23j3P0M1j10r1Kp2K45O7m19K95k47M3
4374i1J21r8QM1Q2j24L0n3K08j8j3j23O9k24P9oJ68j18l9Q1M7j9N1j09K37l12
4400a25L5J13j72K35q5po8K07J33l97N0P6K9m2j03k9K54j44K45l96K21O5j84o1
4424a50K50p3N1j69O2R9j34N7J39J07j80k9J66j65nO3m4Q6j45Jj38O2J32J34k92
4449a15N9M7k10L42r0jp3J22j98J33J82l43J6O6O0M1m9k8J36m4J07k12J96k57
4473a13K89k01J53k60M3J45k68K10L5j32p9M9J26k6j40L14k71J57k51J76K34j27
4495F3O8j38q6J78j68L02jm33K88k20J30Oj12J15K41k68J48j27k3J9k5kO2K27
$$ plain form
4519 244 -26 133 13 54 -54 80 -69 59 135 0 29 50 186 163 -16 120 -287 14 144 47 72 89 -92
4542 -92 37 109 -80 -74 -39 43 -30 -53 -64 -24 -104 -121 -75 116 151 -96 -172 -12 -60 -27 -90 -2 -24 72 -136 -29 -307
4569 -307 90 -16 -88 5 41 172 34 -93 202 103 -54 102 -66 112 82 -110 38 -125 -52 -27 2 -24 -28 -151
4593 -151 36 115 106 3 -20 41 -2 -117 54 57 35 -204 84 38 -71 125 -236 109 118 -55 -36 -28 47 75 127 -82
4619 -82 -33 32 38 -34 -61 -24 68 -193 52 65 72 -214 7 -14 -17 99 -246 91 14 143 95 0 18 6 -82 -179 113
4646 113 -139 -10 -65 -150 7 -56 125 1 7 -230 -82 -24 90 75 87 63 -3 -95 50 155 6 32 156 157 94
4671 94 -36 42 77 -49 109 -184 -85 -182 43 -3 -23 198 23 80 54 -6 189 15 -45 -251 53 -80 96 83
4695 83 25 243 -222 0 52 -31 -35 -16 -7 191 161 -73 47 -144 36 10 -20 170 -16 99 -38 37 109 -96 38
$$ packed form
4519B44k70J59j20M1j08J34j49J28P6j35K9K1J36k3j79J36m07L01J30r7K5J7j81
4542i2J29P2j89OL5Q2p3k3j1M0q0j7M6J91L5k47p6J60m8L3o3Q8k2R6k08J07k78
4569c07L97j06p2R3L6J31j38j27K95r9j57J56j68J78l0j92J48j63P3K5K9k6mj23
4593a51J87P9rj03k3O1m3j15J71Lk2k39K88m6j09J96l61L45Rj73J9QP5K8N2k09
4619h2M9O5Op2k7L7R2k61K45J3Pk86K21k1lJ16l45L37p7J29m8r5J8j2q8r7K92
4646A13k52J29n5q5J57o3J81j24Ok37J48N8J14j5J2k4o6r2J45J05j49K6J24Jo3
4671I4j30P8L5j26J58k93R9r7K25m6k0K21j75N7k6o0J95j74o0k06L04j33J76j3
4695H3n8K18m65K22N2q3mJ9RJ98l0k34J20j91J80k6l0J90j86J15j37P5P2k05J34
$$ plain form
4720 38 103 -64 -32 -99 52 -37 -27 28 82 162 68 237 -56 -97 78 -77 173 -154 99 -80 38 -126 -158 -60
4744 -60 -166 3 34 -89 41 -199 5 -140 -161 -53 121 -16 27 104 233 42 -128 70 9 -18 210 94
4766 94 146 173 73 -89 -200 25 41 -47 21 58 -30 -174 237 -45 -26 -32 62 -96 -90 129 -74 -71 0 -95 195 -171
4792 -171 8 -42 20 20 31 79 47 -165 92 -98 -67 -194 -5 -183 170 35 31 146 -116 43 -96 -44 -143 51
4816 51 13 0 -123 101 110 -41 173 -79 -159 -74 -157 60 -154 -43 -54 46 31 -118 -37 60 112 -121 -54 -108 118
4841 118 6 -259 -99 -51 -97 90 -19 105 130 -80 -20 -102 -153 -30 -60 66 -62 -88 -126 20 182 9 -33
4864 -33 -100 47 -50 116 157 -51 -195 -10 -101 -38 -37 -25 -78 -137 33 -25 -35 140 145 -197 -104 158 -164 15 117
4889 117 162 -94 -51 75 85 -18 49 155 102 -94 87 87 -85 -106 54 -4 207 114 -216 -183 -62 -37 134 144
$$ packed form
4720C8O5j67L2o7J51q9J0N5N4Q0r4J69k93m1J75j55K50l27K53j79J18j64l2R8
4744f0j06J69L1j23J30k40K04j45k1J08J74j37M3P7J29j91j70J98o1k7K28j16
4766I4N2K7j00j62j11K25J6q8O8L7q8j44M11k82J9oR4j58OK19k03LP1r5K90l66
4792a71J79n0O2%J1M8l2k12K57j90L1j27J89j78L53j35mJ15k62J59j39N2r9J94
4816E1l8j3j23K24Rj51K14k52q0Q5q3K17k14J11j1J00j5j49Q1R7N2k33O7n4K26
4841A18j12k65J60M8m6J87j09J24K5k10O0q2n1J23l0J26j28k6l8J46J62j73m2
4864c3o7J47r7J66M1k08j44J85r1O3JJ2n3n9J70n8j0J75Nl42R3K62l22J79J02
4889A17M5k56M3J26J0j03O7J06n3j96J81%j72k1J60n8K11r3l30L3J21K5J71J0
$$ plain form
4913 144 -51 142 104 39 -83 33 -14 -90 58 210 -30 188 83 -22 -37 53 16 -28 145 -175 -1 -15 23
4936 23 -5 -55 -86 -178 -3 24 -7 36 -28 -57 -50 -26 -33 -29 -264 176 -194 43 -35 -11 28 -100 120 -42 205 12 -34
4963 -34 5 -63 122 -101 154 99 162 152 47 73 -17 -11 -107 98 -115 -144 -12 144 102 -46 -78 70 67 -36 -163
4988 -163 -270 49 45 -49 31 -4 -152 -78 19 -96 -12 30 185 -5 -101 218 -189 134 -65 162 124 -49 62 -172
5012 -172 -29 79 183 77 -108 -12 335 153 -8 -73 156 220 198 54 59 106 -140 50 34 -80 31 128 40
5035 40 -169 -8 209 -20 134 -96 19 182 72 31 -190 41 21 -50 38 1 -36 72 68 -170 -252 -54 124
5058 124 132 104 76 -132 -24 80 -64 34 -25 103 119 114 31 17 5 143 54 60 93 -233 4 157 11 72 75 70 28
5085 28 47 152 -91 -9 52 -18 -43 -112 -96 -214 -63 -56 22 147 18 -128 175 -38 1 -132 5 12 178 -10 -49
$$ packed form
4913A44j95J93l8o5j22J16m7p6J48J52k40K18j05j05j5R0l7m4J73l20J74j4L8
4936B3k8n0l1r2J75K7l1M3o4k9PK4pMk35M40l70K37p8K4L9j28K20j62K47j93m6
4963c4L9o8J85k23K55n5O3j0j05K6r0Or6K05k13k9J32J56m2j48l2J48lj03j27
4988a63j07L19mr4Q0l5j48P4R7j15Q4M2J55j90r6L19m07L23j99K27l8j73J11k34
5012a72J43J08J04j06j85R6L47j82j61o5K29O4k2j44NM7k46J90j6j14J11R7q8
5035D0k09J61K17k29J54k30J15J63j10m1k21K31k0p1Q8l7l7J08mk38q2J98J78
5058A24Qk8k8k08J08J04j44R8n9J28J6nq3j4j2J38q9OL3l26K37J53j46O1Lnm2
5085B8J9J05k43Q2O1p0k5o9J6j18J51PP8J25j29j46L03k13L9j33J37PJ66j88l9
$$ plain form
5110 -49 194 -28 -26 -32 36 104 57 127 2 -43 -113 -23 51 -123 -13 336 -36 67 -159 -69 53 116 57 -60 61
5135 61 -40 1 28 12 5 10 -111 -3 -167 26 -33 97 -58 -20 -1 57 -71 30 56 89 -121 34 -37 4 43 -23
5161 -23 -76 -44 -214 164 35 26 143 128 18 -102 2 -26 220 92 -86 79 -37 -245 19 -35 -176 57 47
5184 47 175 -69 61 -112 -46 24 -60 -99 83 18 83 46 79 -34 -4 -60 -14 -6 -4 179 135 62 -41 50 155 -80
5210 -80 23 -57 -66 -131 132 61 -53 97 -109 99 -77 -10 -165 29 35 -79 -100 -8 17 47 -9 -147 -80 42 -3
5235 -3 -73 37 -17 -165 -31 6 -295 86 -57 69 129 25 -38 -66 145 57 25 -77 154 122 117 61 227 -85 70
5260 70 -71 -190 85 -93 -124 -79 24 -136 90 66 -25 89 -1 70 -76 -55 -107 -202 12 30 49 -138 176 21
5284 21 16 -54 28 127 -111 -132 81 -2 12 -69 73 163 -76 -100 200 -119 44 -180 -111 29 -20 44 -128 76 216
$$ packed form
5110d9K43k22KoO8O8m7P0j25m5p0R0P4j74J10L49l72J03k26R0J22O3n9j17J21
5135F1j01M1K7j6pNj21J08j64J93n9J30j55L8J9N8j28J01K6L3k10J55p1M1L9o6
5161b3n3L2j70L78j29rJ17j5j10j20J04k8K46j28j78J65j16k08K64n4j41K33j0
5184D7J28k44J30j73O6P0q4l9J82o5O5l7L3j13L0n6M6QKJ83m4p3j03R1J05k35
5210h0J03q0ro5K63p1j14J50k06K08j76O7j55J94Oj14k1R2K5L0n6j38O7J22m5
5235cp0J10n4j48J34L7l01L81j43J26O0j04o3k8K11q8l2j02K31l2nn6J66l12J55
5260G0j41j19K75j78l1M5J03j60K26k4r1J14r0P1j46K1n2r5K14J8J9j87L14j55
5284B1np0Q2R9k38k1K13q3J4q1J42R0k39k4L00l19J63k24O9J40m9O4j72K04J40
$$ plain form
5309 216 54 46 106 -86 220 276 128 -148 77 -182 -155 -19 114 77 -53 -98 -52 111 -124 4 45 -33 113
5332 113 -34 141 -22 125 -234 -62 103 138 34 135 -81 -33 37 97 -15 -15 64 4 -44 16 188 -16 -215
5355 -215 -85 200 9 -68 8 -111 35 169 -236 69 3 -21 -64 -84 -87 -58 -48 22 32 -89 123 196 30 66 -7
5380 -7 -33 24 -38 -43 191 33 2 -60 27 82 -83 -153 19 84 -43 -218 -24 83 -59 78 105 13 207 -146 1
5405 1 25 -2 -4 -12 42 -229 -63 20 26 -283 -79 -45 -167 -120 151 109 74 77 61 174 -27 119 92 128 6 84 -117
5432 -117 53 5 90 -124 256 -162 -45 -61 126 -135 -44 -8 23 2 -15 137 42 -15 -14 175 -75 -218 -28 -76
5456 -76 70 -223 44 -21 21 75 76 -57 -15 -159 -149 42 -143 28 65 60 46 -9 -33 -18 -31 63 -43 45 71 29 81
5483 81 -11 19 -125 0 34 140 -45 -73 110 -85 158 -23 89 2 -56 53 -61 6 112 -171 -17 69 -189
$$ packed form
5309B16j62qO0j92L06N6j48k76K25k59K7J36J33l7j30m5M6J63k35J28M1p8J46
5332A13j47J75j63J47l59J72J65L5j04J01k16M8P0O0j12%P9o0m8O0J72k04j99
5355b15J30K85j91p7P6j19J46J34m05L05o6k4m3k0lK9J0P0J0j21K12P3j66L6p3
5380gk6N7o2nK34j58l1o2Q7N5j65p0J72O5j27j75J94J07j42J37K7r2J94l53J47
5405AK4k7kqN4k71J66Q3Ol09K04L4j22M7K71m2l5Lj6J13k01J46k7L6j22P8k01
5432a17J70m8Q5k14L80m18J17j6J87k61R1L6L1k1j7J52r5n7JJ89k50j43J90m8
5456g6J46k93K67o5M2N4Jj33M2j44J0J91j85J71L7nj4n5k4J5j3R4j06Q8K6m2N2
5483H1r2L0j44J25L4J06j85k8J83j95K43j81J12q7n8J09j14O7J06k83J54Q6k58
$$ plain form
5506 -189 -87 -42 134 15 114 10 169 13 -87 60 -10 2 -22 -128 0 -13 -50 48 -165 -103 47 20 81 54
5530 54 -43 -77 153 -74 -53 -45 -98 60 -24 70 225 20 -117 -17 142 19 -48 95 -189 114 -41 -14 -7 108
5554 108 -206 11 -102 -80 -72 -31 53 13 86 231 -16 -60 97 -8 5 -43 -60 14 -187 -80 -20 58 -95 123 -8
5579 -8 -9 -149 35 199 2 -211 90 -73 51 -81 84 203 -86 -119 1 -47 -32 143 -290 26 -104 57
5601 57 -83 30 82 -101 -29 88 -35 227 45 -158 -92 158 85 24 -73 66 -65 -75 -39 -5 3 183 -67 -73 123
5626 123 -65 -130 -105 96 -101 52 -98 19 90 60 24 72 -43 60 -49 -145 2 92 79 -200 -66 -195 -39
5649 -39 -188 -21 -145 -14 21 -168 -195 125 -36 91 -70 8 22 -4 -213 -60 -43 43 -5 -170 54 80 107 45
5673 45 -54 -20 -58 -10 135 -197 176 -15 -34 -33 69 43 -2 -41 28 149 98 -35 7 -83 -135 56 -101 -39 -10 -19 138
$$ packed form
5506a89J02M5J76j19R9j04J59j56j00J47p0J2k4j06J28j3l7R8k13O2J50k7O1k7
5530E4r7l4K30k27K1Qn3J58q4R4J55k05j37J00J59j23o7J43k84L03j55K7PJ15
5554A08l14K17j13K2QM1Q4m0P3J45k47m4J57j05J3m8j7P4k01J07O0P8j53K18j31
5579hjj40J84J64j97k13L01j63J24j32J65J19k89l3J20m8J5J75m33L16j30J61
5601E7j40J13N2j83P2J17j23K62j82k03O6K50p3o1r7J39j31j0L6L4QJ80k50oJ96
5626A23j88o5K5K01j97J53j50J17P1l0l6M8j15J03j09r6J47R0j3k79J34j29J56
5649c9j49J67j24J31L5j89k7L20j61J27j61P8J4k6k09J53J7Q6m8j65K24K6K7o2
5673D5r9L4l8M8J45l32L73j91j9JJ02k6m5l9O9J21n1j33M2r0n2J91j57O2K9rJ57
$$ plain form
5700 138 -3 139 -65 144 -25 -84 -100 31 -115 -141 104 -4 28 25 -54 89 -11 -84 -25 27 -32 -40 117 -35
5724 -35 -108 32 21 25 -19 -205 1 -17 -94 -32 93 -99 -114 47 -10 131 25 141 113 -49 108 7 -43 52 45
5749 45 -64 19 -88 19 97 59 -56 19 -64 152 -68 166 9 -84 65 10 6 -99 -14 -189 -77 -61 39 -84
5773 -84 -39 -106 -137 17 6 -39 35 -95 103 95 29 -11 29 6 158 -81 -37 88 67 174 128 -148 176 -151 -13
5798 -13 -106 286 -239 -81 127 -50 124 -141 12 -1 50 -211 -135 -95 58 12 -34 -101 71 30 -60 146 -15 -9
5822 -9 -34 135 89 -28 -1 -31 65 -165 -52 -72 -65 -186 214 -21 58 -126 94 7 119 -32 284 33 62 -39
5846 -39 97 57 -239 35 29 3 96 -53 -137 265 77 165 34 -133 181 -25 -28 53 -58 -34 214 -32 -141 -7
5870 -7 119 -34 -17 -75 71 -94 157 16 -172 -13 -53 44 -65 -74 -132 -21 -251 125 -82 -55 -25 17 2 85 -5
$$ packed form
5700A38j41J42k04K09j69n9j6J31j46k6K45j08L2lp9J43j00p3N9N2n9qJ57j52
5724c5p3J40j1Mm4j86K06j8p7O2J25j92j5J61n7J41j06J16k8j62J57j01n0R5p
5749D5j09Q3j07J07P8l8j15P5q3K16k20K34j57r3J49n5mj05Q5j75J12J6J00j23
5773h4M5o7l1J54j1m5P4j30J98qo6m0M0k3J52k39M4J25k1J07m6k76L24l27J38
5798a3r3L92n25J58K08j77J74k65J53j3N1k61P6M0J53m6m6o7J72m1r0K06j61O
5822ik5J69m6j17K7l0R6k30J13k0Pj21M00k35P9j84K20q7J12j51L16k51K9j01
5846c9J36m0k96K74ok6R3j49q4M02j88Q8j31j67L14k06lQ1j11K4K48k46j09J34
5870gJ26j53J7n8J46j65K51j41j88J59m0R7j09rn8J11k30L76k07K7L0M2j5Q3r0
$$ plain form
5895 -5 15 -65 -174 -67 -151 -72 113 46 -112 -50 -6 130 -66 -122 -49 70 -93 -152 -91 2 8 -31 -21 -24 96 -53 -2
5922 -2 -9 -37 -30 72 109 -86 83 52 68 -51 73 50 85 -158 -146 -26 -15 156 64 -89 -86 -67 60 117 -59 69
5948 69 119 -11 8 -68 167 -110 17 56 -157 -39 12 9 192 14 -81 190 119 43 6 -89 142 -4 131 -61
5972 -61 41 -23 -124 10 -51 -133 107 44 30 -24 -47 -19 -5 120 91 79 73 276 142 -107 -175 -143 160 -85 96
5997 96 -12 -142 -68 -109 25 -12 128 57 -17 0 -86 -55 181 136 209 -96 13 105 92 -174 -199 130 -205 -44 -174
6022 -174 -4 138 221 -57 -9 24 -311 81 6 -68 130 138 85 32 36 -149 215 -51 -40 -183 -56 -133 -64 -29 -171
6047 -171 -62 -210 26 -16 35 -73 29 -200 -36 -104 66 -58 29 99 85 74 44 65 160 -1 65 -89 50 -178
6071 -178 5 155 59 -23 3 144 -100 -10 108 2 86 97 -60 -184 -37 -15 -77 21 -2 9 64 26 36 -37 25
$$ packed form
5895eK0q0j09J07q4P9J85o7j58O2M4J36j96n6P3J19j63n9O1R3Ol9J0lJ20j49N1
5922bpk8PJ02L7j95J69l1J6j19J24k3L5k43J2J20J1J71r2j53LJ9J27N7j76J28
5948F9N0j30J9p6K35k77J27L9k13J18N1lJ83j78r5K71p1p6l7r5K31j46J35j92
5972f1J02o4j01J34o1q2K40o3j4n4k3K8J4J25k9j2oK03j34k49o8L2L03k45J81
5997I6j08j30P4m1J34l7J40p1p4J7q6L1K36m5P3l05J09R2j3k66k5L29l35J61j30
6022a74J70J42Q3k78M8L3l35L92p5p4J98Qn3n3Mj85L64k66J1j43J27p7O9L5j42
6047a71J09j48K36m2N1j08J02k29J64o8J70j24Q7P0j4j1l0K1R5j61O6j54J39k28
6071a78J83J50r6q2K6J41k44R0J18j06Q4J1j57j24J47K2o2R8k3J1N5l8J0p3O2
$$ plain form
6096 25 174 208 -82 26 42 214 12 1 -79 36 96 175 -102 90 42 121 -46 4 109 126 151 104 -100 -9 -30
6121 -30 -69 -147 -138 31 78 -15 -140 170 -65 152 43 115 -43 -207 2 219 27 -39 -35 1 -40 75 -82 69
6145 69 20 -45 -11 -62 88 132 31 -49 110 -184 -44 -217 -4 39 79 -63 -23 -10 -138 73 -42 -70 -48 -49 80
6170 80 -42 45 -128 10 -81 -3 39 46 33 133 84 127 -118 -10 -62 111 -69 -190 111 98 -71 -100 -59 18 -5
6195 -5 40 -35 -117 15 7 67 -39 -167 -11 149 26 105 127 -60 -118 46 20 55 -45 76 23 -13 69 170 -24
6220 -24 -37 -109 -35 -116 -33 -136 -71 -102 -80 48 -17 -92 44 8 87 58 -118 -22 -75 -204 -31 38 230 4 15 14 145
6247 145 25 -28 -112 -67 30 -122 63 70 31 -126 -13 -110 -186 51 -100 -74 -38 -3 -143 -54 -80 131 212 -149 74
6272 74 -6 66 18 -15 -57 28 -85 -71 -47 27 -134 -162 97 -50 27 -137 -90 34 -6 87 86 -91 75 -50 71 -8
$$ packed form
6096B5J49L4k90J08J6J72k02j1q0J15O0P9k77J92m8P9j67N0J05J7K5m7k04R1k1
6121c0l9p8RJ69M7r3j25L10k35K17j09P2j58j64K09K17j92o6ML6m1J15j57J51
6145F9m9o5L4n1J50M4j01q0J59k94J40j73K13M3M0j42M0J3j28K11j15k8K2jJ29
6170H0j22Q7j73J38r1P8M2Pj3J00m9M3k45J08n2J73j80j21L01j3j69k9M1P7k3
6195eM5p5q2J32qO0j06j28J56J60j23P9K2j87n8J64k6L5j00J21n3l6Q2J01j94
6220b4j3p2P4q1Q3j03O5l1K2J28o5p5J36l6P9k9j76R6n3j29J73O9J92k26J1jJ31
6247A45j20n3q4M5R7j52J85Pl9j57J13r7p6K37j51K6L6L5j40Q9k6K11Q1l61K23
6272G4q0P2m8l3m2Q5j13J4K4P4j61k8K59j47P7j64M7J24m0R3jj77J66j25J21p9
$$ plain form
6298 -8 30 164 -175 -151 39 39 -67 31 -4 -7 -64 -30 -6 0 52 -15 -45 94 117 134 -10 -119 -150 -221 216 41 -165
6325 -165 8 79 -116 -67 -4 93 116 74 -124 29 -28 60 3 65 -28 153 -267 -30 -88 47 -13 79 -74 -54 -37
6350 -37 -165 -17 -32 32 234 169 78 -90 -17 115 11 188 -50 137 -96 -40 -108 -45 -74 -19 -42 -18 166 54
6374 54 43 258 -31 24 116 -25 -188 -75 -95 -52 -181 -168 82 54 148 -112 133 -84 10 -151 -127 -166 27 60
6398 60 33 -30 70 39 99 48 63 6 12 100 165 -153 36 10 37 -2 190 126 -33 -64 -202 -142 84 -82 -45 42 -233
6425 -233 -28 180 -68 37 52 8 42 113 -60 -175 -13 -27 0 119 -116 99 186 -7 197 -214 28 76 48
6448 48 203 -7 186 -154 -47 -128 -209 67 -72 58 2 80 40 75 5 34 194 0 -15 112 -101 -55 121 87
6472 87 -72 40 108 -35 -168 -154 -76 52 -102 45 -57 -74 34 27 122 106 150 56 -76 45 14 -58 79 44 -153
$$ packed form
6298hL8J34l39K4J90%j06R8l5ln7L4K4ON2o7l0J39K3J7j44j09l1p1M37j75k06
6325a65J73P1j95M9O3R7K3m2j98J53n7Q8n7O2r3J81m20K37n8J35o0R2j53K0J7
6350c7j28J48j5O4K02o5r1j68P3J32j04J77k38J87k33N6o8O3k9N5k3K4J84j12
6374E4j1K15k89N5R2j41j63J13k0M3j29J3K50k8R4k60K45k17R4j61K4l9J93L3
6398F0k7o3J00l1O0n1J5n7OQ8O5l18J89k6K7l9J92o4j59l1j38O0K26j66L7Q7k75
6425b33K05K08k48J05J5m4L4P1j73j15J62j4K7J19k35K15Q7j93K04m11K42M8k8
6448D8J55k10J93l40J07q1q1K76j39J30n6P8m0L5p0K9J60j94j5J27k13M6J76l4
6472H7j59J12O8j43j33J4P8J28j54J47j02j7J08pR5j6M4r4j32J21l1p2J37l5j97
$$ plain form
6497 -153 9 12 -1 -138 61 5 -45 38 97 4 12 -21 -30 -20 164 -81 -66 -36 -137 -120 69 17 -11 131 25 42 -142
6524 -142 18 -7 69 105 49 -46 98 80 -97 46 105 -247 -1 59 -158 4 -24 -40 63 -88 -11 24 -79 -150
6548 -150 30 -49 67 3 18 -32 19 -20 96 -8 -1 100 78 -143 29 -59 -168 -1 23 1 -76 -49 69 -61 -23
6573 -23 63 60 -88 -29 -70 1 -229 68 11 -12 -33 -177 166 -77 -176 -107 -242 -37 -63 -75 -79 85 -70 -21 -22 -122
6599 -122 -33 -30 -144 176 -76 54 -138 -212 2 14 212 -20 0 -75 -41 10 67 -27 89 -53 105 -12 -204 -40
6623 -40 102 -87 -66 -99 -81 7 -26 -112 -70 -53 112 3 -14 -16 93 65 193 -12 -110 37 117 -15 -33 60 -67 42
6649 42 123 30 70 23 -117 -27 -43 -166 -11 182 -58 -8 86 -132 -158 -29 -70 92 40 92 -28 189 -49 -104 -105
6674 -105 2 -162 -48 89 -56 -104 80 100 -69 47 172 -43 -62 43 -3 79 -121 -95 45 -41 68 -124
$$ packed form
6497a53J62Lj3j37J99n6n0Q3N9r3Ql3rJ0J84k45J5L0j01J7J89n2k8J42j06J7j84
6524a42J60k5P6L6n6r5J44j8j77J43N9l52K46O0k17J62k8j6J03j51P7L5j03p1
6548a50J80p9J16o4J5n0N1l9J16j04PJ01k2k21J72q8j09J67K4k2p7K7J18j30L8
6573b3Q6lj48N9m1P1k30K97n7k3k1j44L43k43r9O9j35K05k6j2mJ64j55M9jj00
6599a22Q9Lj14L20k52J30j92p4K14J2J98k32K0p5L4N1N7r4J16j42J58j17j92J64
6623d0J42j89K1l3J8Q8l3q6M2J7J65j09j7kJ09k8J28k05r8J47Q0j32j8R3j27J09
6649D2Q1r3M0m7j40R0j6j23J55J93k40N0R4k18k6J29m1J62n2N2j20K17k38n5j
6674a05J07j64J14J37j45m8J84K0j69J16J25k15j9J05m6Q2k00K6J40q6J09j92
$$ plain form
6696 -124 143 48 61 -53 52 -31 31 160 -51 62 96 15 2 87 7 -166 88 28 -158 -76 -35 9 145 83 112
6721 112 85 -115 0 -122 -17 47 -143 -81 -25 92 -46 85 -139 -187 175 29 42 -79 5 -87 35 73 0
6744 0 121 -53 42 -11 -147 41 72 -42 -75 -124 -255 -223 -218 -114 184 20 -39 163 -20 32 -114 -28 -150 -85 -146
6769 -146 111 -18 142 -34 30 39 -122 -27 12 -57 95 -25 188 -94 -60 101 -23 108 -48 64 107 -115 65
6792 65 41 -102 -46 78 76 204 3 -84 165 70 117 -63 -84 -55 177 5 46 -22 -192 -9 -33 -99 4 136 -11
6817 -11 -115 165 -12 94 -112 153 -97 291 62 -35 -13 31 17 -21 -236 -154 -114 -205 -16 61 232 49 -128
6840 -128 -73 59 104 -73 12 33 91 32 -96 99 -44 -78 -96 -225 66 157 -40 65 120 -16 97 95 7 -33 33
6865 33 48 73 176 -236 30 -132 124 238 -97 -125 84 201 -50 14 10 -120 -136 -103 12 222 19 52 -10 -39
$$ packed form
6696a24K67r5J3j14J05q3O2J29k11J13L4q1j3Q5q0j73K54o0j86Q2M1M4J36o2K9
6721A12k7k00J15j22J05O4j90O2N6J17j38J31k24m8L62j46J3j21Q4r2J22L8p3
6744@J21j74R5n3j36J88L1j14l3m9j31L2NJ04K98j64n9K02j83N2j46Q6j22O5o1
6769a46K57j29J60j76O4Rj61R5L9o9J52j20K13k82L4J61j24J31j56J12M3k22J80
6792F5k4j43N6J24kJ28k01q7K49r5M7j80k1K9K32j72M1o8j70J83k4o6J03J32j47
6817a1j04K80j77J06k06K65k50L88k29r7K2M4j4l8k15Q2M0r1J89P7J71j83j77
6840a28N5J32M5j77Q5K1N8n9j28J95j43l4j8j29K91R1j97J05N5j36J13kq8m0O6
6865C3J5K5J03m12K66j62K56J14l35k8K09J17k51O4mj30j6L3J15K10k03L3o2k9
$$ plain form
6889 -39 40 -130 -38 -145 -170 187 -42 51 -57 143 -41 -3 185 -44 24 -127 16 -125 -84 192 -90 -17 -116
6912 -116 34 1 5 -199 143 66 8 77 154 44 210 200 -110 -53 212 19 -37 77 -126 -91 183 118 -17 154
6936 154 74 -86 143 47 39 -2 172 85 157 15 91 -50 36 -185 -124 61 -72 59 88 121 0 107 -185 2
6960 2 32 -10 -23 66 49 -20 -38 33 -95 -73 -4 -119 111 -9 69 -65 -50 139 49 141 -47 4 64 -164 133 -79
6986 -79 102 120 -54 17 173 92 -20 -32 -110 -66 178 -15 109 -43 -17 -240 103 -163 26 -85 112 81 33
7009 33 -126 -161 -86 68 100 -4 205 3 134 156 -36 13 91 135 -73 -68 -10 103 -73 51 74 25 -14 -14 -23 -92
7035 -92 -63 15 4 62 79 -133 54 -157 78 57 141 -46 32 65 63 30 75 17 -70 88 -36 -131 181 18 -7 51
7061 51 76 77 -17 -68 70 -4 13 65 -53 -47 131 93 165 -62 131 -47 -117 -53 -147 69 -78 -112 -156 -131 74 128 -169
$$ packed form
6889c9P9j70R2j07k5L57k29R3j08K00j84L8J88k29O8j51J43j41M1K76k82P3r9
6912a16J50l3Mk04L42p7n8O9P7j10J66j0l10N7K65j93n6J14k03L5K74o5j35J71
6936A54q0j60K29r6qm1J74q7P2j42P6j41Q6k21O1J85j33J31K9L3j21J07k92J87
6960BL0m2j3Q9j7o9j8P1j28K2O9j15K30j20P8j34J5J89r0R2j88N1O0k28K97k12
6986g9J81J8j74P1J56q1j12j2p8M4K44j93J24j52K6k23L43k66J89j11J97l1m8
7009C3j59l5P5J54L2j04K09k02J31K2j92M9P8M4k08NN8J13j76J24K3m9l9%ro9
7035i2K9P8j1N8J7k12J87k11K35k1Q4j87P8L3kl3M5n8q7J58j24r5L12j63k5N8
7061E1K5Jr4n1J38p4J7N2j18OJ78l8P2k27J93j78p0O4r4K16j47l4m4K5K05N4k97
$$ plain form
7088 -169 -99 -71 138 130 115 27 34 196 156 -60 -38 -17 102 -107 200 99 -19 251 -10 -51 -52 -75 64 -87 159
7113 159 -66 11 39 104 -203 79 -97 62 -128 -144 -135 -151 127 -287 30 98 -56 -106 -92 11 -42 101 -69 157
7137 157 68 177 8 -107 -112 50 128 -145 105 27 -26 28 83 -36 -57 -101 68 -10 12 -10 14 19 17 -130 135 182
7163 182 -146 -23 -36 -141 69 -52 68 41 62 167 -228 17 -193 -87 -163 -12 -99 -9 -9 -155 63 155 38
7186 38 -97 51 48 -20 26 7 -3 101 6 -137 5 -77 28 24 84 -135 131 -15 -33 -185 9 -22 -114 -83 -94 94
7212 94 -101 -50 248 -58 -19 -60 75 -351 97 -60 -54 -40 79 -74 -102 221 14 11 177 99 -146 -197 -14 -86
7236 -86 165 -65 17 37 41 163 233 -84 -38 -97 71 -150 95 -28 109 48 -22 44 -27 -148 -83 -30 121 123 -54
7261 -54 -39 54 71 -77 -60 -283 -38 -102 83 15 -10 -50 -171 -146 7 -82 -160 -34 -123 -46 23 91 165 -20 -126 -116
$$ packed form
7088a69P0K8K09qj5q8PJ62m0k16K2K1J19k09L07j01j18K70k61m1jk3J39j51K46
7113A59k25P7K8O5l07K82j76J59j90j6Rj6K78m14L17O8j54n0J4J03n3J43j70K26
7137A57q9J09j69j15nJ62P8k73K50p8n3N4N5j19k1m4J69p8K2k2K4Nkj47K65M7
7163A82l28J23j3j05K10j21J20k7K1J05l95K45k10J06p6J51q7R0%j46K18R2j17
7186C8j35J48lo8M6j9j0J04r5j43J42q2J05mO0k19K66j46j8j52J94l1r2L1j1J88
7212I4j95N1K98l06L9m1J35m26M48j57OJ4J19j53k8L23k07lJ66p8k45n1J83p2
7236h6K51k30Q2K0MJ22P0l17M6n9J68k21K45j23J37o1p0O6p1j21O5N3J51Kj77
7261e4J5R3J7j48J7k23K45o4J85o8k5m0j21K5J53q9p8J26q9P7O9O8P4j85j06J0
$$ plain form
7287 -116 107 73 38 -130 -171 179 -61 57 -1 -35 -71 5 2 -42 122 7 -126 138 -65 76 -63 -99 -44 -21
7311 -21 -9 -14 -40 -81 8 142 147 82 -21 -136 -29 97 -52 20 31 -260 -50 -68 50 147 -44 -34 118 -72 69
7336 69 25 -65 -60 229 6 117 -74 54 -136 -46 -56 6 99 -17 7 104 135 -36 -39 111 -156 -39 -118 134 62
7361 62 98 42 73 119 -10 4 -20 -29 1 -18 -106 105 -20 57 -105 -64 -43 -159 -30 -92 -15 100 -27 172 81 17
7387 17 -78 120 154 -37 -202 6 82 -8 -65 -95 -5 80 -161 -91 -106 71 -23 -31 139 -102 -11 -253 -165 -71 112 29
7413 29 27 33 189 159 -140 16 -79 50 134 16 93 328 -67 6 -5 -78 11 -150 92 83 88 -243 -107 -57 30 -34 -134
7440 -134 63 131 51 -139 -80 126 176 118 68 61 142 107 -24 -20 106 119 120 -244 -15 -32 19 -89 -19 2 -99 -8 -36
7467 -36 -2 13 -23 0 139 205 24 -80 66 -53 193 74 -37 -5 -115 -2 1 -164 -83 30 -163 227 20
$$ packed form
7287a16K23l4l5j68m1L50k40J18n8l4l6P6lm4J64j15j33K64k03J41j39l6N5K3
7311b1J2nk6m1Q9J34No5j03j15J07J26j49P2J1k91K10j8J18R7j91J0J52j90J41
7336F9m4r0NK89k23J11j91J28j90R0j0O2R3j16K4R7L1j71lJ50k67J17p9K52p2
7361F2L6n6L1M6j29J4k4rL0j9q8K11j25P7j62M1K1j16J29o2P7J15j27J99r1o4
7387A7r5J98L4j91j65K08P6r0n7l0R0Q5k41P0j5J77r4qJ70k41R1k42Q8R4J83q3
7413B9kOJ56l0k99J56r5J29Q4j18P7K35l95P3j1p3Q9j61K42rNl31J36N0Q7o4j00
7440a34J97O8q0j90N9K06N0n8n0pQ1l5j31MJ26J3Jl64K29j7N1j08P0K1j01R1k8
7467c6L4J5l6K3J39O6j81j04J46j19K46j19j11L2j10J13Lj65Q1J13j93L90k07
$$ plain form
7490 20 -7 77 108 -68 -142 54 160 21 -171 2 36 146 -31 2 4 75 -76 47 -257 -227 -91 -235 -64 66
7514 66 -15 -40 64 -34 51 44 -54 -30 -273 -11 -14 -43 -26 -18 41 67 26 -154 -25 202 122 160 138 8 -12 44 -83 162
7542 162 -213 173 24 146 73 -182 70 -187 119 69 -17 96 -96 168 -49 -96 -61 -62 56 97 -127 -15 264
7565 264 47 -113 84 -175 134 142 -55 181 -72 25 -90 -130 -92 111 -35 -81 62 142 -195 -38 130 72 -18
7588 -18 60 283 -53 67 51 -142 -72 11 45 108 150 89 1 -2 117 -25 40 34 43 115 -167 -181 -25 -35 -131 -103 -47 159
7616 159 29 20 37 34 23 -11 185 65 107 -17 -48 -13 22 -261 48 14 -89 -138 18 12 41 73 -129 8 -91 -114
7642 -114 123 22 116 166 -67 15 -19 -19 119 252 22 -15 -58 -64 -94 135 -17 78 120 -48 85 10 89 -120 94
7667 94 153 90 93 76 -103 -69 87 -30 45 -52 -77 193 116 29 -5 89 63 151 178 60 -26 41 73 97 187 64 70 -40
$$ packed form
7490B0k7Q4L1j76p4J96J06j39j92J73L4J10j77L3KP1j51J23l04L0J36j44J71J30
7514F6q1k5J04r8Q5pr8K4k43K62lk9J7QN9K6m1j80J29K27q0L8k2j30k0N6j27K45
7542A62l75L86j49J22p3k55K52k57L06n0q6J13j92K64k17m7L5jJ18M1k24J12K79
7565B64k17j60J97k59L09Qj97K36k53R7j15m0L8K03j46m6J43Q0l37J57J68n8r0
7588a8P8K23l36J20j6j93P0Q3L4O3M2o1q8lJ19j42O5oRP2k82j4J56j0r6K8N6K06
7616A59j30rJ7lj1l4J96j20M2j24l1L5L5k83L09l4j03m9J56oK9L2k02J37r9k3
7642a14K37j01R4N0k33Q2l4%J38J33k30l7m3ol0K29j52R5M2j68J33p5P9k09K14
7667I4N9o3Lj7j79L4J56j17P5r7k5K70p7q7l4R4k6Q8K7j18q6O7L2K4R0j23Oj10
$$ plain form
7695 -40 -148 -1 49 -121 38 119 -137 -117 -72 -131 52 85 -31 18 119 142 -76 94 28 131 45 25 217 103
7719 103 -5 -39 53 44 -177 16 47 104 182 77 256 -31 -289 -132 -158 -40 -77 68 -87 -23 21 139 59 223
7743 223 -126 14 57 43 4 -31 -189 -92 29 7 -160 -11 -42 -29 -93 -93 -72 -93 81 47 -9 34 143 111 56 78
7769 78 -41 89 -73 -39 74 -168 -58 84 116 35 -62 117 -78 57 2 -27 -45 9 124 -146 24 -185 -82
7792 -82 3 139 -104 -18 -50 171 -8 -104 -186 -48 115 8 -164 209 133 151 -185 43 77 -71 89 89 160 85
7816 85 86 77 29 -48 87 48 -184 -21 38 -74 -6 52 37 34 -63 -14 -143 -20 37 -18 -19 -19 -57 -87 -27 14 32 -262 160
7845 160 42 72 28 -34 -136 -18 123 189 -50 -75 -16 94 152 35 -73 127 -269 57 80 -80 -33 41 120 -159
7869 -159 70 161 140 127 171 -16 221 153 5 -3 -157 35 -126 -101 49 -82 48 5 -81 92 -62 19 -106 -76
$$ packed form
7695d0j08J47N0j70J59Q1k56K0M5n9J83L3j16M9J01K3k18J70o6J03q6k0J92j14
7719A03j08l4R2rk21J93L1N7P8j05J79k87k58J57k6J18l7J45j55O4M4J18q0J64
7743B23l49J40M3j4l9l5j58R7J21k2j67J49l1J3o4%K1k1J74l4n6M3J09l2n5K2
7769G8j19J30j62L4J13k42J10J42L2q1r7J79j95J35n5k9j8N4J15k70J70k09J03
7792h2Q5J36k43Q6l2K21j79r6q2J38J63j07j72L73p6J8l36K28L4j48J60%P1p5
7816H5Jrm8p7J35l9k32J63N9j12O8N8j5lr7M9j29J23N7n5j%l8l0O0M1J8k94M22
7845A60j18L0m4o2j02J18J41O6k39k5N9J10N8j17j08K00l96L26K3j60M7P4P9k79
7869a59K29R1k1j3M4j87K37o8j48qj54J92j61K5J50j31J30m3q6J73j54Q1j25L0
$$ plain form
7893 -76 -104 112 36 -70 -5 -46 10 -62 129 -71 101 -41 45 57 253 -54 -146 65 -66 -95 183 10 -7 46
7917 46 111 -7 -91 -46 152 180 83 100 36 -11 22 -290 -115 -218 -60 1 -76 -134 -86 123 -66 30 -45 56 -86
7942 -86 120 -73 -18 -31 135 -49 217 128 -95 4 -28 83 -209 -17 -44 -43 51 6 29 136 -80 64 -91 -84 23
7967 23 -65 28 179 110 -31 30 22 -321 -80 -1 32 -121 -120 -42 -11 -136 133 57 30 -100 139 39 16 60 32 61
7993 61 163 -56 49 -4 -52 -45 48 -148 -14 49 -5 57 -107 -143 78 30 49 -2 -3 -64 18 -27 -16 -74 -280 5 -111
8020 -111 133 -81 36 -154 6 95 77 -26 8 7 -82 32 194 -141 -161 42 -3 -3 20 -78 76 17 2 82 206
8045 206 -25 62 2 146 244 -51 -12 -12 142 -4 -13 -198 75 -49 -14 102 -94 -72 -152 -21 95 -118 -117 87
8069 87 -65 -62 -36 -11 -160 102 30 -8 72 147 164 13 -28 -256 -137 133 -49 -40 5 -43 71 51 -95 -109 -3 31
$$ packed form
7893g6k8K16p6j06O5m1N6p2J91k00J72j42Q6J2J96l07r2K11j31k9K78j73j7N3
7917D6O5j18q4M5J98K8r7J7o4m7L3l12J75j03J58O1p7n8M8K09j89R6p5J01j42
7942h6K06j93N5j3J66j84K66q9k23R9l2J11k92J92k7JR4m5K3J07k16J44j55PJ07
7967B3q8R3J51o9j41O1ql43K41P9L3j53JP8L1j25K69p6k7j30K39j00k3M4k8K9
7993F1J02k19J05n3m8PR3j96J34O3n4O2j64l6K21m8J9n1jo1Q2m5J1n8k06K85j16
8020a11K44k14J17j90J60Q9j8j03L4jq9J14J62l35k0K03m5%K3r8J54n9j5Q0J24
8045B06k31Q7o0J44R8k95L9%J54j46rj85K73j24L5J16j96K2q0J31J16k13JK04
8069H7j52LK6K5j49K62p2l8Q0P5J7j51m1k28J19K70j82RM5m8J14k0j46j4J06L4
$$ plain form
8095 31 -5 172 -105 -54 -55 79 -53 66 -22 46 55 68 83 -16 -9 -82 -25 -139 -57 25 12 -12 67 138 135 94 121 165 -62
8124 -62 -78 13 38 -4 -143 196 -32 120 -8 -1 54 8 82 -58 165 -40 -87 -35 36 121 56 -88 40 -145 106
8149 106 59 74 -95 -186 -149 80 64 -78 81 60 16 1 -49 155 -155 -143 67 42 44 -41 10 17 -57 41 170 294
8175 294 43 54 -135 87 -33 -32 -20 59 101 -86 -69 -9 130 237 41 -92
$$ packed form
8095C1l6J77k77N1jJ34j32J19q8O8RJ3J5r9Pp3N7j14Q2Q2j3k4P9P1lm1K7M4k27
8124f2j6R1K5m2j39L39k28J52j28PN5m6P4j40K23k05m7N2P1Q5o5j44J28j85K51
8149A06m7J5j69r1L7K29j6j42J59k1m4j5n0K04l10J2K10k5Kq5N1Pp4R8J29J24
8175B94k51J1j89K22j20JJ2P9M2j87J7O0J39J07j96j33
8191i2
$$ Imaginary data points
##PAGE= N=2
##DATA TABLE= (X++(I..I)), XYDATA
$$ plain form
0 0 0 0 0 0 0 0 0 0 0 0 0 0 -8 8 -8 8 -8 9 -16 16 -16 24 -24 25 -32 37 -41 48 -56 60 -67 75 -87 97 -105
35 -105 120 -132 146 -163 180 -200 222 -246 271 -301 334 -371 415 -464 521 -587 671 -770 901
54 901 -1071 1309 -1663 2246 -3388 6454 -32233 -92157 -25031 44259 45653 -13143 -40028 -19213
68 -19213 7972 152 -11676 -2690 11582 -2678 -25323 -20854 10186 23121 2724 -21825 -15724
81 -15724 6791 13175 427 -4960 2253 5160 -3646 -7208 4591 15902 6704 -12024 -13810 5828
95 5828 18857 6667 -12782 -13110 3709 13334 2710 -10845 -8045 4553 6655 -2930 -7738 -2093
109 -2093 4383 2473 -2824 -2486 1392 1468 110 3042 5843 635 -5328 453 12484 11950 -3068 -10913
125 -10913 3351 20754 12641 -11122 -14260 10276 23971 5130 -18378 -11100 15316 19803 -5538
$$ packed form
0@%%%%%%%%%%%%qJ6j6J6j6J7k5L2l2M0m8M9n7O9p8Q9j04J16j27J42j62J84k02
35a05K25k52K78l09L43l80M22m68N17n72O35p05P86q79R85j108J258j441J671
54I01j972K380k972L909n634R842l8687n9924O7126O9290J394n8796k6885K0815
68a9213K7185p820j1828Q986J4272j4260k2645M469L1040J2935k0397k4549O101
81a5724K2515O384j2748n387P213K907q806l562J1799J1311r198j8728j786J9638
95E828J3029j2190j9449l28J6819R625j0624j3555K800J2598K102r585m808N645
109b093O476j910n297L38L878P6j358K932K801n208n963N781J2031n34j5018p845
125a0913J4264J7403q113k3763l138K4536J3695j8841k3508P278K6416M487k5341
$$ plain form
138 -5538 -21296 -3887 17427 8806 -14506 -16472 3746 12893 -2630 -16858 -7218 8911 4457
151 4457 -11775 -11959 3938 9143 -4499 -14577 -3401 11646 6568 -11212 -12662 5371 15042
164 15042 1590 -14374 -8486 10544 14517 -2440 -15258 -4511 13016 10940 -6779 -14050 -1553
177 -1553 12155 6939 -9093 -12256 949 9892 2100 -9197 -8003 2350 5930 -622 -5935 -3095
191 -3095 1987 1445 -1017 95 1675 -385 -1633 2141 5973 2854 -3338 -2097 6905 9713 810
206 810 -6220 481 10617 7924 -2948 -5391 3891 10007 2831 -5558 -2211 5841 4572 -3394 -4214
221 -4214 2482 3999 -2750 -6341 38 5600 -662 -9305 -5299 6021 6241 -6122 -11952 -1240 10105
236 10105 4917 -10142 -11583 3560 12461 1782 -11880 -8511 6918 11789 -529 -11879 -5535
$$ packed form
138e538j5758J7409K1314q621k3312j966K0218R147j5523j4228R640J6129m454
151D457j6232j84J5897N205j3642j0078J1176J5047n078j7780j450J8033R671
164A5042j3452j5964N888J9030L973j6957j2818J0747J7527k076j7719p271J2497
177a553J3708n216j6032l163J3205Q943p792j1297J194J0353L580o552n313K840
191c095N082n42k462J112J580k060j248L774L832l119o192J241R002K808q903
206H10p030O701J0136k693j0872k443R282O116p176q389L347Q052j269p966q20
221d214O696J517o749l591O379N562o262q643M006J1320K20j2363n830J0712J1345
236A0105n188j5059j441J5143Q901j0679j3662L369J5429M871j2318j1350O344
$$ plain form
249 -5535 8664 9501 -3185 -10764 -2505 8305 6076 -5195 -8737 97 6997 1454 -6703 -4966
263 -4966 2223 3286 -2655 -5636 -654 3247 -678 -5705 -1801 4408 2696 -4984 -5233 3270 7051
278 7051 305 -6887 -2567 7509 7605 -2220 -6166 1254 8354 5006 -2877 -3408 3026 6348 2487 -1404
294 -1404 -332 1828 2125 1382 1753 366 -1706 -1166 2565 3877 -898 -5532 -2468 5002 4994 -3538 -7883
311 -7883 -1249 6474 3956 -5317 -7734 600 7252 2541 -6046 -5716 2488 6355 1223 -5469 -3884
326 -3884 3131 4659 -723 -4408 -1175 3292 2326 -2016 -2780 877 2363 -1102 -3539 -299 2922 102
342 102 -4939 -3811 2647 4316 -2585 -8135 -2562 5857 3912 -6027 -8684 948 7908 2321 -7802
357 -7802 -6856 4018 8077 -52 -7674 -3025 5596 5898 -1243 -4728 -104 4780 3431 -992 -1486 1609
$$ packed form
249e535J4199Q37j2686p579Q259J0810k229j1271l542Q834O900n543q157J737
263d966P189J063n941k981M982L901l925n027L904O209j712p680k49Q503L781
278G051o746p192M320J0076R6r825l946P420P100l348p883n31O434L322l861l891
294a404J072K160K97p43L71j387k072N40L731J312m775m634L064P470qq532m345
311g883O634P723k518r273k417Q334O652m711q587L30Q204L867n132o692J585
326c884P015J528n382l685L233M467r66m342p64L657J486l465k437L240L221k820
342A02n041J128O458J669o901n550N573Q419j945r939k657R632O960n587j0123
357g802R46J0874M059q129p622M649Q621L02p141l485M624M884j349m423m94L095
$$ plain form
373 1609 2250 1232 962 1228 552 -314 1088 2702 1910 -1190 -2086 1215 3777 1130 -2774 -2054 1684
390 1684 3070 130 -2806 -1734 1378 2250 -181 -1838 -833 690 1120 138 -515 -660 -107 90 546
407 546 930 -81 -1239 -827 1108 2112 315 -2537 -1946 1583 3326 -284 -4414 -3144 2567 3886
423 3886 -1580 -6175 -2715 4032 4138 -3509 -6905 -1223 4969 2512 -4848 -5733 447 4773 332 -4763
439 -4763 -3248 2152 3096 -1051 -2959 -249 2138 819 -1216 -524 1870 1106 -1016 -180 2342 2133
455 2133 -600 -1694 1019 3248 1511 -1705 -1527 1702 3233 637 -2087 -1207 1563 2436 473 -1684
471 -1684 -1320 858 2176 848 -1136 -1735 143 2071 1269 -1346 -1948 262 1932 1335 -840 -1917
487 -1917 -41 1784 1841 -85 -1497 -768 1217 2368 403 -1992 -1500 1228 2523 309 -2657 -2306
$$ packed form
373A609O41j018k70K66o76q66J402J614p92l100q96L301K562k647l904P20L738
390A684J386k940k936J072L112Q72k431j657J005J523M30r82o53j45N53J97M56
407E46L84j011j158M12J935J004j797k852N91L529J743l610m130J270N711J319
423C886n466m595L460O747J06p647l396N682O192k457p360q85O180M326m441n095
439d763J515N400R44m147j908K710K387j319k035O92K394p64k122Q36K522k09
455B133k733j094K713K229j737l216J78L229J531k596k724Q80K770Q73j963k157
471a684L64K178J318j328j984n99J878J928q02k615o02K210J670n97k175j077
487a917J876J825N7j926j412P29J985J151j965k395M92K728J295k214k966L51
$$ plain form
503 -2306 1264 2608 -509 -3340 -1905 1695 1398 -1539 -2978 -985 1252 67 -2083 -1709 112 98
519 98 -1574 -1246 487 566 -1515 -1922 476 2175 63 -2523 -1072 2374 2630 -704 -2851 -211 3132
536 3132 2440 -1107 -2531 498 3234 1954 -1339 -1787 566 2284 1626 -773 -1641 -47 1757 1447
552 1447 -396 -1723 -517 1223 1559 -275 -1563 -575 958 969 152 -792 -606 497 1150 465 -173 -423
570 -423 -112 1055 1485 123 -1068 -410 1318 1747 -14 -1637 -625 1345 1403 -511 -1702 -250 611
587 611 400 -619 -1000 -688 -376 -199 -176 -220 -1110 -1734 -442 1052 361 -2045 -2349 230 2154 218 -2832
606 -2832 -2275 1393 2535 -155 -2551 -1056 1681 1860 -385 -1902 -447 1636 1440 -254 -1001 -43
622 -43 828 1054 423 -368 -385 195 769 493 -391 -775 -18 628 607 -129 -663 -338 272 813 577 -195 -591
$$ packed form
503b306L570J344l117k831J435L600k97k937j439J993K237j185k150L74J821j4
519I8j672L28J733P9k081m07K398J699k112k586J451L446K56l334k147K640L343
536C132o92l547j424L029K736j280l293m48K353J718o58k399q68J594J804l10
552A447j843j327J206J740L36j834j288R88J533J1q17r44J86J103O53o85o38k50
570d23L11J167M30j362j191O58J728M29j761j623J012J970N8j914j191J452Q61
587F11k11j019l81L12L12J77K3m4q90o24J292J494o91k406l04K579J924j936l050
606b832N57L668J142k690k396J495K737J79k245j517J455K083j96j694p47R58
622d3Q71K26o31p91j7N80N74k76q84l84P57O46k1p36n34L25O10N41k36p72l96
$$ plain form
643 -591 -58 849 1058 -28 -1085 -193 1423 1707 -8 -1172 -180 1681 1574 -340 -1377 24 1719
660 1719 955 -562 -793 -37 839 550 -171 -734 -591 -54 470 275 -658 -1547 -618 832 744 -1150 -2060
679 -2060 -519 905 787 -1210 -1795 -159 942 242 -1212 -1086 155 839 484 -516 -433 43 278 425
697 425 131 -231 -527 121 817 371 -568 -522 -33 887 722 -428 -1099 -107 773 511 -208 -793 -570 366
717 366 829 119 -609 -524 228 1011 512 -851 -871 409 1517 693 -784 -904 884 1575 540 -728 -525
736 -525 846 1289 457 -365 -330 399 740 445 48 -537 -295 165 484 146 -609 -915 121 640 -34 -957
756 -957 -862 174 613 -210 -912 -699 102 197 -48 -285 -351 -276 309 504 -96 -530 -450 355 978 169 -1053
777 -1053 -744 547 1060 -62 -1041 -599 795 824 -191 -767 -398 574 555 149 -574 -423 -167 286 363 -308
$$ packed form
643e91N33R07K09j086j057Q92J616K84j715j164R92J861j07j914j037J401J695
660A719p64j517k31P56Q76k89p21n63J43N37N24j95r33q89R29J450q8j894r10
679b060J541J424j18j997n85J636J101p00j454J26J241O84l55j000Q3M76K35J47
697D25k94l62k96O48O96m46r39M6M89R20j65j150o71R92Q80k62p19n85K23R36
717C66M63p10p28Q5P52P83m99j363k0J280J108q24j477j20J788O91j035j268K03
736e25J371M43q32q22L5P29L41k95l97n85K42M60L19l38p55l06J036N19o74r23
756i57R5J036M39q23p02K13Q01R5k45k37o6P5N85J95o00m34Q0Q05O23q09j222
777a053L09J291N13j122r79M42J394K9j015n76L69R72j9m06p23J51K56M53P7o71
$$ plain form
797 -308 -634 -445 417 731 -52 -927 -630 860 828 3 -777 -194 906 745 31 -306 91 770 658 191
817 191 -236 -61 194 706 684 -206 -484 92 549 601 -203 -729 -225 542 392 -411 -614 -138 239 216 -338
838 -338 -465 -357 59 279 89 -345 -817 -448 652 361 -515 -816 -128 856 796 -316 -956 -25 1051 370
858 370 -764 -646 117 642 213 -232 -593 -62 290 10 -49 -370 -295 -67 335 335 -184 -684 -148 460 385 -471
880 -471 -686 -154 477 328 -313 -653 23 658 473 -43 -463 86 489 594 15 -128 -317 373 827 147
900 147 -389 -292 425 925 304 -311 -384 290 747 73 -339 -216 5 243 217 -32 -166 -252 -48 557 70 -412
922 -412 -786 156 715 189 -928 -640 221 624 -188 -672 -255 453 803 -27 -375 -129 370 168 -62 68
942 68 24 -152 -115 42 137 -303 -385 30 417 123 -473 -760 -42 673 287 -620 -689 183 429 142 -508 -408
$$ packed form
797c08l26J89Q62L14p83q75K97J490l2q25p80N83J100j61p14l37L97O79j12m67
817A91m27J75K55N12k2q90k78N76M57N2q04n26N04P67j50q03k03M76L77k3n54
838c38j27J08M16K20j90m34m72L69J100k91q76l01O88R84o0j112o40R31J076o81
858C70j134J18P63N25m29m45l61N31L52k80n9l21P5K28M02%n19n00N36O08p5q56
880d71k15N32O31j49o41l40O76O35j85n16m20N49M03J05n79j43j89O90M54o80
900A47n36R7P17N00o21o15p3O74M57o74m12J23K21K38k6k49j34q6K04O05m87m82
922d12l74R42N59n26j117K88Q61M03q12m84M17P08L50q30l48K46M99k02k30J30
942F8m4j76L7J57R5m40q2M15L87k94n96k87P18P15l86r07o9Q72K46k87o50J00
$$ plain form
964 -408 223 338 220 -144 -308 2 323 324 -60 -284 32 498 455 2 -59 89 347 450 2 -183 -20 174
986 174 -32 117 -7 -169 -230 147 261 72 -328 -120 337 437 -165 -631 -139 585 507 -441 -546 -129 605
1007 605 300 -369 -467 24 438 103 -235 45 25 121 18 192 91 6 -179 126 431 272 -419 -356 512 494
1029 494 -18 -600 -447 113 432 -133 -609 -121 377 250 -182 -594 -89 -64 341 -116 -470 -142 111 182 95
1050 95 -238 -233 168 148 6 -51 -48 -124 201 124 76 29 -72 182 266 133 -141 -259 88 490 318 -291 -450 87
1074 87 356 270 -255 -334 400 333 84 -359 -261 413 277 -134 -309 -170 111 27 -131 132 322 -177 -74 223
1096 223 203 -3 -369 -55 188 272 -196 -388 50 344 176 -198 -491 118 286 7 -435 -325 -8 202 -29
1117 -29 -329 -272 111 -64 69 -183 -229 116 14 148 130 -73 -152 -10 179 -3 55 -74 -51 195 154 -45 -243
$$ packed form
964d08O31J15j18l64j64L10L21Jl84k24L16M66m3m53o1J48K58J03m48j85J63J94
986A74k06J49j24j62o1L77J14j89m00K08M57J00o02m66M92P24p8r48j05M17P34
1007F05l05o69r8M91M14l35l38K80k0R6j03J74j01q5j85L05L05j59o91O3Q68j8
1029D94n12n82J53N60L19n65m76M88M98j27m32m12N05K5M05m57l54L28K53P1q7
1050I5l33NM01k0j42n7Lp6L25p7m8m7j01K54Q4j33k74j18L47M02j72o09j59N37
1074H7K69q6n25p9P34o7k49m43R8O74j36m11j75J39K81q4j58K63J90m99J03K97
1096B23k0k06l66L14K43Q4m68j92M38K94j68l74k93O09J68k79m42J10L17K10k31
1117b9l00N7L83j75J33k52m6L45j02J34j8k03p9J42J89j82N8j29K3K46m1j99j98
$$ plain form
1140 -243 -123 29 371 109 -361 -161 241 308 -193 -386 -121 405 304 -7 -373 17 509 33 -202 -29
1160 -29 111 34 74 -69 -4 103 116 19 70 274 0 -329 91 345 -10 -122 -328 273 352 -50 -232 -133 295
1183 295 295 88 -343 -134 212 291 76 -200 -125 66 27 -6 -164 -63 79 202 49 -54 -213 34 15 42 -178
1206 -178 -94 -150 35 81 29 3 -3 35 116 205 -71 -137 85 184 207 -220 -83 59 208 107 -240 -185 37 203 107
1231 107 -45 25 152 -126 -17 121 57 100 -72 74 205 62 -229 -55 40 13 72 -236 -263 175 236 -206 -300
1254 -300 -20 169 108 -120 -261 6 276 161 93 -88 -49 101 148 -141 -1 41 80 122 98 60 -66 41 181
1277 181 150 -127 25 -33 116 12 -2 -100 -35 176 53 176 -360 -53 18 178 37 -105 -118 59 178 85 -50
1300 -50 -143 192 46 -129 -160 -64 127 72 31 145 153 -195 42 70 204 -69 -124 151 97 300 -145 -200 89 272
$$ packed form
1140b43J20J52L42k62m70K00M02O7n01j93K65N26j01l11l66L90M92m76k35J73
1160b9J40p7M0j43O5J07J3r7N1K04k74l29M20K54l55j12k06O01P9m02j82R9M28
1183B95%k07m31K09L46P9k15k76P5J91l9l3j58J01J42J23j53j03j59K47j9K7k20
1206a78Q4n6J85M6n2k6oL8Q1Q9k76o6K22R9K3m27J37J42J49j01l47N5K22J66r6
1231A07j52P0J27k78J09J38o4M3j72J46J31j43k91J74R5k7N9l08k7M38O1m42r4
1254c00K80J89o1k28j41K67K70j15o8j81L9J50M7k89J40M2L9M2k4l8j26J07J40
1277A81l1k77J52n8J49j04j4r8O5K11j23J23n36L07P1J60j41j42j3J77J19r3j35
1300e0r3L35j46j75l1R6J91n5m1J14Ql48K37K8J34k73n5K75n4K03m45n5K89J83
$$ plain form
1324 272 -6 -157 -58 133 127 115 -167 -121 154 211 121 -78 -122 61 112 -119 40 183 64 88 0 27 -65 28 27
1349 27 207 92 -246 -43 -44 142 27 -25 -137 -59 60 -5 -248 -295 -200 85 151 -165 -85 49 139 67 -206 -190
1373 -190 -185 155 27 -163 68 122 212 -123 32 89 190 91 -26 77 1 -46 -75 -167 130 -28 -143 -94 -81 263
1397 263 -119 -315 162 157 182 -220 -207 -221 269 51 -172 -135 -5 -31 -45 108 -29 256 -128 -15 -13 219 93
1420 93 -51 27 162 73 -16 -151 -77 121 94 -40 24 313 183 -41 -83 -181 100 138 -164 -63 -96 -5 96 -35
1444 -35 -137 16 52 165 -72 -15 -40 -107 157 178 84 -189 -13 119 7 132 -100 98 -58 46 69 33 -5
1467 -5 76 -15 178 -79 -188 64 -21 -49 -106 -48 79 114 -10 -135 3 109 149 -40 -182 -102 -55 54 -62 25
1491 25 319 -47 -222 0 16 -44 0 117 16 -72 -116 -43 114 -12 -78 -74 48 32 137 80 20 -203 -44 -55 -185
$$ packed form
1324B72k78j51R9J91oj2k82M6K75N7r0j99m4J83N1k31J59J43j19K4q8K7r2R3j
1349B7J80j15l38K03jJ86j15n2j12P8J19o5k43m7R5K85O6l16Q0J34R0p2k73J6
1373a90NL40j28j90K31N4R0l35J55N7J01r9j17J03p6m7k9r2K97j58j15M9J3L44
1397B63l82j96M77nK5m02J3j4M90k18k23L7J30k6j4J53j37K85l84J13KK32j26
1420I3j44P8J35q9q9j35P4J98k7j34O4K89j30k24m2r8K81L8l02J01l3R1J01j31
1444c5j02J53L6J13k37N7k5o7K64K1r4k73J76J32j12J25k32J98j56J04K3l6l8
1467eQ1r1J93k57j09K52q5k8n7N8J27L5j24j25J38J06M0j89j42Q0M7J09j16Q7
1491B5K94l66j75K22J6o0M4J17j01q8m4P3J57j26o6MJ22j6J05n7o0k23J59j1j30
$$ plain form
1516 -185 69 -24 -113 115 65 -203 89 -91 153 71 -32 34 104 -20 7 3 1 -337 24 -52 -198 154 19 -5
1540 -5 -34 73 53 45 17 65 214 -33 -302 -120 22 -27 -84 -29 -200 5 -145 43 12 12 254 32 -117 -22 -21 -103
1566 -103 -9 14 -142 -46 -72 -95 -63 -250 47 30 -35 127 -70 -117 98 26 72 -40 151 52 -108 140 -49 -115
1590 -115 -44 -74 92 41 -40 17 -74 2 -41 -48 35 20 267 -76 -23 87 -185 7 -114 -93 133 164 -50 -29 82
1615 82 74 -168 70 -154 42 48 -64 -39 199 -96 -12 61 29 121 -84 -103 8 95 8 -30 -17 13 228 -191 -41
1640 -41 119 68 84 -117 -41 83 -41 -164 29 18 84 96 -69 -136 -8 -94 18 18 -54 -64 29 -94 -291 105 111
1665 111 -77 78 -83 -98 -157 -24 -56 -13 132 68 -178 -102 -75 40 -102 19 -35 -228 95 131 -106 41 -119
1688 -119 57 -32 144 -67 -39 0 2 87 138 -4 49 -94 99 -80 107 -100 108 14 53 -36 -15 162 -21 -183
$$ packed form
1516a85K54r3q9K28n0k68K92j80K44q2j03O6P0j24K7mkl38L61p6j46L52j35k4
1540ek9J07k0qk8M8J49k47k69J82J42m9n7N5j71K05j50J88l1%K42k22j49R5Jq2
1566a03R4K3j56R6k6k3L2j87K97j7o5J62j97m7K15p2M6j12J91r9j60K48j89o6
1590a15P1l0J66n1q1N7r1P6m3pQ3j5K47l43N3J10k72J92j21K1K26L1k14K1J11
1615H2qk42K38k24J96Oj12K5K38k95Q4P3l2R2k05j9J11Q7q7l8J3L0K15m19J50
1640d1J60n1J6k01P6J24j24j23J93j1O6J2j65o7J28q6J12%p2j0R3j23j97L96O
1665A11j88J55j61j5n9J33l2M3J45o4k46P6K7J15j42J21n4j93L23L6k37J47j60
1688a19J76q9J76k11K8L9KQ5N1j42N3j43J93j79J87k07K08r4L9q9K1J77j83j62
$$ plain form
1712 -183 19 142 53 90 -27 127 62 -25 -14 97 14 74 -154 -3 -44 -73 -6 47 -45 37 257 -15 -57 -24 33
1737 33 143 -38 -125 -31 223 55 -23 -38 -166 105 218 -223 86 -187 110 -8 -91 -79 133 136 -32 243 -29
1760 -29 33 7 82 -175 -96 -33 41 -171 -57 -133 -124 -80 -109 83 159 93 -155 -106 76 -4 -212 -60 -32 17 71 75 -4
1787 -4 137 50 11 -142 -98 -56 8 113 -77 -83 -44 -75 1 -124 -12 91 -78 -4 -170 26 123 -178 58 -20 -35
1812 -35 -187 -61 101 -19 -71 41 -15 -116 169 -15 61 55 27 -77 -65 174 4 34 -83 88 -55 184 70
1835 70 138 184 51 -106 -112 -16 24 -3 51 21 -67 44 37 -41 47 93 -95 56 -93 111 -147 -107 20 148 -203 131
1861 131 31 -97 185 32 15 -167 107 156 -269 57 36 104 -8 -63 287 -45 229 -38 14 -8 79 47 -11
1884 -11 122 -119 68 47 -59 -26 50 -54 268 -2 -84 17 36 15 -73 127 -64 -124 17 1 -41 -107 -35 -23 113
$$ packed form
1712a83K02J23q9L7j17J54o5q7J1J11q3O0k28J51m1k9O7N3r2Q2K20k72m2L3N7
1737C3J10j81q7R4K54j68p8j5j28K71J13m41L09k73K97j18q3J2K12Lj68K75k72
1760b9O2k6P5k57P9O3P4k12J14p6RM4k9J92P6o6k48M9J82q0k08J52K8M9N4Mp9
1787dJ41q7l9j53M4M2O4J05j90oL9l1P6j25J12J03j69P4j66J96R7l01K36p8j5
1812c5j52J26J62j20n2J12n6j01K85j84P6ok8j04J2K39j70L0j17J71j43K39j14
1835G0O8M6j33j57oR6M0k7N4l0q8J11pp8Q8M6j88J51j49K04k58M0J27J28l51L34
1861A31j00j28K82j53j7j82K74M9m25L26k1O8j12n5L50l32K74k67N2k2Q7l2n8
1884a1J33k41J87k1j06L3P6j04L22k70q2J01J9k1q8K00j91o0J41j6m2o6P2J2J36
$$ plain form
1909 113 -30 -45 -55 5 -18 -71 18 118 110 123 210 137 121 51 -97 70 -121 54 235 41 29 76 -60 68 66 28
1935 28 12 -80 207 114 -72 -10 -323 -100 -43 -26 32 135 -19 222 -18 -53 -126 -29 -21 28 72 162 0 22 56 95
1961 95 -40 -4 7 71 -61 -126 -24 27 -30 -85 -198 107 -53 54 16 -63 -21 -121 124 2 -26 -180 162 -33
1985 -33 40 -3 -173 131 186 -40 6 112 17 -110 76 5 100 -67 136 15 24 -49 94 12 17 128 -28 184 -126
2010 -126 -134 -81 31 10 83 -205 1 42 139 91 60 127 -25 14 12 26 91 104 18 -148 -36 -148 -39 -179 -46 25
2036 25 -135 9 37 194 4 -51 20 40 -33 181 -71 -21 24 31 82 -151 82 208 -119 -73 -154 99 59 -35 25
2061 25 187 -171 -44 249 -5 -37 41 18 -25 149 -46 57 50 129 -18 -102 8 43 -113 74 -5 151 -44 -24
2085 -24 61 -6 148 101 -72 56 135 88 10 98 -16 -24 41 -128 -28 39 -146 -31 106 -38 -84 -143 105 -15 69
$$ packed form
1909A13j43j5j0O0k3n3Q9J00qJ3Q7p3j6p0j48J67j91J75J81j94j2M7j36J28kl8
1935B8j6r2K87r3j86O2l13K23N7J7N8J03j54K41k40l5p3R7QM9M4R0j62K2L4L9
1961I5j35L6J1O4j32o5J02N1n7n5j13L05j60J07l8p9M2j00K45j22k8j54L42j95
1985c3P3m3j70L04N5k26M6J06r5j27J86p1R5j67K03j21Rp3J43q2NJ11j56K12l10
2010a26qN3J12k1P3k88K06M1R7m8l1O7j52L9kJ4O5J3q6j66J12j12J09j40J33P1
2036B5j60J44K8J57j90n5P1K0p3K14k52N0M5PN1k33K33J26l27M6q1K53m0r4O0
2061B5J62l58J27K93k54l2P8k3m3J74j95J03pP9j47q4J10L5j56J87p9J56j95K0
2085b4Q5o7J54m7j73J28P9m7p8Q8j14qO5j69J00O7j85J15J37j44m6n9K48j20Q4
$$ plain form
2110 69 27 206 -84 -40 17 -75 67 59 34 111 -227 7 -4 107 190 122 108 -192 104 53 43 179 206 -1 38 68
2136 68 -31 -86 -233 -29 -150 -21 70 -29 -3 36 126 -64 -6 -81 154 43 48 -55 -43 -85 47 46 153 -121 -53 31
2162 31 30 131 -197 81 -128 -121 9 46 53 -2 35 27 -92 16 145 -50 -123 89 57 -36 76 -55 -65 -49 -114 48
2188 48 -108 -22 153 64 63 114 34 99 -35 38 169 -109 10 89 223 -96 -54 105 29 -77 154 -22 123 61
2212 61 -60 -50 -157 -41 24 -25 39 96 -260 140 197 12 -17 -113 6 -138 23 5 48 41 -102 -24 111 -27 -35
2237 -35 -24 -55 13 206 -133 -231 113 186 -79 -73 38 -55 156 -21 -88 15 -128 -65 162 43 172 87 12 -23 -33
2262 -33 151 -32 4 102 -20 199 -103 -84 27 -118 -34 46 166 40 29 33 33 -38 -170 -189 -109 104 -129 -27 30
2287 30 115 -62 85 135 14 24 -132 13 -7 -204 -73 -137 258 34 66 2 -107 52 103 -93 20 161 -62
$$ packed form
2110F9m2J79k90M4N7r2J42qk5P7l38K34j1J11Q3o8j4l00K96n1j0J36K7k07L9L0
2136F8r9n5j47K04j21J29R1r9K6L9R0j90N8p5K35j11Nj03J2m2J32jJ07k74O8Q4
2162C1jJ01l28K78k09PJ30L7Pn5L7qj19J08J29j95p3K12l2r3J12j31j0J6o5J62
2188D8j56Q6J75q9jN1q0O5j34P3J31k78J19P9J34l19M2J59p6j06K31j76J45o2
2212F1j21J0j07J16O5m9O4N7l56M00N7j85k9r6J19j44J61j8M3pj43P8J35j38q
2237c5J1l1O8J93l39r8L44P3k65OJ11r3K11j77o7J03j43O3K27j19J29q5p5l5j0
2262c3J84j83L6R8j22K19l02J9J11j45Q4Q0J20j26j1M%p1j32j9Q0K13k33J02N7
2287C0Q5j77J47N0j21J0j56J45k0j97J31o4L95k24L2o4j09J59N1j96J13J41k23
$$ plain form
2310 -62 112 -67 186 20 -145 -64 -49 -2 57 -113 -70 15 136 26 -60 -28 21 74 -104 71 -23 -106 140 -40
2334 -40 -14 33 -221 -81 68 -30 34 32 57 -27 101 85 46 30 104 23 -32 105 85 -118 7 53 3 -48 103 13 -107
2361 -107 -12 39 13 -4 -92 32 -39 -17 -53 44 49 -71 -85 14 153 -21 -101 142 42 2 -36 107 17 -103 101 -79
2387 -79 -18 113 46 169 70 -86 38 189 -28 52 -83 78 50 -43 85 -44 -54 86 31 125 18 130 13
2410 13 27 65 18 -17 46 66 107 -182 -117 36 23 -128 -118 -35 20 -23 54 146 -15 176 282 28 44 20 -14 -7 158
2437 158 35 17 46 -1 -38 145 12 -142 3 63 62 33 3 174 168 -153 -139 1 93 -52 94 81 23 391 104
2462 104 -131 -37 -77 -12 36 -61 36 -65 -153 -44 -102 81 92 -82 -62 56 2 -191 -22 -60 80 -63 57 -133
2486 -133 158 -81 22 85 -173 -6 202 -40 9 86 -225 216 6 -97 -64 -179 -23 66 -46 -152 105 -167
$$ packed form
2310f2J74j79K53j66j65Q1J5M7N9j70M3Q5J21j10q6L2M9N3j78J75r4q3K46j80
2334d0K6M7k54J40J49r8O4kK5q4J28j6l9j6P4q1n5J37k0k03J25M6n0n1J51r0j20
2361a07R5N1k6j7q8J24p1K2l6R7Nj20j4R9J39j74q0K43j00m0l8J43r0j20K04j80
2387g9O1J31o7J23r9j56J24J51k17Q0j35J61k8r3J28j29j0J40n5R4j07J12j17
2410A3J4L8m7l5O3K0M1k89O5J53j3j51J0Q3N5m3P7R2j61J91J06k54J6k4l4PJ65
2437A58j23j8K9m7l7J83j33j54J45O0jk9l0J71ol21J4J40R2j45J46j3n8L68k87
2462A04k35R4m0O5M8r7R7j01q8J09n8J83J1j74K0J18n4j93J69l8J40j43J20j90
2486a33K91k39J03O3k58J67K08k42M9P7l11M41k10j03L3j15J56Q9j12j06K57k72
$$ plain form
2508 -167 227 48 -185 -63 -30 -32 -11 50 8 -11 -48 -3 94 -196 -123 129 31 68 12 7 110 -52 -46 33 137 24
2534 24 -64 36 -4 -46 74 -67 151 -102 -80 55 60 25 -57 190 -137 -76 90 -20 -95 -16 54 34 209 -199 -59
2559 -59 151 106 -95 -84 -48 -61 7 -185 -66 -73 3 95 52 -91 -184 -129 55 -49 -91 -71 97 -3 42 -89 -288
2584 -288 -11 -36 -196 18 147 -7 3 65 36 -160 60 -7 72 88 174 -121 111 61 -9 159 10 -18 -22 4 62
2609 62 -27 76 11 144 14 75 -47 -114 166 206 44 -23 -91 -174 -9 -73 5 50 36 5 -34 55 -109 103 68 86
2635 86 91 -20 139 152 96 161 -79 26 10 -113 -108 122 -12 142 -182 18 -2 -65 0 -225 7 -22 -27 -70 179
2660 179 98 130 -65 67 -36 29 76 -156 2 5 14 -87 1 -59 343 89 -179 -42 -24 50 -22 -58 16 -79 67
2685 67 71 32 -41 -101 47 -57 -19 -271 29 -50 -140 97 -115 55 89 9 91 76 -71 -22 -115 7 5 -78 -2 113
$$ packed form
2508a67L94j79k33J22L3kK1O1m2j9l7M5R7k90P3K52r8L7n6nJ03j62OP9J04j13
2534B4q8J00m0m2J20j41K18k53K2J35Nl5q2K47l27O1J66j10p5P9P0k0J75m08J40
2559e9K10m5k01J1L6j3O8j92J19pP6R2m3j43r3N5J84j04m2K0J68j00M5j31j99
2584b88K77k5j60K14J29j54J0O2k9j96K20o7P9J6Q6k95K32n0p0J68j49k8mK6N8
2609F2q9J03o5J33j30O1j22o7K80M0j62o7o8q3J65o4P8M5j4l1l9Q9j64K12l5J8
2635H6Nj11J59J3n6O5k40J05j6j23NK30j34J54l24K00k0o3O5k25K32k9nm3K49
2660A79q1L2j95J32j03O5M7k32J58LRj01Q8o0M02k54k68J37J8P4p2l6P4r5J46
2685F7Ml9p3o0J48j04L8k52L00p9r0K37k12J70L4q0Q2j5j47M9r3J22kq3P6J15
$$ plain form
2711 113 -105 -4 -89 51 31 -76 72 271 88 -82 34 153 -98 -83 -42 -166 -63 -92 15 50 103 114 -82
2734 -82 246 -29 119 -36 10 30 -84 70 -233 -10 40 -13 73 194 78 -142 72 137 -86 7 -147 58 -16
2757 -16 -30 82 113 11 -37 -3 75 -153 -170 -185 -143 -18 -1 -66 -71 65 -64 36 29 -145 -335 325 117 134 17
2782 17 75 128 -159 40 -38 -108 6 97 25 46 -102 -166 77 66 -33 -60 -104 39 254 173 180 21 195 -27 58 198
2808 198 60 -71 -138 -78 -227 -37 81 -86 79 -93 111 176 264 47 17 116 141 -137 142 57 -31 108 -49
2831 -49 -47 12 185 30 -29 179 12 12 -67 -85 -59 45 -97 116 10 32 -101 -11 132 -138 7 63 128 34 75
2856 75 71 -160 -114 -24 42 271 -60 0 -64 -11 3 -87 34 -29 -106 -84 -51 23 59 -125 -15 -24 54 -79 270 27 38
2883 38 -146 -52 -104 -16 29 -44 -10 38 -25 13 -3 118 -103 99 -20 103 -127 -115 125 -327 -65 -134 -92 -13 103
$$ packed form
2711A13k18J01q5J40k0j07J48J99j83j70J16J19k51J5M1j24J03k9J07L5N3J1j96
2734h2L28k75J48j55M6K0j14J54l03K23N0n3Q6J21j16k20K14O5k23R3j54K05p4
2757a6j4J12L1j02m8L4P8k28j7j5M2J25J7o5nJ36j29J00pj74j90O60k08J7j17
2782A7N8N3k87J99p8p0J14R1p2K1j48o4K43j1r9k7m4J43K15q1Pj59J74k22Q5J40
2808A98j38j31o7O0j49J90J18j67J65j72K04O5Q8k17l0R9K5k78K79q5q8J39j57
2831d9KN9J73j55n9K08j67%p9j8K6J04j42K13j06K2j33R0J43k70J45N6O5r4M1
2856G5mk31M6R0O6K29l31O0o4N3J4r0J21o3p7K2L3P4L6j84J10rP8j33L49k43J1
2883C8j84R4n2Q8M5p3L4M8o3L8j6J21k21K02j19J23k30J2K40m52K62o9M2P9J16
$$ plain form
2908 103 -35 104 -12 -32 137 132 -6 -41 125 59 -9 -10 -40 -15 -16 100 -159 -268 -49 -233 -117 23 170 -33
2932 -33 109 121 -175 -158 -81 -112 17 36 98 78 84 -54 77 -48 14 7 231 -46 -209 -60 99 -164 38 -25 -219
2957 -219 92 -70 -205 -131 -69 -137 -57 5 343 22 97 65 80 -48 6 -124 159 50 -143 -30 46 102 173 -68
2981 -68 -281 142 62 -43 -17 171 75 157 -58 75 111 217 87 -206 66 3 -73 36 -54 60 -127 175 70
3004 70 -4 2 70 -107 -87 13 77 130 52 -2 -101 -16 2 102 211 -27 91 42 -106 -43 -159 188 -13 -2 105
3029 105 -2 91 -40 205 -90 94 -127 21 34 390 -90 -120 140 -39 -123 123 -107 -8 152 -88 52 39
3051 39 25 183 77 115 -156 197 55 -1 113 97 2 -32 95 -42 -16 -12 -13 -58 -120 11 25 -25 -21 -55 80 -74
3077 -74 50 137 -158 -183 59 -138 116 128 -35 -9 -83 -40 -20 -52 132 -76 -3 110 80 -3 142 -32 25 76 38
$$ packed form
2908A03j38J39j16k0J69nj38l5J66o6o8jl0K5jJ16k59j09K19j84J16J40J47k03
2932c3J42J2k96J7P7l1J29J9O2k0Oj38J31j25O2pK24k77j63J49J59k63K02o3j94
2957b19L11j62j35P4O2o8Q0O2L38l21P5l2J5j28N4j30K83j09j93J13P6N6P1k41
2981f8k13M23q0j05K6J88r6Q2k15J33L6J06j30k93K72o3p6J09r0J14j87L02j05
3004G0p4OO8j77K0J00O4N3p8n4r9Q5J8J00J09k38J18m9j48O3j16L47k01J1J07
3029A05j07R3j31K45k95J84k21J48J3L56m80l0K60j79q4K46k30R9J60k40J40j3
3051C9j4J58j06L8k71L53j42n6J14j6r5l4J27j37K6Mjm5o2J31J4n0Ml4J35j54
3077g4J24Q7k95k5K42j97K54J2j63K6p4M3K0l2J84k08P3J13l0q3J45j74N7N1l8
$$ plain form
3102 38 -87 -64 -51 -100 90 95 107 -33 41 -8 16 296 -112 30 92 -35 165 143 48 -94 -73 -49 131 -19 185
3127 185 -123 -38 -5 -38 -1 49 120 81 45 184 -81 -2 2 117 -8 -41 121 -59 -27 104 115 -86 -132 -72 116
3152 116 -118 -54 83 5 39 -59 -111 94 165 25 30 -33 -8 91 -146 -129 25 7 -24 -79 -161 -70 -57 27 17 15 130
3179 130 102 -98 113 -81 55 200 -39 -24 67 173 18 322 238 -1 46 62 148 41 -68 -179 72 -169
3201 -169 -37 -33 -253 -16 -50 23 -16 -97 -2 -159 -90 -125 72 47 -70 102 43 -191 30 -226 -71 -16 -154 -44
3225 -44 97 64 112 53 -134 -13 -130 140 -69 60 -65 17 -4 -96 71 87 102 -65 -58 45 105 -57 -31 -46 -62
3250 -62 -146 -4 22 104 40 133 106 187 -132 -67 -115 51 -97 -31 27 -37 123 1 -10 120 -173 -26 -69 -44 42 84
3276 84 47 -200 -21 86 31 -42 -193 31 -35 189 -104 -17 61 -64 -20 113 14 -148 -32 134 105 106 -27 -64
$$ packed form
3102C8j25K3J3m9J90NJ2j40P4m9K4K80m08J42O2j27K00k2r5j42K1K4J80j50K04
3127A85l08Q5L3l3L7N0P1l9l6J39k65P9MJ15j25l3J62j80L2J31J1k01m6O0J88
3152A16k34O4J37p8L4r8n2K05P1j40No3K5R9k37J7J54j8l1n5q2R1J3Q4j0kJ15
3179A30k8k00K11j94J36J45k39J5R1J06j55L04q4k39M7J6Q6j07j09j11K51k41
3201a69J32Mk20K37l4P3l9q1R5j57O9l5J97k5j17J72n9k34K21k56J55N5j38J10
3225d4J41l3M8n9j87J21j17K70k09J29j25Q2k1r2J67J6J5j67PJ03O0j62K6j5j6
3250f2q4J42K6Q2o4R3k7Q1l19O5m8J66j48O6N8o4J60j22j1J30k93J47m3K5Q6M2
3276H4l7k47J79J07n5p3j51K24o6K24k93Q7P8j25M4J33r9j62J16J66k9Jj33l7
$$ plain form
3300 -64 -64 4 -73 140 79 -205 208 -108 -1 140 58 15 -85 161 91 1 92 -31 -154 74 156 55 36 -52 -50
3325 -50 26 24 -27 48 118 -1 -96 -73 -8 -4 38 -166 -51 28 -58 175 -92 -20 -19 46 44 -39 -83 114 69 -62 5 100 -23
3354 -23 -39 -5 -52 -77 -120 29 -64 94 -83 20 68 19 120 -120 91 -21 -93 81 33 -20 38 257 62 45 21
3379 21 135 -1 27 3 148 -88 -71 41 -59 -62 -180 97 112 54 -7 54 -33 -268 52 -13 5 -114 53 139 -71
3404 -71 98 72 45 77 -104 94 94 -46 66 -130 77 163 7 18 -127 -313 93 159 93 -16 29 -14 -129 30
3428 30 246 -65 137 145 -113 -94 114 -243 -95 1 -67 62 0 -68 -15 27 24 -50 -114 76 1 -332 195 46 108
3453 108 22 75 15 -137 68 -16 -14 -167 -49 -14 138 -37 33 54 42 -92 165 116 147 -59 92 -44 -13 176
3477 176 -49 123 -11 106 69 -4 -13 153 84 194 172 39 138 -41 127 177 -144 1 85 36 -114 78 28 50
$$ packed form
3300f4%O8p7K13o1k84M13l16J07J41q2m3j00K46p0r0R1j23j23K28Q2j01j9q8K
3325e0P6kn1P5P0j19r5K3O5MM2k04J15P9q6K33k67P2JO5kq3m4J97m5j31O7R5j23
3354b3j6L4m7k5m3J49r3J58j77J03M8m9J01k40K11j12p2J74m8n3N8K19j95j7k4
3379B1J14j36K8k4J45k36J7J12j00lj18K77J5n8o1O1q7k35L20o5J8j19J67Q6k10
3404g1J69k6k7L2j81J98%j40J12j96K07Q6j56J1j45j86M06O6o6j09M5m3j15J59
3428C0K16l11K02Qk58J9K08l57J48R6o8J29o2o8N3M2lp4o4J90p5l33N27j49O2
3453A08q6N3o0j52K05q4Kj53J18L5J52j75P0K1j2j34K57m9L1k06J51j36L1J89
3477A76k25J72j34J17l7p3rJ66o9J10k2j33R9j79J68N0l21J45Q4m9j50J92n0K2
$$ plain form
3501 50 -86 61 31 -82 35 -203 65 58 -185 -63 93 128 -122 50 168 43 181 223 -32 138 121 -9
3523 -9 -212 -62 -2 130 -122 -69 4 -102 38 1 -110 -152 82 75 11 -64 24 -9 -15 -45 -125 -11 141 106 135 125 -72
3550 -72 90 -9 28 265 -22 49 -133 28 104 117 21 122 -108 -83 -54 10 25 -49 -78 52 119 -71 38 22 39
3575 39 16 54 129 -43 -22 43 -162 -61 -46 -95 13 -13 -15 -39 -111 27 1 -111 335 -9 72 -14 -101 41 0 -125
3601 -125 9 165 224 -75 19 0 22 105 -24 53 12 318 110 181 99 6 109 132 111 -106 -32 71 -332 135
3625 135 124 63 62 8 -22 25 109 134 -170 31 -102 -106 -4 74 -69 40 -159 216 -125 60 10 107 21 -186 -54
3650 -54 26 59 289 -74 72 89 218 179 -139 48 48 123 129 -115 -30 138 -143 6 59 29 11 -74 -138 -23 197
3675 197 -11 -12 13 59 -195 118 -2 27 54 -28 -80 -190 6 -102 61 -32 23 -39 -6 -106 -3 -88 132 89 -15
$$ packed form
3501E0j36J47l0j13J17k38K68pk43J22J56L5k50J72J18j25J38M2k55J70j7j30
3523ik03J50O0J32k52N3P3j06J40l7j11m2K34po4p5Q8l3ol0q0J14J52l5K9j0j97
3550g2J62r9L7K37k87P1j82J61P6J3r6J01k30K5K9O4J5p4k9J30O7j90J09j6J7
3575C9k3L8P5j72K1O5k05J01J5m9J08k6kk4p2J38k6j12M46l44Q1q6q7J42m1j25
3601a25J34J56N9k99R4j9K2Q3j29P7m1L06k08P1q2r3J03K3k1k17P4J03m03M67
3625A35j1o1jn4l0M7Q4K5l04K01j33mJ02P8j43J09j99L75l41J85n0R7q6k07J32
3650e4Q0L3K30l63J46J7J29l9l18J87%P5Ok44Q5J68k81J49N3l0j8q5o4J15K20
3675A97k08jK5M6k54L13j20K9K7q2n2j10J96j08J63r3N5o2L3j00J03q5K20m3j04
$$ plain form
3700 -15 24 -99 2 -100 38 7 132 223 203 48 -102 78 -46 76 -3 -204 1 79 147 124 -57 27 -30 -99
3724 -99 130 40 -55 -174 -61 15 -261 -126 -43 -99 -32 -54 29 -18 141 -163 -52 71 -50 82 -10 31 -66 36
3748 36 -14 225 -32 158 -24 -1 110 10 -82 -109 27 -129 86 0 -37 -66 -91 -83 -22 105 28 -22 2 -138 -91
3773 -91 -126 142 -57 76 148 15 157 -26 19 52 -25 -73 -10 24 64 138 72 -30 117 -217 -160 101 -113 55
3797 55 37 124 75 194 -75 70 113 43 38 -47 -86 153 239 -87 -82 -155 2 174 -1 24 4 12 31 -138 5 -70 49
3824 49 -77 30 115 7 -13 44 91 137 95 -59 32 -109 -101 172 3 27 41 -78 -24 -30 108 -85 121 154 -44
3849 -44 46 -10 -13 -12 -162 -149 -93 119 -48 -6 41 -38 -121 -5 -129 11 -67 -211 62 59 14 -106 -148 98 -52 53
3875 53 100 26 -147 -3 -190 -54 -14 16 -42 -49 21 94 -183 131 78 143 193 78 119 108 116 50 212 183 95 28 104
$$ packed form
3700a5L9j23J01j02J38l1J25R1k0j55j50J80j24J22p9k01K05P8O8k3j81Q4n7o9
3724i9K29r0r5j19J13P6k76J35Q3n6O7k2Q3m7J59l04J11J23j21J32r2M1r7J02
3748C6n0K39k57J90j82K3J11j00r2k7J36j56K15q6l7k9k5QO1J27p7n0K4j40M7
3773i1l5K68j99J33P2j33J42j83M5L3p7m8O3L4M0P4o6j02J47l34N7K61k14J68
3797E5j8Q7m9J19k69J45M3p0nq5l9K39Q6l26Np3J57J72j75K5k0QJ9j69J43p5J19
3824D9j26J07Q5j08k0N7M7M6m2j54R1j41QK73j69K4J4j19N4oJ38j93K06L3j98
3849d4R0n6lJj50J3N6K12j67M2M7p9q3J16j24J40p8j44K73lm5j20m2K46j50J05
3875E3M7p4j73J44j87J36M0L0n8pP0P3k77L14n3O5N0j15M1j1Qo6J62k9q8o7P6
$$ plain form
3902 104 21 146 31 10 8 52 -20 -85 -64 -69 -128 57 41 -33 54 163 4 2 -179 -25 26 -153 -3 -124 -129 52
3928 52 98 2 30 -49 62 -55 -16 -43 -52 164 41 18 -28 79 144 -43 102 67 107 215 -34 -28 174 96 -204 -122
3954 -122 151 66 -17 77 2 4 -35 28 67 -47 -23 -51 -26 -61 40 -90 36 7 -88 27 -81 -127 -121 44 -98 -6
3980 -6 19 30 11 33 47 -35 53 129 -26 -119 26 -43 36 -55 -203 39 -48 -101 -9 -23 3 40 -242 86 -23 37 -46
4007 -46 -109 29 -46 -63 -82 -19 -31 74 23 38 -172 -30 -1 61 81 -51 23 61 56 101 -19 -63 -174 52 66 207
4033 207 -17 11 -35 -60 149 8 278 23 2 -117 36 -126 2 -139 14 -6 60 -84 -67 -54 -58 -109 -225 17
4057 17 51 98 -46 9 -94 15 -179 -137 16 -217 -16 99 -74 -82 39 48 -106 21 149 -8 88 -92 134
4080 134 -44 -59 -20 170 -19 242 45 -34 28 -57 -117 -239 -1 13 80 38 -2 40 4 -83 -56 -93 -265 33 -157
$$ packed form
3902A04q3J25j15k1kM4p2o5K1nn9J85j6p4Q7J09j59kj81J54N1j79J50j21nJ81
3928E2M6r6K8p9J11j17L9k7rK16j23k3m6J07O5j87J45l5M0J08k49OK02p8l00Q2
3954a22K73q5q3R4p5Kl9O3L9j14K4k8K5l5J01j30J26k9r5J15j08m6OJ65j42R2
3980fK5J1j9K2J4q2Q8P6j55r3J45o9P9r1j48K42q7n3R2j4K6L7k82L28j09O0q3
4007d6o3J38p5j7j9O3j2J05n1J5k10J42K9O2K0j32P4L8nM5j20m4j11K26J4J41
4033B07k24K8m6k5K09j41K70k55k1j19J53j62J28j41J53k0O6j44J7J3mn1j16K42
4057A7L4M7j44N5j03J09j94M2J53k33K01J15j73qJ21Rj54J27J28j57R6j80K26
4080A34j78j5L9J90j89K61j97p9O2q5o0j22K38J4O7m2m0M2l6q7K7l7j72K98j90
$$ plain form
4105 -157 132 23 56 104 132 -16 11 -58 92 -47 -70 78 -104 93 -9 19 -20 -97 -87 -24 -72 41 -6 58 -191
4130 -191 95 -52 69 -36 19 -24 36 34 211 -51 27 203 26 3 58 -152 -101 119 -64 -21 26 101 -78 92
4154 92 -164 201 232 11 -57 76 -91 76 -152 78 -34 -42 158 -118 -15 20 -26 3 -59 -56 -130 7 76 -155
4178 -155 79 -32 79 -46 42 28 90 -15 186 -37 -37 14 -2 -23 104 -81 -51 109 44 164 171 161 -123 -24 -3
4203 -3 73 -116 28 221 -41 48 31 -9 21 -56 222 -119 0 79 27 -71 45 43 -63 92 38 124 34 -52 25 95
4229 95 -204 -79 -57 16 101 179 -168 140 -70 -194 8 -41 -60 -99 121 -171 374 -60 13 -176 -19 -93 -151 -65
4253 -65 -137 -137 -92 -26 -117 -278 -156 144 33 60 20 -81 -146 -56 36 238 116 -89 -36 11 81 151 58 -40 110 -102
4279 -102 -33 74 -8 196 104 82 -28 4 85 79 64 -55 0 -16 -168 39 98 72 -46 -112 -5 191 -74 193 141
$$ packed form
4105a57K89j09L3M8K8j48K7o9J50j39k3J48j82J97j02K8l9p7J0O3m8J13m7O4k49
4130a91K86j47J21j05N5m3O0kJ77k62P8J76j77k3N5k10N1K20j83M3M7P5j79J70
4154I2k56L65L1k21o8J33j67J67k28K30j12qK00k76J03L5m6K9o2Lp4J37O9k31
4178a55K34j11J11j25Q8j4O2j05K01k23%N1j6k1J27j85L0J60o5J20Pj0k84R9K1
4203cP6j89J44J93k62Q9j7m0L0p7K78l41J19P9n2r8J16kj06J55n4Q6r0q6P7P0
4229I5k99J25K2P3Q5P8l47L08k10j24K02m9j9l9K20k92N45m34P3j89J57p4n8Q6
4253f5p2%M5O6r1j61J22L00j11K7m0j01o5R0R2K02j22k05N3M7P0P0r3r8J50k12
4279a02O9J07q2K04r2k2j10L2Q1oj5j19N5j6j52K07N9k6j18o6J07J96k65K67n2
$$ plain form
4304 141 -56 53 -96 142 -55 -103 7 107 -55 -115 -157 144 0 14 111 -133 -150 -100 82 24 145 -8 143
4327 143 49 -11 147 -6 -69 21 -108 53 2 14 -31 118 -36 -12 -1 30 88 98 -174 52 -32 -42 27 80 66 -152
4353 -152 12 12 -22 -25 -11 -49 -18 -65 128 -21 179 12 -39 49 164 97 111 37 32 -91 88 98 97 30 74 55 33 51
4381 51 8 114 69 102 87 10 55 113 176 -40 14 -14 -40 -62 -176 90 -118 -20 44 7 -72 -83 36 6 28 44 4
4408 4 -220 -149 31 24 -178 90 -156 -53 85 -95 -44 107 -53 -44 92 -25 235 104 123 -48 143 -54 -81
4431 -81 110 18 -59 -8 -219 -28 -65 -24 -66 31 -124 -12 -13 0 52 57 -25 -68 -125 -27 50 -75 29 32 129 88 -89 30
4459 30 18 -64 30 60 -19 -30 -19 160 80 48 102 99 144 85 102 139 55 119 157 66 0 14 -157 -108 123 -109 23 17 -64
4488 -64 -135 -27 235 224 120 -24 87 67 -8 19 -80 46 -70 -76 -67 51 117 -64 -92 -159 65 -91 15 105 -142
$$ packed form
4304A41j97J09j49K38j97m8J10J00j62o0m2L01j44J4R7k44j7N0J82n8J21j53J51
4327A43r4o0J58j53o3R0j29J61n1J2m5J49j54K4J1L1N8J0k72K26q4j0O9N3j4k18
4353a52J64%l4lJ4l8L1m7J93j49K00j67n1Q8J15o7J4p4nj23J79J0jo7M4j9k2J8
4381E1m3J06m5L3j5p7M5N8O3k16N4k8k6k2j14K66k08R8O4l7p9j1J19l0K2J6m0
4408Dk24P1J80pk02K68k46J03J38j80N1J51j60RJ36j17K60j31J9j71J91j97k7
4431h1J91r2p7N1k11J91l7M1m2R7j55J12jJ3N2Nq2m3n7R8P7j25J04LR7m1j77J19
4459C0j2q2R4L0p9j1J1J79q0l2N4lM5n9J7L7q4O4L8r1o6J4j71M9K31k32J32oq1
4488f4p1J08K62j1j04j44J11k0p5K7r9J26j16oRJ18O6j81k8o7K24j56J06R0k47
$$ plain form
4513 -142 110 19 332 285 136 124 53 -39 -143 16 34 94 119 -15 26 6 -31 12 0 -29 -76 -74 73 15 -100 19
4539 19 -133 -25 -18 -48 58 -51 -159 -20 -137 65 78 179 -64 127 195 50 6 66 -156 65 -19 -108 -230
4562 -230 44 -54 -18 86 38 -30 -1 -155 -43 -141 45 -26 -92 -20 -41 -58 116 -168 -26 -10 40 -122 23 16 -158
4587 -158 32 49 90 -86 79 -68 9 42 -16 72 8 0 -18 0 -12 -90 138 115 -188 28 40 -133 -5 43 -14 65
4613 65 204 -151 160 103 -28 -38 -29 27 -105 24 111 111 -54 -22 209 -101 -174 158 70 75 -79 -210 -98 -30 -14
4638 -14 121 10 105 -40 -31 -80 117 154 65 65 -207 -124 46 107 -42 -26 55 -69 -78 40 62 23 138 37 171 -128
4664 -128 47 17 59 -105 -20 -121 -68 25 32 26 28 -36 -37 149 132 57 -54 -109 -64 10 -46 39 68 39 -63 138 77 119
4692 119 -130 36 -23 -1 305 45 -50 -31 24 -110 92 -85 12 53 -38 -113 101 -30 -27 76 68 -18 -204 74 -188
$$ packed form
4513a42K52r1L13m7j49j2p1r2j04J59J8O0K5j34M1k0l7M3j2k9m7KJ47n8j15J19
4539A9j52J08Pl0J06j09j08J39j17K02J3J01k43J91O8j45m4O0k22K21q4q9j22
4562b30K74r8L6J04m8o8K9j54J12r8J86p1o6P2k1j7J74k84J42J6N0j62J45pj74
4587a58J90J7M1j76J65j47P7L3n8Q8o4qj8J8j2p8K28k3l03K16J2j73J28M8n7P9
4613F5J39l55L11n7j31j0RN6j32J29Q7%j65L2K31l10p3L32q8Nj54j31J12O8J6
4638a4J35j11R5j45Rm9J97L7q9%k72Q3J70O1j49J6Q1j24rJ18K2l9J15j01J34k99
4664a28J75l0M2j64Q5j01N3R3PoKo4jJ86j7p5j11n5M5P4n6Q5K9k9j02K01o1M2
4692A19k49J66n9K2L06k60r5J9N5j34K02j77R7M1r1p5K14j31LJ03qq6j86K78k62
$$ plain form
4717 -188 126 -218 68 50 55 -186 164 -16 133 82 45 -242 -67 62 -137 6 -28 -95 233 -41 -62 156 -37
4740 -37 -158 84 -50 57 -120 53 12 -107 -180 -49 194 -94 141 41 113 -10 -49 -115 292 79 -43 25
4762 25 -101 -14 -99 48 166 115 -31 -150 -5 -290 -57 -9 82 -286 189 -112 -48 67 -22 26 -113 100 14
$$ packed form
4717a88L14l44K86j8Nk41L50j80J49n1l7k87J75J29j99J43l4o7L28k74k1K18j93
4740c7j21K42j34J07j77J73m1j19p3J31K43k88K35j00P2j23l9o6M07k13j22O8
4762B5j26Q7q5J47J18n1j46j19J45k85K33M8R1l68M75l01O4J15q9M8j39K13q6
$$ [...]
8191g1
##END NTUPLES=NMR FID
##END=
