##TITLE=1H_EC-3202(V)
 CDCl3, 8 sc, 
 2.10.2020
##JCAMPDX= 6.0         $$ Bruker NMR JCAMP-DX V2.0
##DATA TYPE= NMR FID
##DATA CLASS= NTUPLES
##ORIGIN= UXNMR, Bruker Analytische Messtechnik GmbH
##OWNER= root
$$ XWIN-NMR		Version 3.5
$$ Fri Oct  2 10:34:45 2020 Russian Standard Time (UT+4h)  she@DPX200
##.OBSERVE FREQUENCY= 200.1315066352
##.OBSERVE NUCLEUS= ^1H
##.DELAY= (6, 6)
##.ACQUISITION MODE= SIMULTANEOUS
##.ACQUISITION SCHEME= undefined
##.AVERAGES= 8
##.DIGITISER RES= 18
##SPECTROMETER/DATA SYSTEM= spect
##.PULSE SEQUENCE= zg30
##.SOLVENT NAME= CDCl3
##.SHIFT REFERENCE= (INTERNAL, CDCl3, 0, 15.7039)
##AUDIT TRAIL= $$ (NUMBER, WHEN, WHO, WHERE, WHAT)
$$ ##TITLE= Audit trail, XWIN-NMR		Version 3.5
$$ ##JCAMPDX= 5.01
$$ ##ORIGIN= Bruker BioSpin GmbH
$$ ##OWNER= she
$$ F:/spectra/data/she/nmr/H-F/1/audita.txt
$$ ##AUDIT TRAIL=  $$ (NUMBER, WHEN, WHO, WHERE, WHAT)
(   1,<2020-10-02 10:33:45.21 +0400>,<she>,<DPX200>,
      <created by zg, POWCHK disabled, PULCHK disabled
       configuration hash MD5:
       00 E9 B6 7A A2 85 ED C7 34 08 36 98 17 FE 4E 26
       data hash MD5: 16K
       E1 CA 8C 83 EB 24 50 74 DE 99 CB B1 FF 6A B7 24>)
$$ ##END=
$$ 
$$ hash MD5
$$ 73 43 A9 F7 C9 48 05 1F 18 69 F3 16 88 F1 D3 F2
##$RELAX= 
##$RELAX= 
##$RELAX= 
##$RELAX= 
##$RELAX= 
##$RELAX= 
$$ Bruker specific parameters
$$ --------------------------
##$DU= <F:/spectra>
##$EXPNO= 1
##$NAME= <H-F>
##$PROCNO= 1
##$TYPE= <nmr>
##$USER= <she>
##$AMP= (0..31)
100 100 100 100 100 100 100 100 100 100 100 100 100 100 100 100 100 100 
100 100 100 100 100 100 100 100 100 100 100 100 100 100 
##$AQSEQ= 0
##$AQ_mod= 1
##$AUNM= <au_zg>
##$AUTOPOS= <>
##$BF1= 200.13
##$BF2= 200.13
##$BF3= 200.13
##$BF4= 200.13
##$BF5= 200.13
##$BF6= 200.13
##$BF7= 200.13
##$BF8= 200.13
##$BYTORDA= 1
##$CFDGTYP= 0
##$CFRGTYP= 5
##$CHEMSTR= <none>
##$CNST= (0..31)
1 1 145 1 1 1 1 1 1 1 1 1 1 1 1 1 1 1 1 1 1 1 1 1 1 1 1 1 1 1 1 1 
##$CPDPRG= <>
##$CPDPRG1= <>
##$CPDPRG2= <>
##$CPDPRG3= <>
##$CPDPRG4= <mlev>
##$CPDPRG5= <mlev>
##$CPDPRG6= <mlev>
##$CPDPRG7= <mlev>
##$CPDPRG8= <mlev>
##$CPDPRGB= <>
##$CPDPRGT= <>
##$D= (0..31)
0 1.2 0 0 0 0 0 0 0 0.06 0 0.03 0 0 0 0 0.0002 0 0 0 0 0 0 0 0 0 0 0 0 
0 0 0 
##$DATE= 1601620424
##$DBL= (0..7)
120 120 120 120 120 120 120 120 
##$DBP= (0..7)
150 150 150 150 150 150 150 150 
##$DBP07= 0
##$DBPNAM0= <>
##$DBPNAM1= <>
##$DBPNAM2= <>
##$DBPNAM3= <>
##$DBPNAM4= <>
##$DBPNAM5= <>
##$DBPNAM6= <>
##$DBPNAM7= <>
##$DBPOAL= (0..7)
0.5 0.5 0.5 0.5 0.5 0.5 0.5 0.5 
##$DBPOFFS= (0..7)
0 0 0 0 0 0 0 0 
##$DE= 6
##$DECBNUC= <off>
##$DECIM= 32
##$DECNUC= <off>
##$DECSTAT= 4
##$DIGMOD= 1
##$DIGTYP= 9
##$DL= (0..7)
0 120 120 120 120 120 120 120 
##$DP= (0..7)
150 150 150 150 150 150 150 150 
##$DP07= 0
##$DPNAME0= <>
##$DPNAME1= <>
##$DPNAME2= <>
##$DPNAME3= <>
##$DPNAME4= <>
##$DPNAME5= <>
##$DPNAME6= <>
##$DPNAME7= <>
##$DPOAL= (0..7)
0.5 0.5 0.5 0.5 0.5 0.5 0.5 0.5 
##$DPOFFS= (0..7)
0 0 0 0 0 0 0 0 
##$DQDMODE= 0
##$DR= 18
##$DS= 0
##$DSLIST= <SSSSSSSSSSSSSSS>
$$ [...]
##$SUBNAM2= <"">
##$SUBNAM3= <"">
##$SUBNAM4= <"">
##$SUBNAM5= <"">
##$SUBNAM6= <"">
##$SUBNAM7= <"">
##$SUBNAM8= <"">
##$SUBNAM9= <"">
##$SW= 16.880792210976
##$SWIBOX= (0..15)
0 0 2 0 0 0 0 0 0 0 0 0 0 0 0 0 
##$SW_h= 3378.37837837838
##$TD= 16384
##$TD0= 1
##$TE= 0
##$TE2= 300
##$TE3= 300
##$TEG= 300
##$TL= (0..7)
0 120 120 120 120 120 120 120 
##$TP= (0..7)
150 150 150 150 150 150 150 150 
##$TP07= 0
##$TPNAME0= <>
##$TPNAME1= <>
##$TPNAME2= <>
##$TPNAME3= <>
##$TPNAME4= <>
##$TPNAME5= <>
##$TPNAME6= <>
##$TPNAME7= <>
##$TPOAL= (0..7)
0.5 0.5 0.5 0.5 0.5 0.5 0.5 0.5 
##$TPOFFS= (0..7)
0 0 0 0 0 0 0 0 
##$TUNHIN= 0
##$TUNHOUT= 0
##$TUNXOUT= 0
##$USERA1= <user>
##$USERA2= <user>
##$USERA3= <user>
##$USERA4= <user>
##$USERA5= <user>
##$V9= 5
##$VALIST= <valist>
##$VCLIST= <CCCCCCCCCCCCCCC>
##$VD= 0
##$VDLIST= <DDDDDDDDDDDDDDD>
##$VPLIST= <PPPPPPPPPPPPPPP>
##$VTLIST= <TTTTTTTTTTTTTTT>
##$WBST= 1024
##$WBSW= 4
##$XGAIN= (0..3)
0 0 0 0 
##$XL= 0
##$YL= 0
##$YMAX_a= 114178
##$YMIN_a= -149396
##$ZGOPTNS= <>
##$ZL1= 120
##$ZL2= 120
##$ZL3= 120
##$ZL4= 120
##$ABSF1= 10
##$ABSF2= 0
##$ABSG= 5
##$ABSL= 3
##$ALPHA= 0
##$AQORDER= 0
##$ASSFAC= 0
##$ASSFACI= 0
##$ASSFACX= 0
##$ASSWID= 0
##$AUNMP= <proc_1d>
##$AZFE= 0.1
##$AZFW= 0.1
##$BCFW= 1
##$BC_mod= 2
##$BYTORDP= 1
##$COROFFS= 0
##$CY= 11.3945322036743
##$DATMOD= 1
##$DC= 2
##$DFILT= <>
##$DTYPP= 0
##$F1P= 16.9975609425685
##$F2P= -3.02152046262296
##$FCOR= 0.5
##$FTSIZE= 0
##$FT_mod= 4
##$GAMMA= 1
##$GB= 0.15
##$INTBC= 1
##$INTSCL= 1
##$ISEN= 128
##$LB= 0.24
##$LEV0= 0
##$LPBIN= 0
##$MAXI= 10000
##$MC2= 0
##$MEAN= 0
##$ME_mod= 0
##$MI= 1.114404
##$NCOEF= 0
##$NC_proc= 0
##$NLEV= 6
##$NOISF1= 3.799351
##$NOISF2= 2.8
##$NSP= 1
##$NTH_PI= 0
##$NZP= 0
##$OFFSET= 15.70392
##$PC= 1
##$PHC0= -10489.94
##$PHC1= 15.60089
##$PH_mod= 1
##$PKNL= yes
##$PPARMOD= 0
##$PSCAL= 0
##$PSIGN= 0
##$REVERSE= no
##$SF= 200.130013532006
##$SI= 16384
##$SIGF1= 3
##$SIGF2= 2
##$SINO= 400
##$SIOLD= 16384
##$SREGLST= <1H.CDCl3>
##$SSB= 0
##$STSI= 0
##$STSR= 0
##$SW_p= 3612.71676300578
##$SYMM= 0
##$S_DEV= 0
##$TDeff= 0
##$TDoff= 0
##$TI= <>
##$TILT= no
##$TM1= 0
##$TM2= 0
##$TOPLEV= 0
##$USERP1= <user>
##$USERP2= <user>
##$USERP3= <user>
##$USERP4= <user>
##$USERP5= <user>
##$WDW= 1
##$XDIM= 8192
##$YMAX_p= 0
##$YMIN_p= 0
$$ End of Bruker specific parameters
$$ ---------------------------------
##NTUPLES= NMR FID
##VAR_NAME=  TIME,          FID/REAL,        FID/IMAG
##SYMBOL=    X,             R,               I
##VAR_TYPE=  INDEPENDENT,   DEPENDENT,       DEPENDENT
##VAR_FORM=  AFFN,          ASDF,            ASDF
##VAR_DIM=   8192,          8192,            8192
##UNITS=     SECONDS,       ARBITRARY UNITS, ARBITRARY UNITS
##FACTOR=    0.000296,      1,               1
##FIRST=     0,             0,               0
##LAST=      2.424536,      0,               0
##MIN=       0,             -149396,         0
##MAX=       2.424536,      114178,          0
$$ Real data points
##PAGE= N=1
##DATA TABLE= (X++(R..R)), XYDATA
$$ [...]
994A718j380j910P92K776l003J00L5J366q35o49J049j421O91K53J858l580m2L389
1012A207j49k756o52M562k597j141J918R64k844N77L653l165k52J155J067k262
1028g15J741J027l529K042J761q84l029L184k63j500K112j061j997Q51M532m926
1044f54j759M780o05m275K349M413p147o8O384j319o821L694N045o844O85M685
1060B543k819n096P150K172q776J548O539k094o097N689Q44m787K591K945l414
1075a062k426N938k199k547L364K95m300K044N405n931j483M214P40l658K322
1090G16J109n380M210L877n144m627Q210J494p832K075M574k800l656O410j250
1105A986n287L378L331l658k092N620l053k829M191K308n599j661O639j077k908
$$ plain form
994 1718 338 -1572 -780 1996 -1007 -907 -872 494 -341 -990 59 -1362 -671 -418 1440 -2140 -2182 1207
1012 1207 1058 -1698 -2350 2212 -385 -1526 392 1356 -1488 -911 2742 -423 -675 480 1547 -715
1028 -715 1026 2053 -1476 566 2327 1443 -1586 1598 1335 -165 1947 886 -1111 -260 4272 -654
1044 -654 -2413 2367 1762 -2513 -164 4249 -2898 -2966 3418 2099 -4722 -1028 4017 -2827 -2142 2543
1060 2543 -276 -5372 1778 3950 -4826 -3278 3261 1167 -4930 759 1603 -3184 -593 2352 -1062
1075 -1062 -3488 2450 251 -2296 1068 1363 -2937 -893 4512 -1419 -2902 1312 2052 -1606 716
1090 716 1825 -3555 655 4532 -612 -5239 2971 4465 -3367 -1292 3282 482 -3174 3236 1986
1105 1986 -3301 77 3408 -250 -2342 3278 225 -2604 1587 3895 -1704 -3365 3274 2197 -711
1120g11o36J998k08R16k22l573K189K168n45l563J837J266j463Q38m76l39j047
1137a571K403j300m81R18q53p04P51K891l609j494K174K805j894l202J908J483
1153B25R74k506L58oP28J308j039r79q93L835r04k213O74K131j304j740L989j201
1171A437k854N97M318j987l033K396P3j51N33P18m155J655M432k864l373J934
1187c24L442l874N66J517k119n39K931k66m319L184Q45k547L81L204l267l048
1203d233O226K8m680l52M895k147j602L092k358j703L634K550o653O18N746k282
1219G79l415K977K220n364K424L527l273k378L743Q37m256L314O55l713L19N417
1235C813k626n443M641K354k888j795L128j842n62L351k042k633J927L605m281
$$ plain form
1120 -711 -1347 651 443 1359 1137 -2436 -247 1921 1376 -2187 -350 916 -547 291 -185 -524 -1571
1137 -1571 832 -468 -949 -31 -884 -1588 -837 2054 -1555 -3049 -875 1930 36 -3166 -1258 225
1153 225 1199 -1307 -949 -955 -227 1081 42 -937 -1830 2005 1101 -1112 -438 1693 389 -1351 2638 1437
1171 1437 -1417 -820 3498 1511 -1522 874 947 796 1329 2047 -2108 -453 3979 1115 -2258 -324
1187 -324 3118 -756 -190 1327 -792 -1331 1600 1334 -2985 199 1044 -1503 -1122 2082 -1185 -4233
1203 -4233 1993 2021 -2659 -3011 1884 -263 -1865 1227 -1131 -2834 800 3350 -3303 -2685 3061 779
1219 779 -2636 341 2561 -2803 -379 3148 -125 -2503 1240 2077 -2179 1135 1790 -1923 -1604 3813
1235 3813 1187 -4256 385 2739 -149 -1944 1184 -658 -1220 2131 89 -2544 -617 2988 -1293
1250a293l90L105j060j893J794K009l801J002J729n69q43J171n74k040L831o7
1266B111l085p95M191k84l441J424N19m8n57J451k205m59K595m34j841n17K929
1283A554j904q08J200N81j540q99K678o99j048q80J814J1q62M17q08N78O7J510
1301I62k233o40K080P60j586j268K641q44l55L13N52j053K30J826j823M29N00
1318D91K04j229J569O30k680J246J454m15k193K230j32j620J774L63k103o63M208
1335C134k173k751K447J537k922n96L845k879j643K810J009l906N12L674l125
1350a027r06K578K06l813K384K573l701l53K817k5l297K835O67k751J164K109
1366A460j757j993L881j031k264J857J556k781m25M023k575j786K419J344l383
$$ plain form
1250 -1293 -1683 1422 362 -1531 263 2272 -1529 -527 1202 633 -210 961 387 -1653 2178 2111
1266 2111 -974 -1769 2422 2138 -1303 121 640 592 35 1486 -719 -1178 1417 983 -858 -1375 1554
1283 1554 -350 -1158 42 623 -917 -1816 862 163 -885 -1765 49 60 -802 -385 -1193 -615 -548 962
1301 962 -1271 -1911 169 929 -657 -1925 716 -128 -483 -170 382 -671 -441 1385 -438 -9 491
1318 491 695 -534 1035 1665 -1015 231 1685 1270 -923 1307 1175 -445 1329 1692 -411 -1074 3134
1335 3134 961 -1790 657 2194 -728 -1324 2521 -358 -2001 809 1818 -2088 -1576 2098 -1027
1350 -1027 -1933 645 851 -2962 -578 1995 -1706 -2059 758 733 -2564 271 938 -1813 -649 1460
1366 1460 -297 -2290 1591 560 -1704 153 1709 -1072 -1497 2526 -49 -1835 584 1928 -1455
1381a455P26L045l165m88K664J92l964K329K415l245m28K477Ql101K547Q79k433
1398i97L02K046q37k109K724l18j544M36J741j282j311K438p05q26K37J104j413
1415c14J55J459j500k01O35R67k001N68J111q70l92L31P25j631J047K67n38n69
1433g51Q21N65j823J059L27k12j206J098O47j390K96M61L44j462J259N5r74L83
1451e03P35j17j700J904Q6j119j41J437l03j492J884l23p07QJ525j203q15K131
1469A287p44j053N28J792k211q2K001r18j109Q71J331k589J028J453j540j017
1485i72J943N09k877J605J074j466r50K290n05k381K350M62k022k19K596j549
1501a12j579K417n1j872J98K631k465o36K396n86j842J148J886l002M35K070p93
$$ plain form
1381 -1455 -729 2316 -849 -1337 1327 1519 -2445 -116 2299 -946 -1374 1103 1111 -1990 557 1436 -997
1398 -997 -695 1351 514 -1595 1129 811 -733 -297 1444 162 -1149 1289 584 -242 -5 1099 -314
1415 -314 -159 1300 -200 -401 234 1201 -800 -232 879 9 -383 -52 673 -958 89 356 -182 -751
1433 -751 70 635 -1188 -129 198 -14 -1220 -122 525 -865 -569 -108 236 -1226 33 88 -886 -503
1451 -503 232 115 -1585 319 405 -714 -855 582 279 -1213 671 348 -359 -351 1174 -29 -844 1287
1469 1287 543 -510 18 1810 -401 -483 1518 600 -509 362 1693 -896 132 1585 45 -972
1485 -972 971 1480 -1397 208 1282 -184 -1134 1156 651 -1730 620 1082 -940 -1159 1437 -112
1501 -112 -1691 726 675 -1197 -999 1632 -833 -1469 927 341 -1501 -353 1533 -1469 -1034 1036 243
1518B43j937J722J164k700J130J233j185j250K380lk565J594J107j201j027K231
1534I36q80j295J766R6j371n5K260j741o21J680J4j592N63J969k108l4J190O8
1552H45j233Q33Q96k010R50J121o26j813J663R15j680M3N83L53j332J121j49r67
1570d87M15N62k66j138J268l95m29l5P48m53j044J230j05j31p57P06m7J2M50r00
1590g96J11L42J130j514k00J094J06m99l15J083j101M67N89l21q92P15J038j693
1608f56N89O36l12j291J562Q86k261K41J455K05j951J257K72j023O95P43q47j387
1626a187K436j84j518K26J220p53q63J768r83p79O26J112j361l31J342j254J65
1643c18Q77j70k003J422J529j974n04J244M35j739J526K00j765O20J638p91j959
$$ plain form
1518 243 -1694 28 1192 -1508 -378 855 -330 -1580 800 797 -1768 -174 933 -268 -1295 936
1534 936 56 -1239 527 623 -748 -803 1457 -284 -905 775 789 -803 -240 1729 -379 -413 777 845
1552 845 -388 445 1341 -669 281 1402 776 -1037 626 1541 -139 -96 487 840 -492 629 480 -487
1570 -487 -72 490 224 -914 354 -41 -470 -505 243 -210 -1254 -24 -129 -260 -1017 -311 -358 -346 104 -796
1590 -796 -685 -343 787 -727 -927 167 273 -226 -541 542 -559 -92 497 176 -716 -1 1037 -656
1608 -656 -67 569 257 -1034 528 1414 -847 -606 849 1054 -897 360 632 -391 304 1047 200 -1187
1626 -1187 1249 1065 -453 -227 993 240 -623 1145 162 -617 9 1121 -240 -571 771 -483 -318
1643 -318 559 389 -1614 -192 1337 -637 -1141 103 538 -1201 325 525 -1240 -620 1018 227 -1732
1660a732K243J16j453L89J636j455j397K702j91j646j85J814q37o09J143r83l71
1677h16J000R91k288R7J630m07p88J93P76j219Q96M05q53j61Q76K7j091J511l35
1696D44r82L47J672q22j737J469O24m06o93P55o61P1J294r18j091L90J892j430
1714B18r35Q62M92o66n05J298j007k70K66O55o97k87N85o73N80J92k53j118R26
1733c37J070j003o01J14J200o52J02m42j02P08L02m81j026J439m2o14o7P73m05
1752f4q64J505k43o87k47J176m30l96Q91p89l19Q01J185j967l51J707J57j258
1770a93j19J279j031L26M96m84q26R37Q08j688M79N51l26p72J271r6j600R24O84
1789F20m05j046J111l49n38J160l93j039J57J939j395r48J173M20r40j4J355j468
$$ plain form
1660 -1732 511 627 -826 -437 1199 -256 -1653 1049 858 -788 -973 841 4 -605 538 -445 -816
1677 -816 184 1175 -1113 -1016 614 207 -581 -388 388 -831 65 470 -383 -544 332 359 -732 779 444
1696 444 -538 -191 1481 659 -1078 391 1015 609 -84 671 10 81 1375 457 -634 -244 1648 218
1714 218 -717 145 637 -29 -534 764 -243 -513 -247 408 -289 -576 9 -664 -84 108 -145 -1263 -337
1733 -337 733 -270 -871 -757 443 -209 -107 -549 -651 57 359 -122 -1148 291 249 -365 -432 341 -64
1752 -64 -928 577 334 -353 -600 576 146 -250 641 -148 -467 334 1519 -448 -799 908 1065 -193
1770 -193 -312 967 -64 262 758 274 -552 385 1193 -495 -16 535 209 -563 708 612 -988 -64 620
1789 620 215 -831 280 -69 -607 553 160 -879 -722 1217 -178 -1126 47 467 -473 -487 868 -600
1807f00J2R84L9j198L78J002j191M40N00l55j206J373P15j640J38P24K01r48Q44
1826B12l32n55Q19L70p27o65J591n50o60N14N04p55k43J375p69m41K89O80o34
1845B3%P12r63J70O01M09j476L52J076n06m94j7P54p59M43n6l44k1L41J51q73
1866d77P00j15j26l23N97o4q14O74m5R1n73M73l40mO45o11l79K12J188j149k96
1887g36P13K14n42k00R29q99J56N11K5q48L91R62j125M4O32K53j250O62Q78r35
1907a65k50N25N46j074N97J73m78K16L89j37r33J109p5m19j88O00k27l55P90p07
1927f3L9K21L90p90M0R31q49j70N14M16j297N31P64q60k30N50L98j316P42O05
1947E66q50l74R59K14j477Q89L83m64m37P67K1j010Q39J16l34m78R50k77n28N49
$$ plain form
1807 -600 -588 396 435 -763 -385 617 -574 -134 366 11 -1195 178 893 -747 -609 115 316 -632 212
1826 212 -120 -675 144 514 -213 -878 713 163 -497 17 521 -234 -477 898 129 -312 -23 657 23
1845 23 23 735 -228 -58 543 952 -524 -172 904 398 -96 -113 641 -118 325 269 -75 -96 245 396 -477
1866 -477 223 108 -18 -341 256 192 -622 52 7 98 -475 -2 -342 -346 299 -312 -691 -479 709 -440 -736
1887 -736 -23 191 -351 -551 378 -521 -365 146 171 -677 -286 676 -449 -405 227 480 -770 -108 770 -165
1907 -165 -415 110 656 -418 179 352 -126 90 479 342 -591 518 443 24 -164 436 209 -146 644 -63
1927 -63 -24 197 587 -203 -163 768 -81 -251 263 679 -618 -87 677 -183 -413 137 535 -781 -39 566
1947 566 -284 -658 301 515 -962 -73 310 -154 -591 176 197 -813 26 142 -192 -670 280 3 -525 24
1967B4q7r8k61P70p63J47M16k09k43R2N90q77M34L12k43l86N07L89j034O72K31
1988C83k06o08R67M9j034O06M31j77r00J099r9o61L67L11k63p14J144l65m99J67
2008bN68m12n65Q62l71j49j64N21m14k30O16n20J01m6M04p03L24L11m27o7J24
2029b39M38p39N78jl74N4M34m9q91R43L3m02k79P93j57p46Q06j10k58k51P95m00
2051b2m58P86j29l21k60J025o59l28N36J46l16k69Q70p44K09K16L5n12K67O06
2071F78q84L09J99N3n70M95K00p17L85K08j37o57Q55k34n43M60K21l47n60J064
2091D78l64m39J55M73m65l47R50o08j97K47M77p32%P01n07o1J49L56p62L41M60
2112C05n82o4J50M23p61N94K2m55R6L69L0p92Q60j66k22n4N15k79n18R32j32l80
$$ plain form
1967 24 -63 -161 -422 348 -415 -268 148 -61 -304 -212 378 -499 -65 247 4 -382 125 514 -520 152 383
1988 383 177 -431 536 585 -449 157 588 411 -489 610 511 -150 217 528 265 -449 695 330 -169 -2
2008 -2 566 154 -411 451 80 -69 -233 288 -126 -356 260 -260 -159 -205 199 -504 -180 131 -296 -363 -239
2029 -239 199 -540 38 37 -337 -283 151 102 -789 154 187 -215 -494 299 142 -604 202 92 -166 -417 378 -22
2051 -22 -480 306 177 -144 -404 621 -38 -366 170 316 0 -269 601 -143 66 282 317 -195 72 678
2071 678 -206 103 302 355 -215 280 480 -237 148 356 219 -438 417 183 -360 100 321 -26 -586 478
2091 478 114 -325 -170 303 -162 -509 441 -167 -364 -117 360 -372 -372 329 -178 -239 -90 266 -496 -155 305
2112 305 -277 -341 -191 232 -529 65 87 -368 -272 97 127 -665 195 29 -193 -247 268 -11 -529 403 271 -109
2134a09j31P07l75k46N76l23j70J02P42q04j62O08R7m41j88O36m95J27J06p1k94
2155a08K64K81o36L31l9J3m03M39J43o73L03J14P3m35L97j95j97N19j55l72k45
2176e81J073n13n05K95L86k64k88O52n58J0K26K58n50J9O70n90l3K77L11q15K57
2197b63O58l77l17N7O31n33K59o4k23J57L44p2p32O82J08j53k38L24p8l09N49
2218D10k75r5r1M27l43n3M66m39j32J71O46r20k9N85p4l16j13M97n70L16J68l34
2240i8l11M72L93q77K70J90J0m05M15R7o69L77J60J00o45M80l9j94L36j73p1k49
2262d31Q01l90l71J62L37j55k63N08m62J33J12K28m57%N35l99J58O7P9n81M52
2283F3M37n66j13K19M56o11K84p6j97K42K66j76o79P74j3k44j73L57l7m33N92
$$ plain form
2134 -109 -240 467 92 -154 422 99 -71 31 773 -31 -193 415 512 71 -117 519 24 151 257 186 -108
2155 -108 156 437 -199 132 93 106 -297 142 285 -388 -85 29 102 -333 64 -131 -328 191 36 -336 -581
2176 -581 492 -21 -526 -231 155 -109 -397 255 -303 -293 -67 191 -359 -340 330 -260 -293 -16 295 -520 -263
2197 -263 395 18 -299 -242 389 -144 115 51 -172 -15 329 257 -475 207 315 162 -76 248 170 -139 410
2218 410 135 40 -51 376 33 -20 446 7 -125 46 692 -228 -257 328 254 -62 -175 322 -248 68 236 -98
2240 -98 -409 63 456 -421 -151 39 49 -356 59 156 -513 -136 24 124 -521 -41 -80 -274 62 -111 -182 -431
2262 -431 370 -20 -391 -229 108 -47 -310 198 -264 -131 -19 209 -248 -248 287 -112 46 113 192 -389 63
2283 63 500 -66 -179 40 496 -115 169 93 -104 138 404 228 -451 323 310 66 -107 250 213 -220 372
2304C72j53k29j90N50l14k09M37l66m9J33M83q02oO04q7l76j97N54l59K40J1k41
2326a94j99M65J39p26L36K25m7l95L86Q4n09L41J37q1k76M04j99j44M36j23k87
2347b27n5P53n31k33L13K03j82k21M78m29J28K41j1m37J95N12n67M9J78J80n37
2368b00K84L35n09pK79J88n38K95N1k27J16J20l0n31M97O7j61k67L18O3l50L72
2390A65k51Oo7L51l20j37L68k35n6k5M21o00J47L62k12j69L9L96n13K54J53k64
2412a87j25L91J60o97L44K13o9m15N16K5n31M00J74j53l58N85j35l27L00Q4j54
2433D1j72N72l17k99K60K07k37j93N10m12Q9J19M6k87J57L10n69J46K29K0m29
2454b09L20J66m88J85J71J5n05N17j03k92K22J25j57l35N60k11k42P9L16j72k65
$$ plain form
2304 372 219 -10 -200 350 36 -173 264 -102 -151 -18 465 -337 -343 261 174 -202 -399 155 -204 36 47 -194
2326 -194 -393 72 211 -515 -179 46 -1 -396 -10 74 -435 -94 43 -38 -314 90 -109 -253 183 60 -227
2347 -227 -282 471 -60 -293 20 223 41 -180 298 -131 -3 238 227 -210 -15 497 -70 -21 157 337 -200
2368 -200 84 419 -90 -97 182 370 -168 127 178 -49 67 187 157 -374 123 190 29 -238 80 143 -207 165
2390 165 -86 -80 -147 204 -116 -253 115 -120 -176 -201 220 -380 -233 129 -83 -252 -213 183 -330 -76 77 -187
2412 -187 -312 79 239 -458 -114 99 30 -385 131 156 -375 25 199 46 -312 273 138 -189 111 195 41
2433 41 -131 441 124 -175 85 292 55 -138 372 -40 49 168 214 -73 84 394 -175 -29 200 220 -209
2454 -209 111 277 -211 -26 145 160 -345 172 69 -223 -1 124 -33 -368 192 -19 -261 -182 134 -38 -303
2475c03M26k48j04J02K89l93m2M82l06j55J37L18n27J37K93j94q9Q1L06m98L26
2496C8N1j93j4K14J30n21L97L6j5k44K56L0k49L03r2r7j57M33j84k01K34Pp4j59
2520g1M48l51k7J40K8j66p5L44l70N5J33N3l77J91L13m74J11J37P8l85K42K00
2542A77m18K25N2J01m84M36l4k39P1J51J3l81L97j9k03j6K52j37k20L39j02n5
2564i4j2K70k68r9L03j39Jm2K62l30J43J86k33k3J39J95m37L18M8j98o5K36R7
2587B58m82L78J24k71j55M37q4m00M06K4j83k30N20k00l14K90L3j55j76N06l81
2608e5j35K32Q4k06p3L30k96N1M0O4k41J35J64l31J51K5N8k66K87L6l45K28R1
2631B8j00k25M28k57p0K43L7k19j77N54k29k20J69K30k41j13M20l14j9R6K32l85
$$ plain form
2475 -303 123 -125 -229 -127 162 -231 -273 209 -97 -252 -115 203 -324 -187 106 -88 -177 -96 210 -288 38
2496 38 89 -104 -118 96 226 -295 102 138 123 -121 135 165 -84 219 127 30 -127 306 122 -79 155 162 88 -71
2520 -71 377 26 -1 139 167 1 -74 270 -100 -45 88 141 -236 -45 268 -206 -95 42 120 -265 -23 177
2542 177 -241 -16 36 137 -347 89 55 -184 -113 38 51 -330 67 48 -155 -171 81 -56 -276 63 -39 -94
2564 -94 -106 164 -104 -203 100 -39 -38 -80 182 -148 -5 181 -52 -75 64 259 -178 140 188 -10 -75 161 258
2587 258 -224 154 278 7 -148 289 205 -195 211 235 52 -178 342 142 -172 118 151 -4 -180 326 -55
2608 -55 -190 42 126 -80 -153 177 -119 -68 -28 36 -205 -70 94 -237 -86 -61 -3 -269 18 54 -291 -63 28
2631 28 -72 -297 131 -126 -196 47 84 -135 -312 242 13 -207 -38 192 -49 -162 258 -56 -75 21 253 -132
2653a32M0L84k22j29K9L47m04J03J28r0o6k8K50k52J54l3m7K8N3R6l74L07n9k
2677H1j26J37p9j76L23j77M9j37L02k73p7K38r4j04nL35m06%K38Qk10r1M18m19
2701b45J01J57p2k14K00K83m07R3O4J65l81J97K04l69J52R3P7l02K55j4j61J33
2723IQ6l3k69M71k06q8J2J97j23q8K63l08Q6P0J58l64P0K97k52J1J11J34l99K22
2747F7J84k54j03K07Q2l46K75%k18O3J96o4m07L87K1j11j61K45r1j71K71j72l4
2770a34l7K72k31n3K79j98pj0K56l55J12J73p2j04p1K84k76K39l4o7j30K92N4
2793A82m42L02mM5j84J81L4k06J91J1l5k12K91r6j05J80o2q2j10L52j87j15O1
2816a0J57p8q5J40j98J42qJ14l43J40K36k69L9j5J88l15J18J57k07k3J07J66l46
$$ plain form
2653 -132 -92 292 70 -59 -30 317 -87 16 144 54 -12 -40 210 -42 112 79 32 60 113 209 -165 142 83 81
2677 81 -45 92 13 -163 160 -17 32 -105 197 -76 -153 85 -9 -113 -118 217 -189 -189 49 57 -153 -244 174 -245
2701 -245 -144 13 -59 -273 -73 210 -197 -104 -40 125 -256 -59 145 -224 -72 21 98 -204 51 37 -124 9
2723 9 95 62 -207 264 58 -30 -18 179 56 -32 231 -77 9 79 237 -127 -57 240 -12 -1 110 244 -155 67
2747 67 251 -3 -106 101 183 -163 112 112 -106 -43 153 89 -318 69 90 -21 -182 63 -28 -199 72 -100 -134
2770 -134 -171 101 -130 -183 96 -102 -109 -119 137 -218 -106 67 -5 -109 -180 104 -172 67 33 -34 -164 128 182
2793 182 -260 42 38 83 -101 80 114 -92 99 110 75 -137 154 58 -47 133 71 -11 -121 231 44 -71 -10
2816 -10 147 69 -16 124 -74 68 60 174 -169 -29 207 -62 -23 -38 150 -165 -47 110 -97 -120 -13 153 -193
2839a93K19j3j16N0Q8Ll14L51m9o0j99K47K3k15K07m3q1j7J91k07q5K64j45K1
2863g3J4J43j94M9K09j06r9L4J64l06K01P8q5q9K29N8m10K27J10l8j87K24J4k84
2887a17J94N7n8k20L69j06k18K12J7j21j24L26k45o2J11Q9j00j38K54k58J14Q6
2909F2l6j71Q0J45k19J10n6N6j74K32K5k07J1J28J9k42L70k13j13J70O9j21j87
2932b62M27j19j73M2K25j53r1K42j58jQJ70k68j0K61j61K4k1K05j94M7O0mj09
2956a3L3J28j12P1n3l7k1R8P5k79J66J1K6j30J26m9p9J61j23rr8K69j92m4J25
2981E0Mo9j57L90k94m8K6J14j29l5J83j74M6O9N9k22R8K00k39L1M4J50k74J26
3005e1R5j60O3L5J04k86K52m6r7R3J8K9k11K88q4q6L4J72j81n1K27j16q2P1J82
$$ plain form
2839 -193 26 13 -103 -53 35 38 -276 75 26 -34 -233 14 37 -178 29 -14 -95 -112 79 -128 -213 51 -94 -73
2863 -73 -59 84 -110 -61 148 42 -57 -23 141 -165 36 114 29 -60 169 227 -183 44 154 116 -71 153 167 -117
2887 -117 77 134 76 -144 225 119 -99 113 130 9 -115 211 -34 -96 15 104 4 -134 120 -138 -24 62
2909 62 26 -145 -65 80 -139 -29 -85 -29 -203 29 54 -153 -142 -14 5 -237 133 -80 -193 -23 46 -75 -262
2932 -262 165 46 -127 -85 140 -13 -104 138 -20 -21 -13 157 -111 -121 140 -21 3 -18 187 -7 40 100 96 -13
2956 -13 20 148 36 107 54 17 -4 94 169 -110 56 67 93 -37 89 40 -39 122 -1 -10 -108 161 -31 -75 50
2981 50 54 -15 -172 218 -76 -124 -98 16 -113 -148 35 -139 -93 -24 35 -187 -89 111 -128 -97 -53 97 -177 -51
3005 -51 44 -116 -53 -18 86 -200 52 6 -91 2 20 49 -162 126 42 -44 -10 162 -19 -70 157 41 -41 30 212
3030B12k98P1K11j55o5O4J76k95J14J84k00j8N6J89l67K24l5p4r7J77K1k44K59
3053A10j01j9j33J77o7n7P9pm8j12K55j63m9J40n1J7j42K75k42N1P7oo5l0J95
3078H4k53K00o5L4o8R5Q6k36R5N0J03k51J46O4j60J94p6L0k00K66p5n2M1jL9j69
3104g9K50j22Pn0J26j12l0J77k01Q0K2P4j94J7K14k06N8MJ22k17O3R3o2p6R0L9
3130H7k34J66L2r0r1J71l1j92J79p0L6p5R7m0m6R0p7L2q6K13j15l8O1Mj4n2J74
3157I1j64N8Q0o4m2LJ79k77K26J2l5j56J45R5k44J86oM4k19J92Jj45O2K7R3k23
3183h1K49j18m8M8M3k1j37K30j30m0RJ15q0j29K31k04P1K7R2k43N3J54j75L4j0
3208f0J08j96J82k2j10P1J3L6k44K34l3m9l1J35k9k00K42m0p1m8J98j14p9J97
$$ plain form
3030 212 -86 -15 196 41 -24 40 216 -79 35 219 19 1 57 246 -121 103 68 -6 -103 74 95 -149 110
3053 110 9 -10 -143 34 -33 -90 -11 -18 -66 -178 77 -86 -135 5 -46 -29 -171 104 -138 -87 -10 -16 -81 -111 84
3078 84 -169 31 -34 0 -68 27 113 -123 -28 22 125 -126 20 84 -76 118 42 72 -128 138 63 11 52 51 90 -79
3104 -79 171 49 56 6 132 20 -10 167 -34 46 68 142 -52 -35 179 -27 31 35 157 -60 3 96 34 -42 48 87
3130 87 -147 19 51 -39 -130 41 10 -182 -3 -73 -37 -112 -15 -55 -101 -11 -88 -56 -142 71 -44 -82 -21 -17 -31 -83 91
3157 91 -73 -15 65 1 -41 -38 141 -136 90 102 67 -89 56 151 -93 93 87 131 -88 104 105 -40 22 49 142 -81
3183 -81 168 50 2 50 93 72 -65 165 35 -5 4 119 39 -90 141 -63 8 35 127 -116 -63 91 -84 -50 -60
3208 -60 48 -148 34 12 -98 -27 -14 22 -222 12 -21 -70 -101 34 5 -195 47 7 -64 -112 86 -28 -107 90
3232I0j19k4l8K14j85mJ42k9Or1K01j92P5%l0mpJ35j52P1l4kn0J01M9j92J35o8
3260bN3p0O2M3j17J19o0j6n3K12j24m2M8j3l1q1K11j79Rk5P9r0m2J80j30%JQ4
3288B6j18J2J70j67k0j2J40j94M5J16l9l7K0Q9k27K15o3K4n7J29jj79K03q4N3
3313D4j32K24j30K8P7o8ko9J64j11j6Q7m8m3k3J66k48J21J17r1k6J5P8j77J21
3338E8j2J9j78J73M7k04R2K0N0j40J29o5q4O9N2k8p3J63j12mK6l1j5o5J61j83
3364a35L3rJ05n1q7J92j75R0J1J7j12R4J02j62Q9QQ3k04J49mo4K8P2l7j55K19
3390I7p7k4J4O0L0k14K55p3q4K5J72r3j04J43m5n6k7J72j46k1P6m6K9j65K24j31
3416iO7m1o2j3O8M6j66J54p8K0o6J04J3j75J18J1J4p9J09p3j02J44k8O1j57J97
$$ plain form
3232 90 -29 -53 -91 123 -62 -66 76 47 53 -38 163 -29 46 46 16 12 5 140 -12 59 25 23 -27 74 123 -69 66 -2
3260 -2 51 -19 43 86 -31 88 28 12 -41 171 47 5 53 40 9 -72 139 -40 -31 -56 23 -67 -109 71 -59 -59 -58 26
3288 26 -92 -80 90 -77 -97 -109 31 -163 -118 -2 -41 -78 -58 31 -196 19 -44 -20 -77 52 51 -128 75 -9 44
3313 44 -88 136 6 34 111 43 41 -28 136 25 9 96 48 5 -18 148 -100 21 138 47 21 36 114 -63 58
3338 58 46 65 -113 60 107 -97 -5 15 65 -75 54 -11 -95 -26 26 -2 -75 88 -24 -28 -2 -33 -48 -113 48 -135
3364 -135 -102 -111 -6 -57 -144 48 -127 -37 -26 -9 -121 -27 75 -87 2 10 93 -111 38 34 -30 -2 70 33 -122 97
3390 97 20 -4 10 70 100 -114 141 68 -16 9 181 88 -16 127 82 26 -1 171 25 4 80 34 63 -102 122 -9
3416 -9 58 17 -45 -58 10 56 -110 44 -34 -14 -80 24 37 -138 -20 -9 5 -74 35 -38 -140 4 -24 37 -120 77
3442G7j29k8M3O8k8j33K37j74o1M0J49j08k8J71j55O9k1O6j40Q4J06j40L5J6J00
3467A16j53P7j7q9J03NP1j63J20K8j23N7N9n3r3J60p5Qk7J17j09LM3j02P6k6M9
3494F2r3o5J57r3j5k0J46k32R0P2J2j21J7J58j74P4JK1p9M2O2j94K11m2l2n1R6
3521A0J0j25J19n5L4n7J32j19J1M5J1j0m7R6j10P8j8L0p3JJ46j25LO8np8N4O4
3549I0j27J01m9R2j54J24n4l5J20p6N2j41J72n7m7K9N1n0r0J29r6J8OK7l3o0R6
3576C8j08l0K9J04j35k6J54q1J1n2J42j60N9L4oM3r0J11j48J09r4O9l7O0J5m6
3602c5R4j53J16p5J02m1n8J34p8K3m6J53j54m7J56mo8l7J63r8m5N5n1l0L3J63
3628A72k19O8O0K0j39N7P9r8nJ9O4j29O8N3q1K9l1L0j50J96mn6j6J2M6j18Q8j26
$$ plain form
3442 77 -52 -80 -37 31 3 -130 107 -67 -128 -88 61 -47 -75 96 -59 10 -11 55 -85 -1 105 -35 0 16 116
3467 116 -37 40 23 -66 37 42 113 -50 70 98 -25 32 91 38 -55 105 30 38 11 128 19 22 65 -37 39 13 62
3494 62 -31 -96 61 -32 -47 -67 79 -153 -63 9 21 -100 -83 75 -99 -25 -24 -3 -82 -40 22 -172 39 -3 -35 -86 10
3521 10 20 -105 14 -41 -7 -64 68 -51 -40 5 16 6 -41 55 -55 23 5 35 -38 -37 109 -16 -13 55 50 -28 26 90
3549 90 -37 64 15 107 -47 77 23 -12 108 32 84 -57 115 58 11 40 91 41 -49 80 -16 2 8 35 2 -58 38
3576 38 -70 -100 -71 33 -102 -128 26 -55 -44 -96 46 -114 -55 -21 -27 16 -74 37 -111 -2 -96 -27 -64 -4 11 -35
3602 -35 59 -94 22 -53 49 8 -50 84 6 29 -17 136 -18 -65 91 87 19 -18 145 47 2 57 6 -24 9 172
3628 172 -47 21 81 101 -38 19 98 0 -5 14 78 -51 17 70 -11 18 -13 17 -133 63 59 3 -13 -1 45 -73 15 -111
3656a11J02o2J24r9jJ03j71N7l3J06r5RJ34j42j4P9P9j69N7O7l6m6O1K6j56K06
3682G5q1M7q1O4R8k02R9Lko6J08Jj45J83r8M6q0J32r7mP0j7p1L8J02j39Q7l2k
3711C6n7P1K6j87J44jL7r5J02rj62J53q0P2j49J14l6m3L3K4k8n6J29m9n7k7J25
3738C0m0j50J73j47P0j5R4p7LP0p2P8j02J12p8j9R6j0j4n7J08j04Q1LJ5j2j0J08
3766A34j64J59o2J2n1LP2j00O8p8J07j28J20n9r5J24m0Ql0J27j38p7J23k9%j06
3792a00J93j10L6lMp6oJ48j40P5o2J04j41N8M6j31Q0nM1j09J18l9q4J36q1Nq7
3819a30J44j23Q2K9J9m7p2J75j55N5j1Q2p2l6J68j36K7JQ2j51O0J26j34K0M8R6
3845A47j94J13J7k4l6K2P0j59R5pm0k2L8L1o4M6K0n5l7O3k6j0L4n7N7j07J50j46
$$ plain form
3656 -111 -9 -71 53 -46 -47 56 -115 -58 -91 15 -80 -71 63 -79 -93 -14 65 -104 -47 20 -16 -62 -1 25 -131 75
3682 75 -6 41 -40 24 122 -80 19 22 20 -46 62 63 -82 101 3 49 -31 101 4 0 70 53 -18 20 122 -17 70 38 36
3711 36 -21 50 76 -111 33 32 69 -26 76 67 -95 58 -22 50 -99 15 -21 -64 -31 -7 -35 -91 38 -11 -68 -95 30
3738 30 -10 -160 13 -134 -64 -79 15 -62 -59 11 -61 17 -85 27 -51 -70 26 16 2 -55 53 -51 30 33 48 36 26 134
3766 134 -30 129 67 79 28 31 103 3 71 -7 100 -28 92 33 -62 62 22 30 0 127 -11 -88 35 6 6 -100
3792 -100 93 -17 19 16 20 -56 -62 86 -54 21 -41 63 -78 -20 26 -105 -25 -30 11 -98 20 -19 -103 33 -48 -43 -130
3819 -130 14 -109 -27 2 21 -26 -98 77 -78 -23 -34 48 -24 -60 108 -28 -1 0 82 -69 -9 117 -17 3 51 147
3845 147 -47 66 83 59 23 45 115 -44 51 44 4 -18 20 51 -13 33 53 -2 -39 24 -2 -12 22 -35 22 -85 65 -81
3873h1L0R4r8K9k5O8q3N5oJ1j12J18J5j62J30K4o6n0O7O1j28J00n6J15j49R0L6
3900B7m9O1m7M9q7P1k9L2o3Q5Kp0P3kk2j9J39j46o8J58p9L9k0N8q8K9M0l0L3q0
3930cR4o6L4k6m0k2P1N5j74J18kl6r4R0Np2Q6l0j7r2J35r5l6J38l4m3n8K22j84
3959g6l5J15l3m6p1J69q8N4N5o6kRQ0j33Q0N%q1J09M3j19K2O2n7k2Q2o9L1P3r1
3989@J9jO7r1K6P0n1Lk6Q8p9K1oK4n1jN2j13J27p1M7j16Q7%k9k0k1M8l7O4m7k4
4021d1JN3L1j66J35p6L8o0O2L0n9P5j12L3J9N7l7k7Q0n3N4q6J37j09NL2n3N1j1
4050CO2j03M7l2M8J1LO5j36P8M7n3n2J1R7j29J07n1m6p1J29l1m2M2J3J3j06J45
4078F9n4k4rk0M9j01J79j07j0J0Q2p7m3R3o5K2n5J01r2M8M0r8J6l9K01k57J34
$$ plain form
3873 -81 -51 43 -55 -26 -51 17 -66 -11 -17 -6 -118 0 15 -147 -17 7 -59 -109 -42 19 -109 -9 -65 50 -99 -9 27
3900 27 -22 39 -8 41 -46 25 -4 28 -35 50 52 -18 55 53 31 12 151 5 -63 95 16 55 35 93 5 34 74 44 77 -3
3930 -3 91 25 59 33 -7 -29 42 97 -77 41 39 3 -91 -1 4 -68 18 -12 -29 -121 14 -81 -117 21 -13 -56 -114 108 -76
3959 -76 -111 4 -29 -75 -146 23 -65 -11 44 -22 -24 -15 65 -68 12 17 17 -64 45 88 -31 -9 53 -4 -26 56 -13 18 91 0
3989 0 19 18 85 -6 20 90 39 42 16 104 25 46 40 64 13 12 64 -49 78 7 54 -62 25 25 -4 -24 -45 3 -34 30 -17 -41
4021 -41 -40 13 44 -122 13 -63 -25 -85 -23 7 -52 23 -89 -56 -37 20 -17 -44 36 -17 37 -49 88 -21 -16 16 -37 14 3
4050 3 65 -38 9 -23 25 36 39 104 -32 46 93 40 -12 -1 96 -33 74 23 -23 -94 35 4 -38 4 17 30 -76 69
4078 69 15 -9 -18 -38 11 -90 89 -18 -28 -18 64 -13 -56 37 -28 -6 -61 40 -52 -4 36 -62 -46 -85 116 -141 -7
4105g%o3RN4Jj35K01j16m4L7M2Jj12J92p0k0KO8p4j0J08q3n0M9O1n2%M4n1J5k1
4136b4R0j00O8Q6j15k5P1l4o4J29p9K6n5K6N4j13N7m9O0NN4j38P5m2L5J9n5J58
4164A20j49J8N2k0k8n2O7p3N0ROk9l2P4m3l9N2J1o1L3L2n9L6q2J66r7JN1n4M4
4194DLM1j16J21n8J3m0K0N6p4J20j19O3l6M2rn2R5o7k1KN8p6NQ5q4M8m0R2q6n2
4225f2J25p0l0J1J47j94O7J5Jp3P1M2j12J22n9O5q3N9Rp8O2n0K3o0Q9r3J3J03
4253F0m3lq1R6l3rm%m2pJ44j79O7O9n2k6L5K6o1KK3N2o5P2qo0K5k4O3l9L4rpl8
4287b2R2n7k7M0j9K7o1P4L2j11J00q0O6m8JK%Pl4O2j06Q6o6J10k0m1j3l8M4m2
4317d2N5m6L3m5L3qq3J25l8J3p2R5m0j2M7o4M8p4R5q2L6L9L0n5o6J24o7%j0K7
$$ plain form
4105 -7 -7 -70 -61 -7 -6 -141 60 -56 -100 -63 -21 -20 -132 60 -10 -30 -28 40 -34 -44 64 -19 -69 -20 41 -11 -11 33 -18 -3 -24
4136 -24 66 -34 34 120 5 -20 51 17 -47 82 3 29 -26 0 54 -59 -2 -51 9 14 68 -70 5 -37 -2 17 -38 120
4164 120 -29 -11 41 21 -7 -59 8 -65 -15 -6 0 -29 -61 13 -30 -69 -17 -6 -67 -34 -2 -61 -25 -107 59 -38 -37 14 -40 4
4194 4 7 48 -68 53 -5 8 -32 -12 44 -30 90 -29 34 -2 40 31 -21 74 7 -14 -12 46 -30 -25 60 -24 24 -16 76 -10 -62
4225 -62 63 -7 -37 -26 121 -73 -6 9 10 -63 8 50 -62 60 1 66 -17 42 51 -27 35 -15 8 -52 37 -56 -43 60
4253 60 17 14 -67 29 -4 -13 -17 -17 -59 -66 78 -101 -34 35 -17 -43 -8 18 -43 -41 -18 34 -31 41 33 -27 -2 -26 37 -2 32 23 16 -22
4287 -22 70 13 -14 26 7 34 -27 47 79 -32 68 -12 54 6 7 9 9 16 -18 44 -62 24 -42 68 48 7 -6 -44 0 -42
4317 -42 13 -33 0 -45 -12 -20 -103 22 -16 -3 -75 20 -20 -32 15 -49 -1 -75 20 -62 -26 13 43 -12 -78 46 -21 -21 -31 -4
4347dl1K7J3j9O1q3J03j05M6l3PO8l5P4j16j1P4m3L1J0K5p6Q8o2O0k5K2l3r3J27
4377F7n9O9j00J13o4m0L6J1l1qJ6k7j2K1o9O0j0J9l9rQ0n3L3l0M7q6R6j20R2k8
4407b5rO9q1L3j8J7j7nl8K7L9j3L7K4j0p5L2P4q1MJ5L2q9M1P7k9q4Q0ko3R2q1
4439b7L8j6K3Q7r7K0J7mn3P6m9K1K0Kr0J6M9m3L6p9J19n8o0K0j4N3q7Q0j4K8l0
4470a6o1R8n3P4p3j2Lj4K0j6N5p5Q2j1qkk5P8q5M7J4l1qjKm6R6k4L9r3O0j1n9
4503e6J34p9jK0L9p8RoP6j7o5Q3k5K0r2N7m1LN1m0O4m4J1m2M6K3q8Q4k6Oo8R9
4535E7l6k1k3j2j0j4O1j2QQm5%L1Qm8N9l6O2r8oP1j10Q3N5Jp5L1L5q4L0K2N4j03
4568e7R2n1%N9l4P0j39J38r3O7j9J2p2L8L9p2L0J4kn2P9l5j5LJ8Ko6P5j6k6N0
$$ plain form
4347 -4 -35 -8 5 -14 47 -36 67 -38 8 -25 -18 50 15 89 -27 -38 36 -7 24 34 59 -17 71 9 69 44 66 33 -60 67
4377 67 8 77 -23 90 26 -14 22 33 2 -6 10 -17 -29 -8 -77 -17 -27 -8 -47 -56 24 -29 4 -26 21 -65 31 -89 3 -25
4407 -25 -34 35 -46 -13 -31 -14 -31 -36 -74 -47 -8 -21 16 40 30 -45 -13 61 -20 -16 -1 31 -58 -17 60 31 -53 27 25 -38 54 -27
4439 -27 11 -5 18 105 8 28 45 41 -12 64 15 36 56 58 -32 -16 33 -10 26 -53 66 8 -52 -32 -46 7 -80 0 -14 14 -16
4470 -16 -77 21 -32 42 -31 -43 -40 -54 -34 -50 5 -70 12 1 -7 -9 -34 44 -41 6 20 -11 -19 -20 -18 -64 32 8 47 -46 14 3 -56
4503 -56 78 -1 -2 18 57 -21 -12 -18 58 41 -24 59 34 54 -38 19 -22 -19 32 -8 56 12 23 -19 27 50 -38 46 20 26 -42 57
4535 57 21 0 -23 -35 -45 -59 2 -10 -2 6 -39 -39 -8 0 -48 11 -25 37 -61 -67 4 -106 -23 32 33 -42 -11 24 -60 -30 -8 46 -57
4568 -57 35 -16 -16 43 9 79 -60 78 -15 52 33 45 -27 11 50 -22 8 22 20 -32 47 12 -3 0 18 20 -46 29 13 -13 37
4599C7m0P5j00O3J5o2j5L0Oo4O6n0K5l5L3JMk5L0l4K9Pm6L9j8n5P3J0J6o2K7k2
4631d2P1Mn4N9p4L5j1qJ8J9J0o1J1j0K4pL8L1m8M9l3K0n3M2Ll3j7NP1r2N5J1J1
4664D4n3J00l0m3MpMl6O2k5o5O4Qk6oL0q8L0K4J0m3K1Q0m6l3LM9q0N7K3rk5O8
4697F6k2q4K8No5N1m3L0lM6Pj6n5K9Pm8Q6o3M4j7l4M4k3N1q1P2Rj7p9Q8P2q8j8
4730b1R5k9k1M9l6p4Q1p3N5l9L2j9pML6M2j22O1PnmpK3o7L8l1P5k7mOoLlPo6P5
4766B8p0Q2m8l0M5l1M7p8Q3m8M4m7Rn1L9K0M3l5o4N6nqPJ9j5q8O8j0L6K1qLl0
4799a6J5L7r4P9J0k0k6O6n0N6n4Q1l4l2J4o7J7K5P1n5L0k6n3L9J6j9nj9O8m4j1
4830aM6j8p3N2pm5OM4k2mO8m7K3n5L3l2J4nM%J2qO3p9M8Lm1qP9o4P5m5o4P1o6
$$ plain form
4599 37 -3 72 -28 35 50 -12 -27 3 9 -55 11 -39 -14 -49 -16 -15 -11 -36 -6 -40 -11 -4 -50 -11 -29 -84 -11 -1 15 -47 -20 -42
4631 -42 29 33 -21 38 -36 -1 -12 -20 -2 17 27 -34 -23 -33 -9 -16 22 53 5 54 21 41 -12 30 33 0 -17 -12 59 -33 22 33 44
4664 44 -9 91 61 18 22 15 19 -17 45 20 -45 19 27 1 -5 25 -63 -33 -9 1 -42 -21 59 13 -20 -17 32 -48 9 32 23 -2 66
4697 66 44 -40 -12 -7 -72 -21 -64 -34 -37 9 16 0 -55 -26 -19 -67 19 -44 0 -17 -51 -7 -30 21 -60 12 21 4 -75 13 85 -3 -21
4730 -21 74 45 24 73 37 -37 44 -29 26 -13 19 0 -7 -3 33 75 -47 14 21 16 12 5 28 -39 -1 -32 43 16 12 18 12 15 12 19 -47 28
4766 28 -42 40 -8 -38 7 -24 23 -55 28 -20 24 -23 -14 -65 -26 -6 37 2 -62 -6 -11 -19 -12 7 -8 -96 -28 -38 -2 19 11 14 -16
4799 -16 -1 36 -58 21 31 11 -15 51 1 57 3 84 50 18 32 -35 -18 7 78 23 53 27 -26 13 29 10 5 -14 54 10 -1
4830 -1 45 27 -46 6 -1 -46 -40 4 -18 -22 46 -1 22 -33 0 -32 -18 -23 -19 -19 -7 -15 48 -31 17 20 -21 -29 50 -14 61 16 -48 23 -43
4865d3J9l7M8J8k4M0nm4J6N4l3M9o9pL2m7R2o1L6l5J20j28M3k2po2O4J2NNl5P4
4897F8o4m2R0p5M2m0K2l7JK8Qm0L2J2p2J14r0M3qnK0j9N7q3N9o5M4o1M2M1q5Q0
4929A7q6J47m6n6L0Rj4K5J8q5k4Q2L4k1r0J46m8m3J3Mnk5N6p5N6%Qm9O7m8PK9
4961C3n0K1K7l0rL8K4Lr9K5O1o9N8qkL7m6J1qk3qLk1M6Kl1k4P4p6J0M5m3Qj0J
4996c0K2j8Ol3N7J6p1N6o5O0L2p0l2J7K2J9N6o3R7k8k1m8K6oM5j8j8N9p8NQ1r5
5028a8M7K0o5K6K0J6p6Om0Q1q4P3K6k7k0mkJ8M5o8JJ1O1k4k2Ok1K0n2P4l1N4n5
5061dJ1l9l5R6o4J4KK0Qn1L0m9J7J1N4m8nP7m6k3RK1j02R1MJk3L1n5O8L9m9Kq
5095EK2K1j9L5l1j4%L4n5k1P8q4Q7q0J7j7J8J3n3R2n1J2m6N8qqj9K6L0j13P3j7
$$ plain form
4865 -43 -24 -61 -13 5 -19 21 16 -28 -12 42 9 58 -11 -18 14 -33 59 -2 34 -1 119 -9 34 12 5 -57 7 19 24 29 -6 68
4897 68 4 -38 52 -23 19 -21 1 -36 -35 -7 1 -39 -7 5 -67 47 -43 0 -8 -13 7 -12 45 -38 21 -44 0 -61 -19 22 -63 17
4929 17 -69 78 32 -24 6 15 1 26 44 -41 -65 17 51 30 -60 86 38 -5 8 12 7 -18 38 -37 19 19 27 -22 45 -3 4 33
4961 33 -17 4 31 1 -8 30 54 57 -42 -17 44 -25 33 25 23 60 14 25 17 -6 -14 -11 -32 14 16 -15 -39 35 -41 -31 14 -29 -21 -31 -30
4996 -30 -8 -26 -20 -53 4 20 -51 5 -60 0 32 -38 -70 -53 -31 -12 44 -19 78 50 29 -19 7 1 46 28 10 69 -9 -4 77 -18
5028 -18 29 49 -16 10 30 46 -30 -24 -64 17 -67 6 32 5 -15 -19 -21 -3 42 -26 -25 -14 47 23 1 7 -14 6 -46 28 -3 51 -4
5061 -4 7 -32 -67 29 -35 -21 -19 1 9 -42 -12 -61 -44 -33 21 -27 -32 45 -1 -24 -15 6 -96 -5 -1 0 -23 8 -47 21 60 11 13 5
5095 5 27 48 29 64 33 19 19 53 -2 -23 55 -29 58 -22 -5 -22 -4 9 -44 48 -3 9 -37 21 13 5 -14 12 42 -71 2 -15
5127a5NJ6k2O4m4M0n2K0l7K0K2j1l3j1K6nJ0m5O9r0M4K0j6J3o4P6k4P8p2O5j6
5158C1q1P6m3K3lN9p0n0N3J6N1n6k0N8l6J4l6P7q7M8Jjm2nM0L8k7j0j5lO5j5j6
5191C4nm1N5j6m5L2k9J6J3mk6j3j0O9l5n3O7m6N8p3O6L1o6ljM8m5QRM1m3N4l9
5224Hl2qQ6l1q0M2nl3O3pp0L0Q3p3pKK5k5K9L7k7J3p9L1k8R9m4M7j9k4J1l7M0
5257A7m2N5oL0m2k5M5Rl7Oj9k7L0J0m5L8j4N9p3O2l9J4K3j02R3m5J0j1O1q4M6
5288cL3n4M8j02Q4k6J4PRM7p4J7j2J4M8p2J04r6J3k6L4n2J4O1n9O4m5L1k1O2k9
5319C3Rk8j2ok6K9qopK9j9P4o4l0N4n0Q0n2J1qJ8L2j22P6PL4l7JJ0m0R2q8O8n7
5353cJ2nmj7OK2j32J43p5M6m6M6J0j9L2p7M1k9N3K7k8Kj6M0k4O4o6J8Jo7Q7o5
$$ plain form
5127 -15 -10 6 -16 48 4 44 -8 12 -25 -5 17 6 -27 -38 -12 -17 -7 -52 17 -73 -29 -9 -25 -12 -76 0 -24 54 -18 47 31
5158 31 -50 26 -17 6 3 62 -8 -58 -5 11 62 6 -14 44 8 22 -14 63 -24 24 25 24 -18 -23 17 55 28 18 3 0 65 50 34
5191 34 29 -12 43 27 -18 14 -15 1 14 10 -16 -29 -39 30 -5 -58 9 -37 21 -52 14 45 -21 -24 -25 23 -22 -14 -5 36 -7 47 8
5224 8 -24 -32 54 23 -57 -15 -20 -53 10 3 -67 -37 46 -27 -34 -32 -7 -32 -3 34 7 20 -59 -28 -56 43 -1 46 27 3 14 -23 17
5257 17 -25 30 24 54 12 -13 32 41 4 10 -9 -36 -6 4 -41 -3 -17 42 -31 31 -8 6 29 -73 20 -25 -15 -26 35 -49 -3
5288 -3 30 -24 24 -78 6 -20 -6 1 10 57 -17 0 -12 2 50 -22 82 -14 -1 -27 7 -45 -31 30 -29 35 -10 21 0 62 33
5319 33 42 14 2 -4 -30 -1 -9 -15 -22 7 -12 62 -2 -32 22 -28 52 0 11 3 21 53 -69 7 14 48 11 12 22 -18 74 -14 54 -3
5353 -3 9 4 0 -17 -11 11 -121 22 -53 -7 -53 -7 3 -16 16 -61 -20 -49 4 31 3 5 -11 29 5 69 3 21 22 -45 42 -23
5385b3J9J5j3M8o9KL6l8L8j3n8Q8k9k6J5j6K1L0j2k5L1l1J3M3n1J3k5J9%qkjO4
5418E5p6mM2rM1p2QLkjK9m4M1L9m7l4K1k3QnJ1l6N6q3M6M7J0l4j9J4N5j5Jk7K4
5453B0PqRj3k1K6p2P3m8O9J5o3J6n5N1jrMk9K9N9o3pKN9j11O7K0m3N7n3RN3j1
5487C8l3L3m2J5o0J7K0J6M8j1n2N7p5K1k0M8m1j5P0n8M9o0qL2l4KL9L5q4M0j2
5518b5k7N7j7J9j9O1m1j6Ln4M0NJ3K6o9L4L5k1L0l3LK4lK7o1lK0J0J7j0J7k8J
5551A5J0Nm9j7M9l1P0j9k0l4K2L4n3m6O4j7M0okq9R7l3J5k9M2K9m3jl2%k2O9j4
5584DlJM3o9j5N6l4N2n6JN0r0R3rk2qK7n1J6M2r1R4q1K7L9k0nrJN1L6o6M6k6n
5619A9qj8M4NJ5p2J1K9N7j01N4m6l1N3%J3mj2l6J3l5NN1m0N0m8L3l3J6k7L8K1
$$ plain form
5385 -23 -4 11 -2 46 -23 -21 15 -23 15 2 -56 32 3 -23 -8 -24 -3 27 15 -10 21 -10 3 46 -5 8 -17 2 2 -6 -8 -9 55
5418 55 -21 -25 17 8 49 -23 -15 -12 -14 -15 14 -30 11 50 3 -31 -10 -33 -25 -30 -19 -55 1 -82 -36 11 21 -13 -32 -18 37 22 23 -4 20
5453 20 27 19 28 15 -6 20 -52 21 -27 42 57 -6 10 -45 6 5 -4 0 -29 0 59 -4 -11 -9 50 -61 6 26 -17 40 -13 -4 49 38
5487 38 5 38 -4 11 -49 -32 -12 4 52 41 -11 46 -29 -8 -28 20 -21 -36 34 -24 25 -35 -43 -11 -45 -43 -4 31 -53 -13 -25
5518 -25 -52 5 -12 7 -12 49 8 -8 -5 -59 -19 -14 -1 25 -44 -10 25 4 34 1 4 28 25 52 -9 -12 8 18 35 25 42 14 15
5551 15 25 30 -19 -36 13 -18 52 33 13 -21 1 35 -18 -64 0 -17 23 17 15 -74 23 -10 5 -24 18 47 4 3 -29 -29 -51 18 4
5584 4 1 2 45 -24 -39 17 -17 35 -21 -20 30 -60 33 24 2 -6 21 -30 -14 28 -63 31 -50 -23 16 -4 -9 -18 -17 34 70 4 50 24 19
5619 19 11 -7 37 42 57 -15 -4 25 82 -19 35 -11 -42 11 11 24 20 8 -28 -15 -50 -45 6 -34 16 -32 1 -32 -16 -43 -5 16
5651A6k9J9l1J0j9PL4P2n5n5Q2o2l3L6qN1n2K5m2N4m5M1rJ4l6l7N3m3N0Kj8m5
5683e3OO0L9m5J6Mn8j6Q0%J8r1N7mJ5l2k4K4K4QL1k1m0J5k2J3L7Kn1j0NK6k5p
5717a9j0P4j25K3O7Pmolm3L2K9k0n7O8l4Oj2RL9o3O1n3Kj8P1m1PJ2J6k7j3P4k9
5751B0J6o3N3L0p5M8n5K4K6L0nm6k4k9N3%j3j7J5k2K7N0p3j9K8L0o2O9M0m6J0
5782B0M0k5j9J7mm8K1L9k5nl3J2o5P5n0L4l7P4r9O5on6Q8o0R0j5j1%j3l6J2O2
5814D2j7o3kR0k1pj5KRM6l9m7J3k4M4L5k2m8L7Jj9M3k1Kl8j8P0p0OO2J9r1N9Q
5848B6km1oJM8Qj9J7j4j7J7m3L4r3J51p2J4M7j08N5PLj8jJ4k8J0j9j3K3NK3o6
5881e7O6o0Q9p3oM9Mr1Q7l0J3K7r5M1nN1Lk9O2j2l6JL2j4qK5m9K3oOl2J0%J3k6
$$ plain form
5651 16 -13 6 -25 -15 -34 -27 7 79 24 -31 51 -11 -44 -8 -16 35 -17 8 -34 20 -25 16 7 21 -15 -52 1 -42 8 10 -8 -53
5683 -53 -47 13 52 7 23 27 -31 -47 33 33 51 -40 17 13 28 -4 -28 -4 20 28 59 38 -2 13 -9 4 41 43 -8 -18 -13 13 -12 -19
5717 -19 -29 45 -80 -57 10 17 13 7 4 -39 -7 22 2 -55 13 -21 -15 -27 -18 21 -42 19 -34 -32 -50 21 -20 -13 -1 15 -12 -25 49 20
5751 20 36 -27 26 56 -19 29 -26 -2 24 54 49 3 -21 -50 3 3 -10 -27 -12 -34 -7 43 -30 -49 -21 9 -53 16 56 10 20
5782 20 60 35 16 33 29 -19 2 41 16 11 -22 -10 -75 0 -50 -16 -53 21 -78 -13 -19 -75 13 -47 43 28 17 17 4 -32 -20 42
5814 42 25 -38 -40 50 29 22 7 9 18 64 25 -22 -9 -33 11 46 24 -24 13 14 -5 38 17 19 -19 -37 33 -37 -31 31 50 -41 18 26
5848 26 24 -17 -23 -22 26 34 15 32 18 1 18 -25 9 -84 67 -5 9 56 -52 3 10 13 -5 -6 8 -20 -10 -29 -42 -19 -14 9 -57
5881 -57 9 -51 38 -35 -41 8 12 -79 8 -22 -9 18 -77 -36 -41 10 13 -16 46 34 -2 -1 31 17 9 34 -15 8 2 8 -24 -14 -14 -1 -27
5916b7K5%L0l4KkNK3Qr6Q4jn6K5RN5n1%m2K7nK7k4O4k2j9K9n7Q1o3j4K7lJ2l8
5951b1j3QM3m5M4o9M9k8L3m8L3J0m6M8k0NQm6Lj2M5j3OJ2K2J7j7Mn1M7K9k4J4
5984B7n3L3j1OM0lp3L0L5oOn4RPJ8o2L7pK3j2k1l0M4J2m3R2m5m0M8j3K3l0M6n0
6018a7%qrM3K0j0Jk0k2K4L1qj3pjOl1K8k6Pj1M8j1j4k4jKM3lm1lPlL1j1J9n2N
6056c1LL8n9P5Ml5rK3K4j7j3oOL8m2J6k6L8l9rlL2Km5M5L5r2K2L5k0jm7L9j3N3
6091B1n5J5J3qK5nj3N1Rp8P7o5L4j8kJ9p2L4K5j7KJ0k6QJ2k0L5m8K9N5m4l0l3
6124f0Q4k5k0O1k1K0q0JM9j2K3Ok5L0%Km6K6J5k8M9n7k8L9ok6J01n0L3m3j2jJ0
6157IMKk1k3j0K5%L7j7J7l6j0J8Rj7L3n3L1K8n2P3m4J6Nl0K2n8O0pJ8l2kj2N8
$$ plain form
5916 -27 -2 -2 28 -6 -4 -6 -1 22 30 -66 18 17 -39 -14 -5 50 -1 -1 -43 -16 -21 6 -18 46 24 5 34 -23 58 -5 -19 8 5 17 -21
5951 -21 -34 -26 17 -28 16 -53 -4 -32 1 -47 -14 -4 -50 -2 -22 -17 -9 -55 -52 -64 -19 -32 -26 -14 8 25 8 12 -39 8 37 13 27
5984 27 -26 7 -4 2 42 39 -34 -4 31 25 31 -23 -14 -7 11 -51 -14 -21 2 -10 -31 -61 -17 -5 -48 44 -1 -41 7 -6 17 -13 33 -17
6018 -17 -17 -25 -34 9 29 19 20 0 -22 2 33 25 12 5 4 10 -21 7 -19 -12 -23 25 14 0 -24 -25 -23 20 17 -24 -27 -20 -23 8 -3 16 -36 -31
6056 -31 -28 10 -49 26 30 -5 -14 9 33 16 3 -3 3 41 -1 15 -11 27 -12 -21 -24 8 10 -35 10 45 -47 -25 10 -10 -11 -58 -19 -32 21
6091 21 -34 -19 -6 -14 11 6 -7 44 53 -25 52 -13 21 3 1 20 -52 -18 7 -10 -8 2 -24 -16 -4 -24 11 -37 -8 47 3 -27 -60
6124 -60 24 -1 -21 40 19 39 -41 -40 9 -3 20 26 1 31 31 33 -13 13 28 0 49 -8 -36 3 -3 -29 72 22 55 12 0 -1 9
6157 9 13 15 -6 -29 -39 -14 -14 23 6 23 -13 -23 -5 4 -13 20 -33 -2 26 -26 47 3 19 24 -6 16 -42 18 11 29 -3 -5 -17 41
6191D1l9k3N6n0k6L3nN1k8Pm5N2q7J11p3L2Jr3J22l5OJ5L7q9J6j8L1J4n5N7k8
6222a2K3L3l0j6K2K6p1O0j8J9j25R2j4J8M4o1P0r3JL4k4L3n0O4n0j1K1L5m2oN2
6253B4Pr5J00Kl1J3j7k3M2M0Jm8M3n3PQOk5mM1J4q8J0K6J5k6M8k7J5J2m7l0J0
6286c0M8l5j5J1JJ7K5j0l3J3L1J1o6O0L8n4j4Qk6MM8l1oK3k9oK4K5j3Pm0j4M1
6319A3Qj1J9n3j2lM%k6N8j2NM0p4OK2J8jmJ3k4M6o1N3l1LN7m4j1J3P1r4M8o8K9
6354cJ2j1J7l4P2p1J3L0l8L3n1QN2k0o7O6MJo1M4J7k9O9n3k4L7l5J8k2L8%m2J9
6387a1L4m7J4%j3KL0pj6L0qJ6k2j5K3l4k6J7M4J7p8R6p7k1j9J04n4K2jPJ8j4n
6420Fj2J6PL8j3m7M9ml1jK2K5p4L4J2Kk1L0l6P1r3J1P8j12RL4j3jJ0k4N2m8LR
$$ plain form
6191 41 2 -21 35 -15 -41 -8 -13 38 10 17 -28 24 -63 48 -25 7 8 -85 37 2 8 23 60 -29 -13 -31 0 14 -41 16 -12
6222 -12 11 44 14 -2 20 46 -25 35 17 36 -89 3 -11 7 51 -10 60 -33 -32 2 -22 11 -39 25 -25 -36 -15 20 -22 -28 24
6253 24 31 -64 36 38 7 20 3 -20 22 62 63 15 58 5 12 20 26 1 -3 38 52 -36 -26 0 15 -11 37 10 25 37 -10 -40 -30
6286 -30 18 -17 -32 -21 -20 -3 22 12 -21 -8 23 34 -32 28 66 12 -2 6 -20 -16 32 1 -5 18 -11 -17 7 32 19 26 -14 -28 13
6319 13 21 10 29 -24 -36 -39 -35 -35 -61 -3 -15 -10 30 -44 -38 -16 2 1 -3 10 -14 32 -29 24 -7 -4 53 9 -2 11 82 -12 36 -32 -3
6354 -3 9 -2 15 -19 53 -18 -5 25 -13 20 -31 -23 29 9 -58 8 12 13 -48 -4 13 -16 53 0 -24 13 -22 -4 -26 12 12 -30 -11
6387 -11 23 -24 -10 -10 -23 -21 9 2 -14 16 8 24 2 -13 10 -24 -50 -33 11 28 -50 46 -31 -52 -71 33 -21 1 0 7 25 11 6
6420 6 -6 10 17 55 42 -5 44 40 9 8 30 55 -19 15 27 29 8 38 2 73 -20 -9 69 -43 -34 0 -13 -14 -4 -28 24 -24 -21 -12
6454a2kk2M4l8l1K9J5rN9k3n6K0K6L3rl1J6j5pj0M7l5JJ9%j03N1L1o5P7j0K2o0
6487d8L8j9O2o5O0l1k0M4r0O4K4n5L5k9N6qj8J5MJ0J2m8KL0m4L2OnJ1M4lp0J3
6520Il2L8k3k7J5J4jorJNk3L6rj5j3L3%RJ8r0N4O6q7K0m3O2m6K9J8K5m4jo2K7
6555e2N1J6m7OKJ7mrJ1K1j8L7k3o3O3J4Lm3L3n7N3n5P4K9n9N6p7j5M7J6j3J0J5
6588C9p8P2l8l5L1N6J0k7J7l0j0n2Q7lo5M9q5M0MK8nk8RNQk9%j7L4L9Ll1KJ4n8
6623d4j1J6J8j0N4k1k7Q2j20Q2p4O6l3M4l5NJ4j8M6k3Jj4kk8N9L0J3m5n0P6q6
6654c5M8K3m1RK2k0QK2m6L0l2k8P4o1J2K6l4J1k7J07q4M4l1j3K1l5N6m1qm5P2
6685Dk7l4M4J3LLk0mK8l3j5M3M6j6k7N3n5j4K1k1J6j7O3n3M6n8L0k7kJ8pJ2J7
$$ plain form
6454 -12 -14 -36 8 -30 -61 -32 -17 -26 33 10 -46 -26 0 33 24 -7 9 -6 -13 -23 24 -11 -10 9 9 -94 -43 -12 -77 0 -10 12 -48
6487 -48 -10 -29 33 -32 28 -3 -23 21 -69 -5 19 -36 -1 -30 26 18 0 15 19 29 41 -7 -5 25 -19 13 19 14 25 69 66 -4 9
6520 9 -23 15 -8 -35 -20 -6 -7 -13 -22 -21 -16 -39 -3 -12 -27 -40 -7 -7 2 20 -70 -16 50 -37 -17 -60 2 -44 -15 3 28 -16 -17 -79 -52
6555 -52 -1 15 -32 -26 -24 -7 -11 -20 -9 12 -6 31 8 -55 8 22 25 -18 15 -42 11 -44 30 59 0 56 -21 -36 11 27 14 24 39
6588 39 -39 33 -5 -40 -9 47 57 30 47 17 7 -45 42 39 -26 23 -62 -22 -18 10 5 -23 -14 -9 -1 -30 -30 -47 -13 26 29 -2 0 14 -44
6623 -44 -55 -39 -21 -31 23 2 -25 57 -63 19 -55 11 -22 22 -13 -8 6 -12 34 11 12 -2 -4 -32 27 57 70 25 -25 51 -35
6654 -35 13 36 -5 4 26 6 14 36 -10 20 -12 -40 34 -27 -15 11 -23 -12 -39 68 -16 28 -3 -16 5 -30 26 -15 -23 -68 4
6685 4 -23 -57 -13 0 3 6 -14 -18 10 -23 -38 5 51 35 8 61 6 -8 13 -8 8 -9 54 1 47 -11 19 -8 -10 8 1 13 30
6718C0L6j03N3L4o9N5l0M5l0L7p3oPj4K5l8Q5n4RM4p4L3K6j6n6M3L6j7l3M0Rn8
6750b4K5J9J4m6J4j6J6PK3j5j0ML6p4L6m0K7k8LL1m2k2O4oj5L1OK3n9J6O9m2l6
6783a1K2J9n0O3l1N7q5J6Nl6O5p2R0m0Pq2Q4j0J1j2n1Q0k7J1l5k7L2k0K0l8N0
6814El4M3Mj2l0L9ql3P8j5n3K3k4k9KJ9N9l9M3o4P5o1L2j4N7j22M5nM3j4l9L2
6846Ck0M6p2M2m9M1M5r5O2ml2j1L7mOKl8J4K1j0k1lQ7o4K7k2Ol7N1M8l1j9k3P8
6880F1n9ln1J8K5K6Lm9L9k1O8q2Q7m4o9RL8L5m8N1p6R6p5J4l1K9m0J9J4k5LM4
6912Fj8K9p3J14n5K4k3o6R2m5%K1J4n8O2q1j5O3rJ0L4k8m3M4J3j9M1kj1k4L9p8
6944d2K7P7k0j0o0J7J4M9o9Q0o5k1R2p4N6k1l4K3Nk5J7l0k0ON4l5lK5Lj04J08
$$ plain form
6718 30 66 -37 16 50 -19 36 6 51 21 58 -15 -21 -14 -28 -3 -41 44 -10 -1 43 -31 2 28 12 -44 -1 35 18 -15 25 34 -24
6750 -24 1 20 34 -12 2 -14 2 9 32 17 7 11 47 -27 9 -31 -4 -32 -29 2 -40 -62 2 -4 -19 12 18 41 -18 -2 67 25 -11
6783 -11 11 30 -20 43 12 69 -16 0 5 -31 34 -38 52 12 19 -63 21 11 22 10 -41 39 12 23 -12 -39 -7 -27 -7 -45 5
6814 5 -29 14 18 6 -24 15 7 -26 52 37 -16 7 -17 -46 -44 -25 34 -5 38 -26 49 -12 20 6 63 -59 -14 -19 24 10 -29 3
6846 3 -17 29 -43 -1 -50 -9 36 -59 3 -1 -33 -44 -7 -11 -5 -3 -41 -27 -6 -16 -37 -40 47 -17 10 -12 -6 -43 8 56 25 6 -17 61
6880 61 2 -1 -52 -34 -9 17 20 -29 10 -11 57 -25 62 18 -51 -42 -4 31 -17 34 -42 54 -21 -7 -38 -9 -49 -30 -16 -41 -38 6
6912 6 -12 17 -56 58 3 27 4 -62 30 -15 -15 6 20 -38 24 -57 -72 -9 -18 -8 26 -2 -45 -1 12 -7 34 32 21 -3 36 -42
6944 -42 -15 62 42 32 -28 -11 3 52 -17 63 -2 -23 69 -5 51 30 -4 19 24 -1 16 -14 -34 -28 26 -9 -12 13 16 -88 20
6975B0j2n0J7l5N3oo8O6J8m1Q1k9n6M1K3k0l9K2L4m3ROn0L6j7K6K8j9j6OJ9k1
7007a7j8L1l1M1j5j4N6o1J11j27N0J0j9n7Q4l9L4l3M3m9Q6j7n8L3m2qM3k9K3n0
7037c9kR4o8l3J5L9p2N3oO6n7Om4N8l8K8nJ5J8l0l1J6J0l5jN3l8L9oOQm9J7jq
7072b2l4R9q6J9j4LL7l2Mj2M5j8k2N1l6Ql0L0lk2P9p3M0J4Om0J4m0L2K7%pk2j9
7106b4Q0j9r2Q3J6q4Q1j7J1j8j6L3o6M6j9K3m5O4p2JR5p1L7n3O0m5j3QkmL4j8
7138fm0M7o7P2mk4j1K3J1j3L3j5J6l8mON8j0j7mJ6l4M9p9R3o2KK5J0l9L4jn3j9
7172d5N7K7l6n1Q6j3n6KnM0jJJk5K5Qn6P7p9M9J1k4JK1J8r5M9rJ0mK3nl6L1m4
7207d7orL7rL7rj9n3K5J1JM4k8L4L8p2k0M3K1j8l9L6N0n9pM5m2J5l8P6J7o1jm6
$$ plain form
6975 20 8 -42 -25 -60 -7 -13 -81 -15 3 -38 43 14 -42 -1 22 2 -37 -15 19 -24 -15 -9 -59 -23 -40 -14 14 -5 -21 -15 4 -17
7007 -17 -35 -4 -35 6 -9 -23 33 -28 83 -44 6 16 -3 -60 24 -15 19 -14 29 -20 66 49 -9 24 -18 -26 17 -12 11 -39
7037 -39 -41 53 -15 -48 -33 6 -66 -13 -19 47 -10 -4 -48 10 -28 0 -5 10 28 -2 -33 -17 -7 -42 -43 10 -28 11 5 11 19 -30 -13 -14 -22
7072 -22 -56 43 -43 -24 -38 -35 2 -30 -26 -38 7 -11 -33 18 -18 -10 -40 -10 -13 -35 44 -29 11 25 31 -9 5 -35 -3 24 24 17 -5 -24
7106 -24 56 37 -55 28 44 -40 41 24 35 17 1 34 -32 14 -5 18 -27 37 -35 -34 61 -10 27 -26 34 -11 -24 -16 -18 -22 12 -6
7138 -6 -46 1 -66 6 2 -22 -33 -10 1 -12 21 6 22 -16 -20 -14 44 34 17 13 29 -5 44 -35 58 -4 -2 23 33 -6 28 27 -26 -45
7172 -45 12 39 3 -48 38 25 -31 -29 -34 6 5 6 7 -18 7 15 -41 36 -43 6 17 -7 -6 15 33 -62 -13 -22 -12 -16 7 2 -34 -3 -47
7207 -47 -53 -62 -25 -34 3 -6 -25 -78 -53 -42 -41 3 -25 9 47 -25 -45 -2 19 1 -38 -2 48 -11 -18 27 -15 0 -38 38 55 -6 -7 -53
7241e3J29n0k3l6L7j3N6l7j2Qm3L6m8N9RJk5k7J7k3P7o8M9j4j5k1M1j8K0j1on
7273ioO4J7l6Lj5ok5j2J9l7K7k7K9k0k5L8j1O3n0M6n6L0q2J08ol5mL3j0l0L7k7
7306a5RK7J1k3lJ8n8L5L4j5m9O0J7k7K8o3L1m1MM6mk2k6N7j9%n5L9n1M7N0p9Q5
7339D8q0M5L4o6K6J2l4OK3k9K5kJk0m5O0m3O4m7k9M0j5N5m9L7j7k2M3n7k%M0l4
7372c2J8j0MK4j0Jj8J6m8L1oL8j3jj7K8l3N1M9km7k9N1l8n6J18l7j7j6k5P3m9
7404bj4k6P4l7lnm1O5m4L5k1O7o8JN3m0nJjJ9k1M0j4k8Monk3N7j4J1K1k2j4K9
7439B3kl6rN2r1P2Kj3kkkL8l2o0M7L3n9P0o4K7nJ8j1%J2l1N8m4L6m4N4o8O8kq5
7474e2P8n5M9n7M6J2L0o0K7Ro4k2N8l5rJ0O2o4LJK8M4k8p1N7j5k5qj7O5Kk3qL4
$$ plain form
7241 -53 76 26 3 -33 4 -9 47 10 -2 6 -37 -1 -49 10 19 20 -5 -32 -15 -38 39 -29 20 6 -9 -30 11 -7 13 2 -4 -9
7273 -9 -15 49 66 30 33 18 12 -13 -25 -6 -43 -16 -43 -14 -34 -59 -21 -32 31 -19 27 -29 1 -81 27 21 -14 -18 15 5 -25 12 -15
7306 -15 -6 21 32 9 6 24 -34 1 35 20 -29 31 48 21 49 -14 17 -24 -20 26 22 0 -26 31 12 12 -43 -4 -55 -8 42 -37 48
7339 48 -32 13 47 -19 7 19 -15 -9 14 -15 10 8 9 -11 -56 4 -39 25 -22 -51 -11 -26 29 -20 17 0 -22 21 -36 -38 -38 2 -32
7372 -32 -14 -24 -20 4 -6 -5 -23 -7 -55 -24 -30 8 -5 -6 -23 5 -28 23 72 70 23 -6 45 7 -49 69 32 15 -1 -26 47 -2
7404 -2 -16 -42 32 -5 -8 -13 -54 11 -33 2 -19 48 -20 -19 34 -6 -11 -10 -11 8 -13 27 13 -15 -11 -17 -22 -45 12 -2 9 30 8 -6 23
7439 23 21 -15 -24 28 -63 9 11 -2 -4 -6 -8 30 -2 -62 -15 18 -41 29 -35 -8 -13 5 -6 -6 6 -25 33 -11 25 -19 35 -33 35 33 -52
7474 -52 26 -29 20 -37 9 21 51 -9 18 27 -37 -59 -1 -36 -45 -35 27 -37 -34 -33 -5 39 11 -60 -3 -18 -43 -51 -68 -3 -1 -24 -32 2
7508Bom3L7n0M0N1mm0l2K8k7N2k1L3j3p5N9rM2m5M6l4PK3p1M8L3lq4N3On2R6q7
7542d0J3L7pJ1kjJ9M9q9N6Kk4k9N2k4k2K6j7N6n0Ll6K3Kl4K6Rk7K2o6L3M6q0k0
7576h3Q5k2L6m8P4j7n5M6o4J7J9J3kJ8L0j00O3J0op1M5Pj9M4l1J8qJ7MjJ8j9m7
7609b9L0L9r6N5j3j4K0mJ3oPK0jol0K8k2O2n7J2K6n6L7Opj1K4m8L7n3O3r2N6Q
7643bQkl2K5j7k0N4l0j3%L1n5P9m2j4k7O5p8J9N5ll1K2ol0N9M0m5K4Qn1nl9L6
7677a7%l4M8J7j1M7l4k6%O%J3k3%J9j3mQK6j3j8J6n8O2qm4M5k3L5n9N5k8O4o3
7711a5L5k0qJ6RO0o3J4k7j7L0RJ4l1l5J2Kj4mL9m1P5n7L4roJ8n4QJ6oK1k3k2N
7746c5J8OM5l0M0m1k3qNj2M3L0l7Jj4K8rkJ9k3M3K0m6k3K4Qo7K4M7ql0Lk5J9l2
$$ plain form
7508 2 -4 -47 -10 -60 -20 31 27 -13 -45 -17 -44 8 -13 20 7 -68 -9 -18 24 -21 25 -9 -2 21 -50 -2 31 28 -56 -3 3 -49 47 -40
7542 -40 -27 10 3 14 12 11 30 79 -10 46 48 24 -5 47 23 1 27 10 66 16 19 -17 6 8 -26 0 9 -18 4 -62 -29 17 -63 -83
7576 -83 2 -20 16 -32 42 25 -30 16 -48 -31 -12 1 -1 17 47 -53 10 20 14 -57 -12 -5 -24 20 -11 7 -1 16 20 19 37 18 -29
7609 -29 1 40 -56 -1 -14 -28 -8 -12 1 -5 2 22 21 15 -15 13 -9 53 -4 8 34 -22 15 21 14 3 27 -21 16 -37 26 -66 -10 -2
7643 -2 6 4 -28 -3 -20 -40 14 -16 -29 -29 2 -53 26 -16 -30 -57 8 -70 -51 4 1 -30 -8 -14 -44 15 55 10 34 42 -9 -14 -53 -17
7677 -17 -17 -51 -3 14 3 50 16 -10 -10 -4 -4 9 -14 -14 5 -8 -12 -4 22 9 -9 7 -51 11 3 -41 4 -19 16 -43 12 -16 48 -15
7711 -15 20 0 -8 8 17 77 14 28 1 -16 14 23 37 6 -29 -17 -15 -29 -33 6 -35 40 -17 17 8 2 20 -34 -26 -10 -16 5 -18 -40 -35
7746 -35 -17 -11 34 4 44 3 -20 -28 -23 -35 8 38 1 2 -12 16 7 5 24 1 44 64 18 -5 19 27 -40 -16 31 23 -7 -4 -29 -10 -42
7781d2K5kJ7kK9J5l6Lj1K1l7nN1k1NK0J6m1l4M0L4l2J2m3K8pRk7j3J2L9Mm0K2
7815In6P9l4L0o4M6l1%nKJ6pM3k6K6p0J4O1n1J5n0J18k2oMk2J9j5l%mlm5P2j7
7850B3j6kK6M3m3j9L6n5j4Q6j00Q4m6J7l0l2P1n9N3q6R5m8K6K8k2k8J2k6M4nj
7881A2l2M9n7N6j5M1j05O0NJ4qm8j9N2Kl7N8q1M0L9lMm2N8mJ7o8J3k0L3k7mJ3
7914dRL2l8L9Qn2M5PQk1%o3P3L5r7M7l8L7q6P8k2JRK0J9q5J9L5l0K7j0kk4n0J4
7949f0M1J7m8L4%j9N8om7N5pk7J2j7M5k6n2L7mQJ4Kl0L6nRj5l1O3m5K1jn2J4k3
7984d9k4O5N8n0L6l6O4m5j6L0k2lp2J29o2J0J0k0l4P8l3l7M6mll3M2k9mnoM2n4
8017c1L9j1k9L0k2%nN0n2M3L2r7N1j1oJrJ9m3O1J7n9K8MK9mo2N4k6RLL7l5l0L1
$$ plain form
7781 -42 -17 -19 -2 -4 25 40 4 7 -4 17 -20 -25 26 5 10 30 46 5 -29 11 45 13 25 -18 10 3 12 -15 -28 -16 23 27 -13 9
7815 9 -47 32 -2 28 -36 10 -21 -21 -26 -24 -8 -15 28 2 28 -42 -28 33 -18 -3 -53 65 43 37 41 19 38 23 20 20 16 13 -32 40 23
7850 23 7 5 31 74 31 12 48 -7 -21 65 -35 49 3 20 -10 -42 29 -30 23 -63 32 -16 10 38 16 -12 0 -26 18 13 12
7881 12 -20 29 -28 28 13 54 -51 9 14 28 20 -28 -47 5 7 -30 28 -53 -13 26 23 27 -15 43 39 56 -12 1 -19 14 -13 -17 -4
7914 -4 5 37 -1 38 46 -6 39 46 54 33 33 -30 43 78 -19 28 -10 27 -59 19 -3 -2 7 27 46 -39 -20 15 -15 12 2 0 -24 -74 -60
7949 -60 -19 -2 -50 -16 -16 -35 23 17 -30 25 18 -9 3 -14 31 5 -47 -10 -14 -6 8 10 -20 16 11 20 5 -26 37 -8 13 12 -40 -26 -49
7984 -49 -73 -8 50 0 36 0 64 19 3 33 11 8 -64 65 3 13 23 3 -31 47 14 -23 23 19 16 -17 25 -4 -8 -13 -19 23 -31
8017 -31 8 -3 -32 -2 -24 -24 -29 21 -31 12 44 -53 -2 -13 -19 -18 -27 -8 -51 10 27 -32 -4 0 29 25 -37 17 -9 0 3 40 5 -25 6
8052Fl4K9n0K0M0pn3P2No6L3M8j6J0k0j8K1K8o8j0M2l1P3jk5j9MqnN9q5M9n3M4
8086A4n2N9j6k7M2k5j8l4K6J1J5K4n2mL5K0n5J8q6Q4pk6P9r3N1J3J6M2m1m8O5
8117C0m2K3qLJ3j6J8p4K3L5rj2k0L1lk2P4q6R2n6%J2JmrN7l9k6%Q9o9J4m6L5L1
8152D0o2J6K7j5m7M0K5k6mM4p2N4n5L9Lk1K6o2O4l2nL5j5J5kK0p1%QKJ1K9l6m
8186c1K6j1m7M8L0
$$ plain form
8052 6 -28 1 -49 -29 11 4 -49 23 28 -38 -5 43 27 37 17 -1 20 48 -20 -30 12 -19 54 53 28 9 13 5 0 59 -26 23 -30 14
8086 14 -38 21 5 -22 20 -5 -23 -57 -31 -20 -5 19 -33 -37 -2 18 -37 -19 -105 -21 -28 -54 25 -68 -17 -4 12 54 13 -35 30
8117 30 -12 11 3 6 19 3 21 -53 -30 5 -4 -16 -36 -5 -8 -30 44 -42 50 -6 -6 6 7 3 -6 51 12 -14 -14 75 6 20 -26 9 40
8152 40 -22 -6 21 6 -41 -1 24 -2 -6 38 -34 20 -35 4 7 -14 12 -50 14 -18 -23 12 -3 12 10 30 -41 -41 -33 -31 -20 9 -27 -31
8186 -31 -5 -16 -63 -15 15
8191A5
$$ Imaginary data points
##PAGE= N=2
##DATA TABLE= (X++(I..I)), XYDATA
0@%%%%%%%%%%%%%%Qj6J6j6J6k4L2l2M0m8N6o4P2q5R3j04J20j39J63j84K06k32
36a22K58k89L25l64M05m49M97n51O09o72P42q17Q99r90J092j204J326j462J617
55H50j790J985k214K478k789L165l624M203m959N992p488R857j4170K4418r0258
70g4344p5052K26399l0739j51760M2022J00888q6350m371P3341m5294n9592R2218
82G366K9393j01589K4740P4854l5209m7272N1468K9802m5497k723J3841K3486
94B2660N232k6187l8950N5548N4899p7793m0121O6332L0408n9122O679K2074l7390
107a5731J6518N1764m2836p1419Q2931M4844q8170j9381Q1503p103p5261M4908
119B567M4269n2280l1103O1540P819n2897J3141K3289j2085j6748K8950o516l4508
$$ plain form
0 0 0 0 0 0 0 0 0 0 0 0 0 0 0 0 8 -8 8 -8 8 -16 16 -16 24 -24 32 -32 40 -45 48 -56 64 -75 88 -96 110 -122
36 -122 136 -153 172 -192 213 -236 261 -290 319 -353 389 -428 471 -519 573 -631 695 -767 850
55 850 -940 1045 -1169 1309 -1480 1685 -1939 2264 -2695 3297 -4191 5666 -8504 15914 -74344
70 -74344 -149396 77003 46264 -105496 -63474 37414 -48936 -53307 20034 -25260 -84852 7366
82 7366 36759 -64830 -40090 34764 -445 -47717 3751 33553 -11944 -14667 -826 22660
94 22660 27892 1705 -37245 18303 73202 -4591 -44712 21620 52028 -7094 -415 21659 -15731
107 -15731 787 52551 9715 -61704 21227 66071 -22099 -41480 40023 32920 -42341 2567
119 2567 46836 -5444 -36547 24993 32812 -20085 -6944 16345 4260 -12488 16462 9946 -24562
132b4562J2991L5129p353n0712J2476L9028j725m1790M281L2554j8232j0428J9453
145A110M054l9044J9388L9542k7700l2021K6061L2374l2852o049J9249k176j0293
158h357J3227P276k2111O789R687M336j0152l441L256N601K845j6629J3930M725
172A0982k1220l683M0952r119n7529K9918M9216l2877m5426M6563J6239m2400
184a8384J7032K6128l9090j3439O9686j9930o6683M0511N6273n1852l8637O5142
196B6757K376m9241J5150L6549l1937j4160L4908j6894j4815K3833L240l9929
208b4163J5609L5804k8718k1462J7068J3094j2250O243j6184j0445L7900K746
220A5242m6732M11N8047k3005m0928L3241K1313l6992K993M0390l5862j4542M6997
$$ plain form
132 -24562 -11571 23558 16205 -34507 -22031 16997 15272 -26518 -22237 10317 -7915 -18343 1110
145 1110 5164 -33880 -14492 25050 -2650 -34671 -8610 23764 -9088 -15137 4112 1936 -8357
158 -8357 4870 12146 -9965 -3176 6511 10847 695 -2746 510 6111 8956 -7673 6257 10982
172 10982 -10238 -13921 27031 17912 -39617 -9699 39517 6640 -38786 7777 24016 -18384
184 -18384 -1352 24776 -14314 -27753 41933 22003 -44680 -4169 52104 252 -38385 26757
196 26757 29133 -20108 -4958 31591 -346 -14506 20402 3508 -11307 12526 15766 -24163
208 -24163 -8554 27250 -1468 -22930 -5862 7232 -5018 1225 -14959 -25404 12496 15242
220 15242 -31490 -31079 26968 3963 -36965 -3724 17589 -19403 -16410 23980 -11882 -26424 20573
233B0573j711n3242K7966N0890n3254k6539N7633J5159o1611Q895M6061k2341
245H479j9728K0352M625k6122K1629J3095l0538m957L0117K430l2314O945J5282
258I295J849j2250o324P571Q016j337j8957J0926J1163j0284r894J3712L023j7207
272a0698J2723L386j3857m45K3358j2002k5428K3314J7858k1632k0049K8717P901
285A3146k1306l284J3916L122j4364P610K876n050m166J2389J476k0394O457J9672
299A2100l549l0418J6309K7153k2611k0963K5924J7306l4890K638K5978j0660
311D317j9866K3064Q799l3818J2959K7325j9427k6372L1525J4143l2939N7K2127
324A1894k287j8036J1737K27o370R054k300j0088M175J3844j5768o37J0397p291
$$ plain form
233 20573 18862 -34380 -6414 44476 -8778 -35317 22316 37475 -24136 -15241 30820 8479
245 8479 -11249 9103 13728 -12394 9235 22330 -8208 -13165 16952 19382 -12932 -5987 9295
258 9295 11144 -1106 -7430 141 8157 6820 -12137 -1211 9952 -332 -10226 3486 6509 -10698
272 -10698 2025 5411 -8446 -8891 14467 2465 -22963 351 18209 -3423 -23472 5245 13146
285 13146 -8160 -11444 2472 5594 -8770 -1160 1716 -3334 -7500 4889 6365 -14029 -7572 12100
299 12100 8551 -21867 -5558 21595 -1016 -21979 3945 21251 -13639 -11001 14977 4317
311 4317 -15549 7515 16314 -17504 -4545 22780 3353 -23019 8506 22649 -10290 -10233 11894
324 11894 9607 -8429 3308 3535 -2835 6219 3919 -6169 -1994 11850 -3918 -4555 5842 -1449
338a449l194J2694n051k1516K6592J0357l4456j851M1635j2338m1452L1693K2379
351B4043l4435q678L9537j5641l0990L5685J0189m0652L187M6419k6879l3773
363c1988L6402J7329l6004n383L4565j4695j5098J7414K007j6793R999J3749k1356
376i852K664J5811m614j1849J0211L505q039J1034n408r858J2349J4163k5234
389e117o074L1509p254k5212J1280K1768k3769n678K2254j0397j7234J8372J1944
402A6392l2971L133K8104j1107k5673J5857J9624k3477n686J6128K896j4995M910
415f865Q813p539Q37M038K046q194N927O568l787o461K547J3553o677r803L345
430a652J5400p403j2492J0061M603n992l605R534p779m138J0227%j0887j02J3189
$$ plain form
338 -1449 -4643 8051 3000 -18516 8076 18433 -16023 -17874 23761 11423 -30029 1664 24043
351 24043 -10392 -19070 20467 4826 -26164 9521 19710 -20942 -17755 28664 1785 -31988
363 -31988 4414 21743 -14261 -19644 14921 226 -14872 2542 4549 -12244 -2245 11504 -9852
376 -9852 -7188 8623 4009 -7840 2371 5876 -2163 8871 3463 -6395 5954 20117 -5117
389 -5117 -11191 20318 13064 -12148 -868 20900 -2869 -8547 13707 3310 -13924 4448 16392
402 16392 -16579 -13446 14658 3551 -22122 -6265 13359 -10118 -15804 324 3220 -11775 -6865
415 -6865 1948 -5591 -4754 -716 1330 -6864 -937 5631 1844 -4617 -2070 11483 4806 -4997 -1652
430 -1652 13748 6345 -6147 3914 8517 2525 -1080 8454 675 -3463 6764 6764 -4123 -4225 8964
445H964q195m706L938L015l534k018L127j887M552o060j861O758K730j0537m82
460f196J3813r783m366R674m91j5662J2516J5025k5351o971K6681L065l1026J0463
474h609K0578j8156o113J9742m466k2905K2764J2402k6651j998K7863p077k3585
487a6211K0923R293j8286r42J8261p551r819J3976n231o588J1504L798k1020N269
501b624K0091j2863j1193Q645L980r735J0655k878j9496J3483J8589k0123j9080
514b2549K9025M469k5759N521J9996j4736j2310K4570m157j8082J1917J3455j9953
527h593j513K5346j2710j9149J7275J9018k3092r811J8996K540q030j811K170
540F36m864R249K046j2376j502R828K270r750K501q95J422L207l111m060L896
$$ plain form
445 8964 769 -3937 1 3016 -518 -2536 591 -1296 3256 -2804 -4665 2093 4823 -5714 -6196
460 -6196 7617 -2166 -6532 3142 2651 -13011 -495 14530 -10821 -17792 8889 11954 -19072 -8609
474 -8609 11969 -6187 -12300 7442 2976 -19929 2835 15237 -11414 -13412 14451 7374 -16211
487 -16211 4712 14005 -4281 -5223 13038 5487 -4332 9644 4413 -2175 9329 13127 -7893 -2624
501 -2624 17467 4604 -6589 2056 6036 -3699 6956 4078 -15418 -1935 16654 -3469 -22549
514 -22549 6476 10945 -14814 -9293 10703 -4033 -16343 8227 4070 -14012 -2095 11360 -8593
527 -8593 -10106 15240 2530 -16619 656 19674 -3418 -13229 5767 8307 277 -1534 636
540 636 -4228 5021 7067 -5309 -6811 3017 5287 -4463 -1962 -2857 -1435 1772 -1339 -5399 -1503
555a503N602j0448K845R299m685j1430R527J1704j2711m756O717N514n239J349
569A785m01n463O338N641m077j0945P100P812k905p298j89P987l126k455Q66M110
585D780p127j526J0923j785j1091J88J4713o636p801O589J426p145M102R886j4791
600e295m485J4892K992j6055J867J2109r308j862Q054j286j1984P337Q577q602
614c049k069K476k69k49Q340q578q033J2404N796j0028m430J0794m232m06P106
629E573o099p837J2248Q602j9023J626J5699o192j3402J4644P977k0939K393J6935
643A2205n025j4197J0896K593j1187R555N634j5745n189K3583l152k1115N865
656e279J4056o142q037P724m836j174P925k167j0269N483R597j1949n12R348k836
$$ plain form
555 -1503 4099 -6349 -3504 5795 1110 -10320 -793 10911 -1800 -6556 161 5675 436 1785
569 1785 1384 -4079 2259 7900 3823 -7122 -22 7790 4885 -2413 -2602 5385 2259 -196 670 4780
585 4780 -2347 -3873 7050 5265 -5826 -5638 9075 2439 -5362 1227 2653 -4492 -390 9496 -5295
600 -5295 -9780 5112 8104 -7951 -6084 6025 -3283 -5145 2909 1623 -10361 -3024 5553 -3049
614 -3049 -5118 -2642 -2911 -3160 5180 -3398 -11431 973 6769 -3259 -7689 3105 -1127 -1533 5573
629 5573 -526 -8363 3885 12487 -6536 -4910 10789 4597 -8805 5839 13816 -7123 -4730 12205
643 12205 7180 -7017 3879 6472 -4715 4840 10474 -5271 -10460 13123 9971 -11144 -5279
656 -5279 8777 2635 -5402 2322 -2514 -3688 4237 2070 -8199 -2716 6881 -5068 -5580 3768 932
671I32r676P819O168r335J100K456k166P91Q624r439r338J5575O450j4358o645
686a1042J5822l10q151K792J394l741K756P142j0474k222R407J201r082J653Q306
701E451o904k149M885L510o752j278M939Q65J29m153Q58J022M050j645l539qK110
718A391N030m283l792O56P173k144n921L007J615j040k074M138l688k168L594
733A494N67k516j693L019l540K295J461l128k503L090K746n026K208r99j166K266
749a425L142n575k882R405k435n350L289N303q380P32J0902p011p562Q676P508
764H337j3011P18J0461o115n277R402K063j4210P178J0344r714o762J1605J752
778F771j2425O825N548p507k831R427k787p170P615l92n723K895O378r124j712
$$ plain form
671 932 -8744 -925 5243 -4092 -2992 -536 -2702 -1911 6713 -2726 -12064 3511 9961 -4397 -11042
686 -11042 4780 4470 -3681 -889 505 -3236 -480 6662 -3812 -6034 3373 4574 -4508 -2855 5451
701 5451 -1453 -3602 1283 4793 -1959 -3237 1702 2567 2696 -1457 -599 423 4473 2828 -711 -719 1391
718 1391 6421 2138 -1654 -998 6175 4031 -1890 1117 2732 1692 -382 3756 68 -2100 1494
733 1494 2061 -455 -2148 871 -2669 -374 1087 -2041 -4544 -1454 1292 -3734 -1526 -2525 -3691 -1425
749 -1425 1717 -3858 -6740 2665 230 -5120 -1831 3472 -4908 -4176 6726 -285 -7847 829 8337
764 8337 -4674 -3956 6505 390 -4887 4515 6578 -7632 -454 9890 176 -6586 5019 6771
778 6771 -5654 1171 6719 -788 -3619 5808 3021 -4149 3466 3074 -2649 246 6624 -2500 -4212
793d212R836l533n984L907L772q025M553M460r351n86J0603k335j2948R598O353
808F108j0279k075J0826l160r981J0239K436r132P77J0197o668o582J1085L33
822D124q880J244J0176o095n069O412P47l267R1L426m825K081K814l137j940K705
838F07J804m437K277n28q83J021Q78k665q59N394l735k177K556L015m415r84N083
855A952k109j282O47K680k904Q81K001j725l7M09K608k951L0Q92K100j273l262
872a343L293J170j436l386M618l88m032K343J972k875k846O585k783m787L664
887b31L737n603k640P817l105m186L127L194n490K51N633n100j201M418O15o593
903e357M126M094o123L58M353j260m743O579o13n742M217L994n453k876R504l579
$$ plain form
793 -4212 5624 2091 -3893 14 3786 -4239 314 4774 -4577 -5163 5440 3105 -9843 -245 6108
808 6108 -4171 -6246 4580 1420 -8561 1678 4114 -5018 -4241 5956 -712 -7294 3791 4124
822 4124 -4756 -3512 6664 569 -4500 1912 2659 -608 -517 2909 -1916 165 2979 -158 -2098 607
838 607 2411 -2026 251 -277 -1160 -139 739 -1926 -2785 2609 -1126 -3303 -747 2268 -2147 -3131 1952
855 1952 -157 -1439 -792 1888 -1016 -135 1866 141 104 513 3121 170 200 1092 3192 1919 -1343
872 -1343 1950 3120 1684 -1702 2916 2528 -1504 839 2811 -64 -2910 3675 892 -3895 -231
887 -231 3506 -2097 -4737 3080 -25 -4211 -1084 2110 -3380 -3129 2504 -2596 -3797 621 1236 -5357
903 -5357 -1231 2863 -3260 -2902 1451 191 -4552 2027 1414 -4328 -111 3883 -1570 -4446 5058 1479
919A479n703N489L564p101K37Q494o816k851P196P82q890M099P527q870j616P499
935D519m26q508N918L740q041J509O086l831o626Q888N90q224K545N855m589m330
951d925P692k230m492L499K919n511k77O987n061k555M623J759n881J883M440
966B870m300O7K425l00l443M748Qn262K978L425k564l971N375o06k889J704J349
983A614k425j017M903l486j841K519J629l434n84M095k234j383M31K972k343j286
999a870J875J34K93j722J729j000L57O89N46j532j433M349p94k345q85M262j086
1016A567l075K780M35j662r50M026k478j690K201L00j280m56K552l565J075K268
1032B048j408k416J611K024l267J919n08j625N36L472k834l871N576k4l941P82
$$ plain form
919 1479 -4224 1265 4829 -2272 -2035 6459 -357 -3208 3988 4770 -4120 -21 7506 -1364 -2980 4519
935 4519 4093 -4415 1503 5243 -2798 -1289 4797 966 -5660 3228 3818 -4406 -1861 3994 -595 -4925
951 -4925 2767 537 -3955 -456 2463 -3048 -3325 3662 -1399 -3954 669 2428 -3453 -1570 2870
966 2870 -1430 -1363 1062 762 -2681 2067 2075 -3187 -209 3216 652 -3319 2056 1450 -1439 265 1614
983 1614 -811 -1828 3075 -411 -2252 267 1896 -1538 -2122 1973 -261 -1644 -1213 1759 -584 -1870
999 -1870 5 139 432 -1290 439 -561 -204 485 1031 -501 -1934 2415 1621 -724 -1609 2653 1567
1016 1567 -1508 1272 1707 45 -905 3121 643 -1047 1154 1454 174 -282 2270 -1295 -220 2048
1032 2048 640 -1776 -165 1859 -1408 511 3 -1622 -1086 2386 -448 -4319 1257 1233 -2708 -1926
1048a926M862n021k422P327j139o175J856O915n961j835N900k020m529M536M557
1063D925q857K91P584j595o396L845M039o085J796L353k613l170N092L08m775
1078b258L405Q01l238J76N645m439l701N563P36l560J59L226m673J980M559m786
1094d05m171O355L869r044R24N771k145m301M615J546o703L108L830l078l382
1109c211N033n92m451M150J910m370k655O767j22m780L47K147O68j236P32l001
1125b664J665K752j374k723O73L079k349N09r6k62l35J355K08k039J803q05l9
1142f42K56K205k251k377L483J636j349l647K512K021j93j913n77J751k69J293
1158A939j511o14k25K575J18l370J205J550k51k610L010ql456J054L212q06m597
$$ plain form
1048 -1926 2936 -2085 -4507 2820 1681 -4494 -2638 4277 -1684 -3519 2381 361 -4168 368 4925
1063 4925 -3932 -3641 3943 2348 -4048 -203 3836 -2249 -453 2900 287 -2883 2209 2517 -2258
1078 -2258 1147 1948 -1290 -1114 4531 92 -3609 1954 2690 -870 -711 2515 -2158 -178 4381 -405
1094 -405 -4576 1779 5648 -3396 -2472 3299 1154 -3147 1468 3014 -3689 -581 3249 171 -3211
1109 -3211 1822 1230 -3221 929 2839 -1531 -4186 2581 2459 -2321 -1974 173 841 -395 337 -2664
1125 -2664 -999 1753 379 -2344 -1671 1408 -941 -432 -528 -790 -1125 230 438 -1601 202 -603 -642
1142 -642 -386 1819 -432 -2809 674 2310 961 -2686 -174 1847 1654 -259 -836 915 646 1939
1158 1939 428 -186 -411 2164 2282 -1088 117 1667 1416 -1194 1816 1808 -1648 -594 2618 1812 -2785
1175b785K896J067j102O6L39k211p7N008k995l615J962L834l138j648L131j947
1191a215m42J949P49m218K004K791l159J89K348j103l794N391J435n553pM634
1207A999l30l883L375r17k037K962K273n104j447P010k086m118K267L140m397
1222a293J7M913l481k535L050K226m644J459K498l865K18M157r81o236M269L567
1238C339l719k049K883L79k441L303j254k712J830L354l052k350M328q68k037
1253a066J038K369l106n33L211j299r32M37O95k114K472Q98l777p3L294O87m431
1270b230J291J543n80o04N44n29j497K985n49j818l66K500n87k068J943J46q45
1287g21j149K565r9j840J19J144R78j850P90l83M97L46M45r18j427K826K28j353
$$ plain form
1175 -2785 111 1178 76 142 481 -1730 -1807 3201 206 -3409 -1447 2387 -751 -2399 732 -1215
1191 -1215 -1657 292 1041 -3177 -1173 1618 -1541 -1352 996 -107 -3901 1490 2925 -2628 -2635 1999
1207 1999 1669 -2214 1161 244 -1793 1169 3442 -1662 -3109 3901 1815 -2303 -36 3104 -1293
1222 -1293 -1276 3637 156 -2379 671 2897 -1747 -288 2210 -1655 -1437 2720 1739 -4497 -228 3339
1238 3339 -380 -2429 454 833 -1608 1695 441 -2271 -441 2913 -139 -2489 1839 971 -1066
1253 -1066 -28 2341 -765 -1298 1913 614 -318 119 814 -1300 1172 2070 -1707 -1780 1514 2201 -2230
1270 -2230 -939 604 24 -580 -36 -565 -2062 923 374 -1444 -1810 690 103 -1965 -22 124 -721
1287 -721 -1870 695 596 -1244 -1125 19 997 -853 -63 -446 51 397 842 -76 -1503 1323 1551 198
1305A98j476K478K73j613Q04J02j76o87J955j435n25J129j72o14K53J365k752
1322h93P68J764q57j880J125J386k580J384N29j675q85L237o62l891K671J694
1338A235k309j550L807j343k936L200J080l019p46M461k275k053K992N05k987
1353a938P93L850l582j027L087M01l127J346K393l335Q47K044j147k396L062O17
1369A888l489J832J587j946j547L888j333l041K690J240k536p29L721k412j594
1384a781K912L67l241P41L728l322r71K601M08k925J184K348k902O5J842q3k518
1401a547K098Q85k396O80J236m23k002K229j5j555O10O70n78q88J923j232o46
1418i51R18O39j298n13K060j200l75K66Q44j115N4J172j105j3K77R84j649M28
$$ plain form
1305 198 -1278 1200 1473 -140 664 766 590 -97 1858 423 -102 1027 855 241 494 1859 -893
1322 -893 -125 1639 782 -1098 27 1413 -1167 217 746 -929 -1814 1423 761 -3130 -459 1235
1338 1235 -1074 -2624 1183 -160 -3096 104 1184 -1835 -2581 1880 -395 -2448 544 1049 -1938
1353 -1938 -1145 2705 -877 -1904 1183 1584 -1543 -197 2196 -1139 -292 1752 605 -1791 1271 1888
1369 1888 -1601 231 1818 -128 -1675 2213 880 -2161 529 1769 -767 -1496 2225 -187 -1781
1384 -1781 1131 1498 -1743 -1002 2726 -596 -1567 1034 1442 -1483 -299 2049 -853 -788 1054 971 -1547
1401 -1547 551 1436 -960 -280 956 533 -1469 760 745 -810 -200 470 -108 -996 927 -305 -951
1418 -951 -33 606 -692 -1205 855 -345 -720 -454 390 -725 -671 501 -604 -617 -340 644 -1005 -577
1436e77J078p07m78K77J326j636K80O94J74j009L46J164j513O42M63J19j495J145
1454B93J153j762J57R07L32j846J496M01j398L60R46l95j600K101k47j455N35
1471b2J342j262j211K475r04j223N77J410j860k72K268j610r94J355J176k832
1487a587O85K064j773p29J543N32k671J735J321k181k80K149k78k612K429M92
1503H39j925M9K349j285j945K895k93j772N88K080k159p77K779q85j688Q24K059
1520A733k545J48K087j423r36J490J028k957J159J673j301j066J608L61k163J752
1536F48L99j312l46K001p72j734K044K5j312j38K117j407j185J844j65r35j13
1553c41J474j762K34J418q63j356Q49J694k142j11R03K41j024K31P70j342O52
$$ plain form
1436 -577 501 -206 -684 -407 919 -717 -437 257 431 -578 -232 932 -581 61 524 643 -852 293
1454 293 1446 -316 -159 748 1080 -766 730 1131 -267 93 1039 644 -956 1145 898 -557 -22
1471 -22 1320 58 -1153 1322 418 -805 -228 1182 -678 -950 1318 -292 -1286 69 1245 -1587
1487 -1587 -902 1162 -611 -1340 203 735 -1936 -201 1120 -1061 -1341 808 530 -2082 347 839
1503 839 -1086 -1037 1312 27 -1918 977 684 -1088 -500 1580 -579 -1356 1423 538 -1150 -326 1733
1520 1733 -812 -664 1423 0 -936 554 1582 -1375 -216 1457 156 -910 698 1059 -1104 648
1536 648 1047 -265 -611 1390 618 -1116 928 953 -359 -497 1620 213 -972 872 707 -228 -341
1553 -341 1133 -629 -395 1023 160 -1196 -347 1347 -795 -906 -3 238 -786 -555 215 -1127 -475
1570d75M38j07j091R48M18j069M84K66J77j168J138L68o50k13K96O32o02O54p58
1589c14R6N09O21q24q99J648j62m65m69R31m58k88J031o82m39J76J286j422j10
1608b34J058m77q17O51J407k321lJ710Q0j752L37J392j529N65N78n97j231J705
1626E22O33k251M89J099k52j395J571k70j328J002O64p51j054J698p32l37J014
1643C22k91j269O23K121k048p67J470O57j558N01J223j910N33J386l72k055J604
1660A70J139k055L53J310o38j839K326N14k195J1J534L0j573J270m69n53R36P50
1678A021j540p04K321n07r81J48R47q57J33J029j123K1N56M55j253Q65L65j362
1696d66N69J066k71k178J439R88q93p56M46K23o31J262q57j045M85J560r14j689
$$ plain form
1570 -475 -37 -144 -1235 -287 131 -938 -454 -188 -11 -1179 -41 327 -323 -536 -240 392 -210 444 -314
1589 -314 -218 291 912 88 -811 837 675 210 -259 672 214 -74 957 275 -164 12 1298 -124 -234
1608 -234 824 347 -470 181 1588 -733 -736 974 1054 -698 -361 1031 -498 67 645 48 -1183 522
1626 522 1155 -1096 -607 492 240 -1155 416 146 -1182 -180 484 -267 -1321 377 -355 -692 322
1643 322 31 -1238 -615 1506 -542 -1309 161 818 -740 -239 984 -926 -393 993 621 -1434 170
1660 170 1309 -746 -393 917 279 -1560 766 1280 -915 -904 630 660 -913 357 -112 -665 271 1021
1678 1021 -519 -1223 1098 591 -390 -242 705 -152 -19 1010 -113 -92 464 919 -334 531 896 -466
1696 -466 103 1169 898 -1280 159 1147 254 -502 -56 167 -464 798 -59 -1104 -619 941 27 -1662
1714a662J378M46n13o90J146l93o92P97K18k53o85Q69l60K27L55m23m75L60J447
1733A097j332m53M08J036m28o07L02l47R33j40l08r15J164N56j183J92M80J33
1751E88j145J211K14j062PP95K03j170J002m36m58O88P11j229j094K180n5j265
1769c15m17J435m75o15R81p71m52M26J079j577p4J170o39m30O00O07j764P59J040
1788E68o17q68O48N76j147J136j38q99R8J572n71j720J513M83q03m85J334q14
1806a34o95J447j04j011q2J429j076j06Q77m65p32O63J189j822K9R86J98q81K89
1825aN45r64Q27J53n92o15J358M1j286Q15K61l38o07J308m51r91O81M31l24o35
1845c84J023p35j43O81j5r20k15J591p67n91M4P88m49k75N21n99K25O9L73q97
$$ plain form
1714 -1662 -284 162 -351 -1041 105 -288 -980 -183 35 -218 -903 -34 -394 -167 188 -235 -710 -350 1097
1733 1097 -235 -688 -280 756 328 -279 23 -324 609 469 161 -754 410 966 -217 -25 455 588
1751 588 -557 654 868 -194 -187 608 811 -359 643 207 -251 437 1148 -81 -1175 1005 950 -315
1769 -315 -732 703 228 -387 594 -177 -629 -203 876 -701 -775 395 -244 -674 -74 533 -1231 -472 568
1788 568 -49 -917 -269 307 -840 296 158 -741 -643 929 358 -1362 151 634 -169 -654 680 -134
1806 -134 -829 618 514 -497 -579 850 -226 -332 545 80 -652 11 1200 -622 -593 393 591 -290 -1
1825 -1 544 -420 407 560 -32 -647 711 752 -534 281 542 204 -403 905 454 -537 144 575 251 -384
1845 -384 639 -96 -239 442 427 -493 -708 883 116 -475 -431 357 -92 -367 154 -445 -220 -151 222 -675
1865f75L96M72n37jJ77L52r44O15K56k91k04J46L44m81P21n89k57L30P85n32r72
1886h89J218M7l64m48R38m28l92Q16k21m24j27J259j028l57R27kp88M5J283j081
1906a6l07N85L83p93mQ01q59L10J75J0q15O56N30r45J37K46K18p35O56j47m99
1927d13M94Q8k59n27J126o38m92O40K94p71j43J313j042k69N27M53j015J56J103
1946F25j022k93P32N07j369M30R14p41k04M05N39j212O58L96n38k05N44K66r49
1965e17P21L2j98k19N07j53n26Q39l61j26J0N40o09o1P53n43j39J65P23j121L07
1986B4O57o02k66M15N77j309M56O51l51p09N26N59j124M46J77j02o27O87K45j029
2006f99M44L29m8q26Q91m0n54K38J77J4n12P27l65q6K23J59k81j66P10n77O1J39
$$ plain form
1865 -675 -279 193 -344 -345 -168 184 -760 -145 111 -180 -384 -238 106 -375 346 -243 -500 -170 615 83 -889
1886 -889 329 376 12 -436 502 74 -318 498 277 -147 -274 985 -43 -400 527 525 -263 -218 1065 -16
1906 -16 -323 262 645 -148 -152 649 -210 100 275 285 -530 126 656 -289 -152 94 312 -423 233 86 -413
1927 -413 81 169 -90 -617 509 -129 -621 19 313 -458 -601 712 -330 -599 -72 381 -634 -478 625
1946 625 -397 -690 42 549 -820 -390 524 -217 -421 -16 523 -689 -31 365 -173 -378 166 432 -517
1965 -517 204 236 38 -181 326 173 -353 486 125 -1 9 549 -60 -121 632 89 -50 115 838 -283 24
1986 24 681 79 -187 228 805 -504 -48 603 252 -457 69 628 -496 -50 127 25 -602 85 330 -699
2006 -699 -255 74 26 -800 91 51 -503 -265 -88 -74 -586 141 -224 -310 -87 72 -209 -375 335 -242 -181 -42
2028d2K93m11RO09p08K66J60K03q02N18M59o89n1L69L65j027P07J63m80K8L61
2049C00J36r49Q83l1l72k27P79j16q97Q62j7k26l56P18l35l57O23k81k50l8P35
2070E84q49k2N78k18k90j3O67q67K23L74j97m51L75L74r18N56J75k17m95P42K02
2091C13r22M77L03j32o18Q30j49n76M74K61l20n04Q79l21l09L37J99l76j74Q24
2111D96p17PK23K68m71P3N65p06K00K41J48p23N53L12n72J19K88J03p44P59Q3
2132E05n86M0M16N1o96O69j92l12R3N26m42n99R44j67l33l00O62k49l71N18l23
2153a46r8r0N76o28Q5L59k46j67J61M38p97L01L11l3k97K9K99m66N82j90k70j24
2175d11P65j63q36N89K81q5n53O76j52m24M76R0k50l22Q06m76j84L65J23m44j42
$$ plain form
2028 -42 251 -160 -151 458 -250 16 176 379 -423 95 554 -135 -186 183 548 -479 228 391 -89 -61 300
2049 300 436 -513 370 339 -33 -260 519 403 -494 368 351 125 -231 487 152 -205 418 137 -113 -151 584
2070 584 -265 -287 291 73 -217 -230 437 -430 -207 167 -30 -481 -106 268 -650 -94 81 -136 -631 111 313
2091 313 -609 -132 171 39 -579 251 102 -474 0 261 -59 -563 316 -5 -314 23 222 -154 -328 496
2111 496 -221 -214 9 277 -194 -121 444 -262 -62 179 327 -396 157 469 -103 16 304 407 -337 422 505
2132 505 -81 -41 375 426 -270 399 207 -105 -12 514 72 -527 417 250 -83 -383 279 30 -341 177 -146
2153 -146 -244 -334 242 -386 -301 58 -188 -355 -194 244 -553 -252 59 26 -271 -242 57 -409 173 -17 -287 -411
2175 -411 354 191 -645 -56 225 140 -413 263 111 -313 163 253 3 -319 487 11 -173 192 315 -129 -271
2196b71R91n76l31J76M88l54j25L08m55L69R5k7o26M49M25n86rQ0L05o11N47j28
2218A34l38J70J80l4n22N91l06j34K25L70m81m81R74j96l62j90N62l09j14M48
2238A87m71o3K22N80q47qN35j68k16P1M29o93K87L28q1m28J87M19m44L30j48r3
2260h5j52N76m7o73L75K32K5m31M27j26k00M09q4k23k13O39l75j21K85o4k62L4
2282e4O97p62q0K84L51m28j46L91l82K41O4n5n85N01L96o40q3K61J98o12M79J3
2304D9k92JK77P8n56N50k26j57J47K96m63l28Q68j02l40k74N96j76k08L82l85
2325b63J09J73L12p22J42M86k13j79Q8M30n88L08J82j96k00J60K40m51M61j73
2345A06j72n3N47j63o49N33J32r9l31M48k24j26L93j71k26r5O69n25k32L78O1
$$ plain form
2196 -271 720 144 -187 -11 477 123 -2 306 -149 220 315 288 -338 111 536 -50 -59 21 326 -285 262 134
2218 134 -204 -34 146 112 -410 181 -125 -259 -34 336 -145 -626 348 152 -210 -400 162 -147 -261 187
2238 187 -284 -347 -125 455 -392 -400 135 -33 -249 -178 251 -442 -155 173 92 -336 -149 270 -174 156 8 -85
2260 -85 -237 339 292 -381 -6 226 251 -180 247 121 -79 330 246 23 -190 449 74 -47 238 174 -88 -54
2282 -54 643 -119 -199 85 436 8 -138 253 -129 112 176 121 -464 37 433 -207 -290 -29 169 -443 36 49
2304 49 -243 -242 35 113 -443 107 -119 -276 -129 167 -296 -624 244 142 -198 -472 124 -52 -260 122 -263
2325 -263 -154 19 331 -391 -249 237 24 -155 -67 363 -225 83 265 69 -131 29 269 -182 279 106
2345 106 -66 -119 428 265 -384 149 281 182 -149 299 75 -51 342 171 -55 -150 519 -6 -238 140 201
2366B01l21n6N84n33n6J61K80m00q4M06m32K23N5M1m97L82L39m97m1J02K81m25
2388b87L10j07j54J36J15M5m78N74k19o9J31J51k66k05O10l17j03K5L46k82r1
2409a35L71l17rK18K96o45J19M88k90j78J71L64o00K22K42k04k24K86K78o56L62
2430A59M3j62k00M85r3n30M49M1j02l73M94j70k30L16p7j41j15N01m73qK65r5
2452a6j69K5M33n72P2K81l3l20J95K79n49L25J05r0l93M99J01n02K22K28k7m73
2474c79N08k5l32K34J19j35l08O04k27k09J46K08j65k58N94l62k6K6K87l14j5
2495b9L59l44J7J29J93m69K10K29k11q7P6K26m30J70J00k01N2J12M3l39L62p0
2517I8j74j51L57q0l41L55j83K6j01K68k03j12K66p6r3p1M18m00r4L45o4j59m6
$$ plain form
2366 201 -120 -176 408 -125 -181 -20 260 -140 -224 182 -250 -27 28 69 -428 -46 293 -204 -245 -143 138 -287
2388 -287 23 -84 -238 -102 13 58 -420 154 -65 -134 -3 148 -118 -323 287 -30 -133 -108 238 -44 -135
2409 -135 236 -81 -90 128 424 -221 -102 386 96 -82 89 453 -147 75 317 113 -111 175 453 -203 159
2430 159 202 40 -160 325 232 -298 151 192 90 -283 211 41 -189 127 50 -91 -206 295 -178 -186 79 -16
2452 -16 -185 -160 273 -299 -227 54 21 -299 -104 175 -374 -49 56 -34 -427 72 173 -329 -107 121 94 -379
2474 -379 129 104 -228 6 125 -10 -318 286 59 -150 -4 204 39 -219 375 13 -13 13 300 -14 -29
2495 -29 330 -14 3 132 325 -144 66 295 84 -3 73 299 -131 39 139 -62 -10 102 145 -194 168 98
2517 98 -76 -227 130 50 -291 64 -119 -93 -194 74 -129 -241 25 -51 -144 -215 203 -197 -291 54 -10 -169 -215
2540b15L94l81P6J77J2l19J64L47m44J27O2J53l88J99K38l53J29R7M3l26L06M7
2562A45k31O4J69Rl48M27j60j16Q1J24j43o3L62l19K5O3J76k87j9L88l61l9J37
2585H4J69m99L24J49l28k1K15J40n63L76J16k94j28L06Q1n06L20J33k68n6L10
2606F0o2l70L87jj25j88M10k12j75L40j61l2QL10l25N2J58r7o5K4K53m03K65Q9
2630A40j40j07K53N1m20L52O5j65j70L65j3m49L40P7p3k22L97j27k83K92L8r6
2652A05l29N24k11k08Q6K34k07j84M10j83n6k3K02k07m8J52j79J12o9J75k87J15
2674g6J72k33M6l0J41k25K15j06o7J05M8Rl43M13r1r5n1K59j58k40M33j31n0j41
2698a96L68j99k22M11o0j92OM76m72o5L06l5j47o6M16m10N5J58L8k71J18K52l04
$$ plain form
2540 -215 179 -202 -126 51 63 -256 -92 255 -189 -62 0 153 -235 -36 202 -151 -22 75 118 -208 98 145
2562 145 -86 -22 147 156 -192 235 75 -41 40 164 21 -42 320 1 26 89 265 -22 -41 347 -14 -53 84
2585 84 253 -246 78 227 -101 -122 93 233 -330 46 162 -132 -260 46 127 -379 -59 74 -194 -250 60
2606 60 -2 -372 15 14 -111 -299 111 -101 -276 64 -97 -129 -121 189 -136 -84 74 -23 -88 -64 189 -214 51 140
2630 140 0 -107 146 197 -223 129 194 29 -141 224 211 -238 102 179 106 -116 281 154 -129 163 201 105
2652 105 -224 300 89 -119 -33 201 -6 -190 220 37 -19 -42 160 -47 -95 57 -122 -10 -79 96 -191 -76
2674 -76 96 -137 -91 -121 20 -205 10 -96 -163 -58 -10 -1 -344 69 -22 -117 -168 91 -67 -307 126 -5 -55 -196
2698 -196 172 -27 -249 162 102 -90 -84 392 -80 -145 161 126 -21 -87 329 -81 -26 132 170 -101 17 269 -35
2721c5J33JK8k60L04ol03J73P0Qk56L66j98j32K39j4j70j17M07k18j50J91K4k41
2745a56NL64l25l1J17J58k77mK72l31R4J34Kl71K99K40m20N5J33J56l91K96J3
2768C2k27J50J06j9k14L12j39n8M4J76j39j55L66j46j26j4K00j56L2J66k14P4
2790E1N0J60l90J50J97j24r1j5J97l10K28J6j26m2J28P5k62J63l3p5m7K03n0k41
2814a88K16j2M6j35J37j48j4J19n6p9m6L91k97p4R5O9j38r8L18k75M2J05R8j93
2838a17J7K37k92J29n2J35l46L04J26k06m2K1K04k45K16m7q6J5J20J5k37L03j43
2861B9j2mJ40j35j65L88j61l4q8K80j75n2J63k29M2J48J12m18J05K62j72r1L9
2884b8K20l74J72J52j98j27K16J33m04K35N6p5j89L11j07k08J38O6k1k33K87o5
$$ plain form
2721 -35 98 99 127 -133 171 165 -138 35 105 113 -143 223 25 -107 132 118 -52 -169 238 20 -130 61 85 -156
2745 -156 -151 213 -112 -143 -26 132 -145 -149 123 -208 -114 20 22 -349 -50 190 -230 -175 -42 114 -277 19 32
2768 32 -195 -45 61 42 -172 140 1 -57 -13 163 24 -131 235 89 -37 -51 149 -7 25 191 -23 51
2790 51 101 261 -129 21 218 94 3 -12 185 -125 103 119 -7 -49 79 154 -108 55 22 -53 -100 103 53 -188
2814 -188 28 16 62 -73 64 -84 -98 21 -35 -114 -160 231 -66 -140 -45 24 -114 -212 106 -169 -127 -22 76 -117
2838 -117 -100 137 -155 -26 -78 57 -289 15 141 -65 -107 -86 118 -127 89 42 -44 -29 91 106 -131 172 29
2861 29 17 13 153 18 -147 241 80 46 -42 238 63 11 174 -55 -13 135 247 -171 -66 196 24 -67 -28
2884 -28 192 -182 -10 142 -56 -183 33 166 -238 -3 53 -22 -211 100 -7 -215 -77 -11 -32 -265 22 -43
2906d3l6J44j48l1j7K70k73P0N5K1p1l6J93k69J91LL4k26K04R0k66J78L0p0j96
2931a99L50K3k74O9J18N7j96K31r0q3P7P8r7j64L32q0j16j04K24j34j19K61j56
2954HQo5J48j23pR7j64N2L7Q6k13J11P5q7k0n5J42j68J28m3p3l1K03J6k63K34
2980C3o8l0p7K46j44k02K63l9k9j49L02j37r6K23l1j36n0K82k26q0J22J35j10
3003Bq6J96j70P4LP4j61J30P2k05R9LJ15j77J98Mk16J43l3P4k21K24o9o7Q0Ro3
3030C2j75K87j73p9P6J53j52m2K32k46J7j1K07k97K1K73k23m9J20J34l74J95J41
3053F7j28o4J07N6k26J75Pp0m0K00m9k31K43n9N2j20J65m7j57K16j04k0n2K50
3077A71j89k2J66o2o0LK20k98O2J21k5q9n3K22k05J26J5j0j67R1O4j56J33lL0
$$ plain form
2906 -43 -79 65 -83 -114 -131 139 -134 -64 -9 12 -59 -95 98 -171 20 23 57 -169 35 125 -141 37 67 -3 -199
2931 -199 151 174 -100 -31 87 144 -52 179 89 6 83 161 64 -100 232 152 36 -68 156 22 -97 164 8
2954 8 16 -49 99 -24 -31 66 -98 -46 -9 77 -136 -25 50 -37 -57 -112 30 -138 -10 -53 -126 -157 46 62 -201 33
2980 33 -35 -65 -142 104 -40 -242 21 -18 -47 -196 106 -31 -127 96 65 -71 -121 161 -65 -145 -23 112 2
3003 2 -84 112 -58 16 19 93 -68 62 134 -71 28 31 146 -31 167 171 -45 98 65 139 -82 142 73 6 86 95 32
3030 32 -143 144 -29 -108 -32 121 -31 -73 159 -87 -70 -81 126 -171 -150 123 -100 -149 -29 105 -269 -74 67
3053 67 -61 -125 -18 38 -188 -13 -6 -76 -116 84 35 -196 47 -12 40 -80 85 38 -119 97 -7 -27 -79 171
3077 171 -18 -40 126 64 4 7 227 -71 -9 112 87 -2 -55 167 -38 88 103 93 -74 17 81 -75 58 55 85
3102H5k04K34m2j82J51n3P2j72K12q4r0J08n4k1j19K08p2o0k3J40j50L8J45j92
3126a25Q5OJ32k66P3J24j62L9K1J14j72J25R9j09p7J09N7j91K18q7k2m0J60qk06
3151a03K30j15K9p8J61n3j12J90j23l9j1K04j95k0K23j32l7qK18l07O9R9l3r6
3175c9N8J33k57J82p3J8j75J91N6k08J05J9k6j57K28j3j68J13JNj68K19j03kK9
3200c2p1lm4J85j35J3J9K1Jm8J88j78K7M7L6j61J55O0j84J50m5R0j45J54Oj30
3226b4L8M1L6k08K09k6p7L7Q0m2j88K77r8l0n7J27j13l6J55j01N4j45J94j15K8
3251A6N1j02M0o7J50j95J16m1J7m7O8L1j91K04m4%j13J38J4j75J85k2r7o4J44
3276A6o6j05J50j5k4o8J65j28k4O6M7r6q7K27p1p3jJ59n2j21J93j30O3k3J36j90
$$ plain form
3102 85 -119 115 73 -109 42 -11 61 -111 101 17 -73 35 -19 -40 -159 49 -23 -83 -106 34 -116 -78 67 -125
3126 -125 -40 -34 98 -168 -95 29 -133 -94 -73 41 -131 -6 93 -16 -93 16 73 -118 100 13 -9 -49 111 103 -103
3151 -103 127 12 41 -37 124 71 -41 149 26 -13 -24 180 -15 -35 188 56 19 11 229 -78 -9 90 57 -39
3175 -39 19 152 -105 77 4 22 -153 38 94 -114 -9 10 -16 -173 55 42 -126 -13 -12 -7 -175 44 -59 -61 -32
3200 -32 -103 -106 -150 35 -100 -87 -68 -47 -46 -94 94 -84 -57 -10 26 -135 20 80 -104 46 1 91 -54 100 106 -24
3226 -24 14 55 91 -117 92 66 -11 26 106 64 -124 153 55 25 -32 95 -18 -54 101 0 54 -91 103 -12 16
3251 16 67 -35 5 -62 88 -107 9 -32 -15 -62 6 37 -154 50 6 6 -107 31 45 -130 55 33 -64 -128 16
3276 16 -50 -155 -5 -20 -44 -112 53 -75 -99 -33 14 -82 -169 58 -13 -86 -87 72 20 -101 92 -38 25 2 138 -52
3302e2Q1J26k01O4K1R1j15P7Qn8M2m1O7j33J62q9j2L9l6k4j32K32j21ljM9j03
3329f2m2J88j22n8K4K00k47L7J34q2p3P2N0k03P8J06O5j55K0J11k17J57Nqj12
3354a34J52M0j76Q2J9N4j23J55m0q9P7M0rj22J26p2K2M4k7o4L8J77k93Q7O2M7
3380G3p6K8J32k14J45j9Mq3M4J61k22P4j1J16k22J29J10j50Ql2R3j72J63j27n5
3405a03Q7J9j2j66K77j01o6k8J16m8n5Q3j29J10j41J88j45O8Q8j45R5j7R8k34
3429a61J09Q2o9k4PQ5j40J61m0o2j2J19K9j49J29n0N1j82K69j44k1P0om0r2K08
3455A27q6m0Q3ko5j5J68k03N2M2Q6j01q1J77k25J78r4P3o8K6J4j01O3pJ0j25J88
3482G4m9p2L2l3L0q3J18m1o3K5M6n0r6J98j01k3k3J60j41K1J50j57J1qJ32j47
$$ plain form
3302 -52 29 155 -46 18 39 130 15 92 100 42 84 43 110 -23 139 50 38 77 41 17 -115 117 -4 -7 -8 41 -62
3329 -62 -104 84 -38 -96 -72 128 -119 -82 52 -30 -103 -31 19 -184 -106 0 65 -90 -70 41 -176 -19 -14 -22 -134
3354 -134 18 58 -118 -36 -17 37 -86 69 29 -60 17 57 48 -74 52 -20 2 46 19 -45 -7 170 -123 -36 26 73
3380 73 -3 25 157 -57 88 69 73 -10 34 195 -27 47 36 152 -70 59 169 19 27 -5 88 -84 79 -48 -103
3405 -103 -16 3 -9 -175 102 1 -65 -93 23 -25 -80 3 -126 -16 -157 31 -114 -46 42 -103 -8 -25 73 -161
3429 -161 -52 30 -39 -63 -56 29 -111 50 10 -52 -64 55 84 -65 64 14 65 -117 152 8 -13 57 51 11 -81 127
3455 127 41 1 84 82 17 2 170 -33 19 61 147 46 -35 142 -83 95 1 74 6 32 46 -55 8 1 11 -114 74
3482 74 25 -47 -15 -48 -18 -101 17 -24 -87 -62 -16 -66 -162 36 -65 -88 -111 49 -92 -71 79 -78 -67 -75 57 -90
3508i0N8Q1j18J18p0R5j67J24N8o2m5L1J20j92J39n8o1M9Q0J7j92J81j00N4r4
3533d4J35q2k5J10o8Qq1J43r8j3O1j0Rk1J18k03O9P4ln6l7R0j37O4K1j7j04Q8
3561iK8j16J08n0M3j50J82o1j06R6k8L5m7J10q7L0q3O5m9p1J77q5M0o6J56o6m6
3588e0J25q1N0l4M0k7k6Q0j00L9n7J00j26J38k9j7k4L0O8j57J66o8o2oP9k0p8
3615d7J13q2J5l5J19q4k5O6o6N1n4Q5r5q4J55k3Mr6J44j22J3LP8j56O0N6m5%k5
3644g7N6n6oJ11j53J00J7M6j23O7J2k1M9k4L1j07J27r2M4Rkm7j5J76j50j6M5J32
3672A33j11n9J54j29nN6O1j18RJ82j67jJ4J56k24J13Rl6l2j4J05j40J31l7j8M
3698C6j2M3j11J08o8L2k0K9l7p9R7l1K7p3J28j32O6P3j71L2rJ00j63O1O1n7J1
$$ plain form
3508 -90 -32 49 -69 49 -21 74 -93 31 89 27 -18 13 133 -59 80 22 -39 10 90 107 -85 96 -4 50 -44
3533 -44 91 9 -16 94 26 34 -47 96 -2 -15 46 36 45 24 142 -61 8 82 79 23 -14 76 -61 3 24 7 -97 -9
3561 -9 19 -97 11 -39 4 -146 36 -25 -131 -35 -63 -28 -75 35 -52 -22 -105 -40 -89 -160 17 -68 -28 -94 62 -4 -50
3588 -50 75 -6 44 10 50 23 -3 77 -23 16 -41 59 -67 71 42 25 1 31 99 -58 108 40 -22 -28 51 31 -47
3615 -47 66 -16 -1 -36 83 -1 -26 40 -26 25 -29 56 -39 -123 32 9 13 -83 61 -61 -48 -45 33 -123 -63 -7 -52 -52 -77
3644 -77 -21 -77 -83 28 -125 -25 -8 38 -85 -18 -6 -27 22 -2 29 -78 49 -43 1 10 8 -39 -54 122 -28 -44 1 133
3672 133 22 -37 117 -12 -17 39 100 -18 -9 173 6 5 19 175 -49 64 73 37 5 -9 96 -44 87 50 32 36
3698 36 24 67 -44 64 -4 28 8 37 0 -79 18 -13 14 -59 69 -63 3 76 -95 -63 -72 28 -135 -74 -13 -70 -59
3725e9rN4o4O5pO8j41R1K9j16N4J0Ro3J12lp3M5j1M8p2J50j16L7k3O3j3j07J88
3754A46q5k2nj2O9m7Q6j17N2p3Q0m6J1N1q9Rj0Q1j28O9%m0L0j5j0r0J20K2p5q
3784d6O6m8n9P6l6Kj3R9j2j56J71k2n4r1J65q3q2R5k2Kj9N5l2J7K8J4n5l3J42
3813F9j67P9M1L9n3pL8p8Q2k9J0j07K06r2o9J22m6k4qR6q2oQ5j9o4k3J49j44k6
3842b8L8L8k4l3R0r7j3OK2p0M6ML4o0l1J06j78J73q1J6J5J1j8o9P6m1K0k1Q1n6
3872d4r6J57m7ql0R9p1kO9p7J4l2R6o3L6J8m0O4m0J02j83P8M6O3j03L1Q5j25L5
3901C2l6M1l2J01n4p7O9l2Q9j23L1K8l4J3pL7p8J37q2k6m7R2l9o3J02j07M7m5
3929f3J03l3j7M0j74J38j8L4j63J12O9m5k3k2R4j63J26OJl2M0Jj26J70m9k2QM8
$$ plain form
3725 -59 -68 -14 -78 -13 -20 48 -93 -2 27 -89 -35 -25 -16 -79 33 30 -43 2 -9 39 -33 117 1 38 15 78 65 -42 146
3754 146 61 39 34 22 91 44 130 13 65 -8 72 26 37 88 -1 8 -2 79 -49 20 20 -20 10 -5 -15 -105 15 37 -38 -46
3784 -46 20 -28 -87 -11 -47 -45 -58 41 29 -127 44 22 -32 -123 42 -41 -123 -28 -50 -48 -67 -12 -44 -27 1 15 -40 -73 69
3813 69 -98 -19 22 61 8 1 39 -39 43 14 24 -83 123 31 -38 84 38 14 6 102 20 14 99 80 16 -7 142 -2 -28
3842 -28 10 48 24 -9 81 -16 -29 -23 -1 -71 -25 -21 13 -47 -78 28 -150 23 -58 -42 -27 -16 -34 -103 -27 -68 -48 -69 12 -44
3872 -44 -140 17 -30 -38 -68 31 -40 -42 27 -50 -36 -68 28 -35 1 19 -21 43 3 105 -78 0 46 109 6 37 122 -3 32
3901 32 -4 37 5 106 52 -25 44 12 101 -22 9 37 3 16 9 46 -32 105 23 -3 -50 42 3 -60 42 -65 -18 -63
3929 -63 40 7 -10 30 -144 -6 -24 10 -153 -41 28 -17 -40 -62 32 -131 -5 1 2 -30 10 11 -115 55 6 -16 -8 40
3957D0J8j30J40p5J6l3N8j6l6J03j49P3m1J09q4k1J03j02O7p6J61k18J23K8l7
3982B1n2M8L9r1O8K9n1M0l0L6j08Q8J2l3o2Q2l3j4M5q9M0n9N9p2K1N3k1kq8J41
4012A7p7K0J0ll6M1J2j20J01J5K4o0N5L3l9J2n1P5q1P2k7jN7l0L8r5P1k4Q7j10
4042a4O2ql1L9l0O5r0K8ppJ02j34J9jP0p5K3K2l0k0n9J56r9k3K5M6o0j2R0j12
4072f5P6l7R3j10O6J9j13R7rK7j17J12n0n5P6l4L9o7Q2l3J8o4M5j9k3J00p8M0
4100A6j01J15r1J6J51j69N5J6k8o8R6O1o6J5J8M9j17J14Nr6R9l9J3j47J40n0K0
4127B7k3L0k9l8J60j49J6o2J06l6qp%Mn0Q0p4P9qrl1L6jq0N1Pj9M9J5K1j00O7
4159B4l9rKL2m3q3J11p8O4n8Q3p0K8k3J05m5n9J36j33N1Kj4j1k6J41o3JK9j7n1
$$ plain form
3957 40 58 -72 68 -7 9 -24 34 18 -18 85 -64 9 -32 77 -7 -28 75 -27 40 -36 125 -93 30 58 21
3982 21 -31 17 56 -35 33 62 11 51 21 57 -51 37 49 16 -46 36 3 -11 34 -55 -15 -74 -15 -87 -66 -13 -34 -36 -124 17
4012 17 -60 -40 -30 -33 -69 -28 -16 -136 -35 -20 4 -56 -1 32 -7 5 -46 29 -52 20 -7 -8 49 19 57 -38 33 9 96 -14
4042 -14 48 40 9 48 18 83 -7 21 14 7 109 -25 -6 -7 63 -12 11 33 3 -17 -76 80 -19 -42 -17 29 -31 -43 47 -65
4072 -65 11 -26 67 -43 23 42 -71 26 17 44 -73 39 -11 -66 10 -24 15 -52 30 -3 15 -49 -4 -23 -46 54 -24 16
4100 16 -85 30 -61 -45 106 -63 -8 8 -20 -88 8 69 3 18 36 85 -32 82 87 -9 90 51 64 -83 57 7 27
4127 27 4 34 5 -33 127 -22 -6 -68 38 2 -6 -13 -13 -9 -59 21 -53 26 18 9 -22 14 13 -67 -16 -9 -28 21 36 57 -43 24
4159 24 -15 -24 -22 10 -33 -116 -5 -83 -19 -77 6 -64 -36 -59 46 1 -58 78 -55 -4 -2 -16 -27 -53 88 25 26 55 38 -13
4189a3k0J14o7j9pM7n1K7rj1KnM8o2N9LOj1l8O6q1P1k2q2JQ2K3j15J16q3L0J9
4221A8J4p6qJ31p9k4j3R7q2JK5k6Qr2J67j58L9Q0l1n2L6J00j56Q0m2L6j4M3K1
4250D3j19R6q6M3m0L8K6o6O9Nk7l0R4o6j4P8Jl2N5qp3P2LPr6K9M4r9O1L9k7k6
4282fQ9J0j24P2K5m0m0P1qp9O9k1ln6O4o5L5jn8N3j9L8m8R2n7j0n9J1N9q9J10
4313A5p5O9j9J9L1q4N2l3P2j12N2J7k4m1L2P3q4L1j1oQK7k3l4M3J3%k8K1P4q2
4344gk1O1jk2N1o6K8K9n4J6K2j6l3P5n3K3k1mR3j50R6q1R3p8M9j8p0N2rO3j09
4375f2J17k9q3P9m5M6j00R9o1lj8Q2k4q2J16q6J6nN4m8J3L2k7QJ2j8o4M7J13r4
4405a5oj4Q0n3N1k7j9M1JNp7Q0o2O2l1oKj3N6o6K3j2L4p6O3K9p6N6j2KJ4kqm2
$$ plain form
4189 -13 -33 81 14 -5 -12 35 -16 11 2 -9 -7 -12 36 -26 33 36 42 31 -7 59 -22 49 27 -55 -54 28 51 -64 52 -31 -1 18
4221 18 32 -44 -52 79 0 -24 -37 60 -22 -21 4 -22 -14 -106 61 -97 -58 22 -9 -61 -25 75 -81 -1 -43 -7 -21 22 43
4250 43 -76 20 -66 -23 -63 -25 1 -65 4 9 -18 -48 46 -20 -34 44 45 13 68 60 -13 59 62 69 -27 2 46 -53 8 47 20 -6
4282 -6 83 93 -31 41 66 26 -14 57 49 -30 39 18 15 -41 23 -42 -7 -8 -66 -13 -32 6 -42 50 -7 -17 -76 -65 -6 -95 15
4313 15 -60 9 -10 9 40 -44 8 -25 47 -65 -13 4 -20 -61 -29 44 -40 -9 -20 -26 -18 9 -14 -48 -5 8 8 -20 1 75 -7
4344 -7 -28 33 32 10 61 -5 23 52 -2 14 36 20 -13 62 9 32 11 7 100 -50 46 -35 58 -20 29 11 -59 -7 -16 47 -62
4375 -62 55 26 -57 22 -23 23 -77 22 -39 -42 -60 22 -2 -84 32 -54 -38 -43 11 -37 -24 8 -19 -11 1 -17 -81 -34 79 -15
4405 -15 -21 -35 45 -8 43 16 -3 38 39 44 -33 47 -15 47 16 10 12 -1 55 -11 12 0 34 -42 21 50 -26 30 18 20 34 32 24 -18
4439a8N7q5J24j10nP4p4MK3L0q8O6k1J6j8j8Nr0J56j36J04o2M2l6J4J5LL2r9Q4
4469a1n4J7M9mNl6L9k4OJ6%M3p4N1k1lM5j2l6L1L8o1QJ7J7m4R7n9n0L7RK0o0p
4503a1K4J7KOp5NQ4n2K6o0M4mo4N7J0K3mM3o6pl1J3Lo2Q6k3RLl0j6M6J5m1jj4
4538d5J8L8No3k1J07n6Lm0J10j12M3L3J2pm1O1n7L0L6j1j7k3J02j12N6n0N4K2
4567G5k5L3m2Ll7P4j23L4K6k4M2n0M4m8O2ln0J4n9K9n5J02o5M0m0J8K0m6M0l2
4597d3O1o3Q3m8j1M5o8O3o5M3l6K0k8M9l1K1O1j20N6l0RL0k3P6q0K0J9LMl3J6
4628@J3K0l1N6p8J04r4M7K5l5L0m7K8l8Pj9J6M4o1O9k2Kl1K9p4L7Q0j28K3rR2
4659E5r3J03o3omm4M8p0L6N5nl1P1j01j0K7L1M4o8KJ0k3P3p0MNK0Qm3N7q1J8l2
$$ plain form
4439 -18 39 -46 78 -32 -37 37 -37 -33 -10 20 -68 -2 -23 -7 -25 -43 -38 -128 28 -108 -4 -66 -24 -60 -46 -31 -28 4 -95 -11
4469 -11 -65 -48 1 -3 2 -34 5 -19 -13 3 3 46 -28 23 2 -1 44 32 -4 27 65 4 12 29 46 2 99 40 -10 27 36 56 -4 -11
4503 -11 13 30 32 38 -37 -32 52 0 26 -34 10 6 -58 -1 9 32 28 71 5 -2 -33 -20 -17 -79 7 -16 -7 -4 -34 -50 -4 11 -30 -31 -45
4538 -45 -27 11 16 -47 -68 39 -17 -14 -54 56 -56 -13 20 32 25 -16 45 -12 18 54 43 26 3 105 -7 49 -1 53 75
4567 75 50 83 41 44 7 81 -42 -8 18 -6 36 -14 30 -18 44 41 -9 5 -54 -25 -80 22 -43 -3 -43 -25 -5 -51 -11 -43
4597 -43 18 -45 38 -10 -21 24 -44 19 -46 -3 -39 -19 -47 2 -29 -8 53 -67 -11 -41 -32 -2 -25 51 -29 -9 10 13 17 -16 0
4628 0 13 33 2 58 -20 84 -10 37 62 27 57 10 38 0 7 -12 4 48 -13 56 34 36 5 34 -40 -3 77 -51 -28 -37 55
4659 55 -38 65 2 -4 -8 -52 -4 -74 -38 17 12 -19 52 -49 -59 -32 -1 43 -25 -23 -13 -36 37 -33 -29 -24 -4 4 -39 18 -63 -45 -77
4692g7L7J3mj7N2pRk3j06J52l9k6O2j7j1n3P4K0k7K7L8o5k5O6n8M1m2Q5o5JK8
4723D3o7N3j7N2n9J5%o8J3O5J0m1m7N4OKj3j9ON0n7Kk0L9J8n1M1ll7l2P3p7mQ0
4757A0m9j1N3J5p7Q5m6L3jk3oJ4k1Q1m0n0k1J00n8JM5pn1L4J3k1j2K8M6p9K6p4
4789f3R4j9PJ3o7O2j5L1m4J8Q6p2j7k1M2qk1J9pK7Jk3l2O2q7pP2k2m4J5Q1j04
4821d3O2K6m2qj7k6K9p2P8L7n7N1op7M3K3Mk8O5q0J5M9m1J2m4Q9k2l2j6O3nm0
4853a0PK3L1o0j7O7o6M6o0M8k6m0K1O2J1k2kL4l0k3L9j1k1Jn1O4n9O0J3k1rnO
4886@p7J10nl4m7MR5o2k4J7L3p0N1l7P3n5k0J9k3%J0j2N0n0%M6k5K8K5o5O5k7
4918gkK7K0n4L9l3L0m1L6Olj1L4j8K8k5j9JnJ3k3O0p6L2l3J0J6j4N8o4R4j11M0
$$ plain form
4692 -77 -40 -27 -31 -48 4 -3 6 -17 -123 29 -10 -36 26 9 -2 -55 19 39 12 39 77 12 -13 53 -5 36 -6 79 14 15 43
4723 43 -24 29 12 64 5 20 20 -48 -35 30 40 -1 -48 6 12 14 1 -18 -12 38 -19 -17 -37 2 20 -31 10 7 -30 -62 11 -66 -70 10
4757 10 -39 -50 3 18 -59 26 -20 13 12 -11 -17 -3 -24 57 17 -33 -54 46 -12 -11 34 27 -24 10 23 2 -10 18 64 -15 11 -63
4789 -63 31 12 19 32 -35 27 12 43 -1 17 103 31 14 -7 35 27 6 25 18 45 46 23 -9 53 -34 -41 31 9 -35 -20 61 -43
4821 -43 19 45 3 -5 -22 -48 -19 -91 -13 24 -33 18 12 -65 -22 1 5 -23 42 -38 -23 26 -15 -3 -47 42 20 -12 -28 35 30 -10
4853 -10 -3 20 51 -9 -26 41 -25 21 -39 9 -17 -57 -36 26 37 15 13 47 17 -6 33 22 1 2 -49 15 -44 16 29 8 -1 -6 0
4886 0 -77 33 28 -6 -53 -49 46 -16 -40 -23 10 -60 -9 -46 27 -28 -48 -29 -52 -52 -42 -54 -4 -54 -54 -8 -33 -5 20 -45 20 -7
4918 -7 -9 18 38 -16 23 -10 20 -21 15 21 18 7 41 23 51 26 7 8 3 16 -7 53 -23 9 -24 -14 2 -12 46 -18 76 -35 5
4951Ek8n0N0RMJ8j3M0k9o2P6m6L6MN6o6k7J5K0k6k9l3J52j27Q1m5j2J0KJj1J0
4983a5l9O1qLK2n1k1L2NJ0j7L6l3J2QO8r5RN1m7QJ0N1r2P9o2K0K0j8M2l8J2k4
5016aK9n9Q7J3p4L1J4j8ln1qO2o5QM1J4J7l8J4l0J9j07Q7m9N7K1Pk2Pk9L8%o6
5049e4O7k5k1QK5m1KN3jo1O3ll3nJk4l8L3N4M4Kp3K5j3pK6Jl3j3K1L5m8N6k3J5
5084A5k3%K9k0K9l2P5p5l6K9PJ1l6lR4q2L8Pn3L2Pk7QlJ7m7JJ7M7k7PPk6M4Op1
5120c4L7k4PjM6n1M9l9LJm1M3OL5m6L1o9QJ03j53P3J5K6p4L3J7n2O5j7on1N4M1
5153C5m5KN1l2j1J0K0m4K6JK8o2N7j5OJ2Qj1Qo7J9mK0k3rM0m0J2j5PJ6K8n0N8
5187C6l2Pn5O0n9J8jL4m0L1pl3K0N5k5jj2K0l0J8m2N8q0K3O3j9M2m7j5oML3l7
$$ plain form
4951 5 -23 -73 -23 -14 -10 8 -5 35 6 -56 20 -26 10 14 70 4 -23 -8 12 -14 -43 -76 76 -51 30 -15 -27 -17 -15 -14 -25 -15
4983 -15 -54 7 -1 2 24 -27 -48 -16 -11 -1 -18 18 -15 -3 5 73 -22 -13 38 -9 -1 9 60 -32 47 -15 5 25 7 49 11 23 -1
5016 -1 28 -31 56 69 -5 26 40 22 19 -32 -40 22 -43 -35 6 20 37 -1 13 -17 2 -105 -18 -67 -10 11 18 -4 3 -26 12 12 -54
5049 -54 13 -12 -33 -25 0 -41 -39 14 13 -48 15 12 -21 -26 -25 -49 -87 -54 0 44 46 -27 -2 -15 -22 4 5 -28 -41 -20 15 -33 23 0 15
5084 15 -8 -8 21 1 30 -2 73 -2 -38 -9 -2 9 -27 -30 64 -18 20 27 -26 6 13 -14 -6 -9 8 -39 -38 -21 26 -1 6 13 -13 31 37 -34
5120 -34 3 -21 -14 -15 31 -20 29 -10 -7 -6 -47 -4 2 37 -9 22 -47 -39 64 -89 -16 -1 25 -49 -16 1 -51 14 -3 -9 -60 -6 35
5153 35 -10 -8 43 11 0 10 30 -14 12 13 41 -21 36 21 27 39 47 36 44 -23 -4 -8 12 -11 -20 20 -20 -8 -23 -16 0 28 -22 36
5187 36 4 11 -44 16 -43 -25 -26 8 -32 -1 -8 -41 -21 34 9 8 -4 16 -14 4 -38 20 -60 -37 26 7 49 2 -13 -19 -15 18 -19
5220a9j9L3qlNM9k8k4J0M2j56J14mJ4m7R0l9j7K3k8P2Mo1J7k3rL7J5l1rRJ9m1
5253a3M7k8L1Nk2k3Mo0L8nL5m1pMJ4%J5k7J3mJ8l0j1M2l5P6k3o0O2k0NOJ3k9j3
5288b3O5j7j1J2j6j2kk3K5MMJ8o5K7J2L2m5p1J25k5lj5j2m9P3Pjj7L2J7m4qN7
5321E1M0q4k1N9l5k9M%N4rl3J9pj0l2KQj3L5Mjj0j8M5o5P3j2k1k1PM7o2OK1m6
5356e4P4k8L4J2p6%L8J0mmJ7Rk9NJ7j%J0p6R6l1q8R4k4kK4M7l7m2mk8L2j1J4L1
5391B5l1J7o5O1l3N3ml0K7l5R3o3qk0j1K4N6n3M3r5O4K8p2N2n8O0r0K2L1n9P0
5422aj0N1m6qPm2L4l7P1k2oJ1p4P9J0l0%kK1Ol0K9j6L4k4K4k1k9Q8k1j7k0N1l6
5456B4k6j9L4K5k1k7J4qO1q8L3m0L3j8K8J5m8J5OJ8l1K5N3r4O4j5L4k7l4j6O7
$$ plain form
5220 -19 -38 -5 -13 -16 -11 38 10 -14 -4 38 -118 -4 -8 6 -41 49 10 -7 16 -12 60 64 3 20 -3 -12 25 40 9 0 9 28 -13
5253 -13 34 6 37 42 20 -3 1 -59 -21 -26 9 -32 -39 -35 -21 -21 -6 -33 -20 -24 -6 -36 -47 -5 -40 36 13 -47 15 -5 0 6 19 -10 -23
5288 -23 42 25 14 26 10 -2 -4 -27 -2 2 6 24 -41 -14 -2 30 -15 -86 39 14 11 -4 -16 -65 8 15 14 -3 29 46 2 -6 51
5321 51 91 7 -14 45 10 -19 -15 -15 39 30 -3 16 9 -1 -33 -31 -23 -36 -1 3 2 -8 -26 19 -46 27 15 -6 -27 -20 27 -35 -29 -8 -54
5356 -54 20 -8 26 38 -38 -38 0 10 6 2 19 28 -1 4 21 20 20 30 -46 50 19 -69 25 1 -1 23 70 33 -9 -13 -41 -9 -20 -6 25
5391 25 -6 11 -54 7 -26 27 23 -7 20 -15 78 15 7 -13 -24 0 56 3 46 -49 15 43 -29 23 -35 25 -65 -43 -12 -71 -1
5422 -1 -11 40 -6 -14 -7 -49 -15 -52 19 -3 -9 2 -72 7 17 -13 -13 -15 6 12 -18 11 -5 29 5 29 8 -21 67 46 29 9 60 24
5456 24 -2 -21 13 38 17 -10 4 -4 57 -31 2 -38 -5 -23 5 20 -28 -13 -7 11 -20 5 58 -36 28 13 47 20 -14 -30 37
5487C7n2rJ2jJM2kj5pNk8J2n4OJ0L8M2p6N8r6N1PL9n3J6K0l3J4j2L6n3%N3L6o0
5522a6K2L6j7Pl1N7l9OJ8p3K5QL6q3P6l3OK0l3K2j9K5k6lMj2K6j9K4o3N5k8L6
5555A4l2p2J01l4J2j0PL0PNnj1p2N9Pl3J2j9O2K1o7pOM8l0oll1J6L2m1N3k9lJ8
5590Ej8nj8R0q2M6K5j2j2j3LpM9l2J7nJ2n1j8QK0m2M2K0l2K3Nl1L8k6j6k4L4j3
5624b0L9n2qM0nQl9N6l5JL4k5M4m0K1n4N1J3Nm7o7R9m7PRj7M9Nl1K0l4j9P1k0
5658A2Nop4N5j2L4rJ8k5j3J2qM0q1N7n2M6k4j3j7L0JN7n8l0N7pl6L2J7N7l5J8
5691D8r0O2k4j2J9l2K1l6L6P3m6p9P7j2rn3L1J8L9k7on2n7J12j2l3J9k0K7J0J3
5722En2mP3n8J2JJ7O4r5lL3Mj0QM0j2k5m1LM7K2k6m6K8j2rl4P0nN9q6M4K9o6M1
$$ plain form
5487 37 -15 -24 -12 -13 -12 30 28 13 6 11 -17 -5 -59 -53 -43 -5 37 -39 19 -77 -26 -19 20 -33 -17 3 -30 -16 -28 8 -45 -45 8 44 -16
5522 -16 6 42 25 32 1 58 19 25 43 -30 -5 3 39 -44 32 -1 5 25 -8 14 -5 20 -6 -9 -5 -17 9 -10 14 -49 6 -22 14
5555 14 -18 -90 11 -23 -11 -21 -14 16 23 28 23 12 -60 -1 6 -27 -15 -34 28 49 -18 -25 -19 29 -1 -7 -10 -41 -25 7 -34 19 -10 -13 5
5590 5 -13 -18 -36 54 -28 18 43 31 19 6 9 2 51 19 36 31 43 -8 -26 -18 2 -40 2 22 -10 13 18 -13 25 -1 -17 -41 -7 -20
5624 -20 19 -33 -41 -1 -6 2 -37 19 -16 -15 19 -6 38 -2 19 -35 16 29 34 -13 -80 19 -28 -21 -12 -29 20 25 -6 14 -20 -39 32 12
5658 12 17 11 -63 -8 -20 14 5 23 -2 -15 -3 -11 29 -52 5 -47 -1 -25 -38 -55 -25 -24 33 -25 -55 2 -5 -41 -9 8 65 30 48
5691 48 -42 20 -4 -16 3 -29 -8 -44 -8 65 19 -60 17 5 -4 -57 -26 -8 31 4 -2 -54 -111 1 -11 -44 -25 -45 -18 -8 5
5722 5 -47 -51 22 -36 -24 -23 -6 58 -37 -40 -7 -3 -13 -5 35 23 -2 -43 -40 7 29 3 -43 -15 -27 -36 -70 0 -5 54 -32 12 41 -25 16
5757A6j1O6q5J5Kj4Q6q6jj4L4j6J5l0J1L2o6M1J1J8mk0m8P1l4j4j0K3j4k3j1Q4
5789B4K4r1O0n8L9K7n8P6o3K1k0JM5n0K0J5Qj4l4R1o4M8nj1Pk9L5kM4k1k0n5O5
5822E5n5j4L8k4o2jQ9l3j0JLK7lL9j8o3K5J9m0L9poK9r9R9Kjj7j8nOm6O5o0O2
5857A6kl0lJ4OlRl3J0J7J8o6K7j8N1m2P2m3Lnl4J6L2p1L8K5k5j3P4j7N2n6l3M2
5891B8m5J01q3L1j5J8l0k9K9k4oK9ql3N2Kl3L0J9l4nJ7p4M7j0M0rj6NO3n6qJ9
5924A2j7L6m9L0rJ5J9%l1L2l9p4J28k6k0M1l0L6r7N7q7LP4kkLl7Ok2OKJ0K2Jk0
5959b9J2J8K4l2J6Oj3L1k8rL9NL7o8Nrj0M6j0n7j8Q1n8M0o8N9j9j4L5j8pk1N8
5992B4m3P6n1RO2j05K8l2K9k0L3m2K0J6lk4K0OK0k1J2o7K6Q0l3p3P3o6j8N8j4
$$ plain form
5757 16 5 71 -14 1 3 -11 75 -11 -12 -26 8 -8 7 -23 -12 20 -46 -5 6 24 20 0 -48 23 -11 -25 -35 -12 -26 -49 -60 24
5789 24 48 -43 17 -41 -2 25 -33 43 -20 1 -19 -18 27 -23 -3 12 20 6 -28 63 -1 47 42 31 38 9 44 42 86 65 45 -10 55
5822 55 0 -14 24 0 -62 -63 26 -7 -17 -16 -13 14 11 50 32 -31 -6 13 -27 12 5 -1 28 -71 28 30 29 12 -6 -11 -5 -51 14 -46 16
5857 16 14 -16 -19 -5 1 -2 7 -26 -16 1 19 -47 -20 -38 13 -29 43 0 3 -2 -36 -20 12 -59 -21 4 -21 -34 40 23 75 19 -14 28
5891 28 -17 84 1 32 17 35 5 -24 5 -19 -25 4 -4 -37 15 17 -16 14 33 -1 -6 11 -63 -16 -26 14 5 -11 -6 57 1 -7 12
5924 12 -5 31 -18 12 3 18 37 37 6 38 -1 -75 53 27 7 48 18 54 -43 14 -73 -70 4 2 0 3 -34 -28 -50 -44 -42 -32 -10 -9 -29
5959 -29 -17 1 25 -7 9 15 2 33 5 -4 35 40 77 9 14 5 -5 41 31 -26 -44 37 -21 19 -49 10 -9 -23 12 -6 -13 -34 24
5992 24 -19 57 6 15 77 -28 0 -32 -3 -23 10 -32 -12 4 1 -23 -3 3 23 2 14 -53 -27 53 20 -53 20 -46 -64 -6 -20
6023b0L0m5N8j6j4K9n4R3o4k3k2M8l3J2OM1k6m4N6k3J2J1O2o6M1l3j0K8m4O6q2
6054b6O7l0K7j1mj2m0Pq7J19%Jj2m8O3m9k5J9km6Q3L6nn1K2OjRj3m3M3j9K2K0
6088B0pqLJ2m4J2L4p%JMmQ7j28J3nJ8k6N3j1K6n3k5O4l6M7p1J36p7k9L7o9M8k2
6122gM1n3K8QJ5m2K5j5n0K4N6N1q4P1n2n2J4LK5K8J6k3m4j9L1J1k8Nl3L3Rn6O0
6155dk0N6o2l8N7M5j10L7K3l3M2NnJ1QMn7M7Kk4R5r2J5OK0p0Q5m8Qpk9J9K5j9
6189hl3Q1m3j4L1kj6m1O7j5Lk3mK7n3M0jQnj9O2o2pJ5P4n6J4j2J2p1K6JLJ6o2
6224f7J10m0o8K8J2J6O2j2l6n9kK1J6k5O3rJ0j1m8N4J5k5k9N5o4M9l3PJ4k1j2
6255b9M1L7l9K1jj9k4k2N1m1L4O4j9n2J7lj8Qkl1K6K3n2J6J7Qj8j2N5o7N5rl6
$$ plain form
6023 -20 10 -35 23 7 -7 22 -32 61 -3 -26 -48 0 -33 -21 -15 26 0 -44 12 -11 1 12 74 8 49 16 6 34 -10 56 -26
6054 -26 41 11 38 27 23 11 -29 -22 -109 10 10 11 -1 -49 14 -35 -60 -41 -43 -89 -6 30 25 -26 -4 2 1 10 -3 -46 -3 -22 0 20
6088 20 13 5 8 20 -24 -12 22 15 15 16 20 16 103 -25 -12 -17 1 -25 28 17 43 -10 -35 29 -7 40 -31 105 28 -1 36 -33 15 -7
6122 -7 34 -19 9 17 32 -10 15 0 -50 -26 30 81 -3 68 16 -36 -22 -19 6 34 50 27 -17 -36 -5 6 -22 -17 -50 -17 -8 -64 -4
6155 -4 -24 32 -30 -68 -11 34 -76 -39 -16 -49 -7 -2 -7 4 12 16 -41 6 8 -16 79 -13 2 8 28 -42 43 -5 3 -4 -33 -14 11 -8
6189 -8 -41 40 -3 -17 14 12 -4 -45 22 7 10 -13 -17 10 -43 -3 -4 4 -1 -20 42 -20 -27 -12 62 6 20 8 20 -51 -25 -24 -21 -5 -67
6224 -67 43 3 -65 -37 -25 -9 53 41 5 -54 -56 -35 -19 -44 19 10 20 9 -39 15 30 5 -24 31 -33 16 -17 -10 4 -17 -29
6255 -29 12 49 10 31 30 11 -13 -35 16 -25 9 73 54 2 19 16 -2 6 4 -27 -1 22 -30 -14 3 11 -7 -19 36 -31 24 15 -21
6288b1O6K5j28N0K7m1M5K8m0m2M2k1J0oj3N5l5lJ9ll7J0K6qOl7j2K6l3N6l0l0
$$ plain form
6288 -21 45 70 -58 -8 19 -22 23 51 11 -31 11 -10 0 -6 -19 36 1 -2 17 14 -23 -13 13 5 11 -26 -38 -12 -45 11 -19 -49
$$ [...]
8191E2
##END NTUPLES=NMR FID
##END=
