##TITLE=1H_EC-3202(IV-2)
 CDcl3, 8 sc, 
 15.11.2019
##JCAMPDX= 6.0         $$ Bruker NMR JCAMP-DX V2.0
##DATA TYPE= NMR FID
##DATA CLASS= NTUPLES
##ORIGIN= UXNMR, Bruker Analytische Messtechnik GmbH
##OWNER= root
$$ XWIN-NMR		Version 3.5
$$ Fri Nov 15 14:09:24 2019 Russian Standard Time (UT+4h)  she@DPX200
##.OBSERVE FREQUENCY= 200.1315
##.OBSERVE NUCLEUS= ^1H
##.DELAY= (6, 6)
##.ACQUISITION MODE= SIMULTANEOUS
##.ACQUISITION SCHEME= undefined
##.AVERAGES= 8
##.DIGITISER RES= 18
##SPECTROMETER/DATA SYSTEM= spect
##.PULSE SEQUENCE= zg30
##.SOLVENT NAME= CDCl3
##.SHIFT REFERENCE= (INTERNAL, CDCl3, 0, 15.7039)
##AUDIT TRAIL= $$ (NUMBER, WHEN, WHO, WHERE, WHAT)
$$ ##TITLE= Audit trail, XWIN-NMR		Version 3.5
$$ ##JCAMPDX= 5.01
$$ ##ORIGIN= Bruker BioSpin GmbH
$$ ##OWNER= she
$$ F:/spectra/data/she/nmr/H-F/1/audita.txt
$$ ##AUDIT TRAIL=  $$ (NUMBER, WHEN, WHO, WHERE, WHAT)
(   1,<2019-11-15 14:08:27.06 +0400>,<she>,<DPX200>,
      <created by zg, POWCHK disabled, PULCHK disabled
       configuration hash MD5:
       00 E9 B6 7A A2 85 ED C7 34 08 36 98 17 FE 4E 26
       data hash MD5: 16K
       EF 9D 60 0C 9C 89 AE 9E 52 16 3C 15 CC 20 70 06>)
$$ ##END=
$$ 
$$ hash MD5
$$ 77 68 7F 9B CE 87 A6 A5 F7 BC 76 27 09 49 03 F4
##$RELAX= 
##$RELAX= 
##$RELAX= 
##$RELAX= 
##$RELAX= 
##$RELAX= 
$$ Bruker specific parameters
$$ --------------------------
##$DU= <F:/spectra>
##$EXPNO= 1
##$NAME= <H-F>
##$PROCNO= 1
##$TYPE= <nmr>
##$USER= <she>
##$AMP= (0..31)
100 100 100 100 100 100 100 100 100 100 100 100 100 100 100 100 100 100 
100 100 100 100 100 100 100 100 100 100 100 100 100 100 
##$AQSEQ= 0
##$AQ_mod= 1
##$AUNM= <au_zg>
##$AUTOPOS= <>
##$BF1= 200.13
##$BF2= 200.13
##$BF3= 200.13
##$BF4= 200.13
##$BF5= 200.13
##$BF6= 200.13
##$BF7= 200.13
##$BF8= 200.13
##$BYTORDA= 1
##$CFDGTYP= 0
##$CFRGTYP= 5
##$CHEMSTR= <none>
##$CNST= (0..31)
1 1 145 1 1 1 1 1 1 1 1 1 1 1 1 1 1 1 1 1 1 1 1 1 1 1 1 1 1 1 1 1 
##$CPDPRG= <>
##$CPDPRG1= <>
##$CPDPRG2= <>
##$CPDPRG3= <>
##$CPDPRG4= <mlev>
##$CPDPRG5= <mlev>
##$CPDPRG6= <mlev>
##$CPDPRG7= <mlev>
##$CPDPRG8= <mlev>
##$CPDPRGB= <>
##$CPDPRGT= <>
##$D= (0..31)
0 1.2 0 0 0 0 0 0 0 0.06 0 0.03 0 0 0 0 0.0002 0 0 0 0 0 0 0 0 0 0 0 0 
0 0 0 
##$DATE= 1573812506
##$DBL= (0..7)
120 120 120 120 120 120 120 120 
##$DBP= (0..7)
150 150 150 150 150 150 150 150 
##$DBP07= 0
##$DBPNAM0= <>
##$DBPNAM1= <>
##$DBPNAM2= <>
##$DBPNAM3= <>
##$DBPNAM4= <>
##$DBPNAM5= <>
##$DBPNAM6= <>
##$DBPNAM7= <>
##$DBPOAL= (0..7)
0.5 0.5 0.5 0.5 0.5 0.5 0.5 0.5 
##$DBPOFFS= (0..7)
0 0 0 0 0 0 0 0 
##$DE= 6
##$DECBNUC= <off>
##$DECIM= 24
##$DECNUC= <off>
##$DECSTAT= 4
##$DIGMOD= 1
##$DIGTYP= 9
##$DL= (0..7)
0 120 120 120 120 120 120 120 
##$DP= (0..7)
150 150 150 150 150 150 150 150 
##$DP07= 0
##$DPNAME0= <>
##$DPNAME1= <>
##$DPNAME2= <>
##$DPNAME3= <>
##$DPNAME4= <>
##$DPNAME5= <>
##$DPNAME6= <>
##$DPNAME7= <>
##$DPOAL= (0..7)
0.5 0.5 0.5 0.5 0.5 0.5 0.5 0.5 
##$DPOFFS= (0..7)
0 0 0 0 0 0 0 0 
##$DQDMODE= 0
##$DR= 18
##$DS= 0
##$DSLIST= <SSSSSSSSSSSSSSS>
$$ [...]
##$SUBNAM2= <"">
##$SUBNAM3= <"">
##$SUBNAM4= <"">
##$SUBNAM5= <"">
##$SUBNAM6= <"">
##$SUBNAM7= <"">
##$SUBNAM8= <"">
##$SUBNAM9= <"">
##$SW= 24.0689530833862
##$SWIBOX= (0..15)
0 0 2 0 0 0 0 0 0 0 0 0 0 0 0 0 
##$SW_h= 4816.95568400771
##$TD= 16384
##$TD0= 1
##$TE= 0
##$TE2= 300
##$TE3= 300
##$TEG= 300
##$TL= (0..7)
0 120 120 120 120 120 120 120 
##$TP= (0..7)
150 150 150 150 150 150 150 150 
##$TP07= 0
##$TPNAME0= <>
##$TPNAME1= <>
##$TPNAME2= <>
##$TPNAME3= <>
##$TPNAME4= <>
##$TPNAME5= <>
##$TPNAME6= <>
##$TPNAME7= <>
##$TPOAL= (0..7)
0.5 0.5 0.5 0.5 0.5 0.5 0.5 0.5 
##$TPOFFS= (0..7)
0 0 0 0 0 0 0 0 
##$TUNHIN= 0
##$TUNHOUT= 0
##$TUNXOUT= 0
##$USERA1= <user>
##$USERA2= <user>
##$USERA3= <user>
##$USERA4= <user>
##$USERA5= <user>
##$V9= 5
##$VALIST= <valist>
##$VCLIST= <CCCCCCCCCCCCCCC>
##$VD= 0
##$VDLIST= <DDDDDDDDDDDDDDD>
##$VPLIST= <PPPPPPPPPPPPPPP>
##$VTLIST= <TTTTTTTTTTTTTTT>
##$WBST= 1024
##$WBSW= 4
##$XGAIN= (0..3)
0 0 0 0 
##$XL= 0
##$YL= 0
##$YMAX_a= 320263
##$YMIN_a= -217991
##$ZGOPTNS= <>
##$ZL1= 120
##$ZL2= 120
##$ZL3= 120
##$ZL4= 120
##$ABSF1= 10
##$ABSF2= 0
##$ABSG= 5
##$ABSL= 3
##$ALPHA= 0
##$AQORDER= 0
##$ASSFAC= 0
##$ASSFACI= 0
##$ASSFACX= 0
##$ASSWID= 0
##$AUNMP= <proc_1d>
##$AZFE= 0.1
##$AZFW= 0.1
##$BCFW= 1
##$BC_mod= 2
##$BYTORDP= 1
##$COROFFS= 0
##$CY= 11.3945322036743
##$DATMOD= 1
##$DC= 2
##$DFILT= <>
##$DTYPP= 0
##$F1P= 16.9975609425685
##$F2P= -3.02152046262296
##$FCOR= 0.5
##$FTSIZE= 0
##$FT_mod= 4
##$GAMMA= 1
##$GB= 0.15
##$INTBC= 1
##$INTSCL= 1
##$ISEN= 128
##$LB= 0.24
##$LEV0= 0
##$LPBIN= 0
##$MAXI= 10000
##$MC2= 0
##$MEAN= 0
##$ME_mod= 0
##$MI= 1.114404
##$NCOEF= 0
##$NC_proc= 0
##$NLEV= 6
##$NOISF1= 3.799351
##$NOISF2= 2.8
##$NSP= 1
##$NTH_PI= 0
##$NZP= 0
##$OFFSET= 15.70392
##$PC= 1
##$PHC0= -9453.091
##$PHC1= 15.40088
##$PH_mod= 1
##$PKNL= yes
##$PPARMOD= 0
##$PSCAL= 0
##$PSIGN= 0
##$REVERSE= no
##$SF= 200.130013532006
##$SI= 16384
##$SIGF1= 3
##$SIGF2= 2
##$SINO= 400
##$SIOLD= 16384
##$SREGLST= <1H.CDCl3>
##$SSB= 0
##$STSI= 0
##$STSR= 0
##$SW_p= 3612.71676300578
##$SYMM= 0
##$S_DEV= 0
##$TDeff= 0
##$TDoff= 0
##$TI= <>
##$TILT= no
##$TM1= 0
##$TM2= 0
##$TOPLEV= 0
##$USERP1= <user>
##$USERP2= <user>
##$USERP3= <user>
##$USERP4= <user>
##$USERP5= <user>
##$WDW= 1
##$XDIM= 8192
##$YMAX_p= 0
##$YMIN_p= 0
$$ End of Bruker specific parameters
$$ ---------------------------------
##NTUPLES= NMR FID
##VAR_NAME=  TIME,          FID/REAL,        FID/IMAG
##SYMBOL=    X,             R,               I
##VAR_TYPE=  INDEPENDENT,   DEPENDENT,       DEPENDENT
##VAR_FORM=  AFFN,          ASDF,            ASDF
##VAR_DIM=   8192,          8192,            8192
##UNITS=     SECONDS,       ARBITRARY UNITS, ARBITRARY UNITS
##FACTOR=    0.0002076,     1,               1
##FIRST=     0,             0,               0
##LAST=      1.7004516,     0,               0
##MIN=       0,             -217991,         0
##MAX=       1.7004516,     320263,          0
$$ Real data points
##PAGE= N=1
##DATA TABLE= (X++(R..R)), XYDATA
0 0 0 0 0 0 0 0 0 0 0 0 0 8 -8 8 -8 8 -8 14 -16 17 -22 26 -32 34 -41 48 -53 61 -71 79 -89 102 -114 129
34 129 -146 162 -178 199 -222 246 -273 302 -336 371 -409 454 -503 557 -620 689 -770 864 -974
53 -974 1105 -1262 1457 -1695 1974 -2214 1686 14808 289142 281339 -46573 -217991 -154139 83293
67 83293 224054 74159 -105938 4660 147534 75050 -36722 -30701 57813 187167 170309
78 170309 -45136 -121006 76597 198537 112464 6362 -41172 2455 144889 158893 -4972
89 -4972 -63140 24582 54061 61935 100782 50788 -32835 -38289 -39787 -4082 135061 152153 -45677
102 -45677 -161319 -78674 35798 113121 92095 -60668 -119170 2838 37932 -53923 -43758
113 -43758 40938 60160 28113 -73653 -174014 -53228 164347 129434 -76060 -153886 -83699
124 -83699 46849 132605 17543 -157477 -93676 82712 87204 -15040 -88038 -109969 -10861
135 -10861 113386 43861 -96650 -76626 -8997 -8307 2424 -10537 -60123 -13327 49421 -31125
147 -31125 -107926 -59546 -5823 34616 71439 -20103 -151607 -102056 28208 63489 48956 -13182
159 -13182 -114809 -80413 55467 54962 -30520 -29300 -315 17101 46648 -6004 -91325 -15767
171 -15767 111945 80795 -11176 -42181 -42767 22135 107468 53782 -42747 -2070 55652 25838
183 25838 12635 14437 -9439 31748 80573 16074 -33825 11176 14945 -7641 40147 51252
195 51252 -6622 -14566 -7836 -27908 19805 63461 -14090 -60086 14772 44542 -3579 -38446
207 -38446 -62495 -21752 104896 99498 -85396 -156536 -27917 93291 109745 18262 -120646
218 -120646 -101185 75631 107864 -32785 -79297 3325 73130 73805 -29582 -135011 -28545
229 -28545 163969 125130 -64610 -124727 -37198 90079 141454 11356 -136721 -53991 108801
240 108801 89574 -19933 -63595 -44650 33590 86352 599 -77742 -5748 45889 -16240 -43395
252 -43395 -10495 12516 36988 7767 -91356 -84777 37967 59219 -15959 -39040 -37615 -42277
264 -42277 -11219 -7756 -30700 22993 52280 -59634 -130880 -36914 68483 80660 9086 -113975
276 -113975 -125288 41417 129683 8392 -96671 -60147 20229 74320 36936 -79130 -74025
287 -74025 71118 97096 -26170 -77645 -17774 60489 97014 12776 -114672 -57435 113539
298 113539 124143 -4790 -83187 -68427 29689 131217 74001 -67217 -66610 22756 42458 33472
310 33472 24409 -13517 -6891 34147 -1315 -38285 19735 52320 11351 -4137 -13608 -39110 2319
323 2319 54905 19985 -14627 -6801 -31732 -32340 39587 52498 -12414 -37517 -33422 -21574 40669
336 40669 59442 -30618 -74131 -11386 26823 22652 14407 -32880 -54041 12388 37553 -19850
348 -19850 -26792 9191 1805 -3774 -2385 -37435 -23895 47686 37474 -33344 -41217 -22012 -5802
361 -5802 46117 50087 -31994 -60892 -12354 13510 33435 45231 -19292 -68592 -6659 46791
373 46791 22630 869 -18320 -32613 19520 54492 -14862 -54158 10360 49312 23960 -11503
385 -11503 -53757 -34907 70074 88117 -33106 -90945 -20846 54044 77251 24012 -78961
396 -78961 -73917 52898 88472 -1241 -49070 -26402 12300 49613 19779 -55394 -27727 61944
408 61944 41887 -35610 -42384 -7917 33030 58307 -177 -72154 -25233 48566 26279 -9352
420 -9352 -6433 -15337 -9299 11787 -9442 -14484 34641 18678 -55452 -45347 21196 37823 17166
433 17166 -26908 -70198 -18450 65707 26116 -61473 -45189 14585 30143 8266 -45200 -63433
445 -63433 27363 84771 -11403 -99583 -46536 45862 78385 25659 -84152 -97653 39199 113714
457 113714 18745 -72588 -54717 12627 70588 46731 -51842 -60050 45413 72432 -6922 -45679
469 -45679 -16905 32192 69960 22421 -69173 -44482 57877 66196 3298 -28719 -33456 -1326
481 -1326 50641 28687 -30407 -13643 17941 -8372 -13007 13984 8601 223 -216 -30599 -27843
494 -27843 32286 32185 -28315 -32236 -986 2850 9207 1939 -28405 -6519 36940 -1204 -49215
507 -49215 -11912 35236 33857 11156 -36085 -55068 22747 84234 24329 -44151 -32072 5186
519 5186 42704 54659 -3687 -45189 8703 48950 14651 -5302 2807 3775 25932 33574 -16466
532 -16466 -31347 23759 39907 8442 -5385 -21985 -27055 24335 47424 -7791 -40565 -23790
544 -23790 -12154 14846 35982 -15132 -64532 -28917 10885 6541 873 -23337 -53102 -18644
556 -18644 19961 -15520 -42719 -12444 454 -7263 -12116 -42120 -46042 20017 43524 -20832 -56854
569 -56854 -31876 -1631 30345 29429 -31936 -53138 4941 29205 790 -3947 -3414 -11043 10468
582 10468 16681 -12689 -1963 30262 5302 -19155 7445 20283 11662 15208 -2106 -18441 20104
595 20104 39434 -3595 -12764 22201 21158 2682 -1368 -8250 15674 60354 25104 -51461 -34439
608 -34439 40383 64192 35609 -19022 -54546 3127 80504 42638 -35854 -25229 28124 48605
620 48605 30507 -23889 -45296 31849 88177 20009 -53845 -31063 26191 59567 39324 -35513
632 -35513 -56003 25722 67593 4645 -43930 -26660 8761 39094 22209 -44790 -50584 16738
644 16738 27481 -20040 -30623 -15839 -7116 4319 -17210 -54819 -25431 23641 -2745 -43890
656 -43890 -32799 -19526 -15568 -8388 -26314 -36308 4561 11460 -47039 -59443 -8438 20493 14649
669 14649 -13997 -56203 -39233 30747 31023 -28730 -32096 7748 22281 14623 -16991 -43285 6099
682 6099 71521 35313 -37987 -36049 10623 46241 51317 157 -44278 4565 62408 31774 -14634
695 -14634 -13695 4681 34839 49351 2512 -34361 5320 36377 13452 2198 6495 1409 15406
708 15406 19954 -18060 -24508 21488 32582 8733 -482 -19592 -32146 7053 36760 14599 -1612
721 -1612 -8969 -32763 -18341 29411 28183 -2219 -8197 -15179 -17608 14000 21061 -9161 -4521 15506
735 15506 -1828 -12531 2504 657 3426 20841 1018 -24643 1829 22789 1055 -7853 -4790
748 -4790 -10957 9965 31838 -990 -31084 -13584 -1535 4300 27988 17646 -26999 -33341 -12954
761 -12954 -1135 24914 32784 -16187 -46264 -15637 6172 6032 12043 -1774 -19322 -987 1103
774 1103 -31319 -17781 29437 26631 -7377 -29717 -39448 -4412 49791 26880 -41985 -41302 9157
787 9157 30695 20377 -16409 -50083 -10789 51755 29922 -29038 -31087 -6194 10480 20073 -1792
800 -1792 -24106 8892 30338 -16916 -44697 -7489 28909 36070 12555 -42342 -54735 9359
812 9359 46017 11982 -13016 -10858 -13528 -3637 4782 -9278 2416 31929 4941 -38318 -19277
825 -19277 17582 21983 12573 -10740 -26841 10678 41478 -438 -35433 -4562 28261 29655 13038
838 13038 -21367 -26061 24830 41415 -6247 -20736 16074 32143 17565 -11138 -37509 -3326
850 -3326 66125 52824 -26248 -48702 -8929 30404 45552 13841 -35001 -17797 32825 18253
862 18253 -22665 -15710 9318 22732 22160 -16340 -46849 -5676 37504 12338 -18670 -14639 -8122
875 -8122 2679 9504 -18148 -28808 11048 24487 -9760 -23143 -15498 -13532 4360 15528 -8400
888 -8400 -15250 2805 -10132 -26684 -1252 16324 4697 -1088 -13782 -28139 -1908 24102 -466
901 -466 -17078 2526 4994 -3996 -1447 -11589 -13081 20041 25957 -11484 -20457 -1421 1994 7410
915 7410 13205 -6135 -8121 16771 7619 -20943 -9275 10677 12544 18933 6739 -28169 -22648
928 -22648 15027 19941 9749 7725 -12645 -24023 4857 17640 67 745 3637 -9730 -1920
941 -1920 9974 -10019 -13456 14353 13652 -6250 -6422 -9897 -9671 16223 16901 -18321 -17578 13529 13701
956 13701 -908 -9600 -23177 -5035 37447 25358 -24648 -29417 -2994 11661 23575 14170 -17837
969 -17837 -13027 14641 2253 -14137 7424 20990 9910 1536 -15515 -23117 15130 39254 5536
982 5536 -18608 -4664 2945 7077 13509 -2302 -9046 15328 13053 -16876 -8608 16722 9777 -1849
996 -1849 -5921 -12372 8042 30804 -2233 -38767 -11891 25013 24052 4838 -23190 -34267 6083
1009 6083 35679 919 -27032 -4145 12714 3440 -8773 -24518 -11840 34307 31576 -30220
1021 -30220 -48098 -5820 26987 28863 1187 -40090 -28861 26162 27524 -16508 -23328 -1242
1033 -1242 10156 13753 -4894 -30554 -7183 30196 9172 -24090 -13107 5319 10252 9789 -13555
1046 -13555 -28009 7692 31571 -696 -22822 -9023 114 7497 12682 -7211 -13721 11345 8318
1059 8318 -20342 -9703 16512 14550 4472 -9408 -24953 -2185 33301 14627 -20234 -10437
1071 -10437 7674 8651 9415 -3879 -16975 10008 28995 -2833 -23776 -1873 13634 15055 9744
1084 9744 -14649 -20937 15189 27283 -6091 -17915 -2421 5452 13724 11013 -17608 -20828 12457
1097 12457 16078 -5799 -5550 -2992 -7556 5726 7652 -13826 -8820 12399 2155 -9268 -697
1110 -697 -6118 -8943 10541 9354 -11040 -5635 1496 -7482 2766 14979 -3616 -11377 5755 3853
1124 3853 -2227 8391 2882 -8163 9401 15203 -7079 -5288 11051 6231 5354 10947 -4185 -7276
1138 -7276 16354 13847 -6257 1181 9461 473 6149 8975 -6327 -1219 15171 854 -10042
1151 -10042 6879 7687 -5127 -521 -1622 -8191 7551 11274 -15236 -16571 6502 4613 -6471
1164 -6471 -4972 -12185 -9340 10834 -23 -27313 -13508 12065 3818 -10145 -16930 -21898 65
1177 65 23104 -4173 -34928 -14479 10272 6091 -2511 -17128 -23180 6601 23476 -11057 -29439
1190 -29439 -2741 13793 8126 -2330 -20605 -16390 21613 24881 -15955 -23616 3303 15047 13616
1203 13616 2139 -19586 -8927 26106 17131 -15088 -8390 11231 11457 9301 -1506 -14080 7893
1216 7893 31217 3905 -19180 173 16994 14323 9862 -6492 -12419 16881 26948 -5082 -13312
1229 -13312 10307 15913 8934 2072 -11250 -1914 28799 18539 -18614 -13597 13936 18168 11065
1242 11065 -3923 -20422 -24 30102 9591 -21264 -9763 9366 10370 6763 -10144 -21624
1254 -21624 6219 24810 -5525 -25511 -7206 6302 8367 3950 -19448 -25154 8024 18035
1266 18035 -10592 -19138 -6907 -3912 2968 3343 -17481 -16408 9759 4614 -16381 -9050 -477 -3434
1280 -3434 3436 -302 -18104 -7070 12852 -430 -11167 245 -1118 -4987 5904 1345 -10246
1293 -10246 4065 9267 -7998 -4793 9545 2128 -2111 5337 -3348 -5193 13135 8563 -9005
1306 -9005 -494 7315 -1751 3397 8718 -5248 -3254 10649 581 -7266 6500 4901 -5037 4475
1320 4475 4304 -9416 -429 9449 -2171 -2247 5380 -6346 -8038 9986 6026 -8747 -2065 845
1334 845 -4755 6148 6583 -13412 -7914 12393 5351 -6162 -2266 -5660 -1745 15202 4476 -17645
1348 -17645 -4162 14265 4905 -2494 -3157 -8737 5639 21081 -749 -19914 214 14893 7071
1361 7071 3243 -5094 -10604 10625 20336 -6752 -14501 7869 13289 4773 1186 -9872 -7693 18471
1375 18471 17169 -11647 -10585 8626 6535 2592 861 -8758 633 19412 2338 -20386 -4195
1388 -4195 14297 7143 619 -7235 -13997 5551 18492 -6906 -20225 2145 11600 1856 -4930
1401 -4930 -14107 -11323 14634 14406 -17912 -19854 5784 9595 -576 -9075 -18598 -5419 22376 7975
1415 7975 -26778 -19706 5786 10124 5471 -7566 -22186 -4577 18148 -933 -21655 -4735 10300
1428 10300 5240 -1633 -15272 -18904 10969 24853 -5353 -21466 -4928 5145 7542 6620 -10097
1441 -10097 -12562 12505 13732 -10563 -9762 5981 5670 5605 3286 -10584 -2850 17357 5237 -13564
1455 -13564 -1026 11643 7125 6239 -2828 -14701 3195 21855 4736 -7847 2082 2300 -1089
1468 -1089 6002 1644 -2614 12896 11557 -12659 -11197 8052 9890 8597 5696 -11437 -11117 12047
1482 12047 11607 -5505 -1270 4078 -1850 3825 4522 -9188 -3217 12667 2914 -6971 1993 590
1496 590 -4588 5146 1917 -8654 2793 11440 -3311 -7616 -240 -4802 305 14798 3797 -12806
1510 -12806 -5478 -1086 -2413 9828 9787 -9426 -8551 3716 -2824 -3147 7157 804 -4887 4194 -2878
1525 -2878 -13944 1302 11929 -771 -4342 -2352 -8965 -676 10528 -4053 -13129 3562 7098
1538 7098 -3956 -3303 -5883 -10365 4964 11969 -6486 -10591 2460 -1940 -7288 261 -378 -1059 8193
1553 8193 -2278 -21541 -7535 13212 7384 -2068 -5476 -13017 -3949 12363 266 -13198 2435
1566 2435 9773 -3013 -6954 -6017 -4802 11180 15722 -9945 -16766 5705 11484 517 -2819 -6506
1580 -6506 -1084 18419 11726 -17625 -14595 11256 15776 8230 136 -12008 -4175 16722 8085 -10892
1594 -10892 1533 15481 6995 -2198 -7071 -8497 12368 26358 1634 -18273 -3487 9909 8368
1607 8368 7220 -2806 -8213 10057 14706 -8283 -11980 6542 9733 4732 1831 -9027 -6553 12062
1621 12062 6701 -13391 -4886 11637 6290 -1995 -8590 -15227 585 20802 5173 -16504 -8712
1634 -8712 785 -321 2859 -1012 -8110 3598 8224 -12724 -17685 3224 10592 4215 -1770 -14587
1648 -14587 -14534 9031 12898 -8456 -10876 1150 1788 1518 476 -11973 -7403 12283 7686 -9170
1662 -9170 -5013 493 -2926 2050 2681 -6460 1883 11702 -3421 -13897 -1569 4693 5838 10226
1676 10226 -1542 -15556 -3485 8880 1473 2077 6300 -5058 -7003 2555 -970 -2824 9064
1689 9064 5232 -8474 -3736 1598 -3677 2429 7301 -4728 -5682 4995 -144 -5186 2708 -537
1703 -537 -5653 5147 6610 -6480 -4814 1160 -3652 687 9781 -307 -6789 1559 -1258 -6451
1717 -6451 4886 8593 -377 572 -1236 -10692 -965 15278 7272 -4017 -1937 -3605 -1790 10582
1731 10582 6212 -6320 1725 9133 -1290 -3497 2685 821 5209 11094 -2881 -10189 5723 10634
1745 10634 -619 -2110 263 -115 9780 9316 -10560 -11785 9222 12131 2511 -450 -6067 -5421 8731
1760 8731 7071 -8112 -2116 10482 1654 -6301 -5062 -4463 4763 15177 -1222 -18764 -5431 8687
1774 8687 3420 -465 -4361 -8712 2275 8856 -8413 -14775 2443 7099 -1586 -4741 -9105 -8533
1788 -8533 6466 5929 -13488 -11497 5766 4213 -4794 -8034 -11718 -2990 13233 3778 -16762 -10290
1802 -10290 3966 2047 -243 -3025 -8395 431 9750 -5090 -15418 1032 10406 3763 -1273 -7690
1816 -7690 -8890 8292 14198 -4654 -9939 4708 7576 2699 1533 -5243 -2699 13962 11520 -7485
1830 -7485 -5324 6919 6053 4691 3345 -4234 1345 14015 3863 -9826 -108 9681 6476 5217
1844 5217 -951 -9242 2218 13876 1975 -6407 2121 3094 326 3443 -1847 -6281 6059 9232
1858 9232 -5482 -6554 2294 731 1226 3757 -5034 -6509 6379 3948 -7621 -2635 2253 -1102
1872 -1102 2522 2572 -7519 -4919 5985 767 -4441 1879 179 -4510 1540 682 -6085 1530 6843
1887 6843 -2601 -4946 1120 -2486 -1253 6844 218 -7725 426 2891 -2903 1018 2530 -5319 -899
1902 -899 5768 -2642 -5949 2656 947 -2329 2821 -1057 -7166 2339 5911 -4750 -4882 2527 -220
1917 -220 204 3496 -5901 -7728 5835 6370 -4473 -3470 -1078 -3128 3417 4715 -7047 -4763 6830
1932 6830 1875 -5854 -1703 -650 -183 6377 -14 -11587 -2355 9055 1467 -4134 -1830 -3743 1261
1947 1261 8116 -2126 -10028 2041 7470 -1310 -2962 -1612 -2595 4606 6880 -6876 -7992 6639
1961 6639 7014 -2404 -2972 -3251 -906 9203 5724 -9787 -5235 8321 5369 -1096 -946 -2820 1728
1976 1728 10520 1084 -9718 863 10981 4073 -1553 -2709 -3229 6746 12686 -2150 -9957 3581
1990 3581 9651 2396 239 -2777 -2782 8220 9436 -6665 -7078 6219 6890 440 -1042 -5210 -1518
2005 -1518 10458 4772 -9937 -5330 6253 3543 34 -2107 -7052 -764 9446 -510 -10772 -1258
2019 -1258 4456 -424 -1634 -3871 -7120 2802 7454 -5931 -10670 609 3149 -607 -385 -5877 -6736
2034 -6736 4442 4917 -7818 -6308 2613 942 -1022 -245 -6443 -3789 7198 2064 -8461 -3299
2048 -3299 2504 -55 1255 -4 -7144 -1022 7672 -187 -6708 208 1268 -774 3273 -448 -6332
2063 -6332 1696 6598 -2817 -3842 2097 37 382 4456 -2219 -5348 4098 4887 -3298 -461 1897
2078 1897 -2434 1887 4700 -3032 -3137 5461 1973 -3020 1794 616 -2281 4471 4397 -4897 -1683 4870
2094 4870 585 -79 3360 -1915 -2347 5998 2725 -4654 799 4188 -350 2154 2898 -4021 478 7475
2110 7475 595 -3943 2143 2590 666 4403 -96 -5922 2753 8357 -444 -2900 1531 -54 1290
2125 1290 5113 -1846 -5184 4866 5317 -3546 -2915 1012 233 4106 3245 -7296 -5704 6473 4425
2140 4425 -3605 -2132 -1722 -1693 4291 911 -8424 -2196 6523 -176 -5091 -2570 -2837 -215 4747 -3185
2156 -3185 -9888 657 6161 -2300 -5105 -3345 -3460 3096 5445 -6156 -9468 2042 4126 -2451
2170 -2451 -2169 -2395 -3210 3798 2199 -9152 -4689 6969 4164 -3326 -3737 -4943 -272 8631 2163
2185 2163 -9100 -2774 5544 1231 -1491 -1522 -3514 2194 7614 -2433 -8396 1650 6219 770 -484
2200 -484 -1928 -2979 5231 6918 -5104 -6546 4763 6110 1435 407 -3828 -2750 7105 6480 -4182
2215 -4182 -1765 5319 1590 -338 1000 -1578 1991 9128 1465 -7655 -885 5930 3617 2933 655
2230 655 -4793 1248 7524 -187 -4481 2627 3684 -10 1902 -1780 -4377 3987 6030 -3482 -3637
2245 -3637 2513 625 -615 946 -3844 -3142 6026 3520 -6078 -3453 321 -813 2449 2829 -4928
2260 -4928 -3909 3610 -486 -3935 1668 1489 -1908 1413 -808 -5959 253 6342 -520 -2931 55
2275 55 -2348 -1213 4292 -38 -4774 1594 3322 -2395 -1131 318 -3093 1425 5506 -1891 -4957
2290 -4957 1142 -49 -2335 1679 239 -3186 1488 1703 -6643 -4080 3457 1282 -570 315 -5305
2305 -5305 -5685 3848 3033 -4189 -1912 542 -2693 -659 787 -4926 -1934 5630 -206 -5773 -1277
2320 -1277 199 -988 2642 264 -5378 852 5770 -2177 -4355 1349 1855 3103 4700 -2886 -7218
2335 -7218 2789 6725 225 167 1726 -1038 1564 3184 -2909 -1204 8772 4941 -3964 -1917 279
2350 279 1848 7423 3870 -5899 -1714 6388 2588 -1865 654 42 1880 6275 189 -6833 1093
2365 1093 6492 646 -1271 880 -893 1816 4225 -4241 -5360 5877 7252 -788 -3021 -3703 -2365
2380 -2365 5574 6981 -3857 -4760 2483 332 -2513 479 -113 -169 4207 -367 -8746 -2223 6195 1864
2396 1864 -1719 -2053 -5283 -1137 5285 -1613 -7671 -516 3114 -1304 -1720 -2747 -5738 476 4612
2411 4612 -3698 -5416 1114 -30 -4245 -1937 -2448 -2015 4706 2553 -8358 -6584 1833 1989 1499 1553
2427 1553 -4812 -5018 3496 1808 -3546 1003 3591 -1245 -789 -309 -3433 1709 7164 205 -4681 752
2443 752 1901 782 3337 681 -3986 2830 6148 -1046 -2683 1724 350 1976 5162 -144 -3966
2458 -3966 2562 2586 -2278 1120 3531 -210 1046 1302 -4493 -2413 6439 4076 -1975 -657 -1665 -2788
2474 -2788 3609 4644 -2685 -927 2882 -1461 -1878 2428 -130 -526 4451 181 -4845 698 3496
2489 3496 -330 600 1552 -2173 653 4912 -1213 -4250 2922 3492 470 1988 -886 -4546 1666 5344
2505 5344 -1302 -1534 3092 -373 -1650 1158 -1477 -1400 5540 3022 -5417 -3281 1344 500 2366 1838
2521 1838 -4685 -3264 3999 628 -4716 -625 1060 -941 1634 -1050 -6519 -949 5099 -736 -3772
2536 -3772 -261 -1194 -1069 1791 -2583 -5356 2761 4595 -3242 -4518 -1378 -1486 2301 4132 -3750 -5463
2552 -5463 2443 1938 -3056 -514 499 -956 2002 847 -6164 -2526 5322 1264 -2916 -557 -1475
2567 -1475 -903 4050 115 -5503 781 5091 -736 -2535 -953 -2134 1519 5372 -1052 -4923 2345
2582 2345 3004 -1745 -315 1375 -313 3856 3607 -4676 -3518 5309 4444 295 712 -1653 -1597 5106
2598 5106 4103 -3603 -415 5148 929 -450 1012 -1625 707 6312 1301 -4684 784 4073 493
2613 493 1022 619 -2770 2028 5910 -1316 -4566 1328 2225 766 2706 -613 -4250 1619 3748 -2603
2629 -2603 -1511 2470 -248 -1419 767 -2494 -2351 4533 2440 -4909 -1905 856 -1507 1196 1914
2644 1914 -3640 -2698 3448 -597 -3508 651 390 -1849 1098 -152 -4382 55 3388 -2292 -3434
2659 -3434 512 -805 -669 2104 -2365 -4855 1893 3585 -2720 -1617 -348 -3037 301 3273 -2727
2674 -2727 -3315 2382 807 -3086 -330 47 -2017 2493 1593 -5079 -2799 3444 1036 -841 669 -2772
2690 -2772 -2215 3965 1672 -4159 -605 2437 -736 337 1249 -3018 -610 4746 -15 -3982 1157
2705 1157 2041 -206 1563 149 -3444 2029 5490 -1435 -2853 2060 767 534 3222 -546 -2759
2720 -2759 3704 3379 -2481 157 3277 524 1256 2180 -2493 -881 5842 2664 -2843 443 1858 198
2736 198 3071 1469 -3623 733 5411 -143 -2628 1415 943 665 3160 -764 -4238 2425 4881 -1735
2752 -1735 -2516 741 -847 1122 3335 -3308 -4389 2982 2856 -2768 -1457 -447 -1978 1993 2052 -4716
2768 -4716 -2972 3243 672 -2865 -673 -1669 -1627 3331 802 -6025 -1503 3292 -861 -1473 -5 -2844
2784 -2844 -1090 3175 -1489 -4974 961 2455 -1958 -664 -402 -2555 916 3261 -3233 -4152 2184
2799 2184 828 -1936 225 -1161 -2913 2463 2141 -4239 -1879 2878 -304 -1178 557 -2044 -1402 3808
2815 3808 491 -4644 -296 2408 -611 461 595 -3011 405 4679 -442 -3153 1738 1670 -567 2011
2831 2011 62 -3091 2328 4781 -1805 -2249 2444 885 1020 3240 -1409 -2813 3589 3946 -1900 160
2847 160 1812 -502 1501 2581 -2371 -1346 4648 1770 -2244 539 623 -787 2766 1597 -3838 -311
2863 -311 3871 195 -1089 956 -1070 -865 3556 453 -3767 1033 2887 -1579 -582 1069 -1170 560
2879 560 3759 -1946 -3609 2263 2298 -1134 486 -46 -2730 1649 2935 -2810 -1899 3008 41 -1674
2895 -1674 716 -1217 -1704 3181 1159 -4406 -1021 2733 -468 -543 -35 -3389 -713 3670 -529 -4991
2911 -4991 -408 890 -1274 571 -759 -4049 127 2832 -2705 -3783 1097 333 -1048 756 -2797
2926 -2797 -4362 2120 3190 -3251 -2619 257 -1306 542 2103 -3032 -2693 2968 1299 -3335 -421
2941 -421 889 -655 1796 1388 -3855 -882 4447 540 -2253 548 255 -88 3460 415 -3713 1175
2957 1175 4093 70 -825 1408 -757 289 3299 -316 -2155 3076 2645 -1939 39 1273 -222
2972 -222 2369 3096 -2836 -1923 3722 1643 -1074 1520 -5 -1053 3010 1558 -3713 32 4119 255
2988 255 -813 638 -1279 -261 4461 -13 -3766 1380 2936 -545 -93 96 -2159 1343 4530 -1509
3004 -1509 -3562 1432 1175 -552 1499 -664 -2933 1365 2564 -3220 -2547 2082 246 -785 921
3019 921 -2705 -3156 2988 1666 -3474 -1146 603 -1752 157 489 -3473 -1644 3121 -452 -3520 -499
3035 -499 -290 -1617 1558 415 -3812 -395 2444 -2355 -2134 1408 -213 -892 1500 -2006 -3727 1791
3051 1791 2914 -1961 -692 716 -1613 217 1628 -1978 -1899 3175 1031 -2777 -269 416 -988 2353
3067 2353 1307 -3256 -770 3307 -546 -1731 771 -161 26 3503 3 -4438 -12 3746 406
3082 406 94 588 -2575 -276 3270 -549 -2287 2505 2462 -1194 -47 36 -1712 2655 4246 -2370 -2529
3099 -2529 2373 1144 593 2226 -627 -1758 3117 2514 -2482 -529 2364 207 660 2244 -1465 -1024
3115 -1024 3119 756 -2301 1678 2291 -395 891 410 -2533 814 4377 -359 -2496 772 -256
3130 -256 -992 2070 536 -2468 1454 1676 -2952 -1795 2131 273 245 767 -2866 -2962 2672 1580 -2859
3147 -2859 -851 257 -1355 704 970 -3923 -1823 3074 175 -2951 -345 -786 -1496 1727 218 -3730
3163 -3730 275 2637 -1814 -2879 -263 -1202 515 3236 -1866 -4869 -126 1822 -971 338 23
3178 23 -2824 -270 2098 -2234 -2051 2551 540 -1674 -37 -935 -1908 2360 2491 -2699 -1390 1989
3194 1989 -168 -552 1287 -1350 -1047 3271 776 -3276 -93 1775 -635 920 1851 -1355 -144 2622
3210 2622 -902 -2041 2769 2480 -483 802 -218 -2113 2523 4245 -765 -1279 1735 492 -181 2121
3226 2121 -47 -1130 3033 2162 -2736 -715 2106 345 1638 1960 -1944 -1338 3608 1027 -2050 567
3242 567 1198 357 1908 584 -3965 28 4046 630 -1723 768 -958 -527 2234 -204 -2662 1250
3258 1250 2219 -2110 -1587 433 -637 868 2636 -2085 -3260 1319 1018 -1633 189 147 -2016 775
3274 775 1240 -3093 -1814 2032 141 -1579 568 -1215 -1603 1462 565 -3049 -41 1959 -1430 -1324
3290 -1324 -241 -1562 -325 2848 -871 -3708 224 793 -1276 150 558 -2009 38 1671 -2186
3305 -2186 -2208 2238 974 -1148 31 -1177 -2062 2496 1842 -2494 -1043 1519 34 -170 661 -1875
3321 -1875 -986 3134 1372 -2668 -377 822 -556 1515 1512 -1875 -47 3070 -248 -2156 1475 1450
3337 1450 243 2048 -31 -3319 854 3694 173 -424 1289 -468 90 2739 -206 -1320 2217
3352 2217 2072 -1129 -108 1409 -538 1325 2138 -1339 -844 2906 1019 -1149 938 532 -548 2238
3368 2238 1448 -2542 -428 2601 -40 -305 1234 -542 -974 2012 -215 -2384 1497 2178 -1334 -936
3384 -936 35 -1453 826 3007 -1389 -2918 1070 825 -787 424 -312 -2152 1140 1500 -2855 -1682
3400 -1682 1756 177 -897 406 -1901 -1935 2415 957 -3539 -835 1356 -672 -76 229 -3002 -1162
3416 -1162 2672 37 -2871 -181 -169 -1431 904 -40 -2833 154 2067 -1570 -2448 1027 -2 -224
3432 -224 1386 -1217 -2596 857 2142 -1571 -875 705 -805 114 1446 -1353 -1257 2577 1182 -1869
3448 -1869 152 850 -474 1266 1216 -1987 -116 3180 234 -1139 807 434 29 2329 321 -2262
3464 -2262 947 2914 -407 -554 1074 -156 554 2211 -1012 -1483 2521 2356 -771 -560 189 -691 1667
3481 1667 2610 -1868 -1574 2280 1157 -633 742 -181 -493 2318 1677 -2182 -561 2348 243 -52
3497 -52 1084 -1196 -549 2693 304 -2319 772 1569 -574 429 244 -1951 385 2349 -980 -2214
3513 -2214 996 95 -1176 921 -421 -2050 884 1699 -1720 -1399 948 -588 -711 782 -1617 -1696
3529 -1696 1619 669 -2490 -413 1053 -985 -132 508 -2206 -984 2097 -454 -2493 236 279 -1320
3545 -1320 533 -416 -2712 164 1960 -1224 -1733 502 -411 -375 1341 -1596 -2689 935 1618 -1333
3561 -1333 -886 479 -956 712 1737 -1852 -1963 1749 990 -1174 295 -403 -1077 1570 1392 -1957
3577 -1957 -398 1779 331 -504 553 -741 -654 2580 1098 -2066 232 2024 32 750 942 -1369
3593 -1369 248 2718 -350 -1387 1478 1241 -378 912 579 -1489 1411 2602 -753 -957 1904 571
3609 571 -116 1266 -359 -1030 2218 1484 -1843 -52 1920 45 343 1018 -1341 -435 2617 501 -2249
3626 -2249 578 1376 -74 799 101 -2352 336 2623 -419 -1927 220 -57 -334 897 -984 -2612
3642 -2612 1141 1834 -1830 -1869 354 -645 457 1270 -2025 -2329 1485 1068 -1885 -898 -31 -1419 802
3659 802 792 -2768 -1515 1766 -129 -1378 -133 -692 -997 1181 27 -2949 -38 1503 -906 -1071
3675 -1071 129 -1005 -636 1710 -820 -2325 679 774 -1537 -289 358 -1311 378 1351 -1639 -1390
3691 -1390 1836 747 -1127 342 74 -804 1551 1396 -1980 -168 2230 59 -562 672 -689 -205
3707 -205 2371 707 -2032 758 1835 -143 496 689 -1358 650 2861 -205 -1653 1441 1078 0
3723 0 1339 122 -1860 1115 2349 -603 -572 1263 366 311 1920 -731 -1470 2197 1620 -1090 -4
3740 -4 718 -569 529 1446 -1568 -916 2220 651 -1175 347 36 -1102 1247 833 -1875 -242 1741
3757 1741 -492 -643 1045 -583 -931 1469 -400 -2140 711 1479 -1205 -423 333 -990 -245 1393
3773 1393 -1263 -1704 1346 348 -1916 -195 -486 -1577 1029 1009 -2301 -1446 985 -215 -1154 118 -922
3790 -922 -1399 1706 335 -2824 -643 1559 -528 -492 -57 -2048 -545 2436 -580 -2165 351 626
3806 626 -800 47 -130 -1953 682 2328 -987 -1889 865 -20 -161 1000 -590 -2020 1616 1330 -1692
3823 -1692 -857 1017 57 732 1603 -1316 -1196 2094 827 -1262 413 945 -598 405 628 -1591 384
3840 384 2672 -103 -1494 1048 657 202 1705 208 -1749 1134 2272 -684 -354 1321 -72 347
3856 347 1709 -678 -1296 1838 1627 -1198 249 666 -424 1205 1057 -1392 -358 2412 761 -1188
3872 -1188 64 -113 -606 1706 660 -2111 197 1480 -665 -876 602 -446 -290 1727 -508 -2459
3888 -2459 660 1641 -611 -433 9 -1835 201 1530 -1198 -1796 994 512 -1154 526 -377 -1968
3904 -1968 750 1425 -1646 -1018 755 -725 -1035 576 -1282 -1116 1385 181 -2507 -540 588 -775
3920 -775 162 861 -1757 -1146 1342 -284 -1499 649 371 -1094 34 36 -1692 297 1857 -1269 -1299
3937 -1299 942 -409 -469 1202 -646 -1487 1293 1108 -1913 -354 862 -438 749 1735 -994 -1046 1482
3954 1482 591 -1202 949 734 -627 1061 718 -1729 0 2377 261 -361 380 -502 -4 2223 716
3971 716 -1799 592 1613 -678 357 804 -610 846 2286 -269 -1748 1640 1419 -95 925 364
3987 364 -1053 1157 1783 -1291 -813 1661 736 -29 1142 -578 -1226 1674 1425 -1315 116 1036 -596
4004 -596 -562 714 -689 -297 1593 -322 -2175 -97 735 -377 192 181 -1556 -71 1524 -1117 -1483
4021 -1483 773 367 -659 719 -723 -1925 571 1242 -1977 -1140 438 -528 -710 196 -1698 -1146 1719
4038 1719 393 -2133 -852 164 -739 737 492 -2145 -882 1545 -391 -1611 590 88 -525 1115
4054 1115 -237 -2317 393 1734 -996 -985 379 -553 -97 1290 -657 -1616 1123 1375 -936 -59 289
4071 289 -853 564 1450 -1028 -1074 1610 285 -784 976 610 -231 1045 842 -1553 -219 2450 84
4088 84 -235 751 -657 -877 1565 762 -1305 1090 1430 -650 119 565 -617 484 2034 -626 -1446
4105 -1446 1103 901 -549 595 351 -847 976 1982 -1218 -905 1458 411 -171 818 -499 -1093
4121 -1093 1724 1073 -1251 382 1218 -563 -80 664 -1391 -442 2123 166 -1655 -171 154 -648 1090
4138 1090 664 -1885 -222 1049 -855 -987 787 -451 -576 1276 -606 -1896 404 1264 -1286 -502
4154 -502 459 -949 -564 1001 -1432 -1606 1037 358 -1279 11 -233 -1519 496 948 -1832 -892 973
4171 973 -662 -1466 282 -292 -917 949 -85 -2383 -109 1534 -857 -405 191 -1164 26 1505
4187 1505 -568 -1785 1138 1091 -657 -25 -38 -1276 569 1713 -1314 -1218 964 407 -432 464 -398 -928
4205 -928 1480 1223 -1523 -531 1074 123 443 889 -662 -423 2017 559 -1245 561 1243 -394 771
4222 771 635 -1044 465 2390 46 -1048 1035 426 -171 1214 359 -1265 883 1656 -698 -389 1385
4239 1385 94 205 1495 -329 -1029 1535 738 -1287 -27 956 -303 119 748 -1274 -460 1820 172
4256 172 -1564 415 201 -966 565 242 -1673 -291 1246 -936 -1305 358 -602 -390 1073 -441
4272 -441 -2110 288 956 -1068 -446 363 -1004 58 775 -1315 -1399 896 310 -1284 49 -162 -1656
4289 -1656 765 769 -1781 -838 1182 -582 -850 369 -765 -1005 1597 457 -1748 69 968 -857 155
4306 155 507 -1196 -428 1481 -440 -1515 864 339 -721 724 263 -1123 465 1419 -772 -866 979
4323 979 0 -577 1032 -107 -1047 1367 1168 -1129 112 963 -311 371 1248 -817 -436 1913 567
4340 567 -810 858 850 -152 1049 720 -1436 131 1725 61 -636 544 176 -426 1258 194 -1373
4357 -1373 973 1476 -362 -165 994 -373 557 1618 -732 -1096 1151 818 -684 277 473 -819 946
4374 946 1089 -1173 -586 1160 62 -753 581 -405 -777 991 607 -1477 -136 990 -523 -196 606
4391 606 -682 -368 1346 -471 -1749 321 694 -1013 99 47 -1385 218 1321 -987 -1313 840
4407 840 -46 -814 86 -532 -1346 806 1175 -1566 -846 1117 -366 -350 700 -1127 -1191 1172 288 -1640
4425 -1640 -194 446 -594 124 115 -1387 -664 1488 -284 -1201 522 438 -726 748 -87 -1369 278
4442 278 1320 -723 -636 680 -151 170 1127 -191 -1058 1213 951 -915 -158 833 -442 703 1478 -805
4460 -805 -699 1588 742 -1100 548 451 -196 1056 480 -1316 303 1582 106 -701 1084 -40 -381
4477 -381 1621 303 -1273 755 1224 -349 32 950 -421 361 1462 -581 -1048 1386 840 -776 417
4494 417 223 -947 718 1442 -1056 -607 884 9 -737 636 -168 -983 1139 253 -1399 -49 1052
4511 1052 -708 -284 462 -938 -454 1468 -157 -1444 303 477 -706 159 136 -1201 220 1307 -1013
4528 -1013 -1171 675 -443 -728 681 -461 -1594 530 858 -1450 -650 595 -723 -15 249 -1296
4544 -1296 -1468 1198 324 -1383 -152 31 -949 329 173 -1483 -324 1223 -553 -936 391 -313 -792
4561 -792 932 295 -1290 236 1048 -412 -456 460 -361 45 1202 -248 -1469 900 989 -644 416
4578 416 559 -580 489 1077 -683 -526 1573 384 -301 695 130 -606 1249 1237 -927 6 1282 115
4596 115 48 1041 -69 -295 1371 266 -1128 703 1114 -214 317 454 -872 280 1425 -155 -1036
4613 -1036 1077 505 -316 359 -109 -1171 775 1418 -777 -747 800 -391 -359 875 -410 -875 828
4630 828 254 -1449 -215 571 -379 20 575 -1233 -617 1210 -403 -1344 303 -228 -603 99 83 -1504
4648 -1504 52 1175 -826 -1008 519 -472 -759 571 -745 -1280 833 605 -1462 -587 374 -704 235
4665 235 908 -1095 -1255 796 384 -1026 168 -217 -894 496 440 -1395 -389 1191 -445 -774 355
4682 355 -287 -498 1001 204 -1258 -202 689 -448 -304 700 -647 -163 1308 -196 -1204 808 421
4699 421 -411 823 607 -1041 383 862 -757 -281 1318 162 -559 528 269 -846 1181 875 -996
4716 -996 -166 977 -159 342 955 -331 -492 1460 362 -1312 547 856 -286 302 484 -998 170
4733 170 1432 -49 -725 885 282 -116 703 -107 -1079 812 1212 -681 -169 663 -124 -18 954 -229
4751 -229 -853 984 658 -871 167 479 -514 484 905 -1162 -760 1123 332 -717 418 -28 -670 573
4769 573 110 -1503 -216 1056 -592 -366 375 -803 -632 624 -429 -1050 392 435 -1128 -376 120
4786 120 -1144 111 962 -811 -1109 663 -75 -1043 461 -114 -869 392 371 -1324 -760 926 -513
4803 -513 -775 235 -721 -683 1093 159 -1193 8 637 -640 -76 426 -916 -116 1041 -162 -897 634
4821 634 347 -384 502 131 -692 659 1094 -754 -731 818 245 -140 860 -552 -849 1091 775 -691
4839 -691 174 562 -356 261 908 -565 -380 1472 230 -507 242 618 -176 976 563 -930 86 1408
4857 1408 -21 -619 766 -301 -177 1110 95 -1112 657 841 -577 44 549 -327 -178 1086 -623
4874 -623 -861 923 759 -793 131 139 -705 367 812 -1126 -428 1107 -62 -804 378 -119 -729 743
4892 743 29 -1615 56 669 -333 -278 365 -725 -638 882 -71 -959 35 302 -665 -198 -142 -1264 -97
4911 -97 859 -727 -848 422 -126 -996 95 -347 -760 418 556 -1287 -501 746 -137 -247 631 -797
4929 -797 -870 642 215 -1032 60 313 -302 58 137 -844 -218 1154 -143 -710 463 224 -689 832
4947 832 227 -762 506 813 -727 -654 758 -369 308 820 -366 -883 787 840 -455 76 435 -321
4965 -321 464 1007 -605 -198 1430 170 -559 370 348 -220 1319 989 -896 -127 1384 -234 -345 735
4983 735 -181 -40 1349 340 -959 750 1175 101 130 588 -580 43 880 -352 -662 716 554 -176
5001 -176 43 10 -670 379 763 -767 -575 715 106 -610 347 -640 -871 713 342 -1248 -66 580
5019 580 -639 -76 256 -1065 -792 764 -343 -838 -219 336 -543 275 4 -1190 187 731 -752 -888
5037 -888 172 -282 -590 445 -454 -1212 211 609 -1080 -801 120 -504 -111 456 -662 -1058 697 427
5055 427 -932 178 94 -570 295 494 -861 -395 837 83 -622 385 -42 -342 463 -25 -940 133
5073 133 844 -401 -375 348 -583 -41 995 -145 -1000 694 652 -155 392 318 -118 457 716 -436 -219
5092 -219 743 455 -217 419 185 -254 944 975 -296 14 761 -195 -97 779 16 36 1202 269 -897 670
5112 670 636 -505 131 611 -465 319 1110 -347 -556 643 261 -338 481 275 -687 576 764 -625
5130 -625 -199 669 -443 -231 492 -672 -831 838 192 -773 -420 121 -616 -144 352 -1191 -416 625
5148 625 88 -1166 -90 1 -624 211 91 -1271 -237 497 -724 -577 30 -366 -176 510 -358 -1120 311
5167 311 441 -573 -534 134 -680 -116 553 -606 -808 675 -96 -608 149 41 -646 250 476 -836 -389
5186 -389 681 -575 -234 363 -270 -352 754 495 -684 251 731 -142 -83 521 -398 165 669 -223 -942
5205 -942 724 510 -447 317 433 -636 177 1143 -241 84 1029 155 45 557 -170 -406 463 781 -486
5224 -486 56 867 67 75 723 -681 -378 1417 119 -842 300 296 -117 587 387 -557 37 1041 -223
5243 -223 -660 344 285 -350 537 -281 -1069 181 510 -425 -363 228 -519 -198 300 -664 -861 461 327 -633
5263 -633 -141 -75 -491 -81 685 -596 -563 651 -226 -649 67 -154 -405 515 244 -1104 4 759 -507
5282 -507 -336 225 -428 -285 719 -283 -1162 395 757 -618 -358 159 -668 55 437 -788 -873 553
5300 553 67 -513 213 73 -664 19 473 -1139 -671 838 196 -310 476 -375 -316 754 127 -880 406
5319 406 578 -561 225 362 -806 16 1096 -216 -626 667 16 -92 527 313 -422 344 929 -417
5337 -417 -443 802 123 27 728 -66 -400 637 706 -430 73 574 -108 114 689 -515 -173 756 269 -407
5357 -407 515 514 -280 545 544 -897 32 984 -91 -323 553 86 -357 411 198 -799 328 912 -473 -121
5377 -121 415 -450 3 634 -522 -699 539 198 -842 283 -46 -669 374 393 -722 -349 583 -243
5395 -243 -503 104 -317 -863 744 307 -827 -155 598 -690 -393 241 -667 -603 790 49 -1037 105
5413 105 126 -784 394 48 -1031 -118 386 -501 -767 158 -466 -182 407 -286 -771 193 731 -972 -296
5432 -296 262 -153 -78 633 -471 -559 1047 31 -907 -53 409 -209 187 319 -626 -167 897 -197 -889
5451 -889 416 202 -348 440 633 -666 304 961 -398 -361 431 51 -10 948 -31 -417 688 619 -713
5470 -713 399 513 -252 174 813 -276 -560 830 -101 -415 118 49 -177 496 477 -640 141 811 160
5489 160 6 199 -75 35 788 352 -714 -18 624 -429 2 364 -511 246 651 -176 -412 517 378
5508 378 -474 85 -63 -482 342 182 -605 -571 413 -245 -336 272 -251 -335 450 388 -1076 -276 462 -435 -394
5529 -394 54 -633 -147 701 -605 -1050 -31 -81 -530 173 289 -854 -30 404 -727 -283 470 -317 -552
5548 -552 -19 -202 -986 267 395 -717 -308 526 -299 22 567 -472 -405 571 75 -473 283 -69 -399
5567 -399 312 579 -481 -167 399 -6 -342 464 -221 -336 853 86 -613 92 691 -407 15 264 -545
5586 -545 -11 710 129 -329 596 497 -642 43 615 -423 166 793 -339 -360 904 210 -89 478 75
5605 75 -484 459 536 -599 6 615 127 63 493 -476 -162 840 262 -360 456 365 -186 -166 526 -438 317
5626 317 721 -94 -769 500 93 -448 274 -5 -703 328 851 -537 -285 311 -350 -337 701 -524 -674
5645 -674 693 317 -773 -245 355 -587 3 227 -803 -392 550 -90 -641 -342 -169 -511 447 182 -981
5664 -981 56 401 -665 -458 -35 -493 -417 554 -25 -1051 196 570 -820 -274 51 -426 338 235 -488
5683 -488 -443 525 319 -676 30 -48 -381 302 265 -534 -186 578 -70 -411 498 -253 121 925 110 -808 400
5704 400 636 -15 83 544 -378 3 941 -180 -584 588 533 -460 195 541 -312 207 998 -313 11 982
5724 982 187 -163 585 112 -488 625 757 -578 232 1069 -440 207 668 -173 -85 1043 220 -605 401
5743 401 350 -566 319 33 -331 -174 522 -189 -355 206 -332 -474 474 34 -692 287 237 -284 -208 155 -414
5764 -414 -240 82 -446 -627 338 -116 -907 -205 -194 -452 -6 153 -579 -433 434 -319 -732 8 -380 -531
5784 -531 191 35 -954 -127 297 -784 -357 331 -419 -414 670 -319 -819 553 467 -323 0 194 -655 -169
5804 -169 929 -243 -465 643 71 -267 412 -64 -738 656 733 -589 -219 253 -107 -451 624 -196
5822 -196 -240 977 293 -397 382 445 -281 407 585 -820 311 1077 -63 -370 585 351 -104 484 296
5841 296 -408 504 808 -284 -165 613 -38 77 969 -170 -241 626 713 -427 144 659 -49 -43 524 -478
5861 -478 -481 886 187 -355 200 194 -479 245 364 -729 -66 689 -266 -423 471 -43 -339 289 -322 -898 242
5882 242 496 -633 -39 287 -180 46 464 -536 -749 313 126 -248 92 -207 -547 239 421 -945 -267
5901 -267 245 -33 -632 285 -154 -579 569 -13 -939 -119 405 -237 -280 38 -456 -256 603 -360 -1238 76
5921 76 18 -659 365 345 -650 76 737 -493 -455 648 400 -221 167 -35 -557 532 447 -472 199 603
5941 603 -32 -462 470 -230 -185 690 87 -579 274 318 -393 347 660 -211 -76 651 -158 -206 486 288 -270
5962 -270 650 213 -517 256 793 -377 148 458 -404 -1 844 -253 -513 785 400 -184 419 559 -557
5981 -557 201 556 -176 82 657 112 -140 41 266 -45 51 176 -739 -106 588 -197 -188 660 -325 -366 266
6002 266 -204 -415 8 344 -575 -35 21 -495 -192 436 -401 -521 377 7 -442 181 -149 -374 302 411
6022 411 -392 -524 163 -165 -194 364 -601 -454 527 183 -567 51 235 -297 -136 -68 -942 -156 522 -240 -711
6043 -711 286 -126 -175 253 1 -708 27 775 -292 -251 102 -84 -397 673 -150 -734 209 452 -492 97
6063 97 531 -176 156 628 -437 -287 798 -38 -675 162 246 -174 375 119 -497 115 539 -90 -130 312
6083 312 -83 134 550 68 -607 472 718 -365 -183 725 -296 -202 724 -331 -407 512 332 -440 381
6102 381 259 -210 301 267 -406 157 826 23 -360 -74 -12 -422 541 419 -446 -25 390 -5 -55 254 -498
6123 -498 80 565 152 -512 -142 386 -461 81 229 -694 -45 239 -143 -305 416 -140 -395 -52 -6 -195
6143 -195 -38 290 -478 -466 -61 -535 38 468 -52 -630 261 -243 -524 51 232 -533 287 108 -554 -180
6163 -180 134 -428 -471 495 -114 -496 -105 280 -443 -127 239 -391 -280 238 -245 -336 467 -227 -325 -18 260
6184 260 -249 -219 313 -110 -125 411 -327 -366 578 245 -304 232 -111 -542 301 610 -257 -285 491 -130 -164 528
6206 528 -376 -150 794 350 -542 197 261 -54 327 143 -503 -108 701 73 -376 367 318 10 647 -49 -206
6227 -206 322 386 -270 -194 336 29 68 666 -80 -134 363 343 -360 -38 340 -233 -47 480 -145 93 761 188
6249 188 -474 390 256 -192 58 86 -797 -35 812 -418 -293 38 -156 -41 479 -246 -523 146 700 -789
6269 -789 -140 310 -430 -236 495 -295 -717 395 266 -813 -76 162 -277 98 -20 -584 -474 27 -221
6288 -221 -536 239 -34 -308 357 -348 -588 -96 223 -64 -257 108 -469 -163 200 -280 -524 91 351 -357
6308 -357 171 411 -504 -49 563 -183 -323 432 -54 -114 106 259 -417 191 453 -463 92 344 -17 -199
6328 -199 193 72 -94 489 66 -348 320 421 -30 240 501 -234 378 591 111 -224 743 283 -103 398
6348 398 391 -236 360 401 -223 249 522 -31 -138 282 -190 -247 559 328 -83 231 361 -170 374 502 -220
6369 -220 -114 570 -103 -295 -47 -56 -395 184 354 -577 -80 369 -253 -136 493 -526 -129 228 -216 -691
6389 -691 23 142 -549 -46 -104 -587 -53 35 -349 -513 -94 -136 -521 37 -291 -615 93 72 -859 -210 13
6410 13 -273 -327 248 -282 -393 417 137 -516 147 90 -244 -168 33 -579 -47 454 -134 -596 84 -42 -358
6431 -358 283 -117 -592 -32 601 -415 -81 404 -79 17 631 283 -531 507 468 -328 130 182 -216 96
6451 96 466 -360 -230 613 463 -138 363 -40 49 344 453 -363 153 315 -262 -152 491 147 -102 618 152
6472 152 -252 461 471 -303 -157 78 -3 135 513 41 -359 440 343 -386 321 257 -146 134 683 -530 51
6493 51 517 -125 -367 273 -329 -301 626 -91 -530 278 424 -255 -255 178 -137 -185 358 -31 -461 229 31 -410
6515 -410 -261 359 -324 -268 106 -224 -433 203 -167 -545 -177 -270 -469 294 226 -284 -276 375 -185 -131 122 -473
6537 -473 -454 132 -51 -408 259 -265 -583 -107 226 -418 -150 368 -24 -335 248 22 -73 359 115 -340 85
6558 85 284 -93 -255 461 -51 -239 678 -225 -512 572 606 -468 161 109 -145 191 507 -103 -229 435
6578 435 10 -331 274 71 -135 589 114 -260 161 390 -248 -289 198 -70 -33 503 21 -516 134 594 -108
6599 -108 60 260 -207 -92 413 -71 -523 349 58 56 444 179 -172 229 480 -507 -129 456 39 352 -43
6620 -43 66 -337 531 -68 -244 -103 -78 -260 59 54 -358 -438 140 -136 -304 219 162 -65 -70 126 -728 135 434
6643 434 -250 -123 161 -111 -185 55 -171 -466 168 270 -458 -422 115 -193 120 48 -663 -62 386 22 -196
6664 -196 -205 288 -344 106 226 -316 177 598 -80 -328 253 -112 -383 116 -122 -783 295 419 -90 134
6684 134 156 -204 -1 316 14 -319 125 -92 -297 -87 314 90 137 404 -99 -235 658 86 -88 283 74
6705 74 -297 179 151 -335 195 420 -156 133 81 -92 4 135 -216 -187 340 67 -263 226 343 -207 151 442
6727 442 -431 -86 472 270 -6 236 19 -21 150 296 -189 138 439 -119 44 469 -2 -349 337 81
6747 81 -273 -83 150 -282 86 22 -260 39 512 -72 -572 120 -209 -490 -106 -36 -778 68 266 -275 -180
6768 -180 -6 -193 -407 132 -55 -630 -244 179 -388 -163 400 -493 -147 302 -269 -139 -60 -158 -410 20 -129
6789 -129 -231 39 440 -379 -265 95 -20 -250 -243 -160 -437 155 224 -315 52 83 -444 27 106 -298 33 572
6811 572 -80 -222 170 289 -456 -239 -307 -149 236 314 -494 -32 -2 265 14 172 -81 -415 250 100 76
6832 76 61 347 -17 138 278 -140 36 513 193 -159 120 197 -71 139 591 -363 236 408 181 57 419
6853 419 175 86 347 398 -215 52 466 -171 128 616 -48 202 333 -122 -19 361 243 -152 36 233 -41
6874 -41 185 311 40 92 386 -2 -98 60 -26 -27 199 15 -282 32 282 -407 -62 88 -504 -258 213 -48
6896 -48 -474 -6 -199 -445 366 119 -393 -238 368 -185 -334 215 -107 -388 125 -60 -457 168 116 -517 -48
6917 -48 151 -286 -556 25 -230 -578 14 -110 -428 111 288 -694 381 406 -305 111 507 -131 -180 183 -21
6938 -21 -179 312 49 -157 294 592 -253 -20 457 -220 -47 348 101 139 239 391 -73 35 -26 64 109 446
6960 446 -316 -264 360 172 460 43 254 -171 216 204 -238 6 508 -206 23 404 -59 -314 396 -220 -502
6981 -502 368 288 -171 98 146 -154 81 162 -438 -215 218 171 -195 -110 -155 -413 20 349 -392 -127 158 -83
7003 -83 -60 54 -92 -120 554 44 -363 -117 361 -160 -137 312 -456 -67 497 -344 -544 131 -142 -245 114
7024 114 12 -275 194 458 -425 -380 -104 -290 -578 217 -357 -475 -156 41 -368 -164 446 -329 174 81 -368
7045 -368 -339 159 -81 -258 -35 -8 -440 70 183 -474 97 232 71 -210 53 -80 -188 127 -16 -216 297
7066 297 394 -114 51 358 147 28 428 -208 -105 517 25 -148 -106 338 30 -209 477 121 -213 532 186
7087 186 -285 324 219 66 82 177 -206 -64 395 -239 -47 636 -94 19 75 -262 -217 83 97 -53 84 32
7109 32 -528 -13 169 -284 -215 120 336 -516 314 234 -289 342 368 -280 -125 260 -226 -59 328 -17 -214
7130 -214 496 -108 -182 18 137 -489 -236 464 -467 -344 257 91 -193 111 -126 -327 94 243 -439 36
7150 36 260 -189 -365 -37 -221 -418 284 -112 -153 53 139 -465 41 -5 -89 104 243 -20 -415 460 54 -282
7172 -282 -54 20 -311 159 7 -342 -126 613 -31 50 166 -275 -109 330 68 -234 146 382 -156 -456 340
7193 340 -219 110 307 -123 -104 234 273 -5 -136 -17 -150 121 254 -452 -153 333 -91 -421 46 60 -50
7214 -50 564 229 -372 -24 583 -32 176 218 24 -227 620 20 -522 519 387 -577 71 362 -243 451
7234 451 424 -186 -346 336 -16 -104 345 304 -393 379 393 -409 -318 304 -64 -169 107 90 -406 211 -46 -336
7256 -336 -105 264 -153 -164 -43 -605 74 388 -34 -657 111 -338 -225 61 94 -448 -71 128 -471 -285 -177
7277 -177 -102 -233 416 -117 -330 168 -121 -422 13 110 -293 -290 397 -612 -188 440 -142 -444 196 23 -281
7298 -281 68 305 -262 -310 413 -304 -307 330 -30 11 86 35 -213 37 274 -445 -55 338 -77 37 315 -72
7320 -72 147 390 -122 -516 113 172 -63 159 253 -86 -350 142 243 -180 483 289 -112 531 149 -153 -238
7341 -238 288 146 86 298 38 -147 559 293 4 321 353 -476 194 331 -231 170 596 -2 -490 339 263
7362 263 199 306 65 -228 312 325 -163 304 296 30 294 131 -114 -217 77 34 -332 298 11 -288 148 339
7384 339 -298 -152 280 -92 -478 -73 -296 -133 141 -157 -493 2 253 84 -124 447 -550 -203 48 -69
7404 -69 -453 231 -46 -433 -546 91 -214 66 218 -340 -390 157 76 -541 64 5 -541 208 68 -180 -126 302
7426 302 -85 -202 187 -2 -369 425 327 -251 77 280 -244 250 311 -128 23 209 -195 -459 262 -39 -107
7447 -107 389 -161 -147 235 26 -53 180 334 -20 -75 263 -233 28 344 157 -452 2 168 -189 56 69
7468 69 -82 -100 258 -348 -82 131 119 -371 -1 131 -58 116 250 8 -36 333 202 -397 266 -67 -344
7489 -344 -18 273 46 101 350 2 -51 274 -206 -212 549 -95 28 54 -157 -461 219 -116 -262 95 180 -96
7511 -96 -266 -170 110 -356 -65 -102 -403 -333 61 -387 -483 296 -217 -40 131 -307 -568 298 -3 -91 -22 -5 -158
7534 -158 -239 269 -135 -254 -114 -91 64 166 -142 -15 51 259 -33 -163 263 -102 -31 -38 -79 -34 178 -195 -277
7557 -277 40 197 -230 234 212 -363 -119 238 -80 -316 162 95 -48 -109 283 -227 253 409 -165 -54 132
7578 132 -58 236 391 -117 -58 212 408 -83 61 -79 -56 310 174 -65 -188 277 -3 -24 355 119 159
7599 159 64 276 -312 243 375 -41 30 26 -151 -81 178 33 -326 -79 70 -411 86 319 -171 -314 182 -13
7621 -13 145 348 -205 -62 308 125 -175 227 -47 -219 -113 153 -160 -213 -116 -22 -92 252 -303 -226 164 -180
7643 -180 -245 104 112 -161 -287 203 -238 -532 -43 39 -125 -34 -58 -322 38 454 -151 -126 143 -299 -194 -67
7665 -67 40 -87 184 71 -263 -126 240 -111 -91 54 76 -26 244 66 -272 60 -6 -111 393 90 -172
7686 -172 43 118 -27 -129 69 -135 -354 273 -131 18 100 287 -46 112 398 78 83 -10 -81 -200 -57 406
7708 406 -3 278 220 -9 210 318 -129 -162 376 86 -59 299 116 61 190 179 -104 355 237 -61 60
7729 60 143 164 -183 325 236 -266 260 291 -214 -234 194 -226 -55 164 -138 -225 -280 -215 140 -89 243 -235 214
7752 214 291 -31 -10 114 -101 241 190 -420 -477 141 171 -175 14 43 -330 138 194 -295 -93 303 -233 -499
7774 -499 5 -9 -374 -102 389 -388 -169 108 -325 -333 -70 -346 -51 1 -254 42 238 67 -262 -216 -54 70
7796 70 -163 542 -272 -74 377 3 -428 214 85 31 38 248 -334 -88 397 -167 43 481 -185 30 471
7817 471 69 -261 48 177 -191 78 228 -58 -117 494 13 -243 78 230 -20 284 117 111 334 423 -219
7838 -219 306 271 -59 46 239 -121 -228 565 114 -409 87 168 -327 122 390 -155 19 177 -46 -313 225
7859 225 215 -426 264 46 -22 -99 -233 -7 -54 -38 -443 -178 206 -238 -269 -239 160 -260 -33 281 -192 -157 -48
7882 -48 -193 -54 490 343 -288 157 158 -357 -42 -14 -123 -243 423 83 -208 22 -39 -248 124 -80 -218 42
7904 42 221 -162 -105 -100 -242 -216 187 -95 -472 80 34 60 -21 -1 -332 -20 310 -272 -211 149 -146 -141 84 -78
7928 -78 -234 252 267 -282 151 -6 101 -172 356 122 -237 38 -253 -415 -90 -184 250 -91 186 -59 -92
7949 -92 351 -213 -98 221 -8 -32 40 -30 2 61 412 3 -117 175 -300 -192 104 -102 -143 128 -87 -119 39
7972 39 257 57 243 164 170 190 79 -67 -419 -115 231 -3 -115 207 -116 -14 329 -257 -83 48 203 -51
7994 -51 -161 -185 -201 9 108 -455 -252 187 -346 83 558 -61 -256 359 -169 -40 365 -24 93 74 317 -207
8016 -207 -50 -5 -173 -142 100 -85 -191 9 -134 -94 -180 126 -349 -241 -19 -74 2 -58 30 -139 132 323 4
8039 4 -219 87 -516 -30 118 -74 1 14 26 -89 266 -32 -141 258 -114 -105 153 -83 -50 -75 142 -307 -70
8062 -70 414 94 21 -148 521 74 348 -152 -9 214 233 -60 56 196 -297 -18 190 250 4 -8 183 -151
8084 -151 132 183 -47 37 135 0 -6 326 394 -281 -21 -32 -203 32 282 41 -31 333 85 -33 270 -159 104
8107 104 169 150 -79 276 142 -148 173 249 17 -32 343 -67 -85 144 221 -327 -47 128 -144 -131 -184 -261 -162
8130 -162 239 -14 -99 47 -138 -145 206 -34 238 104 -15 -50 -2 161 -54 -194 -23 54 -343 -123 376 -85
8152 -85 -103 255 -93 -170 285 16 -298 119 70 -132 -220 -308 -220 68 -98 -57 -66 101 -249 -195 297 -133 -267 194
8176 194 246 -263 -103 -9 -346 -20 392 -45 74 192 -118 -57 220 228 40
8191D0
$$ Imaginary data points
##PAGE= N=2
##DATA TABLE= (X++(I..I)), XYDATA
0 0 0 0 0 0 8 -3 8 -8 16 -16 24 -24 32 -40 50 -64 72 -88 104 -120 144 -168 192 -223 256 -291 332 -379
28 -379 427 -483 547 -614 687 -769 859 -957 1065 -1183 1310 -1452 1610 -1782 1974 -2183
44 -2183 2419 -2686 2985 -3326 3715 -4172 4707 -5353 6147 -7149 8461 -10260 12896 -17142
58 -17142 25129 -45436 206523 320263 -141620 -194352 -23611 226250 262023 77690 -117459
69 -117459 15317 165814 78190 -57589 -5403 87482 148239 79758 -103638 -143146 77408
80 77408 177035 26663 -101661 -85142 -13349 87716 68430 -97131 -143208 -9485 39847
91 39847 1616 1203 -40821 -115700 -86962 -31204 -1817 69075 48843 -139700 -209372 -51729
103 -51729 80911 83271 9921 -120036 -148068 -2999 56105 -45273 -51126 38262 32239 -35542
115 -35542 -95160 -122057 3848 173797 86439 -143516 -167920 -19742 94669 107554 -21651
126 -21651 -162847 -70292 116311 85138 -62477 -103641 -60476 33427 114885 25142 -119972
137 -119972 -76267 35048 29761 6308 1951 -32900 -4846 52990 -13923 -83853 -7780 67105
149 67105 62595 48877 -26508 -115676 -32386 116081 112308 32502 -24953 -74848 -21161 111385
161 111385 98256 -17529 -17554 39239 43075 43346 9762 -48280 21763 134136 72811 -48543
173 -48543 -50923 -2398 50099 98820 34890 -67060 -22642 56149 18279 -17498 -83 -8066
185 -8066 10290 46394 -12791 -69040 -11578 19204 -14349 9316 23812 -37846 -49552 -12793
197 -12793 -16962 5813 40599 -26285 -74444 5130 42905 -22015 -50615 -31051 9400 85652
209 85652 56067 -109988 -140122 32847 137517 77861 -37041 -123190 -66424 103339 115578
220 115578 -48658 -89869 24051 79097 34301 -53339 -105115 6938 162272 80617 -124915
231 -124915 -136514 11010 111007 92671 -44519 -154438 -44802 119485 66922 -76349 -92025
242 -92025 -27008 37294 58457 -27595 -100896 -21757 47330 -19600 -57233 -5614 16660 8951
254 8951 -17950 -80740 -58549 62117 72160 -33387 -59594 -21576 -10946 12519 24798 -2751
266 -2751 18832 40715 -46314 -92136 24626 119870 72429 -24349 -95649 -62200 95425 150983
278 150983 -1243 -104803 -23727 73180 83852 25258 -64076 -44060 91580 102106 -38399
289 -38399 -77957 18081 83433 68819 -16914 -102344 -26965 130187 102900 -59901 -107948 -31214
301 -31214 63999 112252 28198 -106335 -80438 42354 57491 8604 -8368 -29308 -25570 16836
313 16836 -2491 -41209 8866 43432 -12200 -39654 -22779 -26748 3403 46681 3842 -46821
325 -46821 -25733 -18250 -18802 34650 39790 -36019 -57070 -18153 4343 36185 38867 -43703 -77257
338 -77257 5779 50843 16466 -7962 -32268 -40342 21003 48286 -15443 -32794 15665 13512
350 13512 -8571 -830 -14255 -7248 49091 34611 -42777 -41206 9575 24979 42935 33587 -40565
363 -40565 -59057 13333 46112 31200 21068 -26394 -59591 9159 65908 20441 -20022 -18662
375 -18662 -16294 20783 48263 -15358 -53864 16886 55742 6390 -32056 -38545 -9440 67663
387 67663 65015 -56427 -95320 7899 78710 52900 -16270 -84581 -54228 69377 86934 -27583
399 -27583 -73204 -15736 28647 37632 4341 -55075 -26858 58076 32000 -55478 -46730 12852
411 12852 36960 31525 -21672 -74527 -19341 59700 24904 -33450 -22102 -11053 -9192 10667
423 10667 -1510 -16793 17349 10079 -53286 -37121 39327 41207 -5919 -37699 -48972 2257
435 2257 71056 24173 -66189 -37223 39804 38875 -1461 -34366 -32160 42435 80440 -17763 -91794
448 -91794 -10799 84745 72482 -5093 -80121 -58730 73480 121048 -2420 -91904 -33042 49893
460 49893 72658 26558 -56562 -51867 54123 72829 -23853 -57502 -1305 42538 46058 -4896
472 -4896 -74002 -36258 66927 58062 -30480 -53778 -24577 9275 42250 14622 -46684 -28920
484 -28920 18591 -1965 -18632 10175 7709 -13293 -9110 -18734 -16077 32421 31105 -33132 -35065
497 -35065 14133 18928 7657 3574 -15857 -2336 36400 5439 -40134 2078 51218 28237
509 28237 -9461 -32529 -29140 38120 80304 5702 -65416 -27954 28714 43172 30214 -22213
521 -22213 -53942 3832 47124 1495 -30455 -9589 -1651 4304 8108 -30315 -42971 12792 27842
534 27842 -20162 -37199 -29051 -23655 12928 27425 -31377 -61632 -22443 3029 9436 14522 -28405
547 -28405 -65934 -17927 31948 12266 -11663 -22081 -35344 -2964 35942 1171 -31529 3493
559 3493 23760 4173 -3503 -12139 -9336 42048 55518 -14090 -44963 4561 41625 46254 30071
572 30071 -20765 -32882 30890 57188 12806 -3248 10095 7032 18688 27587 648 1591 32902
585 32902 13513 -16487 11275 30198 10238 4865 1 -10873 18232 36962 -6124 -21799
597 -21799 17678 20446 -7405 -7023 -66 12878 37639 4700 -59314 -28950 52303 53945 -2724
610 -2724 -45171 -49421 10259 70867 20611 -62393 -38560 29153 32619 -4451 -42477 -44330 23151
623 23151 62905 -15472 -85281 -36889 32231 36618 -4443 -61954 -64252 17160 50597 -25740
635 -25740 -73390 -31659 11515 18989 -7801 -60482 -55678 15690 26504 -32485 -43265 -11688
647 -11688 -2071 -2773 -16101 -40179 -12034 34856 5781 -40824 -20334 9251 7589 7832 -1075
660 -1075 -10160 19568 28615 -21446 -27658 32371 54690 24081 -6194 -25144 -209 60797 54113
673 54113 -13566 -16085 35224 43089 18175 -4245 -12839 29145 76355 28817 -46087 -25791 37802
686 37802 55557 33877 -13925 -42741 8730 62410 20159 -35636 -19831 13262 27674 24788
698 24788 -17139 -46137 -1186 35245 2819 -19396 -6682 -5750 -1669 3813 -22679 -27166 17936
711 17936 26461 -12422 -25025 -22816 -22060 11690 35744 1781 -26070 -19989 -22221 -7081 33456
724 33456 24569 -19004 -23287 -11285 -8231 14211 21329 -11779 -14744 10417 -1923 -16986 1531
737 1531 6610 -1107 8763 -3423 -26980 -2162 22081 -4008 -19443 -5653 -4279 4807 18609
750 18609 -11255 -39283 -11494 13673 8396 13427 1858 -36668 -33676 4428 17099 19990 15622
763 15622 -26728 -47623 -3723 26486 12369 4719 -4115 -19616 -3628 8796 -14632 -5992 35190
776 35190 24092 -20616 -30754 -15731 15933 50383 19284 -47056 -34752 28982 39376 7661
788 7661 -23073 -35290 5340 56625 23975 -41421 -31900 12109 23275 17229 -2105 -20692 5024
801 5024 26852 -13994 -37522 9341 42899 24586 -9043 -42482 -35796 30268 58621 6851
813 6851 -27884 -11935 -1012 5666 15269 4379 4252 25111 3209 -34589 -8404 34999 27208
826 27208 3307 -11956 -16378 14498 39688 -1918 -35632 3210 38709 21831 -5093 -24792
838 -24792 -19406 25781 38371 -12841 -30036 12691 25699 -2353 -24618 -28824 5143 54106
850 54106 26430 -54055 -59569 4175 38437 26382 -11395 -48394 -24941 27475 12046 -34163
862 -34163 -22313 12054 13589 -1236 -28434 -43340 -407 39668 5074 -34228 -20014 -1491
874 -1491 2599 4879 -13704 -22715 12622 24971 -14615 -28690 -5853 3411 10682 16831 -6508
887 -6508 -17804 3915 1604 -14281 8341 26217 4944 -8392 -9184 -13356 8609 31598 5349
900 5349 -17377 4208 13197 -1782 -662 60 -1812 20629 24079 -15025 -23217 7508 14551 7929
914 7929 9857 -4407 -10272 12215 8395 -19038 -6745 20003 13699 4670 -3868 -26569 -16223
927 -16223 24843 25243 -1368 -6614 -14138 -19043 9231 23299 -1203 -8750 1345 -6920 -4541 10023
941 10023 -3704 -11344 14141 14515 -11836 -11375 -1704 -680 14963 15655 -17023 -16924 18136 16664 -7365
956 -7365 -11072 -9359 5559 34932 17267 -32797 -28910 12984 24646 17995 4508 -21012 -15112
969 -15112 16799 9754 -11891 6472 19961 506 -11375 -13811 -12301 17830 34388 -5029 -31937
982 -31937 -7815 9258 5236 5932 -5085 -13553 6760 8808 -19390 -12842 15490 6809 -12509
995 -12509 -10389 -7630 4358 18908 -9160 -40255 -7160 32183 16482 -13996 -28500 -24133 12318
1008 12318 35631 -3580 -34113 -5047 16966 809 -12487 -14159 -1344 29990 20712 -36594
1020 -36594 -43822 12940 40198 18832 -13461 -37447 -17239 34130 30502 -20648 -25416 8142
1032 8142 16919 7986 -6722 -22616 -632 33235 9858 -27675 -10621 16277 12640 3065 -11185
1045 -11185 -18240 12622 32631 -3088 -27706 -3548 13299 10567 9446 -4834 -12852 10063 12610
1058 12610 -14259 -6057 22728 14584 -5865 -11374 -13770 5882 33761 11543 -26632 -12283 15620
1071 15620 10938 2555 -4110 -12306 8024 24378 -7066 -27880 1458 20182 8410 -2127 -15622
1084 -15622 -17027 14578 24671 -12349 -24411 1026 10897 7075 1758 -18088 -18829 14635 18652
1097 18652 -10138 -12470 -381 -3098 3514 7803 -10546 -8700 13970 5254 -11305 -892 2494
1110 2494 -3063 10371 11193 -10115 -7088 8091 1488 3309 14697 -935 -11989 7083 10583
1123 10583 -1727 5242 5548 -6425 5489 13887 -7101 -9305 11121 7431 -2689 2910 -5331
1136 -5331 -9929 10361 9778 -13063 -8198 5762 -3495 -4873 1084 -9925 -9490 7089 -3287 -18055
1150 -18055 -1397 4060 -12033 -9699 -3038 -9227 -555 4650 -17588 -19845 6717 6131 -11261 -8975
1164 -8975 -6812 -6543 8280 1946 -22135 -9117 19245 7064 -13303 -11489 -6178 9124 24849
1177 24849 -1342 -29753 -3331 25984 13486 -3889 -8792 -7399 16114 28851 -5273 -22928
1189 -22928 9484 27562 10217 -3095 -9300 -2542 27579 27154 -14361 -20261 15463 25669 10692
1202 10692 -1394 -12797 -1816 28607 18811 -17206 -9194 17731 13708 2583 -2996 -8837 8016
1215 8016 26007 61 -24503 122 20820 8211 -2340 -10378 -11898 12158 20514 -11801 -21220
1228 -21220 6954 13872 -2681 -9010 -12178 -4612 18139 7451 -28380 -20152 13397 12790 -5250
1241 -5250 -15550 -21382 -2725 22370 503 -31773 -15067 10455 4772 -6248 -15352 -19965 3622
1254 3622 19439 -11277 -31072 -5098 12595 4038 -5130 -18072 -19034 11272 20752 -11925 -21579
1267 -21579 -84 5947 3968 3759 -10728 -10433 14079 11084 -12852 -5532 10046 4595 4099 4070 -8954
1282 -8954 -920 19221 6559 -9384 3327 8217 114 7148 6866 -5338 4199 13195 -3466 -4377
1296 -4377 12742 6247 -3723 3945 1461 -3548 10826 9189 -10365 -3634 9979 24 -1394 6510
1310 6510 -4119 -6532 8250 2025 -9137 3094 6447 -6639 -954 4470 -7658 -2701 10156
1323 10156 -1363 -7226 3503 -2266 -7328 8921 7379 -9948 -4118 5219 -1318 3357 6318 -9660
1337 -9660 -6915 14563 7513 -9244 -2993 1612 1332 12214 4672 -16410 -3302 17984 5523
1350 5523 -7642 -2617 -1866 5819 16742 -2791 -20935 1626 18838 4044 -5148 -5984 -7287 7825
1364 7825 16333 -8947 -18066 7714 14245 -2386 -7375 -8643 -5909 14096 12059 -17179 -16249 8673
1378 8673 6808 -5076 -4551 -7151 -2592 12239 -1660 -23486 -5484 15760 2979 -9559 -10080
1391 -10080 -10593 3727 14488 -8759 -22671 2282 13908 -3125 -10991 -10017 -5664 12789 11745
1404 11745 -18594 -19607 10947 13903 -4941 -10614 -9927 1625 20773 5931 -26560 -14638 17485
1417 17485 16341 832 -8365 -14545 1816 22141 3696 -18751 273 18282 6052 -4571
1429 -4571 -8531 -6436 16765 26073 -5747 -22103 2377 16733 9753 4335 -5878 -7785 14281
1442 14281 16195 -9635 -9207 11554 10604 2211 1694 -6239 -1533 16637 6612 -14244 -1030 14872
1456 14872 5610 -1532 -4458 -10206 4541 20824 1924 -14921 -1523 4975 -1993 2712 2059 -4318
1470 -4318 5372 6238 -15046 -12913 10711 11214 -414 -3775 -12537 -11032 11372 11520 -10077 -7993
1484 -7993 3513 -2120 -1704 2391 -8175 -5396 10604 1588 -12197 -2370 2495 -5014 1284 2650
1498 2650 -8538 -668 9395 -5261 -11868 335 540 -253 9802 263 -16822 -6900 5314 1359
1512 1359 5214 5387 -11842 -11835 4940 2299 -3883 5098 1375 -7981 -223 -656 -10503 1910 13399
1527 13399 -2154 -9759 -2231 -3509 -323 9774 -1795 -12873 3767 10260 -5346 -6306 -1524
1540 -1524 -3794 5752 12075 -6272 -12723 3922 4078 -4893 2750 5142 -402 4311 -904 -15185
1554 -15185 -1149 20612 9766 -6496 -5758 -5406 1900 15745 4813 -10424 3319 13622 -1679
1567 -1679 -6809 1188 3794 11906 13207 -8939 -15240 10480 16900 -638 -4747 -718 3322 14915
1581 14915 8179 -17421 -11798 17725 18676 471 -6836 -9994 -1974 16461 8260 -12862 -2277
1594 -2277 14255 2025 -9795 -7231 -2606 10890 18401 -6451 -24992 -4024 13752 5437 -1907
1607 -1907 -6917 -9914 4303 9716 -11649 -15873 6009 9632 -3149 -6455 -9996 -7678 8086 4863
1621 4863 -15392 -8005 10661 2715 -10178 -10630 -9125 3173 17690 825 -22071 -10111 6762
1634 6762 2361 568 -456 -6988 576 6735 -10038 -14171 9155 15164 234 -7178 -10748 -7081
1648 -7081 12676 15451 -8025 -11855 5549 6777 666 44 -5866 -2932 14305 9395 -10433 -5714
1662 -5714 5975 1946 2455 4802 -3019 359 10299 -2696 -13371 2075 11456 5231 3691 -3779
1676 -3779 -14128 -1192 13261 4242 -1991 2451 -4471 -7392 3758 3861 -2123 6342 4522 -9685
1690 -9685 -4714 5289 -18 1226 6369 -3659 -6845 5324 2943 -5260 2301 3580 -3607 3366
1704 3366 7004 -5874 -5719 5088 1681 1240 8870 228 -8445 1520 4077 -2843 5441 9903 -1770
1719 -1770 -4266 444 -4624 1786 15814 5873 -9735 -4852 445 755 9074 5856 -8134 -1994
1733 -1994 7906 -1807 -6559 2769 2895 1300 5332 -4360 -11670 3873 10449 -4219 -7392 190 240
1748 240 3464 3387 -12438 -12140 9474 11279 -4821 -8616 -6980 -5360 6111 5723 -10188 -6823 7351
1763 7351 -361 -11624 -5009 -167 3717 8502 -5724 -20482 -4593 12329 3086 -6226 -5416 -6336
1777 -6336 1162 7313 -7055 -13636 4409 10341 -3440 -7749 -5113 -3035 7180 7445 -10335 -9088
1791 -9088 9960 7930 -5606 -6047 -2609 3542 14291 4735 -14951 -6316 12178 8364 427 91
1805 91 -1877 3573 11572 -473 -9921 6187 16612 3958 -3687 -3019 -1044 10991 15266 -3353
1819 -3353 -9497 7640 11609 1126 -728 -1745 -103 11981 9522 -9714 -7625 8706 7146 -250
1833 -250 -292 -4209 -1274 9438 1428 -12640 -1946 9718 2940 -3150 -5206 -8950 397 11218
1847 11218 -858 -11699 -1840 2730 -2984 -1344 -2719 -7096 2631 6464 -8029 -10387 2374 2376
1861 2376 -1940 57 -4690 -7077 4265 4429 -8468 -4284 4369 -110 -930 1210 -6158 -4951 7078
1876 7078 2801 -5838 470 2026 -4032 434 2469 -4149 167 7069 -2509 -6788 1730 1697 -1514
1891 -1514 5205 488 -8198 -268 5519 -1851 -1159 2949 -3373 -2085 5614 -1231 -6481 2885 3493
1906 3493 -3097 666 884 -5258 1277 6549 -3987 -5531 3873 2470 -1220 1867 -3390 -5745 6648
1921 6648 7689 -5457 -5200 1809 303 2961 4300 -4747 -4453 7376 3692 -6738 -1199 3520 1314
1936 1314 4061 593 -9050 -418 11722 2560 -5820 -1193 640 2000 7084 -929 -8794 2866
1950 2866 10056 -1052 -5038 1013 1158 3913 5611 -4854 -6802 8264 8786 -4205 -4188 1134 2117
1965 2117 7268 4654 -9053 -4660 10398 6772 -4106 -2256 19 2186 7405 545 -10047 544
1979 544 11467 1651 -6617 -2962 -620 4808 8375 -4643 -12293 2496 9516 -1012 -5429 -3389
1993 -3389 -2944 4661 5464 -8973 -9801 5413 5697 -4835 -5675 -4354 -2141 6203 1705 -12461 -6596
2008 -6596 6823 2934 -4835 -4680 -5424 -857 7210 -1317 -11685 -2075 6494 -774 -4325 -2702 -3906
2023 -3906 2407 7133 -5297 -10337 2882 6818 -823 -1702 -2730 -3871 5463 6703 -6249 -5621 5597
2038 5597 4137 -1353 -49 -2300 -1201 8123 3922 -7632 -2129 6696 2658 148 732 -3331 337
2053 337 8980 1486 -6815 1426 5096 415 1980 1044 -4265 2082 7785 -1463 -4706 3966 3085 -243
2069 -243 3064 -813 -4592 4136 6397 -3109 -2046 3296 -256 734 4607 -1898 -3434 5073 3135
2084 3135 -3748 339 2350 -1600 2871 4062 -4319 -2332 5769 1814 -2217 2317 -675 -2810 4574
2099 4574 2737 -5148 -436 4658 -509 -1200 1822 -3441 -1778 5972 333 -6567 745 3013 -1207
2114 -1207 545 -648 -5969 639 6753 -2289 -7122 82 698 -1059 2001 -2813 -6629 2175 4215
2129 4215 -5787 -5659 1440 560 11 181 -7267 -6154 5849 4095 -6734 -4655 -492 -1198 1789
2144 1789 440 -7975 -2908 6825 381 -7150 -2131 694 620 3433 -2078 -8376 1550 8036 -1981
2159 -1981 -6221 -689 970 3602 4886 -4776 -7945 4729 7593 -1615 -2504 787 181 3933 3403
2174 3403 -5751 -2827 9668 5607 -4974 -3287 146 3189 8314 2164 -8087 -1720 8830 3228
2188 3228 -2564 402 166 2735 6888 -1176 -7269 3439 8759 347 -2442 -204 -110 4637 6005
2203 6005 -4113 -6023 6329 7428 -1148 -2183 -1966 -1355 6478 5919 -5364 -3850 5113 1774 -2622
2218 -2622 -27 -410 782 5629 -653 -9436 -1329 7136 1657 -1919 -1702 -5218 -621 6152 -1533
2233 -1533 -7184 880 3154 -2713 -1918 -2048 -4546 1842 4459 -4874 -5884 2117 696 -2728 -204
2248 -204 -2586 -2968 4348 2522 -7180 -4710 2893 759 773 1679 -4839 -4275 4050 1346 -3838 1352
2264 1352 2765 -2222 -414 331 -3910 726 6744 -336 -4802 284 -114 -975 4009 1078 -5191 898
2280 898 3835 -2480 -2738 1361 -1099 433 4468 -2004 -6218 1147 2152 -2307 548 1466 -3267 -209
2296 -209 2124 -4450 -3074 5332 2894 -2557 -812 -2789 -3076 5206 4790 -4161 -2390 2587 -281 115
2312 115 2467 -1313 -254 6346 1588 -5279 599 4032 1322 2804 2510 -3015 1430 6941 -576
2327 -576 -4126 3753 5121 2412 3191 -2177 -5195 4210 9078 -77 -2326 1724 -168 103 2936 -1603
2343 -1603 -1423 6811 3256 -6626 -3676 2361 2350 4089 1283 -7136 -3262 6294 1834 -4918 -1211 426
2359 426 181 2653 -1515 -7806 -392 6674 -712 -4470 -654 -1002 -730 1641 -3816 -6037 4447 5998
2375 5998 -4644 -6933 -2505 -644 4089 4347 -5701 -7555 1832 1273 -3476 -700 390 -1599 1000
2390 1000 -1624 -8398 -2092 6928 1480 -5137 -2990 -3094 -515 4798 -598 -7299 -3 4929 -1243
2405 -1243 -3192 -1005 -2541 1691 5672 -1950 -5328 2701 2775 -2897 -497 1634 595 4389 3020
2420 3020 -6362 -3906 6580 5799 1284 913 -2819 -2448 5421 5335 -1811 1311 4835 -96 -1039 1711
2436 1711 -7 2502 6930 351 -5694 1030 4611 894 1725 506 -3184 1602 5676 -1874 -4186
2451 -4186 1772 1918 481 2608 -964 -4884 947 3366 -2239 -618 3612 -743 -2106 305 -2915
2466 -2915 -1887 5935 3214 -4897 -3018 -390 -1413 3250 3994 -3318 -3204 2849 -620 -2678 2265
2481 2265 1330 -1337 2473 148 -5334 319 4872 -296 -1636 1166 -1794 -837 3686 -1081 -5135
2496 -5135 2328 4136 -1502 -1335 -1178 -4317 1128 5064 -1763 -4246 1320 -259 -3007 74 -597 -2203
2512 -2203 2917 1512 -7044 -4460 2983 1271 -340 219 -5087 -3989 3847 1417 -5194 -809 2818
2527 2818 -796 -182 -398 -5142 -208 5989 -216 -4792 161 1334 -774 1727 -646 -3724 2876
2542 2876 5406 -3184 -4687 1433 1939 2304 3366 -2981 -4859 3619 4162 -2410 -680 2565 -100 1182
2558 1182 1746 -3731 -955 6985 2691 -3801 -509 1005 343 3604 1639 -3898 1029 6551 -100
2573 -100 -3303 961 1003 1626 4890 -632 -4813 2643 4874 -1278 -677 2614 595 1650 2688 -3753
2589 -3753 -3269 6027 5185 -2405 -1602 -837 -1187 3844 3530 -4478 -2161 4415 586 -2919 -85 -623 -224
2606 -224 3826 -198 -6270 -780 4288 -891 -1921 -422 -2759 -91 3888 -2637 -6331 908 2961
2621 2961 -1447 -437 -1179 -4667 125 3606 -2721 -3296 1552 -304 -3202 -46 -1502 -2710 2998
2636 2998 1677 -5333 -2794 2344 -572 -203 1514 -3463 -3063 3298 598 -4045 207 1990 -1747
2651 -1747 -90 705 -3267 -178 4138 -1327 -3665 1744 1334 -1171 1640 -665 -3772 2164 4992
2666 4992 -1972 -2494 1267 -423 664 3610 -1237 -3395 3419 2652 -2997 -164 2136 -31 2203
2681 2203 2458 -3636 -1901 5319 2511 -1556 254 -474 -1194 4321 2890 -3792 -654 4255 403 -496
2697 -496 1500 -1083 -201 4652 538 -3800 1037 3708 -336 495 1082 -1851 1563 5268 -1125 -3380
2713 -3380 2449 2262 -301 1775 -208 -3102 2292 3464 -2692 -1324 3233 537 -978 850 -2013
2728 -2013 -1694 4370 1541 -5034 -1586 2224 -215 539 608 -4032 -1175 4044 -767 -4905 305 1227
2744 1227 -1426 431 -1759 -4734 1002 4287 -3120 -4574 312 -23 -207 1233 -2954 -4835 2637
2759 2637 3039 -3742 -3189 396 -1000 692 1406 -4278 -3252 3909 1182 -3889 -1084 200 -948 2512
2775 2512 908 -5274 -1544 4551 344 -2495 254 -189 -660 3396 74 -4361 1529 4077 -1477
2790 -1477 -1321 731 -877 1286 3740 -1762 -3405 2853 2948 -1795 -43 972 -1325 2064 2963 -3069
2806 -3069 -1699 4324 1617 -1619 937 10 -476 3819 1855 -3856 453 4385 277 -547 1317 -1420
2822 -1420 393 4669 206 -3409 1646 3374 -328 474 673 -2052 1772 4324 -1450 -2998 2410
2837 2410 2001 -579 1579 -1095 -3020 2588 3399 -2831 -1574 2009 -184 -216 1667 -2122 -2429 3411
2853 3411 1264 -3771 -673 1341 -967 916 1001 -4171 -1525 4017 -86 -3101 -80 -313 -1492 2153
2869 2153 246 -4099 -224 3248 -1875 -2265 835 -593 -718 2206 -2002 -4166 2016 2592 -2323 -851
2885 -851 209 -2175 804 2548 -3058 -3108 2761 711 -2766 210 -238 -1988 1641 1074 -4661 -1480
2901 -1480 3324 -246 -2191 218 -1620 -1105 3537 -97 -5080 -90 2566 -1004 -254 283 -2872 184
2917 184 3677 -1429 -3682 1962 2193 -1082 658 -326 -2085 3062 4149 -2599 -2692 2478 1506 713 2551
2934 2551 -1178 -1887 4114 2900 -2703 45 2619 609 1263 2052 -2542 -367 5098 1409 -2675 1159
2950 1159 2262 182 2280 931 -3037 1101 4744 -371 -2211 1625 258 -433 2519 -287 -2730
2965 -2730 2105 2680 -2415 -1332 1856 -487 628 1970 -2720 -2905 3402 1845 -2652 240 517 -1561
2981 -1561 1066 1152 -3676 -1063 4011 -155 -2861 65 -205 -690 2432 -421 -4591 -177 3195 -1901
2997 -1901 -2287 248 -1588 239 2640 -2429 -5156 516 2095 -1347 -590 -604 -2772 632 1986 -3052
3013 -3052 -3314 2178 714 -2004 -356 -1861 -2613 2481 2052 -3868 -1899 1844 -513 -776 897 -1792
3029 -1792 -1340 3464 583 -3764 -3 1642 -356 1199 1732 -2678 -463 3287 -876 -2077 2501
3044 2501 1399 -996 1121 -142 -2423 2460 3890 -1487 -1774 1647 77 178 2655 -621 -1445 3145
3060 3145 1977 -2865 -58 1916 57 1388 1911 -2741 -1014 3775 704 -2509 833 1490 258
3075 258 2348 132 -3899 727 4892 531 -1311 577 -1131 61 3489 167 -2594 1724 2651
3090 2651 -1903 -1025 925 -529 1882 3192 -2277 -3479 2333 2144 -944 640 -410 -2176 1867
3105 1867 2377 -3067 -1344 2606 143 -1051 1253 -1463 -2242 2069 536 -3265 461 2056 -1743
3120 -1743 -1301 -283 -2301 -173 3701 -1326 -3869 -449 236 -1465 669 155 -2970 -327 1058 -2933
3136 -2933 -1935 2546 616 -1873 -352 -2249 -2434 2718 1937 -3124 -1740 1081 -443 -157 851 -2652
3152 -2652 -1242 3363 471 -3123 -645 725 -798 1314 902 -2379 138 3281 -1084 -3036 1010
3167 1010 1054 840 2311 -1511 -3991 1138 4128 288 -388 695 -1692 -203 2933 -634 -1315 3098
3183 3098 2286 -2054 -267 948 -430 2177 2605 -2294 -1463 3151 1067 -947 1615 509 -756 3057
3199 3057 1680 -2992 -160 3210 262 160 1779 -716 -931 2805 -201 -2156 2471 2593 -1200 -762
3215 -762 -39 -1291 1723 3861 -1534 -2943 1038 653 -835 1106 102 -1669 1529 1438 -3452 -1483
3231 -1483 2605 640 -788 482 -2257 -1821 2872 447 -3431 -479 1615 -859 -211 -93 -3218 -707
3247 -707 3538 -294 -3319 -379 -402 -1101 1007 85 -3219 215 2192 -2250 -2687 708 -34 -92 1756
3264 1756 -2118 -3541 1388 2076 -1572 -834 459 -1446 66 1320 -2206 -2213 2415 657 -2210 83
3280 83 34 -1353 1388 1083 -2228 -289 2443 -1040 -2272 874 290 64 2442 -51 -3288 573 2708
3297 2708 -708 -280 1164 -1099 221 2145 -1207 -1691 2945 2249 -1240 -125 498 -737 2482 2658
3313 2658 -1992 -1152 2810 924 -785 1057 -375 -422 3243 1924 -2735 -491 2175 507 658 1573
3329 1573 -1133 -444 3057 388 -2091 1310 2329 -19 929 -36 -2313 1033 3903 -672 -1759 460
3345 460 -100 -611 1631 10 -2352 1201 2077 -1989 -735 1476 -140 -210 1158 -1615 -2014 2201 620
3362 620 -2705 -280 680 -1064 709 486 -2745 -1325 2098 -311 -1845 301 -368 -1508 1014 -185
3378 -185 -2822 665 2116 -2047 -2321 30 -438 111 1822 -1545 -3670 832 1471 -1511 -424 108
3394 108 -1437 294 1522 -2396 -2065 1906 1081 -1460 -80 -706 -1227 2051 1258 -3169 -896 2283
3410 2283 111 -763 -37 -1940 -320 3251 414 -2562 -240 1607 -306 722 1089 -1514 120 2904
3426 2904 -600 -2242 1336 1522 -376 969 -350 -2113 1945 2810 -967 -1189 1869 315 121 1780
3442 1780 -373 -904 2688 1574 -1885 393 1860 -162 634 1416 -1577 -141 3135 594 -2275 800
3458 800 1382 34 1341 328 -2039 538 3009 -796 -1634 844 162 -311 1334 -778 -2367 1842
3474 1842 1944 -2045 -1477 480 -602 640 1666 -2110 -2152 2073 1282 -2112 -238 -135 -949 1169 775
3491 775 -2883 -1531 2345 -74 -1728 23 -1109 -1043 1948 -196 -3031 -79 1544 -1159 -914 -19
3507 -19 -1830 -572 1752 -875 -2815 329 909 -1346 -417 -247 -1944 76 1499 -2263 -1615 1505
3523 1505 -57 -1196 393 -834 -1926 1045 1070 -2437 -691 1448 -626 -708 774 -1156 -665 2280
3539 2280 324 -1984 260 1430 -433 808 835 -1614 161 2910 -461 -1756 1345 1026 -81 1266
3555 1266 -120 -1963 1803 2826 -770 -725 1151 278 496 2013 -1128 -1558 2423 1748 -1095 25
3571 25 739 -314 1214 1882 -1495 -861 2921 1152 -881 653 112 -458 2205 1018 -2142 -227 2327
3588 2327 70 -486 920 -772 -222 2270 203 -2228 804 1794 -957 -80 169 -1124 399 1891
3604 1891 -1170 -2115 1020 711 -889 344 -221 -1705 949 1204 -2572 -1003 1676 -471 -1211 236
3620 236 -1126 -981 1770 -111 -3096 -377 1575 -823 -591 -485 -2285 -289 2227 -808 -2808 -83
3636 -83 717 -907 62 -348 -2559 539 2372 -1732 -2060 747 452 -225 405 -1241 -2182 2033 1577 -2095
3654 -2095 -975 783 -319 483 1055 -1828 -1400 2424 381 -1733 -200 801 -535 1258 813 -1830
3670 -1830 193 2587 -424 -1447 671 273 -201 1887 330 -1620 1057 1915 -740 -164 1265 -354
3686 -354 321 1683 -688 -1105 2359 1571 -1156 327 948 -491 1104 1703 -1537 -239 2533 671
3702 671 -830 957 287 -253 2022 975 -2187 415 2334 -435 -538 669 -1009 -81 2109 -271
3718 -271 -2368 843 1799 -479 216 295 -1993 340 2152 -864 -1512 1162 197 -915 562 -371 -1840
3735 -1840 1245 1505 -1601 -1256 715 -658 -441 1018 -1326 -1803 1249 339 -2365 -382 462 -1322
3751 -1322 237 267 -2148 -1109 1450 -410 -1716 434 -343 -1377 532 -282 -2224 60 1438 -1399
3767 -1399 -1405 635 -541 -768 1541 -1028 -1961 986 894 -1543 -852 443 -901 582 1472 -1522 -1663
3784 -1663 1816 575 -1051 154 -220 -559 1211 715 -1965 -378 2235 15 -708 16 -708 -19 2515
3801 2515 628 -2313 634 2033 -283 -23 723 -754 698 2401 -879 -1805 1296 1440 -170 643
3817 643 101 -872 1508 1864 -1324 -815 1953 605 27 850 -624 -895 2020 1935 -1582 12 1321
3834 1321 -398 203 1059 -1163 263 2233 -180 -1846 295 1043 -193 903 242 -1756 375 2037
3850 2037 -744 -1388 797 272 -741 571 -480 -1714 1143 1218 -1773 -949 1086 -693 -330 393 -1285
3867 -1285 -1239 1842 403 -2420 -576 24 -854 719 565 -2336 -820 1622 -561 -1589 586 -12
3883 -12 -1018 763 -606 -2560 271 1900 -801 -1383 80 -1075 139 1615 -1348 -2151 634 1181
3899 1181 -1036 -413 -20 -1344 590 1399 -1530 -1076 1446 -287 -957 674 -72 -915 1191 676 -1989
3916 -1989 -599 1720 80 116 625 -1066 -735 1812 577 -1067 937 1272 -830 278 753 -878
3932 -878 639 2113 -795 -1303 1568 951 -432 1198 344 -968 1040 1708 -983 -668 1397 204
3948 204 178 1544 -737 -928 1654 1393 -1328 562 1082 -475 428 878 -1205 -246 2574 391 -1586
3965 -1586 -92 432 -474 1435 758 -1884 -25 2119 -528 -790 748 -269 -190 1436 -502 -2268
3981 -2268 934 1537 -1168 -461 265 -1472 -183 1128 -1398 -1577 1074 860 -1025 -392 -824 -1627 894
3998 894 1222 -2041 -1269 839 -751 -1000 550 -691 -1250 976 -487 -2674 -41 1348 -783 -605
4014 -605 -162 -1319 -441 1664 -699 -2010 936 944 -1137 100 -117 -1625 875 1528 -1655 -1337 1037
4031 1037 125 -814 437 -646 -582 1934 1001 -2345 -571 1453 86 515 600 -1203 -711 2146 521
4048 521 -1268 842 1131 -155 508 531 -1531 636 2618 -365 -1336 1118 381 -263 1354 269 -1104
4065 -1104 1274 2144 -699 -505 943 -77 282 1760 -575 -1051 1379 765 -1110 784 1017 -423
4081 -423 624 373 -1228 -103 2140 185 -1122 537 59 -969 1196 781 -1608 270 1354 -970
4097 -970 -759 832 -290 -203 1308 -831 -1829 933 1088 -1245 -128 142 -1138 505 1037 -1423 -1503
4114 -1503 1155 559 -961 159 -451 -1264 821 872 -1738 -714 944 -467 -887 355 -742 -545 1609
4131 1609 -7 -2225 -5 450 -642 455 586 -1794 -668 1367 -288 -1626 498 -37 -1175 308
4147 308 -200 -1894 290 1219 -1244 -799 551 -558 -576 1112 -654 -1581 1008 910 -1756 -317 746
4164 746 -304 75 1332 -951 -710 1895 103 -1276 837 525 -542 912 563 -1533 421 2210
4180 2210 -189 -755 673 -73 230 1768 343 -1316 940 2028 -543 -53 946 -185 489 1823
4196 1823 -752 -1529 1631 1140 -669 772 384 -407 1269 1654 -1524 -776 1912 395 -315 539 -263
4213 -263 -514 1594 1009 -1540 320 1337 -449 -40 768 -917 -310 1768 -180 -1711 691 712 -632
4230 -632 412 381 -1463 432 1312 -1123 -1089 763 -61 -852 451 -525 -1466 912 818 -1521 -817 933
4248 933 -493 -576 335 -1264 -1138 1266 36 -1800 -158 432 -678 16 336 -1623 -301 1414 -815
4265 -815 -1222 347 -195 -793 564 -226 -1842 445 1292 -825 -722 566 -619 -298 1062 -561 -1347
4282 -1347 1005 922 -1212 -80 615 -908 411 1106 -1232 -1022 1750 443 -610 689 236 -780
4298 -780 955 813 -1475 56 1889 -69 -149 755 -303 -27 1554 564 -1285 963 1229 -586 328
4315 328 1156 -551 406 1773 -455 -842 1177 695 -669 528 169 -806 1216 1238 -992 -369 1310
4332 1310 21 -446 1087 -381 -904 1189 724 -1228 -72 1088 -622 56 757 -1145 -113 1893
4348 1893 -69 -1464 83 263 -501 924 278 -1700 64 1657 -669 -1195 615 -577 -302 847
4364 847 -734 -1664 442 811 -1343 -553 330 -625 -70 840 -1331 -1434 1103 -86 -1293 87 6 -842
4382 -842 415 782 -1332 -612 1393 -421 -1044 328 -414 -799 788 88 -2225 146 1168 -551 -296
4399 -296 519 -978 -407 1273 -846 -1384 1086 866 -881 -100 199 -778 698 1400 -1430 -805 1747
4416 1747 354 -671 104 -151 -869 1582 775 -1323 56 1414 95 -321 750 -742 -403 1854
4432 1854 70 -1154 669 1228 -299 487 418 -631 515 1940 -364 -887 1062 394 -23 940 20
4449 20 -955 1036 1309 -883 -383 1262 -203 -230 1150 -322 -519 1530 482 -1037 108 449 -146
4466 -146 481 626 -1279 -246 1590 -52 -1280 646 111 -706 850 116 -1503 163 1157 -919 -779
4483 -779 702 -408 -495 1272 -506 -1267 821 500 -1414 -516 494 -850 104 995 -1203 -1026 1286
4500 1286 -190 -1234 42 -195 -1245 363 428 -1492 -457 1024 -471 -674 446 -556 -792 953
4516 953 -70 -1938 -174 764 -924 -264 91 -1136 -167 1235 -904 -1399 483 345 -632 480 101
4533 101 -1229 286 878 -1182 -998 1234 343 -483 857 -563 -747 896 664 -1054 244 733 -366
4550 -366 450 1089 -527 -693 1332 269 -929 1001 829 -359 752 966 -999 207 1613 -190
4566 -190 -268 767 365 -95 1127 383 -1055 681 1465 -465 63 947 -302 76 1547 -51 -590 1358
4584 1358 485 -835 285 303 -351 640 927 -1297 -394 1649 194 -833 335 -348 -942 916 51
4601 51 -1572 161 1319 -662 -304 377 -814 -218 1083 -442 -1303 311 503 -1267 -389 -137 -1290
4618 -1290 111 872 -1124 -1314 724 -201 -836 212 -376 -1337 276 504 -1523 -255 791 -392 -714
4635 -714 204 -807 -938 1145 67 -1354 69 533 -848 81 439 -1224 -74 907 -569 -1242 473
4652 473 180 -550 531 164 -1185 728 1203 -868 -798 786 71 320 822 -600 -888 1285 876 -770
4670 -770 85 751 -357 326 981 -826 -593 1253 309 -843 495 518 -147 910 789 -1207 240 1513
4688 1513 -339 -396 661 -23 -51 1139 -151 -1050 926 1154 -484 -60 615 -523 504 1256 -619
4705 -619 -719 1411 516 -732 323 466 -416 564 1110 -939 -426 1091 47 -356 639 -96 -627 1118
4723 1118 485 -1352 273 888 -559 -275 327 -836 -411 1038 -291 -1428 321 425 -1081 170
4739 170 -15 -1259 216 1403 -708 -837 549 -406 -653 308 -382 -994 487 427 -1165 -669 428 -474
4757 -474 -467 352 -828 -880 746 193 -1309 24 266 -747 364 560 -1357 -411 1065 -483 -1311 327
4775 327 -335 -732 670 -111 -1107 415 599 -918 -306 376 -509 304 1095 -620 -1392 537 833 -465
4793 -465 258 543 -548 262 779 -513 -540 1421 465 -578 301 196 -284 802 450 -918 142 1395
4811 1395 -171 -164 746 13 -34 1459 226 -958 747 1080 -290 171 329 -357 424 1041 -475 -583
4829 -583 1032 429 -350 472 6 -971 686 1066 -630 -359 1182 -111 -513 871 -339 -550 854
4846 854 397 -1437 -192 798 -375 53 270 -751 -8 1021 -66 -1059 417 216 -804 410 -69
4863 -69 -1100 -189 1198 -631 -621 394 -258 -590 577 -355 -1242 830 331 -1060 -490 135 -379 -88
4881 -88 448 -846 -820 968 108 -747 170 -25 -787 303 240 -1216 -494 945 37 -933 337 -292 -617
4900 -617 538 91 -1407 252 707 -688 -532 174 -420 -38 770 -320 -1131 738 393 -606 355 356 -717
4919 -717 508 948 -906 -268 873 298 -386 499 -204 -572 1147 537 -893 166 926 -262 303 675
4937 675 -602 122 1057 143 -779 438 893 -381 533 433 -876 399 1157 -222 -516 793 280 8
4955 8 925 -8 -431 862 1217 -459 -153 818 -18 93 705 -244 -568 849 327 -1166 235 450 -525
4974 -525 196 803 -1035 -324 1216 -275 -743 436 -68 -591 768 310 -1290 -207 601 -689 -635 273
4992 273 -704 -649 396 -524 -1074 528 596 -833 -550 38 -860 -329 605 -946 -1110 495 -47 -770 -73
5011 -73 -142 -1173 269 395 -1030 -465 663 -529 -471 494 -391 -712 625 163 -1010 -29 325 -632 86
5030 86 382 -800 -96 1323 -360 -1268 758 299 -649 478 348 -1132 197 1064 -794 -497 953
5047 953 -74 46 966 -305 -728 978 500 -783 228 656 -129 329 619 -337 -231 1130 440 -818
5065 -818 365 867 -50 759 521 -1115 283 1262 -179 -439 672 105 79 782 -12 -445 523 932 -220
5084 -220 149 861 -266 109 898 -766 -690 1073 361 -599 264 114 -360 388 459 -827 -371 672 -206
5103 -206 -776 319 -333 -504 351 -33 -1016 142 615 -373 -126 -9 -739 -245 366 -485 -894 471 243
5122 243 -734 -279 -96 -897 151 751 -606 -951 347 -206 -647 77 -282 -905 245 316 -1408 -454 580
5141 580 -259 -725 64 -549 -634 701 -7 -944 7 478 -478 77 109 -821 -32 687 -312 -685 635 146
5161 146 -263 634 388 -504 251 1097 -502 -185 412 -149 -111 1191 -83 -529 641 723 -320 350 916
5180 916 -205 579 721 -139 -42 969 249 -181 619 280 -224 593 641 -775 165 851 -452 -233 636
5199 636 209 -288 721 -16 -672 395 833 -763 211 426 -595 22 732 -542 -498 804 285 -678
5217 -678 -113 -158 -600 471 684 -705 -426 1018 -135 -494 342 -338 -728 672 291 -943 -236 614
5235 614 -463 -2 177 -958 -407 1064 -374 -1025 66 104 -703 180 56 -1040 -45 658 -703 -796
5253 -796 66 -295 -552 426 -336 -984 325 500 -728 -222 124 -464 -89 396 -813 -684 935 456 -731
5272 -731 203 116 -522 444 468 -800 -292 549 -253 -385 495 -2 -464 440 -172 -885 406 992 -456 -230
5292 -230 406 -118 -89 983 -239 -861 539 569 -574 0 361 -177 508 550 -191 -821 1084 370 -243
5311 -243 362 -4 -565 843 407 -642 19 763 -165 -153 566 -282 -148 869 473 -825 476 630 -289
5330 -289 246 392 -459 215 1021 -360 -789 626 319 -191 474 -58 -543 434 778 -874 -344 726 -191
5349 -191 -294 508 -529 -449 624 34 -666 293 489 -394 33 142 -769 -261 763 -230 -720 -94 -73 -402
5369 -402 474 -157 -1143 313 439 -889 -727 530 -293 -277 392 -270 -887 236 527 -740 -296 185 -752
5388 -752 -26 690 -747 -332 376 9 -794 74 119 -574 110 573 -905 -324 835 -127 -636 254 -401
5407 -401 -451 375 244 -1107 396 859 -294 267 336 -597 -71 940 -204 -611 756 374 -70 489 329
5426 329 -437 373 978 -368 -382 745 56 -260 664 -132 -305 889 417 -771 287 567 22 -320 658
5445 658 -550 -329 1165 321 -535 445 319 -100 589 347 -471 232 1008 -6 -456 370 298 -162 411
5464 411 -173 -410 432 629 -424 -370 684 -176 105 684 -581 -662 746 105 -616 80 115 -315 84 514
5484 514 -787 -151 592 -357 -699 120 -263 -360 540 234 -868 -65 466 -649 -177 494 -217 -350 243
5503 243 -355 -678 489 643 -513 -53 211 -581 191 538 -474 -771 327 -162 -448 300 -125 -523 226
5522 226 328 -1164 -219 750 -64 -95 149 -355 -620 664 -143 -914 41 641 -451 200 100 -475 61
5541 61 634 -382 -251 909 560 -162 361 355 -178 657 456 -430 -290 986 112 -200 728 247 -474 847
5561 847 543 -516 109 349 -321 296 561 -288 23 743 226 -517 892 337 -329 798 537 -769 170
5580 170 1013 -176 -248 349 -38 -223 852 153 -564 649 426 -349 323 610 -470 -38 395 -272 -482
5599 -482 540 43 -292 414 170 -364 542 425 -686 -102 784 -127 -423 469 -145 -644 505 136 -1144
5618 -1144 -327 514 -635 -239 96 -524 -211 772 -320 -985 53 338 -521 70 -340 -791 154 1062 -671
5637 -671 -799 154 -276 -649 242 -392 -875 303 668 -747 -341 385 -311 -131 392 -266 -533 618 34
5656 34 -854 160 288 -178 425 218 -754 29 633 -67 -576 117 257 -150 649 69 -315 220 254 -428
5676 -428 -96 402 378 43 825 -175 -591 876 773 -565 143 719 -55 553 577 -364 -80 1089 245
5695 245 -42 483 433 -230 644 426 -651 279 900 -57 -468 539 -110 -115 639 -278 -405 509 540 -244 -130
5716 -130 520 -311 -51 483 -628 -393 628 112 -264 154 -267 -789 338 275 -632 -312 469 -169 -547
5735 -547 223 -161 -705 665 -86 -846 -190 411 -698 42 60 -658 -319 545 -552 -748 105 -119 -701
5754 -701 82 102 -710 -112 341 -508 -484 348 -317 -451 347 24 -666 241 212 -526 198 452 -659 -187 402
5775 402 -600 -733 483 -178 -696 153 -93 -442 167 527 -476 -200 722 -178 -295 518 100 -299 718
5794 718 219 -640 461 692 -28 74 205 -364 -154 960 27 -385 625 381 66 315 244 -403 500
5813 500 821 -365 -16 519 150 -62 521 -92 -245 917 451 -335 159 474 23 59 189 -319 -231 780
5833 780 46 -564 320 270 -314 179 526 -1010 135 257 -299 -599 283 -21 -313 164 -335 -649 212 517
5853 517 -747 -393 577 -507 -145 351 -537 -598 489 -9 -970 -16 184 -331 10 102 -515 -100 426 -166
5873 -166 -603 83 -61 -423 386 -167 -688 366 662 -640 -363 -89 -377 -398 549 -188 -886 572 320
5892 320 -749 -128 145 -321 142 730 -218 -220 578 161 -731 449 386 -263 476 458 -822 19 650 327
5912 327 -274 509 61 -286 562 -42 -323 600 681 -496 44 528 -268 15 767 -275 -531 621 336
5931 336 -485 264 379 -39 360 735 -474 -75 703 -18 -70 484 -162 -297 646 293 -335 7 532 -450
5951 -450 153 382 -224 -212 761 -137 -450 353 -96 -549 249 336 -634 33 542 -500 -231 244 -253 -114
5971 -114 140 116 -812 370 448 -294 81 435 -449 -474 263 -489 -551 306 -23 -475 -84 -19 -306 100 264
5992 264 -480 -522 540 -449 -340 481 -11 -194 326 106 -681 -156 230 -469 -218 558 -428 -416 413 -22
6012 -22 -699 123 -110 -381 86 96 -404 204 577 -542 -389 340 48 -452 373 -167 -195 350 309 -540 -72
6033 -72 206 -231 -229 266 -273 113 795 287 -737 401 439 -298 218 206 -680 -26 826 47 -440 442 266
6054 266 -375 123 6 -541 206 618 -397 -109 453 -104 117 677 -292 -463 235 561 -324 503 617 -18
6074 -18 176 403 -382 -131 694 20 -590 332 388 -310 516 336 -455 304 747 0 -368 576 -188 -81 268
6095 268 137 -416 449 659 -391 -271 680 -151 84 435 -216 -418 420 73 -611 96 211 -272 215 27
6115 27 -873 -6 451 -524 -296 144 -351 -441 435 -39 -947 8 124 -646 -320 114 -506 -263 734 -84 -623
6136 -623 298 98 -514 -193 303 -458 -283 508 -517 -535 254 -333 -328 298 -285 -535 329 110 -413 338 420
6157 420 -407 -271 363 40 -309 715 -72 -424 158 -3 -657 150 301 -437 -103 457 -332 -183 365 102
6177 102 -236 495 176 -610 194 146 -399 -69 622 -118 137 367 -113 -245 821 462 -624 241 577 -187
6197 -187 313 956 -330 -111 528 285 84 454 -64 -349 691 345 -680 -112 405 -170 110 353 -290
6216 -290 -214 515 -109 -558 268 301 -265 28 24 -647 75 467 -525 -500 301 -36 -52 199 -114 -324 54 379
6238 379 -617 -268 179 -293 -591 429 -150 -456 283 115 -916 143 231 -471 9 4 -646 -215 246 -435
6258 -435 -920 56 98 -451 -40 -187 -541 49 449 -377 -452 192 -184 -183 185 -383 -213 526 281 -832 -2
6279 -2 260 -237 75 280 -455 -228 567 63 -600 191 261 -95 328 498 -139 183 698 -114 -523 504 48
6300 48 -265 269 8 -478 263 503 -64 -81 392 -81 -71 810 -275 -213 663 267 -328 255 433 -321 210
6321 210 454 -472 75 813 11 -330 482 -56 -70 442 343 -393 389 501 -150 -148 601 -154 -67 441 -261 -403
6343 -403 245 189 -212 251 -188 -522 -15 308 -335 -383 83 -234 -533 97 -183 -521 422 175 -652 -425 109
6364 109 -101 -334 481 -152 -434 172 64 -404 8 -210 -450 -10 425 -476 -480 462 -301 -466 324 -180 -343
6385 -343 141 89 -760 23 53 -329 -185 481 -622 -72 487 -296 -550 126 414 -349 177 362 -422 294
6405 294 406 -316 66 505 27 -223 310 -7 -354 239 371 -720 -99 646 102 25 580 72 327 631
6425 631 141 -291 366 505 -60 228 336 -366 147 444 -173 -322 652 322 -264 153 -113 -229 260 462
6445 462 -240 -211 390 110 -236 273 -226 -175 649 203 -590 205 405 -163 54 354 -670 -151 427 -216
6465 -216 -649 89 373 -350 234 120 -712 21 417 -338 -99 379 -144 -481 -18 -314 -556 203 102 -578
6485 -578 -61 47 -547 -197 213 -588 -66 356 -121 -695 -10 93 -592 97 394 -539 -324 162 -383 -438
6505 -438 417 -143 -500 62 -236 -474 148 353 -85 -135 171 -291 -139 222 -65 -405 149 26 -574 189
6525 189 258 -417 -37 216 -523 -265 488 69 -197 240 118 -363 97 320 -211 176 448 -27 74 610
6545 610 -172 -70 552 264 -379 510 271 -277 282 93 -90 52 462 51 -157 421 57 -14 326 472
6565 472 -329 324 250 -167 -166 384 81 71 498 -38 -119 359 119 -126 195 121 -89 388 175 -446 -141 513
6587 513 -67 -440 89 -150 -169 233 111 -488 29 219 46 -369 95 -397 10 371 43 -444 9 404
6607 404 -467 178 228 -128 47 332 -169 -157 537 -144 -311 9 -359 -299 419 247 -393 -123 284 -114 -269
6628 -269 117 -175 -337 143 10 -394 3 63 -419 -8 164 -550 17 176 -280 -321 77 -253 -379 -47 -175
6649 -175 -348 133 537 -345 -351 302 57 -238 206 -54 -96 653 -102 -645 7 367 -120 -31 165 -161 215
6670 215 545 -59 -186 211 473 -2 288 283 -384 403 690 -99 -111 554 2 146 299 252 5 118 314
6691 314 -58 196 75 -80 349 241 -206 -139 470 66 -174 321 261 -347 62 499 -375 -361 472 -56 -415
6712 -415 169 57 -142 685 -8 -217 -342 199 -24 93 105 -320 -239 223 -181 -353 268 205 -318 -130 63
6733 63 -105 -54 317 -346 -177 98 -43 -601 251 24 -254 155 -136 -522 -501 126 -48 -148 67 -179 -113
6754 -113 329 -6 -900 108 37 -452 111 164 -316 -337 79 -159 -395 415 -50 -132 15 -83 -296 -10 357
6775 357 -429 -230 142 -93 -340 197 -126 -165 71 244 -480 159 242 -127 2 377 -248 -254 580 288 -267
6796 -267 462 47 -106 110 107 -311 -126 596 61 -43 360 -92 -219 504 -40 -350 468 293 -305 247 210
6817 210 -1 84 466 -163 -195 616 457 60 440 54 20 141 80 -276 -95 240 221 -170 218 -221 -368 127
6839 127 -227 -105 204 173 -137 38 414 -204 -107 578 -66 -532 -2 303 -124 12 35 -187 222 81 -396
6860 -396 -373 154 -64 -53 56 -251 -582 173 67 -571 8 182 -432 81 160 -254 -359 310 -120 -540 -46
6881 -46 114 -405 16 -58 -602 -202 429 -197 -327 374 -71 -162 74 -158 -425 72 383 -271 -17 285 -357
6902 -357 -238 194 -117 -187 535 -158 -295 107 47 -182 242 443 -327 95 497 -95 -419 130 67 -346 333
6923 333 587 -150 129 357 -56 219 171 -166 -10 540 30 -479 556 288 -311 343 393 -167 479 545 -151
6944 -151 -118 431 237 -151 319 46 -181 132 -13 -89 -198 208 -49 141 236 -115 -151 322 80 -549 100
6965 100 377 -111 -91 172 -404 -538 449 -66 -364 11 50 -288 324 -81 -606 274 -1 -194 -177 310 -303
6986 -303 -325 180 -258 -630 64 433 -549 -140 -197 -427 -355 90 -572 -150 399 -248 -756 -101 136 -138 -131 213
7008 213 -332 -83 136 -78 -262 192 -88 -235 15 -179 -613 127 148 -123 -396 265 -124 -51 294 -303 -198
7029 -198 323 156 -77 62 -35 72 16 488 -252 165 486 -49 -299 85 232 284 228 352 -169 211 311
7050 311 -370 112 42 23 47 626 184 -219 331 493 -206 237 330 -203 367 361 -312 -126 284 -56 -58 201 58
7073 58 -330 339 340 -288 -50 329 -72 77 212 -92 -198 244 -70 -189 495 151 -86 368 -51 -506 120
7094 120 419 -143 -404 434 55 -252 78 97 -505 18 221 -227 -421 -96 -384 154 184 -375 -116 184 -33
7115 -33 -500 -41 -218 -264 -195 108 -527 -465 45 -318 -459 -53 -237 -21 356 58 -673 -163 87 -82 20
7136 20 61 -38 -111 432 178 -443 145 161 -221 183 542 -351 -209 403 -163 -611 426 56 -293 78 -9 -152
7158 -152 29 341 -159 -117 374 -100 -148 427 41 -236 575 391 -130 146 154 -305 185 310 -198 64 513
7179 513 86 -263 350 105 -36 538 424 -167 311 431 -47 118 268 -63 277 246 200 -272 325 309 -505
7200 -505 153 595 114 69 184 163 -119 234 39 -189 -10 141 -63 257 107 -307 -208 42 1 -174 60
7221 60 -144 -251 135 92 -442 -123 286 -216 -1 -72 -87 -36 113 -160 -623 230 -40 -15 -176 36 -429 133
7243 133 241 -400 -203 458 -180 -485 -72 -33 -100 172 -115 -518 -73 428 -202 -64 67 -195 -370 292 -74
7264 -74 -34 245 141 -9 157 412 -334 277 265 -112 -371 418 -82 -25 698 14 -438 293 611 -258 -23
7285 -23 382 -83 -126 266 -178 -30 90 123 -14 171 302 -247 181 279 -181 -100 403 29 -277 195 72 -74
7307 -74 225 235 -154 130 308 -163 -161 264 -112 -230 363 216 5 322 319 -185 138 82 -27 -206 422 -170
7329 -170 -21 433 -26 -271 -99 78 -241 -241 298 -64 -158 135 -46 -26 510 -118 -114 385 -16 -379 39 204
7351 204 -346 -95 -34 -4 -250 112 -161 -455 11 49 -367 188 85 -316 -213 143 -226 -364 299 11 -308
7372 -308 275 -69 -564 397 -7 -483 -156 -77 -165 -3 257 -313 -343 285 -102 -260 -76 175 -155 -5 -2 -173
7394 -173 -344 80 181 -243 227 -167 -312 253 -98 -619 28 436 -228 31 304 -337 -82 252 65 55
7414 55 140 -183 -159 61 382 -271 292 340 175 15 545 -8 75 319 32 -380 491 443 -258 132 470 -45
7436 -45 27 177 -20 67 145 338 -425 390 218 -304 -65 241 -244 -309 458 -58 7 472 -308 -43 106 -127
7458 -127 -65 183 169 -442 16 54 -267 -61 134 -73 -147 356 97 -589 -55 374 -233 -345 388 -78 -100 88
7480 88 7 -268 174 -179 -122 -243 203 -365 176 280 -217 -308 -9 -73 -145 125 -543 -191 -77 -66 -73 161 108
7503 108 -149 -90 241 -346 -54 175 -126 -357 134 -130 -284 -44 265 -201 93 210 -166 -228 71 -162 -35
7524 -35 323 -28 -6 242 262 -393 -59 232 -517 266 237 -267 -250 172 73 -223 433 29 -161 167 444 1
7546 1 216 520 -92 -291 208 296 -134 427 61 -134 135 439 120 143 245 -119 3 469 -7 -124 576
7567 576 196 181 251 114 -347 254 376 40 -26 260 89 -105 24 -53 -306 415 -61 -367 -22 415 -101
7588 -101 -22 257 -186 -126 181 98 -254 -47 -275 -287 -46 66 -818 -134 200 -77 -208 31 164 -119 317
7609 317 212 -341 46 387 -194 -22 263 -271 -388 107 57 -501 97 -7 -501 -124 -145 -352 96 -176 -494
7630 -494 -62 149 -158 -193 -20 23 -168 262 112 -365 -184 432 -365 -4 300 -100 -223 157 -69 -256 278
7651 278 238 -83 -112 272 -533 196 376 66 -276 288 -29 -57 187 257 70 299 311 -113 -76 -3 -143 -270
7673 -270 315 81 -201 443 125 -451 169 162 -222 25 210 -143 45 471 -63 -324 381 132 -75 -109 58
7694 58 -181 268 273 -271 17 -60 -19 -398 229 -54 -140 186 218 -102 -258 106 -253 -35 323 -234 -197 304 79
7717 79 -316 105 9 -253 -45 -78 -439 -87 334 -172 -389 68 -199 -83 291 -119 -212 25 158 -225 -192 -259
7739 -259 -433 91 302 -508 -302 -191 357 -167 -99 -184 -522 -228 279 -303 -469 325 -285 -275 157 63 -454
7760 -454 267 137 -374 -33 13 -126 -371 1 -169 11 165 -22 -304 117 -125 -142 368 -123 -381 64 306
7781 306 -246 -40 56 257 -65 391 102 -153 -91 227 -219 160 143 66 -54 321 18 -132 393 66 11 112
7803 112 32 48 -6 -79 -294 90 370 35 -84 -95 89 -304 71 3 -280 93 301 -378 -176 139 50 -78
7825 -78 279 75 -129 309 418 -157 -255 246 -79 -21 119 21 -195 107 -15 -80 262 54 13 -117 165 42
7847 42 72 62 100 127 106 -168 -36 195 -281 -320 -34 -86 -220 -96 -32 -71 -187 216 -268 -371 135 157 -226 229
7871 229 -125 -322 -25 54 -259 66 161 -332 -367 -57 -131 -328 95 10 -69 -51 33 -38 -99 171 -210 112 239
7894 239 51 -318 195 -57 -312 100 60 -443 -316 101 -97 -379 38 -162 97 107 311 -36 187 -10 -212
7915 -212 -104 179 -411 70 357 7 -321 44 216 -332 64 169 -120 -127 274 -189 -32 501 -139 -62 -105
7936 -105 -192 -106 229 239 51 120 66 -151 1 373 -300 275 174 -149 135 154 88 -103 72 287 -398 -51
7958 -51 146 -338 -119 391 47 -219 214 -6 -37 150 229 -331 102 225 -5 -266 193 -152 -326 254 60
7979 60 -552 -132 185 -231 -267 230 -305 9 372 -109 -354 101 -20 -446 104 -71 -493 -140 169 -60 254
8000 254 76 -304 -208 196 -53 -327 64 20 -128 -222 171 -226 -123 123 -206 -231 75 -67 -478 101 78 -311
8022 -311 -1 190 76 -175 428 -124 217 298 30 191 37 91 -90 204 282 79 -45 111 -60 183 220
8043 220 -22 -106 401 227 217 542 169 -137 7 -22 18 129 219 11 95 227 95 -235 194 204 -126 -24
8065 -24 219 -32 -133 86 -60 -295 92 -28 -503 -41 217 -104 242 335 -214 89 221 -23 -58 443 -246
8086 -246 56 391 -271 -222 76 200 -553 2 362 -235 -111 269 -296 -126 90 5 -446 -35 -129 -20 -187
8107 -187 -65 -95 -279 -45 66 69 223 -122 -102 422 -84 -230 235 -38 -148 66 130 -14 -95 65 29 -217
8129 -217 361 -215 -456 -154 96 -192 -81 -50 -351 -141 249 -244 -169 50 -168 -99 -115 -92 -290 -375 205 -665
8151 -665 -256 169 78 54 50 -287 -298 -64 290 15 123 -76 39 -95 262 88 -494 243 -55 139 160 -110
8173 -110 -89 188 163 22 216 175 55 -43 368 62 -114 69 349 45 144 140 -37 -100
8191a00
##END NTUPLES=NMR FID
##END=
