##TITLE=1H_EC-3202(II-6)
 CDCl3, 8 sc, 
 22.8.2019
##JCAMPDX= 6.0         $$ Bruker NMR JCAMP-DX V2.0
##DATA TYPE= NMR FID
##DATA CLASS= NTUPLES
##ORIGIN= UXNMR, Bruker Analytische Messtechnik GmbH
##OWNER= root
$$ XWIN-NMR		Version 3.5
$$ Thu Aug 22 14:02:42 2019 Russian Standard Time (UT+4h)  she@DPX200
##.OBSERVE FREQUENCY= 200.13155
##.OBSERVE NUCLEUS= ^1H
##.DELAY= (6, 6)
##.ACQUISITION MODE= SIMULTANEOUS
##.ACQUISITION SCHEME= undefined
##.AVERAGES= 8
##.DIGITISER RES= 18
##SPECTROMETER/DATA SYSTEM= spect
##.PULSE SEQUENCE= zg30
##.SOLVENT NAME= CDCl3
##.SHIFT REFERENCE= (INTERNAL, CDCl3, 0, 15.7039)
##AUDIT TRAIL= $$ (NUMBER, WHEN, WHO, WHERE, WHAT)
$$ ##TITLE= Audit trail, XWIN-NMR		Version 3.5
$$ ##JCAMPDX= 5.01
$$ ##ORIGIN= Bruker BioSpin GmbH
$$ ##OWNER= she
$$ F:/spectra/data/she/nmr/H-F/1/audita.txt
$$ ##AUDIT TRAIL=  $$ (NUMBER, WHEN, WHO, WHERE, WHAT)
(   1,<2019-08-22 14:01:23.17 +0400>,<she>,<DPX200>,
      <created by zg, POWCHK disabled, PULCHK disabled
       configuration hash MD5:
       00 E9 B6 7A A2 85 ED C7 34 08 36 98 17 FE 4E 26
       data hash MD5: 16K
       69 F1 12 9C 8E A1 73 F8 73 1E DC ED 7C D9 6F 4A>)
$$ ##END=
$$ 
$$ hash MD5
$$ 36 11 51 17 FD 9D 2E D9 E4 A2 52 9D 94 39 10 6D
##$RELAX= 
##$RELAX= 
##$RELAX= 
##$RELAX= 
##$RELAX= 
##$RELAX= 
$$ Bruker specific parameters
$$ --------------------------
##$DU= <F:/spectra>
##$EXPNO= 1
##$NAME= <H-F>
##$PROCNO= 1
##$TYPE= <nmr>
##$USER= <she>
##$AMP= (0..31)
100 100 100 100 100 100 100 100 100 100 100 100 100 100 100 100 100 100 
100 100 100 100 100 100 100 100 100 100 100 100 100 100 
##$AQSEQ= 0
##$AQ_mod= 1
##$AUNM= <au_zg>
##$AUTOPOS= <>
##$BF1= 200.13
##$BF2= 200.13
##$BF3= 200.13
##$BF4= 200.13
##$BF5= 200.13
##$BF6= 200.13
##$BF7= 200.13
##$BF8= 200.13
##$BYTORDA= 1
##$CFDGTYP= 0
##$CFRGTYP= 5
##$CHEMSTR= <none>
##$CNST= (0..31)
1 1 145 1 1 1 1 1 1 1 1 1 1 1 1 1 1 1 1 1 1 1 1 1 1 1 1 1 1 1 1 1 
##$CPDPRG= <>
##$CPDPRG1= <>
##$CPDPRG2= <>
##$CPDPRG3= <>
##$CPDPRG4= <mlev>
##$CPDPRG5= <mlev>
##$CPDPRG6= <mlev>
##$CPDPRG7= <mlev>
##$CPDPRG8= <mlev>
##$CPDPRGB= <>
##$CPDPRGT= <>
##$D= (0..31)
0 1.2 0 0 0 0 0 0 0 0 0 0.03 0 0 0 0 0 0 0 0 0 0 0 0 0 0 0 0 0 0 0 0 
##$DATE= 1566468082
##$DBL= (0..7)
120 120 120 120 120 120 120 120 
##$DBP= (0..7)
150 150 150 150 150 150 150 150 
##$DBP07= 0
##$DBPNAM0= <>
##$DBPNAM1= <>
##$DBPNAM2= <>
##$DBPNAM3= <>
##$DBPNAM4= <>
##$DBPNAM5= <>
##$DBPNAM6= <>
##$DBPNAM7= <>
##$DBPOAL= (0..7)
0.5 0.5 0.5 0.5 0.5 0.5 0.5 0.5 
##$DBPOFFS= (0..7)
0 0 0 0 0 0 0 0 
##$DE= 6
##$DECBNUC= <off>
##$DECIM= 24
##$DECNUC= <off>
##$DECSTAT= 4
##$DIGMOD= 1
##$DIGTYP= 9
##$DL= (0..7)
0 120 120 120 120 120 120 120 
##$DP= (0..7)
150 150 150 150 150 150 150 150 
##$DP07= 0
##$DPNAME0= <>
##$DPNAME1= <>
##$DPNAME2= <>
##$DPNAME3= <>
##$DPNAME4= <>
##$DPNAME5= <>
##$DPNAME6= <>
##$DPNAME7= <>
##$DPOAL= (0..7)
0.5 0.5 0.5 0.5 0.5 0.5 0.5 0.5 
##$DPOFFS= (0..7)
0 0 0 0 0 0 0 0 
##$DQDMODE= 0
##$DR= 18
##$DS= 0
##$DSLIST= <SSSSSSSSSSSSSSS>
$$ [...]
##$SUBNAM2= <"">
##$SUBNAM3= <"">
##$SUBNAM4= <"">
##$SUBNAM5= <"">
##$SUBNAM6= <"">
##$SUBNAM7= <"">
##$SUBNAM8= <"">
##$SUBNAM9= <"">
##$SW= 24.9336996594482
##$SWIBOX= (0..15)
0 0 2 0 0 0 0 0 0 0 0 0 0 0 0 0 
##$SW_h= 4990.01996007984
##$TD= 16384
##$TD0= 1
##$TE= 0
##$TE2= 300
##$TE3= 300
##$TEG= 300
##$TL= (0..7)
0 120 120 120 120 120 120 120 
##$TP= (0..7)
150 150 150 150 150 150 150 150 
##$TP07= 0
##$TPNAME0= <>
##$TPNAME1= <>
##$TPNAME2= <>
##$TPNAME3= <>
##$TPNAME4= <>
##$TPNAME5= <>
##$TPNAME6= <>
##$TPNAME7= <>
##$TPOAL= (0..7)
0.5 0.5 0.5 0.5 0.5 0.5 0.5 0.5 
##$TPOFFS= (0..7)
0 0 0 0 0 0 0 0 
##$TUNHIN= 0
##$TUNHOUT= 0
##$TUNXOUT= 0
##$USERA1= <user>
##$USERA2= <user>
##$USERA3= <user>
##$USERA4= <user>
##$USERA5= <user>
##$V9= 5
##$VALIST= <valist>
##$VCLIST= <CCCCCCCCCCCCCCC>
##$VD= 0
##$VDLIST= <DDDDDDDDDDDDDDD>
##$VPLIST= <PPPPPPPPPPPPPPP>
##$VTLIST= <TTTTTTTTTTTTTTT>
##$WBST= 1024
##$WBSW= 4
##$XGAIN= (0..3)
0 0 0 0 
##$XL= 0
##$YL= 0
##$YMAX_a= 334665
##$YMIN_a= -576222
##$ZGOPTNS= <>
##$ZL1= 120
##$ZL2= 120
##$ZL3= 120
##$ZL4= 120
##$ABSF1= 10
##$ABSF2= 0
##$ABSG= 5
##$ABSL= 3
##$ALPHA= 0
##$AQORDER= 0
##$ASSFAC= 0
##$ASSFACI= 0
##$ASSFACX= 0
##$ASSWID= 0
##$AUNMP= <proc_1d>
##$AZFE= 0.1
##$AZFW= 0.1
##$BCFW= 1
##$BC_mod= 2
##$BYTORDP= 1
##$COROFFS= 0
##$CY= 11.3945322036743
##$DATMOD= 1
##$DC= 2
##$DFILT= <>
##$DTYPP= 0
##$F1P= 20.1720416913024
##$F2P= 0.152960286110954
##$FCOR= 0.5
##$FTSIZE= 0
##$FT_mod= 4
##$GAMMA= 1
##$GB= 0.15
##$INTBC= 1
##$INTSCL= 1
##$ISEN= 128
##$LB= 0.24
##$LEV0= 0
##$LPBIN= 0
##$MAXI= 10000
##$MC2= 0
##$MEAN= 0
##$ME_mod= 0
##$MI= 1.114404
##$NCOEF= 0
##$NC_proc= 0
##$NLEV= 6
##$NOISF1= 3.799351
##$NOISF2= 2.8
##$NSP= 1
##$NTH_PI= 0
##$NZP= 0
##$OFFSET= 15.70392
##$PC= 1
##$PHC0= -9213.384
##$PHC1= 17.00096
##$PH_mod= 1
##$PKNL= yes
##$PPARMOD= 0
##$PSCAL= 0
##$PSIGN= 0
##$REVERSE= no
##$SF= 200.130013532006
##$SI= 16384
##$SIGF1= 3
##$SIGF2= 2
##$SINO= 400
##$SIOLD= 16384
##$SREGLST= <1H.CDCl3>
##$SSB= 0
##$STSI= 0
##$STSR= 0
##$SW_p= 3612.71676300578
##$SYMM= 0
##$S_DEV= 0
##$TDeff= 0
##$TDoff= 0
##$TI= <>
##$TILT= no
##$TM1= 0
##$TM2= 0
##$TOPLEV= 0
##$USERP1= <user>
##$USERP2= <user>
##$USERP3= <user>
##$USERP4= <user>
##$USERP5= <user>
##$WDW= 1
##$XDIM= 8192
##$YMAX_p= 0
##$YMIN_p= 0
$$ End of Bruker specific parameters
$$ ---------------------------------
##NTUPLES= NMR FID
##VAR_NAME=  TIME,          FID/REAL,        FID/IMAG
##SYMBOL=    X,             R,               I
##VAR_TYPE=  INDEPENDENT,   DEPENDENT,       DEPENDENT
##VAR_FORM=  AFFN,          ASDF,            ASDF
##VAR_DIM=   8192,          8192,            8192
##UNITS=     SECONDS,       ARBITRARY UNITS, ARBITRARY UNITS
##FACTOR=    0.0002004,     1,               1
##FIRST=     0,             0,               0
##LAST=      1.6414764,     0,               0
##MIN=       0,             -576222,         0
##MAX=       1.6414764,     334665,          0
$$ Real data points
##PAGE= N=1
##DATA TABLE= (X++(R..R)), XYDATA
$$ [...]
2958a025j700M815J087n479n29L320j018n25P21k870J52M664j889m863K474K760
2974I5j933J074o66k497K440L796l839k198M256R53k189J513o99k591M394J404
2990C313m334l4L793j267o75J381j981o29M166p22m301J957K285j982O27Q88k919
3007d34N44L631k417l107L169O11k442J639l63l428K267K249l572j128L088j639
3023a332p04K077k388j968M220N73l763M88K338j566J007J600l488K38M911j325
3039I18l250K179J091j838K615n12l503K364M347l588k532L100J02l63J927k252
3055H05k255M143J340l954j88K727j028L1J008l605o97N287j348m524J252K207
3071A201j582Q85j92m102K325M011l612k906K916K90o17J584j804k810M562J954
$$ y = [-1025, -2725, 2090, 3177, -2302, -2831, 489, -529, -1054, -333, -3203, -3051, 1613, -276, -5139, -2665, 95, -1838, -764, -1430, -3927, -1487, 2309, -1530, -3728, 528, 1481, -708, 805, 106, -2485, 1909, 3313, -1021, -1055, 2738, 1471, 796, 2177, 196, -433, 3733, 3011, -1290, 667, 2952, 970, 1597, 2485, -434, 110, 3741, 1324, -1783, 1386, 1997, -445, 1194, 831, -2597, -330, 1919, -1653, -2781, 307, -1332, -2036, 41, -2347, -4315, -95, 478, -3285, -2797, -459, -2025, -1018, 582, -2906, -2668, 2243, 918, -2332, -153, 938, -900, 1715, 1203, -2300, 64, 4411, 823, -1709, 1391, 1493, 1130, 3057, 805, -1450, 2693, 4033, 79, -109, 2618, 1590, 1621, 2629, -976, -1673, 3614, 2266, -2258, -1006, 1201, -381, 504, 312, -3790, -1465, 2546, -1066, -3972, -1056, -766, -1383, 201, -1603, -4413, 149, 2103]
3087B103m813l12L274o19m51J179k770m03M753o31m431J937K969k104M91N40k739
3104b027J701M393l039l090L337R47j797J407l38k328L101J724l799q45L423j033
3120A737j081J504k023j652L727j13m196J346K158j954j02J245l033K87M194k410
3136c66k931K398R46j932J490k54k959K712K339l278j737L338p11o34K137j450
3152h92k326L507J722l925M54K980j297K07J646k775l65M340p20l428J876J223
3168B227j697J513O17l813J653L731l029k187K561l61j159K082j715k440L476
3183A459J263l983k01K607j345m38K221l161j247L931j82l845J518J316j902J412
3199e77N16l446J047L763j944k817K150O29r12K261o57k989K900L106l777o24
$$ y = [2103, -2710, -3022, 252, -367, -818, 361, -2409, -2812, 1941, 1310, -3121, -1184, 1785, -319, 172, 712, -2027, -326, 4067, 1028, -2062, 1275, 2222, 425, 1832, 1494, -834, 2267, 3991, 192, -653, 2770, 1737, 656, 2160, 137, -1515, 2212, 2099, -2097, -751, 1407, -547, -649, 596, -2437, -2150, 2044, -366, -3297, -899, 47, -1885, -395, -649, -3608, -896, 1443, -1835, -3572, -234, -945, -1579, 558, -892, -3218, 289, 2011, -1914, -1460, 1520, 223, 430, 2076, -699, -1064, 3276, 2556, -872, 1004, 2227, 530, 2043, 2660, -1153, 500, 4231, 1202, -985, 1576, 1215, 56, 2138, 423, -2017, 1459, 2722, -1261, -1462, 1145, -200, -638, 1583, -1578, -2825, 1106, 924, -2921, -1403, -87, -1989, -577, -61, -3507, -2460, 1303, -641, -3458, -1308, -679, -1591, 670, 13, -2976, -76, 3030, -747, -1371]
3215a371K324l25K29J662k563j854M630Q55m198O89K148r89O76L76l329M88M546
3232C994j815l573J862J079r90J111o86l326K714K835l894j715K744k17q72J402
3248F53j827k068L992P60m269p1K800j041n2J236l122L62M236j343l745K286K263
3265A050j644M89N73k892K379L052l215j750L101j07j163J721n92j994K885J407
3281C300m054Q02K306j484k41J948k276j336L733m55l494J721J130j842J303M71
3297A532l523R14L369k120k254J745O6j253K249j147k944K742K494l410j237K302
3313d75n82O4J686k423j891M063R24l632N92J888j140J118R96l249L36M646j607
3330A314l118K002Q54j027K031r12k877K942K855l478j388K736m26o77J359j974
$$ y = [-1371, 953, 628, 857, 2519, -44, -1898, 2732, 3587, -611, 78, 2226, 1237, 1913, 2289, -1040, -552, 3994, 2179, -1394, 468, 1547, 557, 1668, 982, -2344, 370, 3205, -689, -2404, 340, 123, -749, 653, -1174, -3242, 750, 1510, -2759, -2830, -30, -1071, -1123, 113, -3009, -2647, 1589, 246, -3499, -1213, 1050, -594, -105, 468, -2424, -45, 3007, -208, -1958, 1143, 1036, -127, 1594, 1002, -992, 1893, 3300, -754, 48, 2354, 870, 629, 2577, 301, -1035, 2698, 2243, -1251, 470, 1600, -242, 1061, 1532, -1991, -1077, 2292, 172, -2082, -337, -271, -1524, 725, -422, -3366, -624, 1870, -1540, -2777, -475, -1057, -993, 693, -1730, -3621, 442, 1366, -2266, -1674, 214, -926, 192, 1188, -2061, -1725, 2921, 1314, -1804, 198, 1052, 25, 2056, 1144, -1733, 1209, 4064, 586, -802, 1934, 1508, 831, 2190, 216]
3346B16j493L742P65m265L62K473j277r4R46k698j22L613j595l344K541N92j742
3363a380J036M37l250J632K965k672j649K587l70j252K096j132k292K884J917
3378A557l132L4J806j412P72K253k877j472M320L41l337J120J025r98J860K41
3394B101l752J228M085j401l228J851J81l49J805j663l127L093K999l833j567
3409a577K505l52j28J391l175j404M486k04m136J094J783r45N18M2l372J477L737
3426A740k205l317K392J254j080J150o88k446L125K420l616q09K984l02q99J490
3442A193j757j053L444L16l435R96K540j498J82J144k265j43L207j317k336K031
3458A249K14j472J767k62l074J584K685k247j702K344j261o14K149j509k835K945
$$ y = [216, -1277, 2465, 3230, -1035, -673, 1800, 523, 429, 1375, -1323, -1445, 2168, 573, -2771, -230, 362, -1380, -344, 93, -3157, -1525, 1440, -1232, -2881, -294, -664, -1916, 180, -952, -3244, -360, 1557, -1575, -1541, 265, -1147, -375, 1878, -999, -2471, 1849, 2190, -1147, -27, 998, 0, 1860, 2101, -1651, -423, 3662, 2261, -967, 884, 1065, 716, 2521, 858, -2269, 824, 3823, -10, -1577, 928, 576, 448, 1839, -1336, -2740, 1746, 1542, -2594, -1500, 283, -662, -144, -102, -3474, -1997, 1740, -465, -3782, -1390, -136, -1216, -66, -754, -3200, -75, 2345, -1271, -2080, 904, 602, -297, 1193, -564, -1617, 1827, 2143, -1292, -296, 2244, 746, 928, 2072, -193, -336, 2871, 1554, -782, 1249, 1463, -9, 1758, 1496, -1578, 6, 2691, 444, -1258, 1086, -175, -789, 1360, -149, -2984, -39]
3474c9J713k894m28J257j143J184J355l252r85M191Q6l359Q75R72j010J993ll539
3492c026J407L946k149k569J929M02k9J849j396l096L631K352l401q11K199k71
3508I67K68R24k677q97M784%l982M38J953j125J007j47l122J280L606k371l016
3525b110J943Q00q88R21r36k634K363K619l611r00K399n88o34J425j903j274L341
3542C33N87l457R48J683j167O94J082k872L06L747j025k765J561R72j044J833
3558A416l34k727J442L425k242j860K006k14o2J911k090k354L428J586l601m23
3574f93J939p37P82M56l320J7L875r36l292J493Q23p07Q87k96l504K153L069k542
3592e33k287K114K25n24J306j613k074L288J967l980l64K638n70j34J331k265
$$ y = [-39, 1674, -1220, -1648, -391, -1534, -350, 1005, -2247, -3232, 959, 1045, -2314, -1439, -467, -1477, 516, 513, -3026, -1619, 2327, 178, -2391, -462, -60, -89, 1760, 364, -2732, 899, 3251, -150, -961, 1238, 967, 1235, 2159, -518, -1415, 3369, 3369, -613, -175, 1778, 653, 1660, 1513, -1609, -329, 3277, 906, -2110, -167, 633, -255, 666, -270, -2904, -541, 2078, -1533, -2433, -34, -622, -1256, 169, -1734, -3008, 333, 920, -2537, -1589, 94, -1073, -379, 703, -2169, -1863, 1884, 859, -1906, -345, 627, -417, 1416, 1082, -1645, -203, 3222, 980, -880, 1126, 912, 850, 2761, 671, -1683, 1745, 3331, -270, -693, 1246, 509, 1291, 1747, -1573, -1556, 2319, 1383, -1909, -416, 407, -300, 587, 291, -3213, -1060, 2009, -533, -2820, -706, -481, -1005, 301, -1312, -3386, -98, 1869, -2111, -2475, 163, -407, -541, 790, -1475]
3608a475n15M009o49l319J672J178o91P13O77k177M16L227k070j523K188k57j180
3625B24J921n63k598K163J969k926p11J783j272L64J626k379j628L025N96k951
3641a357K80J090q13M96Q95l202o9M028o93l070J185M29n94J882p95l192K402
3658a098L465k938j585J739l6L21J643k252k102M175J465l918j94J982j03Q64
3674A428N14l043K44L932o63l568J456J301l88P73j272k339K133L154l274j804
3690a416K263j24l67P58j755j587L273J080l911n3K263q04r3J209k308p94K898
3707E32l35l182J450J353j013O91L80k597P90L149j508j752J955J13o74J725o28
3724D49k499K836K016k990n25J696o04M86J235k187j187L904J32l391N08J201
$$ y = [-1475, -1990, 2019, 1370, -1949, -277, 901, 210, 923, 1600, -577, -161, 3066, 996, -527, 1661, 1404, 224, 2145, 1582, -1016, 1147, 3116, 190, -521, 1262, -10, 354, 1980, -399, -2027, 998, 1594, -1357, -1077, 13, -800, -304, 591, -2611, -2680, 1348, 655, -2415, -1230, -801, -1395, 487, -308, -3500, -1098, 2367, -571, -2156, -417, -453, -132, 1511, -741, -2843, 1332, 2797, -1121, -1315, 667, 564, 1428, 1942, -1101, -857, 3075, 2412, -1156, 300, 1601, 1213, 1986, 714, -1625, 508, 3662, 388, -1416, 847, 723, 356, 1114, -641, -2228, 1045, 2125, -1786, -1839, 424, -380, -473, 736, -1572, -2366, 532, 197, -2985, -1535, -182, -1195, -504, -124, -2721, -1931, 1218, -290, -2042, -87, 26, -648, 1077, 449, -2050, 786, 2802, -188, -713, 983, 379, 865, 2100, -87, -1274, 2630, 2762, -629, -121, 1080]
3740A080L0M82K04l086K18L935j299l104J633P39o98Q47j049k518K239K763l196
3757g80j700K281m9n54R77j705j223L387O59l739K84K155m85J98N05k521M40L727
3775A857j406k620K044J227j192R77n64k079J859K581k502j401K795n36r49J334
3791A425q28j214K338O61k667J59J532j247L16J741k354j002K994m92k358N66
3807d30J094j364J696L5l644P98L075j359j997J189J96j6J405j347k882K692K987
3824B128l072j451J661R6M31J097k617o88L918N0l275J48J636K45Q55P0l021J281
3842e08L641j536k827J518J084k08O76j529j769K992K108l117j688K248K63o81
3858F67P40j958p76L828j88m424P71J912n95o0K26k071L25L148j810k523J764
$$ y = [1080, 1110, 1592, 1796, -1290, -1072, 2863, 1564, -1540, 93, 832, 134, 981, -68, -2586, -347, 2416, -780, -2480, -199, -248, -802, 175, -1530, -2753, 634, 1293, -2446, -2162, -7, -492, -294, 211, -2310, -1870, 1857, 451, -2169, -125, 1102, -90, 887, 323, -1756, 103, 2684, 182, -1219, 1576, 1040, 91, 1425, 597, -617, 1721, 2382, -285, -126, 1406, 159, 475, 2216, -138, -1140, 1854, 1362, -996, -430, 664, -700, 996, 1031, -2613, -1815, 1260, -99, -2096, -907, -711, -727, 678, -669, -3551, -859, 2128, -944, -2395, -734, -638, -207, 890, -1727, -2415, 1503, 1553, -1722, -1574, 62, 307, 1162, 1232, -1789, -508, 3133, 1597, -1230, 288, 1372, 1164, 1840, 311, -1458, 1534, 3642, 525, -1163, 1085, 1348, 667, 1407, -551, -1327, 2501, 2313, -2111, -1340, 572, -23, -83, 143, -1928, -1603, 1545, -265, -2788, -1024]
3875a024J125j074L37o6j932J926J887k370j136K325r3q50J374q38j959K757J361
3892A750k562q1J555o62N09J287k654k51L503l37k727J150J000o79J173l17k915
3909a258J109L410k396j857J536L80k41J172j931k020K810J522l030r36K021m22
3925a31j30P38k476n51L754n92k927M36J778p76P36Mk640J304L272k143k557K360
3943e41O81p90Q47o01j824K665J542k779p01K770l48l73Q56j513q41K983J58k771
3961e80J191J545j505mJ228k283L43K829j516k328J713L55j383J632j89l045J675
3978c22K285k313j294J712n79l58J839j910k116K998P57k654J40J644p82M71P59
3995B77k757K41L303k21l270J224J272n96J444o57k492K271K535k020k017J553
$$ y = [-1024, 101, -973, -636, -702, -2634, -708, 1179, -1191, -2327, -2, -95, -945, 429, -409, -2368, 389, 1750, -812, -893, 662, 0, 509, 1796, -858, -1109, 2394, 2057, -670, 480, 1480, 801, 1974, 1657, -1258, -149, 3261, 865, -992, 544, 924, 683, 1855, -76, -2096, 714, 2236, -794, -1730, 291, -131, -261, 477, -1999, -2550, 1204, 612, -2315, -1879, -101, -877, -141, -137, -2777, -1473, 1799, -344, -2901, -541, 140, -650, 197, -404, -2228, 437, 1979, -800, -1501, 1269, 921, 548, 1404, -109, -950, 2033, 2191, -580, 611, 2156, 651, 647, 1875, -408, -65, 2764, 1248, -1080, 633, 988, -395, 1237, 1048, -1997, -322, 1963, -350, -1644, 68, -511, -869, 970, -940, -3056, -58, 699, -1955, -1815, -171, -953, -482, 277, -2480, -2239, 1064, 843, -2427, -1203, 69, -527, 917, 260, -2232, 39, 2574, 554, -1463, 90]
4011I0Q19j81J271k018j342L239J192l392l68K741p39J21Mk098J36L096p73l149
4029a351J139J568j128J18k48j943J355K483k094k448K274L44j112J358j133j645
4045b463K009J632k979m45K217m57k58J052j670p61K821P4k460O39J625j110P62
4062B28N64k355N16L127j227j901J781O59p20P94j41k353J838K255k516j100J673
4079A122l24K69P93j797j883L335Q07l075r4J790q75K11K54k162R2L404j308k850
4097b291J429J013j030K34k28j616J927K207k976j403K296L80r24J026j179j031
4113b166K439J021k814M0K085l43k35R13j470j81K866o94k582J437J650j486R04
4130A384l3j705R79J915j964j305J925l10r48J356n06k297K219J407k555o08K090
$$ y = [90, 909, 728, 1999, -19, -1361, 1878, 3070, -322, -690, 2051, 1312, 1433, 1437, -661, -525, 2571, 1798, -1351, -212, 1356, 228, 346, 98, -1845, -490, 1993, -101, -2549, -275, 69, -1043, 315, -818, -2463, -454, 1178, -1801, -2246, -29, -486, -744, 308, -1362, -2123, 698, 772, -1688, -1049, 576, -534, 228, 792, -1563, -1047, 2080, 853, -1048, 733, 1392, 672, 1466, 1325, -1028, 810, 3065, 549, -551, 1122, 798, 1067, 1860, 63, -1820, 1515, 2322, -753, -847, 943, 68, 279, 533, -1629, -1537, 1867, 559, -2291, -862, 151, -879, -645, -873, -2489, -562, 1645, -1331, -2734, -438, -58, -982, 44, -1135, -2166, 273, 1294, -1520, -1480, 605, 262, 27, 940, -530, -711, 2155, 1461, -1121, 316, 1966, 480, 1384, 1351, -354, 625, 2540, 576, -729, 1196, 886, -62, 1294, 788, -1509, 710, 2117, -438, -1046, 1044]
4147A044r80m19J367j613j110K241M87k881M38J665j094P48K49k486M22K950j185
4164a57k406J498O04n66J428m89k501K164K391k767o74J914l91J51J210j552j290
4181a433L249O59l161K35J557j71J00M07k427Q13L297j615k794J770J003r61N93
4198A121o11j788J785J949k429j477K245l38j084P87p55j065K120J94k563K52
4214a657J550r03k41J117j456n89K923j049j997J451J463j798R73O52k337J085
4230h13K561j633j376J838n88l08J623o93j915K159J689k907j03J635n26p2J541
4247B112j788j264K893L02k624L64J067q27Q89O1k614P56K878j642k269J209P92
4264B95q35Q39j127k069K631J580k618q58K153l78m22Q51j318r07L174K1l216
$$ y = [1044, 64, -355, 1012, -601, -1711, 530, 1017, -1864, -1426, 239, -855, -107, 142, -2344, -1922, 1028, -157, -2563, -1065, -461, -1027, 401, -88, -2589, -425, 1966, -801, -1475, 439, 48, 199, 1409, -143, -1433, 1816, 2475, -686, -451, 1106, 935, 1035, 1442, -985, -172, 3125, 1510, -1284, 486, 1489, 528, 1121, 510, -1278, 507, 2456, 27, -1450, 795, 457, -627, 160, -595, -1660, 460, 654, -1909, -1657, -107, -1010, -1251, -134, -1590, -2179, 744, -305, -2302, -851, 612, -1186, -213, 439, -1898, -813, 1748, 115, -1261, 577, -11, -319, 1304, 611, -1304, 855, 2544, -363, -466, 1169, 643, 571, 2112, 324, -940, 1953, 2255, -369, -5, 1062, 235, 1124, 1185, -1429, -673, 2205, 563, -1706, -497, 295, -540, 299, -828, -2897, -266, 1314, -1304, -2162, -9, -387, -809, 42, -1276, -2183, 991, 1012, -2204]
4281b204R50J630p21J69Q20k223P30K883j612k216K126Q80j115O39J78j843J998
4298A069J765k589n86K069m41j286J863j213j638K368P63k443p0J530j046K24
4314C39J056k029p22K674n06k391J221M99j164R58J70k152R47K705k037j393J424
4331d01q7m70J341r62j897K147J408k542l31J865o37L00J198k052q56L343O5k695
4349a263Q88J199n53O83K97k262R79K868j837k054J910L95n80P77q27j838K331
4366A113J041k637m43J893n36l67P17j359r25K649M5k713O01J216r92L48O24k127
4384a852L95K745j317k257J820L07o54P05m22j766J784J979k536p05K151o63j50
4401d36J145j030j003K351Q08k499L11J491o94M25P23j965m49K988o12k080R66
$$ y = [-2204, -1254, 376, -345, -176, 644, -1579, -849, 2034, 422, -1794, 332, 1212, 97, 736, 914, -929, 1069, 2834, 245, -341, 1728, 1287, 1, 1864, 651, -987, 1381, 2144, -299, -369, 1161, 115, 339, 1395, -634, -1356, 1318, 812, -1579, -358, 141, -1023, -65, 105, -2047, -1100, 1605, -432, -1825, -401, -488, -958, 383, -579, -2476, -329, 1079, -1463, -1794, 71, -566, -266, 932, -1120, -1976, 1367, 1432, -1263, -375, 824, 271, 954, 1251, -1011, -32, 2836, 999, -1055, 855, 1250, 670, 1447, 620, -1218, 1113, 2154, -483, -926, 967, 431, 64, 781, -578, -1503, 1146, 1191, -1522, -921, 295, -697, -349, 275, -1852, -1457, 1288, -29, -2286, -466, -159, -813, -108, -530, -2296, -512, 1467, -1069, -1774, 377, -286, -436, 709, -321, -1324, 1027, 1835, -664, -353, 1138, 444, 869, 1592, -373, -822, 2166, 1554, -526, 440]
4418D40M55m58Q91k75k101J450K098k331j321J881j71q94J489j465j640K774N86
4435A408k996LJ701m59l23Q94j905k12K698o01k807J358J347r91O21L65k028J058
4453h69K425j774j502K047p1m89J140o83j304J685J783k787j77K017r97J8Q50
4470A312q75j170K178M25k503P27J416j078J58J011k203k43K717j698j123J209
4486B60K71j265J340j70k165R39J968k186q47J571l00k99J109j311j405K642Q22
4503I74k608J31J514j061Q48O08k293O19K510m58k444J474Q76q32O50L07k092
4520a277J287K297j920j171J773J92q06J198j093j353K229Q57k490L68J170o24
4536F37n2P20j865l09K713p80k423J170Q10j195M65L86j967O13K258j849j349
$$ y = [440, 895, 437, 1328, 1053, -1048, 402, 2500, 169, -1152, 729, 558, -336, 1153, -312, -1952, 822, 1408, -1588, -1585, 116, -343, -666, 228, -1677, -1889, 809, 208, -2599, -1241, 106, -885, -264, 101, -1927, -869, 1556, -218, -1720, 327, 256, -233, 907, 224, -1080, 605, 2388, -399, -576, 1441, 444, 462, 1312, 437, -733, 1445, 1870, -633, 94, 1510, 432, 590, 1601, -602, -845, 1872, 174, -949, 260, 531, -734, 606, 436, -1729, -790, 1178, -1008, -1855, -284, -584, -883, 226, -1085, -2490, 152, 974, -1634, -1503, 11, -1050, -202, 406, -1887, -1268, 1242, 784, -1660, -186, 690, -142, 508, 815, -1277, 10, 2307, 387, -784, 989, 1181, 375, 1573, 480, -873, 1356, 2213, -277, 91, 1261, 637, 585, 1305, -560, -869, 1844, 1064, -1359, -189, 621, -574, -109, 277, -1690, -1077, 1181, -668, -2017]
4553b017J354N02j143J535p31j746J912J406k635k58K010q80M2J268j340r29K599
4570I49K45k204Q48R00j329R93J051k270M21K754j323k059J854K37r51J661o62
4587A115k212J381K317k446j107J825n80K08J018j800j272K833N28l016J76J588
4603E56r88K53L77k089M78K454j058k402J569N94o40P97j80j889J652K096k585
4620a005j076K419k43q24J383r39j242K318R73k811L26J887j248L91O26j438N5
4637d48K370o19k054J275R56j121O60L72j860R28J812j954j250J631j22q41J156
4654H91l32k074K031O71j736q96J609r38J89Q81j136j131K417K65k563P64Q13
4671b75j084J070O08k087M87K417j335j425J340M92j098J642l00k152J338K338
$$ y = [-2017, -663, -161, -1304, 231, -500, -2246, -334, 1072, -1563, -1821, 189, -691, -649, 619, -721, -1650, 949, 1194, -1010, -162, 738, -591, 402, 1453, -817, -396, 2358, 1035, -1024, 830, 1067, 116, 1777, 1115, -1097, 284, 2601, 155, -952, 873, 293, 501, 1519, -281, -1553, 1280, 1808, -1208, -1032, 556, -432, -179, 198, -1891, -1413, 1041, -17, -2419, -850, -256, -896, -99, -279, -2168, -516, 1580, -1005, -2081, 338, 95, -729, 654, -285, -1527, 791, 1764, -1047, -721, 1166, -82, 309, 935, -503, -448, 1922, 1303, -751, 524, 1480, 359, 1019, 1391, -469, 459, 2271, 317, -933, 698, 576, -265, 891, 559, -1515, 516, 1187, -549, -1445, 164, -774, -585, 296, -840, -1971, 446, 711, -1852, -1088, -275, -1359, -289, 319, -1768, -1281, 1136, -199, -1624, -284, 208, -890, 752, 452, -1700, -362, 1976]
4687A976k169p29J289J55l36J211j392j096K703L77k320M36J463j095N57K45j726
4704d51K14K496j255j834J059L86r81Q76k5j761J124J627j981j125J898o22l38
4721f93J055r53j595K412N88k288L40J370p72l10J277j722k65K344m79j746R56
4738d81Q01r62J029K61j913P95K233j627j123J640K64n15R93o52j593J861J055
4755B066k078k93J303n50j09J204j672p36K550l48k160R14O80j091P97L80j989
4772a132J68K428j255j670J567k52n55J217p81j818J567J529k228n70J614l36
4788e07l09Q99j193r46K528J20j942P35J230j033N77R59k051K12K736j388j325
4805f98J132P83j317J297j47j568R74J876j858j326K116n26n30J076q93j668K319
$$ y = [1976, -193, -922, 367, 522, 186, 1397, 5, -1091, 1612, 1989, -331, 105, 1568, 473, 1030, 1275, -451, -237, 2259, 1004, -830, 229, 615, -366, 510, 485, -1276, -152, 1475, -506, -1631, 267, -355, -693, 362, -591, -2186, 226, 814, -1474, -1134, 236, -536, -846, 431, -1291, -1556, 788, 309, -1437, -481, 320, -642, 387, 648, -1265, -470, 1763, 136, -987, 653, 917, 402, 1395, 743, -850, 1011, 2066, -12, -305, 998, 448, 339, 1543, -129, -865, 1685, 1337, -823, 91, 771, -320, 477, 857, -1132, -964, 1464, 209, -1461, 106, -146, -701, 516, -265, -2083, -516, 1013, -1215, -1785, -171, -507, -816, 83, -1110, -2056, 472, 592, -1350, -615, 615, -418, 159, 1118, -933, -721, 2015, 627, -698, 434, 1217, -100, 1197, 1050, -518, 456, 2332, 474, -852, 1264, 738, 208, 1284, 391, -1277, 1042]
4822A042L66j969J10J479j154J51O78j760k63K595m90k120Q37M68q54P14k0k195
4840b385J176K131j622j330J672k71k66J530j102j348K128R88j963k04J472m52
4856A54P6Q68j534l07K176r1j882P60J030j108Q17L80j826P64J886j243j514J139
4874E45R3n23J168r57j300J490J362k375m67J619o99l87J153j747o47K288o3k556
4892b003P55J165r65Q16K90j918N32K210j034j539J381L80p29J211l47j923J357
4909c61J942j924r86J367J59j29J033j304q41K181N40j967QJ616j035O68M24j898
4927e07J38K174k88k193J073M99p32L67L26j890Q52J939k031j104J365o9l75R87
4945E31j128r96J492R56k243K37Q68n51N00M46j335l28K365l43k190J137O85m65
$$ y = [1042, 1408, -561, -451, 1028, -126, 25, 703, -1057, -1320, 1275, 785, -1335, -498, -30, -884, -170, -190, -2385, -1209, 922, -700, -2030, -358, -629, -895, 635, -467, -1815, 313, 1301, -662, -866, 606, 154, 230, 1098, -436, -743, 1433, 1342, -540, 220, 1250, 142, 959, 1339, -487, 277, 2163, 920, -594, 545, 638, 115, 1283, 326, -974, 516, 1878, -497, -964, 655, -44, -431, 722, -1025, -1672, 616, 553, -2003, -1248, -83, -1048, -232, 58, -1860, -1328, 882, -152, -1691, -310, 70, -659, 552, 205, -1718, -361, 1581, -343, -1329, 38, 197, 68, 1101, -203, -1044, 1137, 1677, -290, -282, 1334, 299, 967, 1391, -507, -369, 1805, 1517, -676, 397, 896, 164, 531, 857, -1033, -181, 1758, -273, -1377, -12, -81, -456, 531, -597, -1593, -101, 855, -1388, -1151, -283, -834, -334, 112, -1223, -1551, 814, 471, -1719, -582, 103, -362]
4963c62K7O71j783O70K205j251j399J205L34n09J181o93j043J305J293k013L5
4980a27J260j21m06R52j460q80K343j35k026O33Q26q02K42N91j804K69K030j355
4998C0j277J015L98m41O85n04j752J888J044k074o44J450m39m62J250j069q47
5015a749K025L79k292K71J408n02Q2J139j746J18K320q89j356P62R29q21P76j19
5033G35j422J053J439j007j281J222J33j59N98p83j461J876P20k286L18J116m59
5050C52R0O86j783m7J956o07j920O42J165j049M63L9j746R37J821j376j366J100
5068f43K52n43J252r62q75J300J270j974k63J548o36j38J125j099o56J967L09
5085A234j810O77P79n14J62O52j360K03J966j229j519J386J47l07O67l79j731
$$ y = [-362, -335, 336, -1447, -777, 1428, 177, -1222, -17, 317, -192, 989, 296, -747, 558, 1851, -162, -127, 1133, 1012, 606, 1558, 98, -782, 1561, 1426, -600, 33, 859, 57, 299, 890, -914, -645, 1385, 30, -1247, -232, 166, -275, 410, -94, -1846, 42, 1086, -988, -1632, -182, -621, -1083, 167, -902, -1749, 276, 655, -1637, -1366, 42, -460, -378, 761, -985, -867, 1453, 564, -792, -30, 899, 78, 854, 735, -687, 366, 1805, 798, -483, 739, 872, 713, 1311, 528, -933, 943, 1663, -623, -305, 811, 352, 442, 1128, -655, -702, 1254, 647, -1273, -631, 534, -515, -52, -13, -1759, -822, 999, -377, -1743, -643, -391, -934, 318, -644, -1519, -219, 1051, -923, -1186, 362, -274, -412, 713, -386, -1042, 925, 1234, -576, 101, 880, 366, 528, 1180, -180, 23, 1989, 760, -759, 627, 774, 467, 1134, 755, -976]
5102i76J502J270j914m80R18l67Q1P72j047j022J983Q4j900K34R30l59O2O24j966
5121a571K62K073p86j460P83M91n50P59n0j760J222J629j389o72J125J09m00R69
5139G84o66j349K000J002k312K07J189n23L69M11j311k05K378o33k079P62R33
5156I57q32P20m5j387O73J816j500j243R81p1j51N37n90j359J406J110j928m56
5174a362J201k62j26P66j416l75K099m95j653N89J124q55O88J70j678R03J671
5191I89j145q03R56P17r12J237p12j163J410J258j549o82J357l63j28P40j159
5208D8n81J741K34j832L73R76j033O27L92j762M14J517l17j660J075o3p86R57
5226C20l66j577P35K003j711o53J185m12j29R68j337q42J516R82k181L31J386
$$ y = [-976, 526, 1796, -118, -598, 320, -47, 34, 806, -241, -1263, 720, 804, -1096, -862, 68, -291, -229, 395, -1571, -1309, 764, -22, -1482, -699, -208, -758, 1, -49, -1809, -587, 1042, -347, -1019, 106, 215, -185, 784, 118, -1231, 769, 1771, -541, -334, 855, 332, 701, 1112, -199, -404, 1974, 1341, -738, 24, 957, 125, 845, 800, -587, 86, 1902, 402, -841, 140, 69, -82, 455, -135, -1494, -88, 1022, -906, -1362, -161, -423, -549, 217, -1199, -1574, 525, 30, -1623, -1034, 90, -765, -77, 93, -1585, -682, 989, -156, -959, -3, 714, -198, 1039, 327, -836, 574, 1832, 283, -399, 958, 595, 467, 1207, 48, -533, 1208, 1442, -390, -17, 959, -74, 553, 945, -817, -403, 1114, 797, -863, 212, 149, -637, 320, -46, -1623, -888, 1115, -596, -1249, -64, -476, -605, 363, -974, -1816, -300, 682, -1499, -1168, 218]
5243B18p90K87K88r60J84J980n02j666R03M44m77O53m3j028J000J048j135p94
5261c90J338k39l86P65p29p17J300O09j882j93J514n59j74O37j317j48J665k89
5279H05j748L02O77m34L40N5j637N12J700r46j285J080P4n47J034l57j291J596
5297g0R48j495j97Q78l79p2J109j167q58K017M38j766J63O36k37P82M4j488O99
5316a5J649r59j360Q85O89m41P71j31j853J098J404j595p55J408l92j43M98j213
5334d55o18J752L12j829J54J012r83M40L53j425J48J797m10j914J244L56n73R41
5352C02k43j456J066J070j186p69J518k61n80Q36m93j252J865R13j851q8J641
5369A032q21K66N84j095j06J591m96j234O28K53l00O00J90j886Q38J782j682q56
$$ y = [218, -572, -285, 3, -957, -773, 1207, 705, -961, -58, 386, -91, 562, 519, -509, 491, 1539, 404, -390, 948, 709, 323, 1088, 359, -358, 942, 1551, -331, -524, 990, 431, 257, 894, -423, -571, 1094, 805, -943, -641, 36, -398, -58, -3, -1640, -1128, 572, -374, -1659, -579, -505, -1052, -18, -375, -1666, -70, 878, -617, -814, 64, -315, -387, 722, -445, -1303, 714, 1152, -614, -451, 185, -52, 730, 774, -714, -15, 1634, 675, -685, 200, 889, 448, 1219, 1088, -765, 333, 1737, 142, -613, 795, 403, 260, 758, -455, -1073, 679, 991, -838, -684, 328, -655, -215, 138, -1287, -1139, 658, 248, -1666, -422, -66, -639, 302, 59, -1397, -331, 739, -447, -1216, 302, 41, -539, 297, -196, -1448, 417, 1330, -521, -609, 1032, 211, 477, 1061, -34, -140, 1451, 955, -279, 349, 602, 302, 902, 1092, -794, 44, 1826, 144, -712]
5387g12R35J58o57P07m40j376J412J048j927J11N34l32k3Q08r28o12J648k31j626
5406a503O72O14j83J08M09j488M79J827q04j191J007L47o60Q08k25j203J181J153
5424A348j289m92J385on58N20p49m08J718j85j704O51M43m00l4M68r71OJ516p73
5444D86j540J180M49q34N73j86q49N87Q98j387n34J221l74m60Q63p17j109J676
5462e7M57j360j27P60l36k99J161q60n01J760k08j313N00O01l82P62L3j407Q76
5481F0J369q58q60R22p2k45M95n92j234J746J212j844j12O75k73k24O66j008m96
5500f73J585K06j842M80P23o13N47n28j111P78J397j135j251J402Q9q14J41J56
5518d63j239J351R98j597k43J053j07k88Q51r64k37J459L69j781O23R53m99p7
$$ y = [-712, 223, 381, -276, 431, -9, -1385, 27, 1075, -852, -741, -207, -539, -562, 246, -682, -1294, 354, 123, -1503, -831, -217, -400, -292, 117, -1371, -892, 935, 131, -1060, -53, 294, -366, 442, 217, -986, 195, 1348, 59, -433, 952, 946, 388, 908, 159, -249, 1469, 1284, -420, 231, 674, 274, 240, 708, -263, -257, 1259, 486, -1054, 126, 575, -259, 314, 128, -721, -134, 764, -623, -1157, 64, -310, -770, 93, -624, -1733, -57, 400, -960, -1087, -327, -663, -962, 199, -661, -1162, 598, 390, -923, -423, 178, -204, 558, 591, -816, 60, 1429, 571, -289, 633, 561, 316, 811, 219, -1015, 731, 1943, 99, -13, 662, 389, 165, 831, -177, -673, 912, 1118, -724, -244, 479, -134, 413, -115, -1226, -448, 949, -186, -1437, -35, 54, -760, -619, -463, -1702, -351, 647, -950, -1193, -140, -247, -535, 316, -648, -885, 574, 943, -838, -215, 738, 239, 162]
5536A62O00j049R3J389o96j246J405J71o85O72m94q44J003R81j357n08J353n86
5554C64p2O85p40j174J702K62j393R3Q34o13j19M65j356L4J369j46j544O39O30
5573h0n81O91k10j335Q76J612j336p30R15J62k22L85n46q20J617P88j971j02J431
5592E44m08K70N45j322l71J898j27j651P77Q80m96J1K54j286L27J744j485n61
5610d57J069Jq37N80l45p59R77N28j324M3R64q16k06R90o05j132J497L23j385
5629h94K82M64o40M30P99j432J37J385k75j457Q41J43n63J211k65r88R13Q42j002
5648f9m56Q84L0q7Q05q32p12J479M81j555j15R82n09O25K61j477k53J783n97r58
5668b90K99N76o41P68l83j346J147J093j817l34J209q2m60L88n94r24J159R69
$$ y = [162, 762, -287, -194, 1195, 499, -747, 658, 829, 144, 816, 322, -522, 481, 1462, 105, -403, 950, 364, 292, 977, 237, -937, 765, 1027, -366, -273, 561, -52, -171, 294, -1062, -1028, 341, 195, -1349, -710, -80, -661, 30, -180, -1515, -639, 973, -363, -1093, -178, -16, -238, 147, -399, -1219, 398, 1186, -785, -887, 544, 136, 406, 951, -371, -742, 1156, 1029, -622, 155, 1035, 539, 550, 804, -482, -155, 1589, 104, -457, 612, 613, -224, 356, 11, -748, 229, 757, -567, -524, 440, -376, -582, 408, -197, -1329, 168, 491, -894, -612, -148, -788, -358, 441, -991, -854, 531, 256, -1201, -360, -217, -780, 431, 166, -822, 91, 933, -69, -525, 359, 389, 302, 1107, 275, -437, 1042, 1523, -32, -147, 835, 326, 951, 1212, -265, -518, 1265, 668, -290, 9, 585, -56, 712, 329, -1017, 130, 1223, -594, -928, 281, 199, -261, 127, -467, -1391, -232, 737]
5686G37j825R8J103o39K10K43q41P5J390n56j313Q78Q79q54L46M27j090K41J493
5705A002q43q12J294j90m46N54K09j068R57Q45j391l80J263n92j59P21r36n39
5723e11J413K01j582L89O33n21L87L16j814N19J699j065r49P61J83p33Q86m76
5741b64j258J350Q15j358p58J300M1l32N37j046m83J767L96j636K79Q08o29O25
5759A54J42r60L46J640o00j402Q72J61j41M87k53r11P83J266j470m13Q37O8n80
5778B6N16l15o53J419j09j319J31P75n71Q1O91j199J82Q52l26j201O70M59q43
5797g34L18K73j307M69J437q24p38R81k66q7O77o30o67R63J026j493J5J031q53
5816d09N82N49q41o92J763R6j346L49N09m26Q33M6j240%J417k40j400R76K17m57
$$ y = [737, -1088, -990, 113, -526, -316, -73, -914, -839, 551, -5, -1318, -440, 439, -415, -69, 358, -732, -491, 1002, 159, -653, 641, 451, 5, 559, 768, -300, 657, 1502, 111, -269, 994, 402, 243, 964, 28, -511, 902, 1103, -479, -90, 543, 22, 409, 725, -1089, -570, 1129, 64, -885, -124, 59, -674, 212, -264, -1522, -172, 643, -715, -1473, -173, -132, -464, 73, -973, -1456, 311, 707, -929, -650, 158, -471, 154, 296, -664, -318, 1322, 722, -680, 192, 353, 212, 699, 446, -465, 318, 1584, 114, -299, 538, 606, 26, 542, 227, -426, 993, 884, -435, -304, 471, -100, -19, 672, -527, -345, 507, 181, -1020, -350, 109, -734, -416, -143, -1450, -981, 456, -368, -1106, -125, -391, -478, 199, -431, -1098, -135, 891, -602, -587, 444, -409, 173, 722, -119, -811, 952, 1048, -298, 51, 560, 134, 967, 1013, -227, -227, 1190, 950, -450, 526, 743, 286]
5836B86N16l09j261J160R98j601l07R12n05j2N69r81o74J858l24j274M04N54p23
5855g14J61M81j200O10J190p46j030J066K06o93O88L2j094J005Q43p87m42Q54
5873D30m29q6Q53p77n04J452K92j460L22P04k82K8O66j304j78J476l45j219Q03
5892D42K32p09O76R8j443N22J243q73r90J111l31l90P04l78j154J512K43j230
5910g15k15O93k85J61L93j099j32J586j87j439P56O72m70N53j78j422Q84J768
5928A324j197j250J404P3l33M03m08p29J063R69j296k50J241o64j21O91p45j58
5946A7J019j75j212M51P42q67L70J77q70J50J102o58r37O36K88q04L82L30j365
5965a224R16J003j558k4N66n0j59P43o90j029J619L43j202M22L79l55K61M31j110
$$ y = [286, 802, 493, -768, 392, 1390, -211, -518, 394, -111, -123, 446, -535, -1209, 649, 325, -949, -545, 9, -714, -553, -72, -1272, -662, 528, -218, -1248, -182, 24, -669, 19, 51, -1043, -38, 805, 18, -424, 430, 1, -85, 768, -9, -513, 939, 1231, -229, 93, 797, 515, 543, 1209, -95, -273, 1203, 858, -361, 442, 674, -35, 641, 739, -704, -182, 1061, 188, -802, 309, -22, -412, 292, -86, -1240, 272, 515, -715, -930, -237, -522, -361, 32, -1067, -1199, 387, 200, -1239, -483, 189, -281, 272, 94, -1328, -444, 1324, 127, -1123, 281, 354, 21, 424, 16, -713, 350, 1319, 23, -227, 1014, 350, 229, 920, 175, 17, 1036, 861, -351, 100, 842, -25, 345, 522, -348, -198, 904, 246, -691, -55, 233, -571, -189, 141, -1224, -308, 695, -863, -887, -321, -371, -530, 213, -477, -1506, 113, 456, -746, -324, 55, -300, -39, 392, -718]
5984g18o6J457k31j188O48M22o09Q70J00j219M85J553j239n36P49p3k7O57q68
6003A67o83J382M25j581K29J29J01M22J4j078l97J699m17j431Q38N64o08N11j9
6022B67j185L31J118q61m52O23L06o94M95R9j413R63R94j571L80Q79o46QO39j023
6042g43J41J334l19j061P22K25p60P63O65j213J40J518o54q84P72n1o17J039m44
6061E73j163R63J049j243l53P00m58k20P48j057m63J479K64j517l5P74m24J18
6079b65M64j317K45J491l75j682O40O81m19O04m31j139J412Q75j005q07J263j78
6097E7k32N04m84q01J513P52j564m9Q48n6n5M62j113j18J728n28j155O78O46q60
6117A73L67K93j004L27R11q14p99J178m65l21R63q24m90R17l9r81K3R44p56k56
$$ y = [-718, -784, 673, 442, -746, -98, 324, -285, 585, 685, -534, -49, 1504, 265, -271, 478, 405, 378, 1035, 167, -516, 866, 1291, -290, -61, 68, 169, 591, 605, -473, -870, 829, 412, -1019, -181, 383, -225, 286, 267, -918, -587, 531, -330, -782, -159, 147, -547, -52, 47, -1366, -403, 591, -980, -600, 279, -367, -359, 280, -743, -602, 732, 413, -648, 74, 299, -461, 302, 967, -246, -106, 1412, 758, -126, 646, 595, -22, 1017, 573, -590, 373, 1422, 179, -174, 526, 68, -152, 596, -461, -924, 555, 819, -698, -733, 41, -383, -265, 199, -1118, -873, 618, 243, -1439, -799, -118, -537, 67, -364, -1503, -91, 784, -221, -1028, 235, 57, -175, 329, -155, -956, 557, 1309, -255, -304, 544, 488, 433, 895, -218, -336, 1392, 864, -291, 387, 1033, 173, 540, 833, -171, 156, 1067, 253, -546, 632, 167, -154, 809, -15, -505, 412, 373, -608, -585, 359, -397, -653]
6137f53P93q13m9N65K82j245M56M35n17N35M09j062J70J265p35p28J105r4j88
6156f9Q73m93j146J352Q32j044l94N97m19K38O28r32m76J466K19j579O34J95l78
6175A04K96K95j321L86J242q21q34N73L97n13L90l18q27O62R08r78p28J278m80
6194b89k09N05n12p62J205M62j176L57N78p71N29K45r53J25J264o53p40Q81K68
6213C54m67L00K18r34P50J015j007o26R97k19l92R69n48r07R22P32j303j29O56
6232C81k68N5N59j084k77J554m98p73j3M32k92M64k02j038K06J439q96n79M99
6251c31L8k54Q26m14r89J152N08j220j29P03l47M57J41p04m38J620Q2j418N74
6270a43P45n58J62M45j319N72J146n47p44J004K45n92K82M6j444J481N26j455
$$ y = [-653, 140, -673, -722, -157, 125, -1120, -664, -229, -746, -211, 198, -864, -694, 571, -164, -892, 213, 119, -69, 804, 311, -835, 517, 1349, 305, -89, 508, 89, 327, 955, 23, -453, 1013, 1232, -347, 287, 482, 104, 400, 695, -626, -240, 1002, 181, -653, -80, 317, -196, 194, -124, -951, -289, 619, -359, -1087, 191, -289, -498, 7, -505, -1267, -62, 400, -776, -419, 159, -612, -83, 162, -791, -666, 598, -55, -795, 86, 354, -113, 187, 405, -529, 221, 1236, 229, -397, 600, 381, -11, 958, 410, -497, 425, 1157, -146, -275, 381, 113, 168, 727, -357, -634, 920, 422, -351, -364, 68, -224, 240, 38, -1000, -794, 645, -251, -830, -331, -293, -547, 279, -135, -1124, 28, 536, -684, -813, -110, -457, 0, 141, -563, -1001, 619, 701, -717, -143, 602, 44, 206, 651, -668, -96, 1050, 503, -241, 763, 1008, 416, 698, 744, -700, 781, 1307, -148]
6288a48l35R75k66l53Q19r42k36R94J61j594M87Q13p32J88O49j262r8J428p50
6307b02p18O22L8l84O53r4r63N92R04q53n46J090l94k19R02m90j055J253P76j288
6327c76J43M26j48K73L00q93j33J318k46j111P86L84n75M04j9j165O65J328j065
6346B96n27K69L38m96P62p69o04R28N92j506M37M55n77L29J32o53m47J509l4j599
6366a165N69O14k65N6L0p91M54R69o69p58R02R2o42N90O4q17J282K06p66n2N59
6387D62m04J01P19l94n42M59M33p08M0M25p19M24N16j157K39R06l94n92K85Q3
6407A82l40O19j73j307O56J288r35r96O52l0K64Lm27o73J231L19j204N6O44r7
6427b68J44M11j469K37J868m85j424O53Q57p90P36l18q38R98O57r22m97O71L64
$$ y = [-148, -483, 492, 226, -127, 692, -250, -486, 508, 669, -925, -438, 375, -357, -169, 480, -782, -880, 548, -202, -920, -298, -260, -644, 9, -85, -1048, -456, 448, -405, -951, 139, -255, -474, 428, -62, -1117, 136, 912, -376, -233, 193, 45, 318, 618, -275, -408, 910, 664, -447, 339, 723, 148, 552, 533, -632, 33, 1361, 296, -231, 38, 376, -120, 642, -127, -731, 197, 789, -717, -280, 175, -402, -73, 59, -594, -1041, 468, 434, -1165, -596, 18, -247, -191, -161, -952, -498, 471, -198, -956, -54, 38, -604, -14, 50, -767, 515, 721, -45, -97, 462, 58, 159, 878, 484, -58, 401, 834, 126, 166, 591, -128, 296, 812, -345, -106, 800, 406, -186, 99, 182, -158, 461, 288, -1019, -363, 925, -10, -1006, -354, -384, -120, -117, -544, -1217, 14, 333, -871, -815, -171, -268, -124, 287, -1182, -945, 923, 438, -986, -333, 524, -266, 470, 152, -686, 312, 969, 47, -450, 221, 585]
6446E85k83L03k59p94J219K12r54j71J052l55m5J69j046j71J373l91j245R60L38
6465D97r41N81J97r97K87Q27p39p12Q78j80k62O10j84p39O43O44j163J09O56l59
6485c47j53R11p63l64R94l3p14M0Q27n95M28L45r60Q1J266m46q01P89k25K72N3
6506F05k10p97P13J035r42o21O92j01l51Q96r48o64J365p6r90J50N46k55j05K74
6526B16r37J90J157n79j186O79N03n71M89k46n04L28P28n07p40J116k78k21O76
6545C13m14n51R94M03j226J93N02J2K6L07m74l74R21k2p77J56P49o93N62P6j037
6566c54P07M11p19k89R78p49m1M87j24r81P53P12r23l21O18m59K18M40r24l38
6586h98J316j62j116J58M62j7L33L3j266O79J159o24p93k1O72j93O17m03o93R61
$$ y = [585, 302, 605, 346, -448, 771, 983, 29, -142, 910, 555, 510, 679, -367, -538, 835, 444, -801, 159, 497, -444, 137, 334, -663, -376, 451, -288, -1000, -122, -302, -564, 46, -138, -877, -234, 410, -753, -644, 12, -347, -500, 411, -352, -716, 278, 245, -469, -429, 398, -197, 231, 576, -384, -303, 963, 517, -284, 505, 280, 552, 605, 395, -402, 311, 1346, 404, -217, 475, 374, 23, 919, -29, -693, 672, 596, -394, -244, 302, 47, -58, 216, -721, -531, 626, 47, -1139, -460, 43, -528, -39, -285, -789, -461, 267, -240, -980, 136, -142, -363, 313, -101, -652, 342, 745, -481, -288, 214, 226, 252, 559, 85, -289, 632, 610, -167, -11, 738, 45, 607, 683, -354, 353, 764, 45, -244, 734, -15, -56, 431, 307, -674, 79, 791, -132, -453, 165, -294, -76, 364, -560, -898, 418, 256, -860, -702, -240, -257, 76, 109, -1157, -478, 681, 57, -736, -757, -85, -278, 339, -64, -757, 204]
6606B04P26r74o12J001k96J21O38p64o54J297or97Q4Q91j31l18L07q91oJ544o32
6627E32j135J161jm29L2P7p23Q89N36j363k80J139m63p8J71l72n11O57M14j204
6647i51L57O29l47k30P66r20J59R53m19o53L23J88j61M33K43j095M35J094q43
6666c9k11M59rn45R45l10p16Q40N98j024j50O01k49K08M88r81j10J113q9r33J71
6687E7M51n71J71k2o41k4J391p02j121Q68J29l44K19k84m25Q71K23p69l52P28
6707a47j13j93L72l96j79N87P8q31M01K74j54L52J59q64K61J064o36o09Q70N52
6727H48p66N17j76p70N33Q75p45l35M82P8l8K87o57n03P59M68q42P5L79n79M38
6748C28k16j57n22R44l62n36j14P91p05O76O6j295O10J211j073l47L98j6j05O69
$$ y = [204, 930, -44, -656, 345, 49, 170, 808, 44, -610, 687, 681, -316, -232, 659, 528, 210, 517, -374, -380, 1164, 532, -603, 558, 557, 128, 160, 237, -486, 403, 939, -424, -704, 435, -28, -106, 65, -307, -818, -161, 253, -951, -594, 35, -312, -542, 224, -696, -537, 416, -3, -656, -333, -145, -306, 127, 370, -725, -290, 804, -39, -250, 209, 200, -345, 600, 290, -426, 414, 1012, -12, -162, 439, 190, 398, 886, -95, -205, 908, 819, -114, 57, 508, -63, 108, 86, -555, -579, 812, 110, -1011, -143, -14, -358, -139, -423, -848, 23, 246, -523, -875, -147, -260, -453, -81, -477, -656, -69, 9, -822, -421, -147, -301, 51, 210, -654, -393, 671, 35, -574, 296, 848, 82, 599, 423, -347, 186, 1061, 316, -19, 463, 541, 503, 790, 133, -370, 389, 857, 15, 90, 469, -110, 328, 112, -45, -567, 377, 15, -521, -635, 156, -549, 127, 193, -1102, -492, 719, -354, -701, -303, -319, -424, 245]
6768B45l96j014J220O36j247J74N26j1k63N02p83l4J225nj245O35L33l17N38l04
6788D15o85L00J092r90m98N00L36n14M89j31q90J051K16q89q8P52o15M4N61n84
6808a28p34J182rj030K92M59n63L26M41j257M21J102r16m47O62R7o37O59K0q36
6828h96N05P63m12l81O85l57J5Q15o01p62R21M02r12J83Q33r62L90P01q27k23
6848a20J054k96q65L55N35m73J13L69j333N16P78n59m70N33p7m8L56n45n96J042
6868B69kn70j70M89k04r2L61p27k65J088l40o89L94P80o26k23M84o40L68R51o87
6889e1n82R43Oo91O92j44o71O86Q08j143J08Q13o55K16O20p06m56R20K0j037O60
6910C56M1o00O95J23r78j75J235l31j066O03o9j17Q07n68o84M09Q93j073l66N99
$$ y = [245, -151, -1165, 55, 691, -556, -382, 144, 133, -130, 372, -411, -445, 780, 775, -470, 165, 498, 181, 719, 415, -270, 30, 1122, 132, -366, 134, 470, -44, 445, 314, -576, 475, 691, -198, -286, 466, -149, -105, 456, -128, -862, 320, 311, -719, -427, 32, -531, -205, 236, -1021, -600, 502, -414, -861, -199, -102, -739, -80, -60, -896, -391, 372, -40, -421, 264, -93, -78, 737, 136, -626, 295, 697, -215, -32, 801, -161, 229, 930, 103, -120, 934, 638, -227, 128, 663, 190, 303, 672, -661, -145, 633, 74, -396, 137, 60, 12, 368, -177, -773, 269, 267, -303, -473, 16, -188, -280, 81, -646, -911, 177, -163, -852, -458, 322, -304, -527, -43, -683, -315, 636, -51, -633, 310, 316, -375, 317, 173, -498, 188, 996, -147, -39, 774, 119, 335, 955, 249, -207, 713, 733, -304, 356, 397, -203, 492, 615, -363, -538, 697, 366, -700, -97, -166, -283, 524, -44, -728, -319, 574, -499, -865, -266]
6930b66J70j28K24l67n19R08K98r26K19N26m54R4N50n56l56J120m97n79L44M32
6950B37k73O46j58p87O21Q14q52p05J110l78l85Q45k74q52Q94M90j284J70M85
6969C64k33k4M85p46J5N57q2q34J19N15n29M95k3n47j64Q95l89p42O99j0n31P50
6991D0k76o98O72P86j167R7Q21m51q1M75q08n6R60K56q07l2O71o22N16Rp45M66
7013B6J012o87m86J98K47k90M50j52n12P63K51p99k32M25n6L26j39p79l08R14
7033A72K76q15j76J059q19R8L05p12p0J119o42n51M94J54m33K93R6n72P57K92
7053C25l23m00L79J62k38J54M8n20Q16J89o14j46Q64m59r5M34n97j98J089j28
7073G42j078R30m3o77M33K37o42p2O83j54r08O96m7m35P49m77q56N94Q87j051
$$ y = [-266, -96, -224, 0, -367, -886, 22, 320, -606, -387, 139, -315, -221, 329, -227, -583, 537, 40, -539, -195, 237, -36, 610, 452, -335, 286, 1100, 248, -457, 653, 275, -110, 735, 461, -391, 503, 993, -291, -121, 364, 131, 107, 592, -154, -139, 418, 336, -498, -379, 136, -393, 102, 79, -468, -632, 263, -126, -868, -169, -179, -710, 40, -236, -934, -262, 524, -643, -546, 275, -176, -257, 218, -590, -646, 314, 570, -237, -269, 402, -220, 296, 305, -440, 26, 1038, 351, -135, 63, 310, 20, 470, 318, -194, 569, 820, 21, -211, 214, 158, 484, 345, -434, -742, 172, 448, -367, -543, 516, -303, -205, 100, -612, -682, 437, -205, -756, -262, -108, -541, -248, -152, -724, 33, 325, 2, -398, -19, 143, -95, 59, 107, -413, 403, 592, -22, -168, 696, 237, 142, 576, -21, -219, 870, 742, -336, 594, 551, -126, 307, 544, -98, -170, 513, 359, -549, 147, 100, -335, 414, -63, -919, -325, 562, -489]
7093d89l29Q28j53j96M82o84k19R82R0r03J90N04n42L43K4o68K04J011l30p33
7113e88L39L24k6L6J58p98M61Q33o70n09P09N8j04K70j10n71P56L78j277J91N46
7134D06j63O6L25r16K93P52n98q14N22M76q77P51J77j118M97P17p38k83O49J5
7154A39o45M14k00n72O77L00o98K72P64p85J70P73r09j99J438p01q13O46L19o26
7174b36N34M29q97L02O75n76m27M74jl92O41j9j104R96N20j202Q8Q72o86K84L49
7195F24q23k36J255k46j163L21L16j38kL58r72K49J121q37p37Q24J69m13L58j2
7215A6q05Q06M21q46J30L60m20J07N64k77p63J008Kq80P52M48p68M5O58q44j75
7236d61J340l29o35K15L49m49L97K00p63M02O12p55m43P91m94j23O99o11m88O67
$$ y = [-489, -818, 10, -143, -339, 143, -541, -760, 222, 312, -591, -401, 103, -439, -96, -72, -740, -536, 475, 145, -588, -249, 75, 49, 85, 243, -555, -94, 739, 69, -440, 269, 327, 223, 493, 383, -188, 568, 946, -331, -140, 406, 243, 309, 634, -282, 11, 763, 165, -649, -127, 349, -528, 223, 400, -718, -221, 496, -242, -525, 124, 139, -506, -92, -292, -864, -187, 113, -585, -313, 451, -334, -164, 609, -300, -499, 939, 238, -575, 71, 390, -236, 298, 727, -170, 132, 807, 231, -196, 278, 277, -115, 526, 507, -597, 399, 919, -283, -195, 677, -9, 275, 624, -199, -435, 820, 574, -589, -268, 48, -90, -92, 266, -706, -457, 664, -173, -910, -86, 83, -330, 28, 16, -789, 17, 438, -408, -278, 82, -338, -231, 333, 56, -707, 301, 303, -577, 175, 623, -145, -100, 558, -286, -461, 879, 550, -85, 130, 479, 30, 427, 627, -136, 266, 878, 123, -320, 471, -23, -146, 553, -58, -546, 121]
7256A21K68p50L1N34n78J26M55o24k20R80l96p24J76M49k94O91m18o05M24Q12
7276D58o64m93N25r4J79J66k63n23J101K57r40j89O20J2j20P08q26r5N98Q7p81
7297b77O70J53n61K78L75r36L80Q84p82q31R44j59k24K99m00l88Q15N36j299j70
7317f93J303n17m89P10o51m40Q14L75j203K03P44p53L50L25p76R8R45m64o80Q17
7337A8l55R2L23L9p11O46O87p21k38M08j02j42P08l76p55R97J91q41J40M58o09
7358a43P14Qo55k25R53k55q78M92J80l55N01k16r88O62O90m06n65P58l86j80K85
7379ij66o05R82Q8p33J07K55Kj80L59o16L00O26Oj157N66K78k57N12k0o19K72
7401iP52n59o23P53j03l40O32k82o71L20R83q91k41R30o35R9N17q05l06J050K04
$$ y = [121, 389, -361, -330, 204, -374, -248, 207, -417, -637, 343, -53, -777, -601, -152, -446, 245, -173, -778, -354, 458, -206, -699, -174, -268, -89, 77, -186, -709, 392, 649, -291, -480, 140, 152, 32, 740, -86, -181, 417, 504, -277, 393, 546, -15, 263, 638, -298, 82, 966, 184, -647, 297, 138, -86, 213, -187, -575, 240, 776, -523, -693, 610, 93, -396, 314, -337, -777, 37, 412, -791, -588, 156, -597, -247, 78, -698, -600, 345, -119, -799, 18, -337, -245, 78, 117, -594, 52, 739, 18, -220, 188, 86, -56, 652, 276, -479, 518, 709, -132, 8, 466, -143, 571, 579, -76, -301, 652, 397, -481, 11, 191, -164, 337, 121, -867, -205, 485, 79, -486, 272, -114, -294, -9, -175, -780, 202, 290, -443, -336, -81, -79, -259, 100, -516, -216, 410, 416, -741, -175, 103, -154, 358, 338, -281, -9, 743, 184, -439, 314, 211, -129, 503, 221, -450, -130, 853, -38, -279, 651, 16, 115, 632, -173, -479, 571, 775]
7422G75j067J35K43j47Q8L76o39l38R71p15j88L72P4l90O27j4j156P53K72l10
7442b78q29J348n98nP10m46q46R15O62j127J52N10l77K27J95o35J81J136k13r63
7462b81L39j95P1O71k51r21Q25J023j006p80O58K55k49N86q10k51R74P9q16j83
7482b62O13o53J25L71n65j68Q85k32r47O49L48r23P62k66l63J73Q38r72k92O90
7502a89J26l39M32o3n91N27M72n34LJ71P9M3J52m83l85J258l89o53K55M73k96
7523F9o3Q00p56k75J278p67p83O75L98p52L21j23o15N09O46o84l98P38k34O8J93
7544B45m66o57R98J72j037N35J19m17L83P5o15L69R02p11o33N62j1MN16m5q01
7565e13L00J020r83r0R26k89l67N73l94n96Q80K78r98M51K28j14j20J96k32k61
$$ y = [775, -292, -157, 86, -61, 27, 403, -236, -574, 397, -318, -506, -134, -60, -450, 177, 163, -993, -240, 32, -278, -1107, 241, -357, -362, 348, -98, -944, -29, 633, -494, -342, 168, -209, 18, 213, -422, -241, 895, 682, -281, 58, -137, -66, 605, 354, -567, 258, 1281, 275, -505, 153, 408, 159, 745, -65, -316, 658, 737, -79, -262, 351, -302, -177, 194, -371, -539, 346, 114, -833, -184, 164, -759, 3, -263, -626, -453, 385, -587, -879, -189, -63, -402, 30, -33, -624, -97, 375, -159, -156, 15, 94, 137, 289, -194, -579, 679, 290, -363, -108, 365, 69, 6, 806, 50, -225, 1053, 286, -497, 178, 576, -176, 145, 22, -593, -84, 562, -122, -520, 218, -16, 52, 245, -221, -878, 120, 292, -745, -210, -91, -508, -125, -50, -665, -296, 606, -105, -738, -176, -187, -183, 333, 288, -513, -213, 807, -176, -266, 660, 371, 4, 577, 183, -413, 467, 745, -253, 198, 426, 312, 192, 388, 156, -105]
7585a05P89j73q75O84P2o92O68K14j200N99O76q58j45L80k54L5M18m34m27M16
7605b12Q45j223J69M87l81r7O64n59n72J129j16p30J65O54o24N52L09j109L69
7624b80R32m40p39O12M43o84O63j39o89N72O72q87l23Q81k23NL01l72n36O62M62
7645H93j225N11K93m88J39J42o02o9Q23l58m54L28J71n79M74o6n98N55N08r19
7665e21k02Q79k12m07K47k26J5M62R2p39K20L29PR0K89m87m14R01l49m97N81M2
7687A00K5K10K43p89L85P75o41j69K08J01m46O64m53p33R03M42r46q7P58k53o5
7708B32K07o40rO06j98o47J29N60m54J85K66r86K35Q00n09m73M11kj85K84K4p75
7730i39Q77K94m92k11P34l87P7N57q70l89J295O9r30J81N43q09M06P11p46L9P73
$$ y = [-105, 684, 511, -364, 320, 392, -300, 368, 582, -618, -19, 657, -201, -346, 34, -220, -185, 233, -201, -628, -212, 633, -590, -421, 66, -315, -412, 252, -307, -879, 250, 134, -596, -431, 223, -401, 151, 460, -649, -280, 652, 212, -527, 85, 528, -156, 507, 368, -321, 251, 923, 36, -287, 594, 371, 376, 677, 305, -231, 431, 893, -332, 179, 472, -16, 123, 265, -337, -406, 417, 59, -395, -67, 104, -475, -1, -67, -665, -110, 398, -521, -723, 156, -56, -463, -216, -442, -427, 35, 127, -612, -392, -63, -56, 34, 323, -164, -578, 323, -26, -523, 58, 100, 125, 335, 578, -211, 174, 949, 308, 139, 347, 448, 2, 666, 213, -520, 383, 825, -121, -208, 550, 297, 232, 439, -201, -210, 396, 198, -449, -320, 240, -214, -29, 237, -749, -514, 286, -223, -696, -285, -287, -472, -188, -164, -939, -62, 232, -260, -471, 263, -124, -47, 510, -360, -749, 546, 615, -315, -134, 409, -400, 6, 717, -29, 10, 783]
7751G83l08p19R27k73m97N29j53o83N37P94j112m55J444m82k88L22n41m10Q19
7770B34K50q48R2M15p26M37M02q62k82J124j78r02M77J21j39K25R2p61K73J007
7790D51n86n96O69K41m37L30m06j02N60N60p74r2M34k28K05M52o23l64J190Qj113
7811b21J24Q93m63L87j00m21J8L24j57o61N89k29k57K36n8n19O12L40q46l20N71
7832a58j73J06K41o14j86Q83J02j055O10M13l55K26R9p03P7R00n44k48L56l2k91
7853c46O83N7o96M05P23p89k2K36k5Q4K72l80n51O96L10o72K34L54m79J56K62
7874E12j000oJ298o61m70K94L41n16L69j90q38N11R81j062k12O72l93K14q7op30
7895i79O90O74j234L97N65k97k5J98l85j25J078l16n67J87K88n1M6L75j051P81
$$ y = [783, 475, -244, 683, 410, -87, 442, 289, -394, 143, 937, -175, -630, 814, 332, 44, 366, -175, -585, 234, 484, -364, -272, 143, -583, -146, 256, -606, -888, 236, 58, -844, -367, -246, -385, -160, -68, -829, -556, 451, -135, -731, -62, 179, -258, 72, -334, -436, 124, 684, -90, -182, 252, 24, 229, 681, 58, -306, 884, 892, -221, -97, 796, 333, 720, 620, 199, 217, 541, 384, -277, 312, 83, -174, 62, 4, -515, 97, 437, -409, -729, -158, -331, -225, 16, -598, -784, 99, 201, -854, -244, 169, -186, 40, 139, -564, -487, 413, -131, -379, -23, -55, -346, 337, 394, -302, 103, 826, 37, 15, 251, 226, 310, 582, 202, -349, 347, 657, -15, 219, 573, 94, 250, 512, -488, -494, 804, 143, -327, -33, 308, -208, 161, -29, -867, -356, 625, -437, -649, 23, -370, -156, -243, -249, -979, -289, 385, -849, -452, 113, -184, -209, -11, -396, -521, 557, 241, -326, -139, 149, 98, 144, 519, -532, 249]
7915B49N08n39k71N20l0l06P63n69l02K68P43q25j11M91k85n7L45p59k78J099
7935F54p5r81K42O22p22L50j6q69n2R18l00m38N83j78l39L37L20j074N25P25p14
7956d82kK85j78P4M92n53l93R68K36j090P03M2r8K99J4m21J43O68m15l79K55N4
7978B22j13K77K35q06L80P22p96n17P27m48K86M05n30m37N83L96p55m26O63l78
7998c10K31R2l43j66R36j62j003j53P20k79K99K29r60L01N87j92l82M78l0j32
8018b39K52l9n42Q65J88n93k85M58j19PO56p90K04N57K16q41j6J88J46j66N79
8039F86o07k36R96n59p18N84K22n37M52l80m99N01N93q91J52N01n58O7K50j33
8059a14m46N05L53j247N47J46j67JN51o52LP21k67m84M19K9l09M26m1k62N55M68
$$ y = [249, 757, 218, -53, 467, 437, 131, 894, 325, 23, 291, 1034, 209, 98, 589, 304, 247, 592, -167, -445, 654, 579, -402, -160, 462, -260, 90, 74, -795, -847, 71, -229, -667, -84, -262, -601, -264, 56, -1018, -493, 232, -482, -484, -199, -377, -303, 189, -364, -757, 211, 447, -643, 60, 102, 4, 303, 317, -104, 39, 707, 292, -87, 168, 222, 109, 386, 621, -185, 195, 917, 121, -396, 331, -117, 169, 574, 44, -393, 190, 586, -169, -595, 68, -310, -79, 13, -330, -496, 440, 278, -725, -878, -158, -437, -138, 91, -869, -568, 19, -173, -555, -77, -107, -239, 13, -26, -568, 297, 485, -108, -393, 65, -54, -47, 609, -181, 23, 580, 796, -45, -61, 127, 273, 107, 686, 79, -157, 839, 280, -438, 146, 368, -169, 283, -97, -596, -95, 498, -393, -241, 260, -298, -231, 19, -114, -560, -55, 298, -949, -402, -256, -423, -422, 129, -523, -520, 201, -66, -550, -131, -102, -411, 15, -26, -288, 267, 735]
8081G35p55o1K38J54n35P12k56n07Q18J10q00K82L52m16K5Q64j016j29P98l36
8101B77o39K67L36l24L82k56l41J75M89m65l87M15k05P8k57J07j13N62N42r79
8121c36j70L87m06Q2M25k11m03Q26P3q11K49M28o1R0Q4n37J98O90k92o66P83r6
8143C26k57M97n71l98M71O58p98j45P06l74l04O87m8p73Q87R3o79J27J74l65J49
8164F3J53n56j43P69l44k86N6N19n22j20L29n10K03O91n76p4K25J29k6K38l57
8185a39l12L43O04q44M7N72
$$ y = [735, -20, -81, 157, 311, -224, 488, 232, -275, 543, 653, -147, 135, 487, 71, 96, 960, -56, -185, 613, 277, -362, -95, 241, -83, 299, 43, -298, -123, 366, -99, -486, -71, -276, -198, -455, -348, -461, 101, 643, -336, -506, -119, -525, -443, -18, -229, -632, 194, 267, -544, -295, 133, 72, 162, 246, -291, -93, 597, 305, -361, 422, 326, 69, 566, -5, -403, 68, 726, -72, -217, 489, 115, -189, 498, 450, -323, 564, 657, -22, 105, 279, -86, 63, 216, -340, -483, 286, -58, -344, -288, 231, -291, -411, -82, -592, -389, 302, -274, -348, -123, 6, -20, 218, -139, -451, -108, 496, -348, -301, 271]
8191B71
$$ Imaginary data points
##PAGE= N=2
##DATA TABLE= (X++(I..I)), XYDATA
0@%%%%%%qJ6j6J6k4L2l2M0m9N7o9Q2r5J08j30J54j75K02k34K66l00L42l90M38
30B31m94N58o24O95p73Q62r59J064j181J309j449J605j778J967k180K422k691
47a416K997l354L769m260M853n583O512p734R423j1921J5983k3703M3365j80001
61a51070m25152L82984M59184q6074m29131j19991K91949K72557j63078l27252
71b95074J6824L18192J07299k13609j90227J14578K64694M6727k47486j21131
81a99213K16730J72989j64698k09098M8116J91576Q2150r6249j19308N0469J24110
92I7574m0300j36855J1143J34985O8582o6140j24018r886J74524J15185j40048
103H4746j63617O0800J31891j5455j14257m5040R2137J05610o0910j43702O600
$$ y = [0, 0, 0, 0, 0, 0, 0, -8, 8, -8, 8, -16, 16, -16, 24, -25, 32, -37, 45, -50, 58, -72, 82, -93, 109, -125, 141, -159, 183, -207, 231, -263, 295, -329, 366, -407, 455, -504, 560, -621, 688, -761, 844, -934, 1033, -1147, 1275, -1416, 1581, -1773, 1996, -2264, 2589, -2994, 3518, -4216, 5207, -6714, 9269, -14434, 28931, -151070, -576222, -193238, 265946, 179872, -249259, -369250, -77301, 195256, 32178, -295074, -278250, 39942, 147241, -66368, -256595, -142017, 122677, 169404, -78082, -199213, 17517, 190506, 25808, -183290, -135174, 56402, 138552, 42303, -77005, -26536, 97574, 57274, -79581, -68438, 66547, 135129, 68989, -55029, -64915, 109609, 224794, 84746, -78871, -18071, 113820, 98365, -15892, -60932, 31205, 136815, 75905, -67797, -61197]
114f1197J05675p600r5868l8257N1039J00483L5375j21995j08785J03182J48661
125A10713l8823j26705l1340N5029N2808Q64k7886J2421K1083m0483k6991L8648
137f62j1444o9111J6726P8244J1739l5808k9145j0088M8635N9621m8107q3757
149g3157L1829R0007J8095n0523n0261K3360J00142K7037j12166p8147M4890M5355
161A6461J133N352k0972l9282J4823L3195j4833k7782j5230k517L7131K4500m2873
174c0894j8997O0681L5538k9134k3841j2051O025M6043K655p5958q088R9846M2917
187I4742p3784p5788O796P4494L5613p8948p0259P0865Q9015l5010o7627M328
199b5563M8716M4986j8931r4257k0769J15613O2170q8357p2627N3110Q2423n827
$$ y = [-61197, 44478, 36878, -58990, -97247, -46208, 54275, 89650, -32345, -141130, -37948, 110713, 71890, -54815, -86155, -31126, 21682, 22546, -5340, 7081, 28164, -12319, -39310, -662, -12106, -81217, -64491, 13753, 25492, -10316, -39461, -49549, -914, 58707, 10600, -73157, -41328, 48679, 66774, 16251, -34010, -10650, 89492, 116529, 4363, -73784, -28894, 16461, 17594, 22946, 1974, -37308, -22485, 10710, -4123, -31905, -47135, -49652, -12521, 11979, -30894, -49891, 10790, 46328, 17194, -6647, -18698, -12673, 33370, 36025, -39933, -48021, 51825, 94742, 20958, -54830, -48034, 26460, 62073, -16875, -87134, -16269, 72746, 37736, -29891, -25563, 23153, 68139, 49208, -45049, -65818, 49795, 111965, 23608, -49019, 4091, 86514, 80687]
211H0687j00677o1903Q4848R0745p9898j12207N4816J20984K171j06401q0505
222a07340N5075J38363j68j71796o4494J58569J31731p9460j59072j7908J51975
233C5475R8673j34569j71074P4187J84053n208j52785o2668R2268J18655k3619
244E3388j57949n6242J44221J08909q5875j10844L5352J19180M1458r5907q9609
255i3918P8733J21478n2003j21272K5745J12965K6891o6287o4775J8655Q7580
266G3792J1846j05469m7233Q6484O9244l8168o6692o285O5686M4092p2025q1605
278f6333O0856R4595l8511q5673M411O1300L5145k7420o9377j3594O1517J3588
290C0504o1746k1142L9979K7551o144l4594l1234L1494M1109m4152m9198M6309
$$ y = [80687, -19990, -81893, 2955, 93700, 13802, -98405, -43589, 77395, 79566, -26835, -107340, -52265, 86098, 85930, -85866, -150360, 8209, 139940, 60480, -98592, -116500, 35475, 134148, -421, -171495, -97308, 86745, 81537, -71248, -133916, -41648, 77007, 53388, -104561, -160803, -16582, 92327, 6452, -104392, -69040, 50140, 91598, -4309, -93918, -15185, 106293, 54290, -66982, -41237, 71728, 98619, 32332, -32443, -13788, 73792, 85638, -19831, -67064, 19420, 88664, 50496, -16196, -22481, 43205, 87297, 15272, -66333, -5477, 89118, 50607, -35066, -30655, 30645, 65790, 38370, -31007, -44601, 16916, 30504, -31242, -52384, -12405, 15146, 9002, -25592, -56826, -25332, 15777, -28375, -77573, -31264]
302c1264M8945k8618l1068J2026K4154J3927j9142l3602K0067M0946k6383m0090
314e0102K7593M3735P787j8065m2276j7498N8173L8301n8018l9116N1283M5004
326D6801j6570l3294j2638K7180L7813k1768m7275J4635L6712p803q560O206r319
339A2120M883K0962k2036l4762J4282J7793p332R314R547k4235j3195J3288O947
352G576M735p589l1555L171M4263o009m1028J6033L5997j4771k5043j997L091
365a3126J4686Q238k7391m974M3260J0720l8845j8284J3011J9965J2590k8542
377h692l5515L9836N3185m4407o0588L7622O3700j1550o2613l8321L9701P8387
389E0745p319q9635j5400Q2082L9193n0807o4751k972P5820N5062p3295r0597
$$ y = [-31264, 17681, -10937, -42005, -29979, -5825, 8102, -11040, -44642, -24575, 16371, -10012, -50102, -22509, 21226, 29013, 10948, -31328, -48826, 9347, 47648, -10370, -49486, 1797, 46801, 30231, -3063, -15701, 11479, 49292, 27524, -19751, -5116, 31596, 23793, 15233, 21439, 12120, 17003, 37965, 15929, -18833, -4551, 13242, 5910, 15224, 24771, 536, -12659, 629, 7576, 12311, 4722, -26833, -23662, 20601, 14592, -26436, -10403, 25594, 10823, -14220, -16217, -13126, 1560, 9798, -17593, -22567, 20693, 31413, -7432, -25716, -12705, 7260, 19850, -8692, -44207, -4371, 48814, 4407, -56181, -18559, 45141, 33591, -29022, -67343, -27642, 50745, 43426, -46209, -61609, 20473, 59666, 8859, -55892, -58864, 16956, 72018, -1277, -91874]
401i1874N7986J08115k2973j01170k5299P1517O9572l5065j02925o138J09373
412C1119M6651p2213n7283K7566N6996J7390n4418n1073N4625Q0828l8930q3239
424d1981K0442P5344R389n8258m6044L1897P0729j4632q6074l656Q3778K3420
436F4354n8913m3783J6278N4480J9671o7170n3349O8598Q2544m3779q8884j076
448e1029P2082M2847m9541q1717J6342R0160L000q2967j9693N5177K9130k4215
460d24m5555j6971M7843M2172m2013m7001L8351M9926j2775l6109j0673K8524
472d705L5539j9842m4573K6380N2804k5776m8116K1441M0885l573l2058l1544
484c3138R516N3979R701n8770k1557M9957L2897k3575m2627j3198M7085M9180
$$ y = [-91874, -33888, 74227, 51254, -49916, -75215, -3698, 65874, 30809, -72116, -78254, 31119, 77770, 5557, -51726, -24160, 32836, 50226, -4192, -55265, -640, 80188, 41258, -41981, -21539, 53805, 63194, 4936, -41108, -9211, 61518, 46886, -39188, -42844, 40934, 64354, 5441, -38342, -22064, 32416, 52087, -15083, -68432, 166, 82710, 38931, -49953, -51029, 21053, 63900, 14359, -67358, -51016, 39144, 42144, -40823, -60516, -5339, 23791, -424, -45979, -62950, -15107, 27065, -14948, -61949, -23598, 26328, 13553, -22556, -33229, -4705, 30834, 10992, -33581, -7201, 45603, 19827, -28289, -6848, 34037, 30464, -1594, -33138, -23622, 30357, 40058, -18712, -40269, 9688, 42585, 19010, -23617, -36815, 10270, 59450]
496E9450m0256o4682L0854O6497p848m8987j8120J8740L4902K381m9311k3388
508c9768M2552K7857k2991k0390q45Q483J6595q760k7461J8023L7669j7719l0173
521a6928K2086K4515j1785j3795k432N910J3843r777k7547J1566K7847j7144k6935
534b0576O492P471k421j739k0272j0837L5433K0990l5674j8563K7826J5768q065
547d167p923l200J1057J6248j4886j2974K5850R477k8786k137K0983q397j6781
560a5636K143L372J0389J3088k2653k3437L1266L1940k1837l0470M468L2456L2175
573D7264j4951n3256O525O7258J0548n5934k2514K5465K3528N3k9996k6564K8242
586E668L5331k9094m2984J0075K8650O717j6948k8381P152M6135K588m9934l222
$$ y = [59450, 19194, -45488, -14634, 51863, 44015, -4972, -23092, -4352, 30550, 32931, -16380, -39768, 2784, 30641, 7650, -12740, -13585, -5102, 11493, 2733, -24728, -6705, 30964, 13245, -16928, 5158, 29673, 17888, 4093, 1661, 7571, 21414, 11637, -15910, -4344, 23503, 6359, -20576, -14084, -6613, -9034, -10773, -31045, -41882, -6449, 14541, -21133, -39696, -11870, 3898, -4167, -12090, -15290, -4233, 12015, -2871, -15845, 10005, 19482, -9304, -11441, 9542, 1145, -15636, -13493, -10121, 268, 13356, -9297, -32734, -1468, 30472, 8635, -21835, -17367, 15089, 47264, 32313, -20943, -14418, 52840, 63388, 7454, -15060, 10405, 33933, 33986, 3990, -22574, 5668, 40999, 11905, -31079, -21004, 7646, 14363, -2585, -30966, -23814, 22321, 24909, -25025, -28247]
599b8247M7003O976l2273j3826J1972K2646M592l3535j8679L7444K2756l7504
611a0675l1126J4730K5553J0340k1945l4167K1881N4608j4271n6485J0071N5632
623B4146J0378l6086k8058J8325N2300P297n9518k3462N0968K9362l4269l7597
635b6214k743K9348K9161k6482n0247J8583N3851j1898m8667J551L8382J9636
647B4261j8786l3942J2056N4929N021n3147q963M6225J5945k7153k8020q35L7338
660B4929K6173m4874n0323L3887N3542k0709n2876r840L8307L7800k0411n7026
672d1421O721O5026J0069n1424j7218K9808K3857m195l0058j7181L5089L2041
684D1114l6288m2221J8457L3444k977k7070k2184J5130L7868q500m4669N844M4061
$$ y = [-28247, 18756, 25732, -6541, -20367, -8395, 14251, 18843, -14692, -33371, 4073, 26829, -10675, -41801, -27071, -1518, 8822, -13123, -47290, -25409, 29199, 14928, -41557, -31486, 24146, 34524, -1562, -29620, -11295, 41005, 48302, -11216, -34678, 16290, 45652, 11383, -26214, -28957, 391, 29552, 3070, -47177, -28594, 25257, 13359, -35308, -33757, 4625, 24261, 5475, -28467, -16411, 38518, 43539, -9608, -18571, 27654, 43599, 16446, -11574, -12409, 24929, 51102, 6228, -44095, -10208, 43334, 22625, -30251, -40091, -1784, 36016, 15605, -41421, -34700, 30326, 40395, -11029, -28247, 1561, 25418, 21223, -8835, -26016, 9073, 41114, 4826, -37395, -18938, 14506, 11529, -15541, -37725, -22595, 15273, 6773, -37896, -32052, 12009]
697A2009J751k8151n679J3288J6973P400k1083j2720K8850J7473k6461j8314J0854
710c810J1939M299j2389k3255J1499L2107j5922l7845J3853L3508l708k0349q347
723a8420P923K5430J0314k6787r878K8262J1921j7659j0215K012Q669J3154j3263
736A1463k4513J5453K2875k5292k5138J9347J7806j0743j4234o044J0137K1589
748A2706p107k3760J3208K6569j1713j9567N850J1413Q962L019j9468j0287K2971
761A2796N104k8003m716K0339p8j4056q397K51J3864P460k2914r792L2221J0123
775A4202l2125r952K3633J5254K88j0599j4763J1884K2672j4404k5484J3743K3739
788A8088m979j9712j4772Q095L0477J188l9571o056L9464Q067k9659j0868J5659
$$ y = [12009, 13760, -14391, -20070, -6782, 10191, 17591, -3492, -16212, 12638, 30111, 3650, -14664, -3810, 8129, 12428, 39, -23216, -11717, 20390, 4468, -33377, -19524, 13984, 10276, -10073, -18420, -10497, 14933, 25247, -1540, -11418, 16844, 28765, 11106, 891, 2903, 11572, 24726, 11463, -13050, 2403, 25278, -14, -25152, -5805, 12001, 1258, -12976, -19020, -8883, 12706, 5599, -18161, -4953, 21616, 9903, -9664, -3814, 7599, 16561, 19580, 112, -10175, 12796, 17900, -10103, -14819, 5520, 5442, -8614, -17011, -16760, -2896, 4564, -18350, -28142, 4079, 14202, -17923, -27875, -4242, 11012, 11300, 701, -14062, -2178, 20494, 6090, -19394, -5651, 18088, 13109, -6603, -21375, -13280, 17197, 18385, -21186, -27242, 12222, 20289, -9370, -20238, -4579]
801d579K1889J0765k2185k7443K1848L4233j5172l0969L814K4316J4739j7375
813A3881l9678J446N0093R040n1138j9008L4252K1043j5968k7039l794L7379K6613
826C7122l7505m0722K9107M4761p980l5036j2074K6240L5580j5201n5339m99N9334
839B7788J2856m8445k6043K2096K9539k346l5599j5067L9824K6844l7538l3207
851c9298K2044L0943J693j8607j7840J2942L2039j1057m0832Q686M2652Nl4027
864a0657j3047J5973K3734k512l3847o880L9084J2797l6322j9214J9275K2981
876A1365P355j6811k4197J5081L4181j2978l4461R640L3645M888k2029k2507M978
889a1850L5353Q231l8751j3915L2043J3398k2052j6381L062J9252J8154j7941
$$ y = [-4579, 17310, 28075, 5890, -21553, 295, 34528, 19356, -11613, -7799, 16517, 31256, 13881, -25797, -24351, 25742, 34782, -16356, -35364, -1112, 19931, 3963, -23076, -26870, 10509, 37122, -383, -41105, -11998, 32763, 24783, -10253, -22327, 3913, 39493, 24292, -31047, -31546, 27788, 40644, -7801, -33844, -11748, 17791, 15445, -20154, -35221, 4603, 31447, -6091, -39298, -17254, 13689, 15382, -3225, -21065, -8123, 23916, 12859, -27973, -19287, 23365, 23370, -10657, -23704, -7731, 16003, 13491, -20356, -27236, 11848, 24645, -11677, -30891, -11616, 11365, 18720, 1909, -22288, -7207, 26974, 13996, -20465, -10825, 22820, 27708, 5679, -16828, -11850, 23503, 31734, -7017, -20932, 11111, 24509, 2457, -13924, -10862, 8390, 26544, 8603]
901H603l1496J2974L1982q625k4698J040J6613J3099q189k9344j882L5979P589
914B3645l3779r378K0146N538q699r342n379J4547J7295j7631k4814J2607K0157
927D913l765r174n996K518J6949L113k3259k483K3139K131j3034L910J733p022
941f327O588O853n742J61K919n970M011Q798j2429p569J7843Q149j1627o428k497
956c267L748J7220q91k7552j186K9307M143k3818j0689R101J9427O801k7330k0857
970b5843K6721K5204k2657k4078R971J8793O546j3485k6713M164L7477K890l7893
983a8903r915K7089J6672j0572k3631n869L0242K0984l2083k7045K7118K8280
995B2367j1485k1268n138J5361K4240p780l6242R91L9255O847l0595j5251J4444
$$ y = [8603, -22893, -9919, 22063, 13438, -11260, -10220, 6393, 19492, 11303, -18041, -19923, 16056, 23645, -10134, -19512, 634, 6172, -2527, -11869, -17248, -2701, 14594, -3037, -27851, -15244, 4913, 1148, -8026, -14022, -11504, 5445, 8558, -14701, -17184, 5955, 8086, -4948, -1038, 695, -6327, 261, 7114, 1372, 1533, 4452, -1518, 2493, 11291, -1138, -8707, 9136, 17285, 5658, -770, -3267, 481, 17701, 16810, -10742, -11928, 17379, 21522, -2296, -12985, -3884, 15543, 22344, -4986, -25843, 878, 26082, 3425, -20653, -10682, 8111, 14657, 1172, -25541, -21377, 16100, 18990, -18903, -28818, -1729, 14943, 4371, -19260, -25129, 5113, 26097, -5986, -33031, -5913, 22367, 10882, -10386, -15524, -163, 24077, 16297, -19945, -18954, 20301, 27148, -3447, -18698, -4254]
1008d254K3924L283l1900j8261L3134K7024k8762k7474J5286K3615L450j7735
1020A330k1161J0714L3104n552l5657j841K7579O838j5515j5637P11K3037P763
1033A5713l2104j5894L1968J7941k4352j6580J1494J6807M037j7184j5838K1562
1045b430K8411j7660k9488J1256K6404N010j5697j8686O560L3146Q99m2317q962
1058b3554L8424J6281k4554k2600L640K4075J3414k6339k4743K4584L0598j5783
1070A3443k8539o61J9311J9610o692l2515m336L5442Q186l2934j4364J9705J6863
1083A2519l224k1616j7198J9001K4582j5695k4019R920J8018L42p417j1764J89
1096a6362K4681J0037k3611j0971J8933R538p821n750j827P093J2110j0093k0002
$$ y = [-4254, 19670, 22953, -8947, -27208, 5926, 32950, 4188, -23286, -8000, 15615, 19065, 1330, -19831, -9117, 23987, 18435, -17222, -19063, 8516, 15354, -161, -15798, -15087, 7950, 15713, -16391, -32285, -317, 17624, -6728, -23308, -11814, 4993, 9030, -8154, -23992, -2430, 25981, 8321, -21167, -9911, 16493, 21503, 5806, -12880, -6320, 26826, 27725, -14592, -23554, 14870, 31151, 6597, -16003, -12363, 11712, 25126, -1213, -25956, -1372, 29226, 13443, -15096, -15757, 3554, 23164, 16472, -16043, -20379, 15063, 23249, -9685, -24049, -4344, 12519, 9295, -12321, -29519, -10518, 14064, -1631, -25650, -15730, 2288, 2630, -4787, -16551, -16362, 8319, 18356, -5255, -16226, 2707, 12245, 4424, -1326, -3153, 3940, 16050, 5957, -14045]
1109a4045P785J6428m011o467k17n640M221J1621p826j0665J1443R733n212j929
1123E219k623n258J0126J2170r453r442L773O7J204L767j2533r417J9069R482
1137A6151k3242j4818J1018J2571L998r043j7790O847K5057m730k5028K900K2261
1150F152Q884q970j9637o793K6573J8843k7186k2600K1616K0793j2441k1618n954
1163b2338J7590K3495j1056l2745M703L0909K042j8942m180J0487J5362L838k2805
1176c640j2666K7218K0003k0103j7795J0369J1064n75j2438j3097J1574K1160
1188B1074j2204k6370M936J7907l93p420n565k07J3873N456k1582q081K4390J1733
1202A7547j5199j0850L387Q470N703j2719j3957J6098J8275j9017k2387J0027
$$ y = [-14045, -6260, 10168, 6157, -310, -527, -6167, -1946, 9675, 1849, -8816, 2627, 12360, 7148, 5219, 2596, -2662, 7464, 19634, 10181, 739, 4512, 4579, 5783, 9550, -2983, -12400, 6669, 16151, -7091, -21909, -10891, 1680, 5678, -3365, -21155, -14308, 10749, 6019, -19009, -16109, 6152, 15036, 6066, -13571, -20364, 6209, 25052, -2134, -24734, -3118, 17675, 5234, -16384, -22338, -4748, 18747, 7691, -25054, -20351, 10558, 12600, -6342, -10522, -35, 15327, 19165, -3640, -16306, 10912, 30915, 10812, -6983, 3386, 14450, 13875, 1437, -11660, -86, 21074, 8870, -17500, -12564, 5343, 4950, -2470, -8035, -8242, 5631, 11087, -10495, -18576, 5814, 17547, 2348, -8502, -5115, 3355, 9058, -3661, -17618, -1520, 16755, -2262, -24649, -14622]
1214a4622J6429L31r074j1739M990K3616r71k9582n87L3035J1456j7294j6194
1227a0206L486K3234J2093k6305j8651K8420K3840k4117k7424N672K1260J1799
1239B3101j6312k8017O848L2703l375l3629l763K5822J5606r977k5339p283L0365
1252F750K0309k6978k2631J9743K0802q462j8408r780J1351K2494n161k9329k858
1265b2158K2431M565j2298p090J488J3312J0644j6590j5974J8410K0014q608j0515
1278b369L287L423O448J637j2193j804J5783J32j3619j636J907j338N254M31j0365
1293e022J155P723p190l446R677r90o325P236M366p697j590K440J253Q438m48
1308I580j6381j358J7223k666j6046P75P551K448m03j2208j0107J6453J6398j6298
$$ y = [-14622, 1807, 2138, -6936, -18675, -13685, 9931, 8960, -20622, -21209, 11826, 23282, 5988, -10206, -6720, 16514, 28607, 2302, -16349, 12071, 35911, 11794, -15630, -9958, 11302, 23101, 6789, -21228, -14380, 18323, 14948, -18681, -22444, 3378, 18984, 9007, -16332, -23615, 6750, 27059, 81, -22550, -2807, 17995, 9533, -8875, -18655, -7304, 15190, 10029, -19300, -22158, 273, 4838, -7460, -14550, -13062, 250, 10894, -5696, -21670, -3260, 16754, 8146, -2369, 918, 4341, 10789, 12426, 233, -1571, 14212, 14344, 725, -911, 996, -342, 4912, 5343, -5022, -3867, 3856, -3334, -6780, 2897, 1907, -4418, 2818, 7184, -513, -2103, 337, 1590, 10028, 9580, -6801, -8159, 9064, 6398, -9648, -8873, -1322, 1126, 723, -11485, -21592, -5139, 11259, -5039]
1322e039j4859J1690J4253n69j0124r660J0273K4942n619k8218K226K4687K864
1335A6847j3896r346J891J3917P538k0790j6120J9347J7223j2760j4687P35J0636
1348E35J0590n715j8731N482K4972k511k0741K87J2513M170j137r248p361J2369
1362E474Q646j6056r890J1501N310n851m212m963J743J2048m032j5045P944J4623
1376G240p882j0313O693O336J512j352q573J525J5529j826j8859J841J5527n29
1390F869q158o482j628J2790R111j8130j3619J9973J5860j3952j3983M546J3621
1403F818J0277r979j9840R170K6273n317k3692j341J5479Q305m875j8362q182
1416a5266K3185J3464k4505j8707J6406J6458m174j5505j0031J1732K1899q663
$$ y = [-5039, -19898, -8208, 6045, 5476, -4648, -14308, -4035, 20907, 15288, -12930, -10704, 13983, 16847, 2951, -6395, -4504, 9413, 16951, -3839, -19959, -612, 16611, 3851, -10836, -10101, 535, 11125, 5410, -13321, -7839, 17133, 14622, -6119, -5832, 6681, 10851, 9714, 466, -6895, 5474, 14120, -1936, -11826, -325, 4985, -866, -5078, -10041, -8298, 3750, -282, -15327, -7383, 7240, -642, -10955, -4262, 2074, 3586, 2234, -6339, -4814, 10715, 8889, -9970, -8129, 7398, 6869, -1289, -7771, -9399, 3391, 12502, -5628, -19247, 726, 16586, 2634, -11349, -6803, 6818, 17095, 7116, -12724, -3554, 22719, 17402, -6290, -7631, 7848, 16153, 11278, -7084, -15266, 7919, 21383, -3122, -21829, -5423, 11035, 6861, -8644, -18675, -6943, 14956, 6293]
1428F293k5640N320K3700R71j4925p424L380J4611P606j8781j3635J7629J3832
1441A2937j2522j1462K566Q099Q424n345j6560M001J9677k336j4499L484P490
1454C954L66K096l771o735Q395R276q725n661O362o45l251L649k594m324N430
1469C822n51p502M478L272r537J243J0504m711q189L784K892N7L808n529p108
1484i267J0667P377j2524o290Q449M529L78k903j1073J484J7432j932j8329J605
1498a0397J4480J742o554o927k070J3593J0094j5148j2142J4558J0823p741p139
1511b828p83M552J2159k951j9150J145J9415J61j4500k428N649N552J283j0580
1525c304p630J4751Q891j3965p501Q250L560j231j134n873J133J1049m061j3087
$$ y = [6293, -19347, -14027, 9673, 10644, -4281, -11705, -8325, 6286, 13892, -4889, -18524, -895, 12937, 415, -11047, -8481, -382, 8042, 2697, -13863, -9862, 9815, 7479, -7020, -3536, 3954, 4320, 6416, 2645, -4090, 4305, 13581, 4856, -805, 5557, 4912, 1661, 5310, 2716, -1608, 3822, 3271, -4231, 247, 3519, -6018, -4775, 5729, 1018, -7171, -3387, -495, -438, 3370, -2159, -9267, 1400, 8777, -3747, -10037, -1588, 2941, 3319, 416, -10657, -9173, 8259, 6327, -12002, -10397, 4083, 5825, -729, -7656, -9726, 3867, 13961, -1187, -13329, 1229, 12052, 4311, -2828, -3611, 941, 13100, 10149, -9001, -7856, 11559, 11720, -2780, -5208, 441, 5993, 7276, -3304, -10934, 3817, 12708, -1257, -8758, -508, 3052, 1821, 687, -5186, -4053, 6996, 2935, -10152]
1539a0152N457J0258m813n270K319r25K786J846q522k81J2801k050j2428L488
1553e486Q478l231k455J066j885N966M491j2224m613J4747N538j0328m288K943
1567a281M989O186o226j3863R550J7908q891j7081L937J1449L605m492j2076j985
1581h271J8282N019k0512q349J5181Q868m676j0576q139J0560J6736j0622k1380
1594a7879R073J9087l479j3781m938N192J3809J910j9008o709J9629P677j4100
1607c517q121M747Q474O363q371j4193R154J7342p270j4149N081J0285Q34k895
1621C764p005q31J3673L365j4474k262J1732M62o121n46j365K184O189o371r566
1636g172Q316P350r774l973N888J213j337r53n631L607J0058o393j1062P560Q700
$$ y = [-10152, -4695, 5563, 750, -4520, -2201, -3126, -340, 1506, -7016, -7297, 5504, 3454, -8974, -5486, 2992, -239, -2694, -1628, -3513, 2453, 6944, -5280, -9893, 4854, 10392, 64, -4224, -1281, 3708, 9894, 3668, -10195, -645, 17263, 8372, -8709, -4772, 6677, 10282, 5790, -6286, -8271, 10011, 15030, -5482, -13831, 1350, 10218, 5542, -5034, -13173, -2613, 14123, 3501, -17879, -8806, 10281, 6802, -6979, -11917, -6725, 7084, 8994, -10014, -16723, 2906, 10583, -3517, -11638, -6891, 1583, 7946, -425, -14618, -5464, 11878, 4608, -9541, -4460, 5825, 6659, 3764, -3241, -4072, 9601, 12966, -1508, -3770, 7962, 8424, 2303, 1757, 392, 2576, 8765, 2394, -7172, 1144, 8494, -1280, -5253, 635, 1848, 511, -442, -6073, -2466, 7592, 1199, -9863, -2303, 6397]
1651F397o742n168J673J154N254N35j2747k220J5668J560j3608k262P085M861
1665A440J308p976p252J2291J2808j2144j1698J0439R774k313m893n728K252J4339
1679A2647j77j8173j304J5772K376r253n755j339Q983Q220j1611j2950J1329J2304
1693A1069q370q155K113M581N273j048j1143o74J4014J058j2158p97M724Q87J387
1708B761l991p706O180Q270q987p679Q218L036m126P27q71j194N585J107p047
1723e717L342P515m673k981N996n20l393L599j334l019O429o96r914K563R412
1738F609m447o252K854J671J800K041o865k818J1886L469j1725j068Q054R95j255
1753D949k056n692L898R977p316j2514N739Q775m272n146l532k22Q488J792j3517
$$ y = [6397, -345, -5513, -3840, -2686, 2568, 3103, -9644, -11864, 3804, 5364, -8244, -10506, -3421, 1440, 2748, -5228, -12480, -189, 12619, 475, -11223, -784, 8990, 6677, 1784, -3944, -1692, 12647, 12470, -5703, -7007, 8765, 11141, 1888, -3867, -5206, 3777, 11997, 386, -12564, -1235, 11069, 2699, -5456, -3343, 1238, 6511, 5463, -5680, -6354, 7660, 8718, -3440, -4237, 487, 1374, 2761, -1230, -8936, -2756, 5514, -3473, -11152, -2934, 102, -4024, -3297, -4168, -5362, 223, 1330, -5717, -2375, 5140, 467, -2514, 3482, 2962, -431, 3168, 1834, -1185, 5244, 4548, -5366, -2803, 6609, 2162, -4090, -1236, 435, 2235, 4276, -2589, -5407, 6479, 9948, -1777, -2845, 5209, 6204, 4949, 2893, -2799, 1099, 11076, 3760, -8754, -3015, 5760, 1488, -3658, -7190, -7412, 1076, 2868, -10649]
1768a0649k533J3851K223q866j131K661K744N419l248q647N873J0748o131p275
1782d961L868L157Q56N22n887k795R525J544j0541R97Q512k004k841K199k152
1797aJ551O322l722n234O886L302o580k38L713k493J007K02o594J192P019o072
1813B60r159O465N319o238l221j03l57O183J326j0527J55J2459n27r278J165L810
1829b268L337L425o762p847R589J0096r749r266O807N965n10l587p416K592J3187
1844G593p72j4022J211J2545J419m833l269r96P729Q176r776j0134J0004Q700
1858A3575o839o310l53J565N606j438j1922m33J1307j862r274Q16L013J30K840
1873D21l228o807O215Q117o702m670N289J540j229J496l169k183O505Q21q066
$$ y = [-10649, -13182, 669, 2892, -5974, -7105, -4444, -1700, 3719, 471, -8176, -2303, 8445, 2314, -4961, -1093, 2064, 2920, 3442, -2445, -5240, 4285, 5829, -4712, -3715, 4797, 2793, -48, 2151, -1, 1550, 7872, 4150, -1084, 5802, 9104, 2524, 2286, 5999, 3506, 4513, 4715, -1879, -687, 6332, 260, -8899, -2434, 2885, -3353, -6574, -6677, -7034, -851, 475, -10052, -9897, 2562, 2035, -7243, -6078, -2268, 1069, 4494, -2268, -10115, -526, 9570, -179, -9445, -2638, 3327, 2817, -770, -8186, -5594, 7593, 6821, -7201, -5990, 6555, 7974, 3141, -128, -1124, 6605, 14781, 5005, -5129, 4875, 13575, 6736, 426, 73, 1638, 7244, 5806, -6116, -6549, 4758, 2896, -6378, -5562, -2549, -2419, 421, -2807, -9614, -3399, 4718, -1984, -6654, -1365, 175, -1054, 442, -2727, -4910, 1595, 2416, -5650]
1888e650J777M793l984p78L972l170j198N327k490l104N802J332m667L402M410
1903E774l849m99L292j688J214L976n915l666P789J337q751j11M559j722J13j471
1919C82n971L446P560n165p257N730M556l057q50j783r22P761J847j0467j838
1934f028R752K7o432o96P56J137L512n245o762O436O341o261l649M333O64k27
1950b342K276l459J50Q027M9q153K768O236k595j211K078j556J317K282n903k840
1966b876Q309O15p663J432L082k669O26K84l995L559O583o228o822O675M118l568
1982A462j208j188J00O053j471j1217J193J1423j430q635j092J169K489M354p252
1997e250o820J0112Q393r385p377N046N852L859k599q951K047J3190j162j3182
$$ y = [-5650, -3873, 920, -3064, -3842, 130, -3040, -4238, 1089, -1401, -4505, 1297, 2629, -2038, 1364, 5774, 1925, 1426, 4718, 3030, 4244, 8220, 2305, -1361, 6428, 7765, -986, -1097, 3462, 1740, 1853, 382, -5589, -2143, 5417, 252, -7005, -1275, 3281, 224, -626, -2409, -3331, 4430, 6277, -4190, -6028, 3724, 3751, -2681, -3377, -2621, -1484, 2028, -3217, -9979, -3543, 2798, -3463, -7112, -2779, -2115, -2342, -66, -3525, -3375, 4652, 4701, -3452, -684, 5552, 2957, 1746, 3824, 2268, 3585, 5867, -36, -2876, 5433, 6048, -1615, -183, 2899, 230, 856, 1140, -2855, 704, 7287, 1059, -5763, 912, 5030, 1462, 254, -934, -834, 5219, 3748, -7469, -6276, 5147, 3717, -4918, -6010, -4841, -2352, 2002, -5250, -12070, -1958, 6435, -2950, -10327, -5281, 571, 4430, 1831, -7120, -5073, 8117, 6955, -6227]
2011f227J022J0995K113l753o499l314Q401Q209r518q671Q512P177m668n443j641
2026c305L309R448o70j3100k27J1692%p471m67K110K602K388o579p438O816O857
2042E965o635m400K449L31j86J427m960j611Q967K14q375Q66M720j529P03J883
2058a71k738J257L953m143k747N917J483m034J966J077l673J726K332l513J883
2073E75M955m669l640N629J030l909J934J446j598K776m54o509K636P423l774
2088C851m889K877M00j588J757l060l309N972K923q095k120M939L54j261Q44l751
2104d156P0O581k771p197M575N069l165j178J238k785J797L884l722k537N618
2119A321n78m085K208J239k435K487K628m600Q67L795l472j028N431j455m064
$$ y = [-6227, -5205, 5790, 7903, 4150, -2349, -5663, 2738, 10947, 1429, -7242, 1270, 8447, 3779, -1664, -3305, 4, 9452, 8782, -4318, -4545, 7147, 7147, -324, -791, 1319, 3921, 6309, -270, -7708, -892, 5965, -670, -5070, -2621, -2290, -2476, -1049, -6009, -7620, 1347, 1561, -6814, -5948, -1228, -2757, -2054, -171, -2909, -1652, 2301, -1842, -4589, 1328, 2811, -1223, 743, 1820, -1853, -127, 2205, -1308, 575, 5530, 861, -2779, 2850, 3880, -29, 1905, 3351, 1753, 4529, 4075, -2434, 202, 7625, 3851, -1038, 1839, 2239, 651, 2408, -652, -3961, 2011, 4934, -3161, -5281, -342, 12, -1249, -405, -4156, -4086, 2495, -276, -7473, -2898, 2171, -994, -2172, -934, -3719, -1922, 1962, -1760, -4297, 1321, 743, -3342, -1134, 105, -2330, 157, 2785, -1815, -948, 2847, -625, -1653, 3778, 2323, -1741]
2134a741L307K342l274R38R33k357K825L049o449k289O616M51m125K33q50L01
2150i0M443j912q340K868Q672l251o331Q41J705K643K021p364m362R806M495q613
2166b769m308M300L054K072k407p727K654J1197k166j0752R29P698J372j303n150
2181c306k942Q321O408r668o146P787N447k596l418k745J235Q311k45j0352J71
2196c738R875q6n512k115L15M055M503n823p372O266N443n730l086K230m9K410
2212A586J228o945j684P489L07n914J684K222j606J337L5m031K787M574m174k305
2228c410M470j683l061L909Q73k964J564N52l442K231L155m227l38N302j059l525
2244a653J507K98k31M569o56o411L015N791m720l210L402Q82J53J084n210l007
$$ y = [-1741, 1566, 3908, 634, 1572, 2505, 148, 2973, 6022, -427, -2716, 3900, 4351, 226, 459, -391, -90, 4353, 2441, -5899, -3031, 5641, 2390, -3941, -3100, -1395, 1248, 3269, -4095, -8457, 1349, 5844, -2769, -7077, -2777, 277, 2349, -58, -7785, -5131, 6066, 3900, -6852, -5923, 1775, 3147, 1844, -3306, -6248, 2073, 8481, -1187, -7333, 454, 5901, 3305, -113, -2858, -1623, 6688, 6443, -3909, -3738, 6137, 6051, 539, -1576, -1261, 2794, 7297, 1474, -5898, 368, 5811, 81, -3005, -775, -824, 1586, 2814, -4131, -5815, 1674, 1981, -3933, -2249, -27, -1633, -296, -261, -4292, -1505, 3069, -1105, -3410, 1060, -623, -3684, 225, 1098, -1866, -302, 250, -3192, -961, 2194, -2033, -2371, 2931, 1872, -1653, -146, 152, -79, 4490, 3834, -2577, 438, 6229, 1509, -1701, 1701, 2583, 2736, 3820, -1390, -4397]
2260d397P167K102o514o84L682j241J13k24m445J900P357k866o852K604L640j344
2276bJ72p07k426L431L476o354l382N822J273k389P52j834k330M755J204n442
2292c981J034N137j836j900J835k122k29N627p14m193K066J305k331J757J422
2307B877m544J318N655l400m822K697O95J30K783k277n353M200M501m012k688
2322b240K898J067J401P97o410j757Q804J503p732j472L811N40N94k751n501L584
2338b864Q142m553q130K246M912O97l58m038k233P635L858q842l336P662L463
2353D261k305j694l584J640P734j753q667J650P290j137l945r80j577M377M946
2368F256n811n946O144M674m541j548J274L0L608P15o652o83O249l45l954R73
$$ y = [-4397, 2770, 4872, -1642, -2326, 1356, 115, 228, 4, -4441, -2541, 4816, 1950, -4902, -2298, 1342, -2, 170, -537, -2963, 468, 3944, -2410, -5792, 30, 1303, -1086, -334, -2168, -4498, 257, 1461, -3981, -2947, 2190, 354, -1546, 289, -1833, -2062, 3565, 2851, -1342, 724, 2029, -302, 1455, 2877, -1667, -349, 5306, 1906, -2916, -219, 476, 606, 3389, 1112, -4241, -41, 4460, 448, -2240, 658, 1725, 3126, 3923, -2487, -4244, 4560, 6063, -1669, -3141, 670, 1210, 1804, -947, -6448, -2864, 5278, 725, -7405, -5159, -247, 450, 92, -3946, -6179, 1456, 5314, -3528, -6864, 798, 4261, 1956, 262, -3322, -1682, 6052, 4299, -4368, -2718, 4572, 3435, -510, -1490, -3067, 1310, 6256, 445, -5501, 643, 5317, 776, -772, 502, 532, 4140, 4855, -1797, -2480, 3769, 3424, -530, 443]
2384D43j10j361K681q75n326K566M173l778k218K986j359j127L873j144l056K929
2400g03J205k993K087K000l899J327M660l109k983K816j77q64K893k214m211M482
2416C17L594m895j875L078L05Q53R51m237q71P568O19o693M60M167k13K28j237
2433B119m554K762O241m601n942L177K645j341m69k679k315N914K606p595j637
2448e669N284J413k313R34k534k08O486r03o526J377N287j404j571J97k584J694
2464a040M778l525m945M159K323k829R76n9k428L257L557m452k207M220R79j522
2480A242J567k197k067N268J284o035l09L324r03j17R91m385l17O050j353o075
2496d032J362L730r20J127j640m393M206O065n407m788M251K694r31m82l148k193
$$ y = [443, 333, -1028, 1653, 778, -4548, -1982, 2191, -1587, -3805, -819, -2178, -3305, 568, -576, -3632, -703, 502, -2491, -404, 1596, -2303, -976, 3684, 575, -2408, 408, 231, -633, 2260, 46, -4165, 317, 3911, -984, -2859, 219, 524, 1377, 2328, -1909, -2780, 4788, 5407, -1286, -826, 3341, 3128, 3356, 2119, -2435, 327, 6568, 1967, -3975, -798, 1847, 506, 37, -2642, -4957, 957, 3563, -4032, -5669, -385, 1028, -1285, -351, -2885, -3093, 3393, 2490, -4036, -2659, 2628, 1224, -347, -150, -2734, -1040, 3738, 213, -4732, -573, 1750, -1079, -103, -162, -2590, 667, 4224, -228, -2435, 1785, 2764, 1242, 2809, 612, -1455, 3813, 5097, -938, -1247, 2077, 1174, 1057, 2048, -2337, -2654, 3396, 2043, -4032, -2670, 1060, 140, 1267, -373, -4766, -560, 5505, 98, -4690, -439, 2255, 1324, 842, -2306, -4499]
2512d499O592K546q287k010N375J519j787j066l027J736P157l102p526L507O127
2527C255j272j659r92j546M150M488n736m508O173L191l863j010q62o97M900M05
2543D417p227j14O227j243l197Q72o94K74L902j840n317K957L934k807j131J519
2559E32k123J054L072l080l338L972Q21l021J151J66l371K652L124l886j583L856
2575bl78j279K662j920k172M769J706m931J08L302r99O48Q34l734K16O085j701
2592C214n720J784L053p39N34j565l666L845M737n054m112M676J799j190J3k971
2608a362j476O096J771p850j019N183K69j766q54k465P66O026l138o486K639M595
2624I29j686o69n13k362L490M119m812l573N480K366k529J27j585o54M616J568
$$ y = [-4499, 2093, 4639, -3648, -5658, -283, 1236, -551, -1617, -4644, -2908, 4249, 1147, -6379, -2872, 3255, 1983, 324, -668, -2214, 1936, 6424, 688, -3820, 2353, 5544, 1681, 671, -191, -888, 4012, 4417, -2810, -2924, 3303, 2060, -1137, -265, -959, -685, 3217, 1377, -3940, -983, 2951, 144, -987, 532, -1591, -537, 2535, -545, -3883, 89, 910, -2111, -960, -794, -4165, -1513, 1611, -2275, -3858, -2, -380, -1659, 1003, -917, -3089, 1680, 3386, -1545, -1437, 1865, 866, 1514, 2348, -1386, -1170, 4915, 3214, -2506, -722, 2331, 1592, 2126, 561, -3105, 740, 5477, 423, -3689, 987, 2786, 1596, 1609, -1362, -2838, 3258, 5029, -2821, -3840, 1343, 1612, -154, -1008, -3473, -2707, 3319, 181, -6305, -3666, 929, -757, -1426, -1939, -4301, -811, 3308, -1504, -5077, 403, 2769, 240, 367, -1218, -1872, 2744, 4312]
2640D312n950m40N406j326j926J346j850k47N254j551n723J970M071k140m87N72
2656A291k610J788M327l816m040L595K111k285K44r34l040M044K529n538k108
2671d442M832Mj888L50j943n69N367o7o227J158M346j308o14N19k375J470N116
2688C729l054n503M315L458k164n33n52j561L594K297n349j767N492O44k382L26
2704I90r04j198N018K53o088J065M699j544k176J139j994M73M189k080n302L134
2720c26K785l310L88M74k698J652L657m554k463M042O44k238J242p91k706M043
2736a59K313n113l28L615o45q30J598k780o16N593J60o027J591L801j070m2J16
2753A177l560K564N176l677m723L571L053j778M32j624k275M557K939o472k076
$$ y = [4312, -1638, -2078, 3328, 2002, 76, 1422, -428, -675, 4579, 3028, -2695, -725, 3346, 1206, 719, 1291, -1319, 469, 4796, 980, -3060, 535, 2646, 361, 605, -329, -3369, 675, 3204, -2334, -4442, 390, 394, -1494, -1144, -3087, -3656, 1711, 1644, -4583, -3425, 921, -387, -1001, -482, -2857, -1387, 3729, 675, -4828, -513, 2945, 781, 248, -304, -1865, 1729, 4026, -1323, -3090, 2402, 3046, 664, 990, 86, -1112, 3906, 4159, -1929, -864, 3835, 2291, 115, 1254, -740, -267, 3922, 1842, -3460, -326, 2459, -851, -463, 11, -2687, -1035, 2622, -1932, -4395, -353, 291, -1947, -705, -1496, -4202, -159, 2154, -2959, -3287, 328, -317, -1147, 451, -2329, -2945, 2648, 2808, -3219, -1628, 2173, 1103, 1061, 1177, -2383, 181, 5357, 1680, -3043, 528, 3581, 1803, 2235, 611, -1664, 2893, 5832, -640, -2716]
2768b716M819J043k219j22k172j53N255j170o540J555M713j892j689l77j738K179
2784a224M097m068n022M929L147l316j086K88q76L306K093n311j518N218R51k838
2800a230O63j74n48L923k40n481J960M861j902j436J189j627L43L403j535l978
2816a809L619K242l177J83J006k322J406L435m124k417M218m86k377J988r36k675
2832b226L021J681n005l32L265r26r73J265k895m78M402p05n009K068L476j717
2848a088j74L86k850K068M552k931l936L483J876k028R91q41j935M437K209n830
2864a611j259N151L04j575J114j971o10M767q86n783K194M328j485j824L48k237
2880a035J567M058l330m247L497K374l316l25j47j736K765K529n401j195M225
$$ y = [-2716, 2103, 3146, 927, 805, -1367, -1520, 3735, 2565, -3975, -2420, 2293, 401, -1288, -1665, -3403, -1224, 2873, -1195, -6217, -1288, 1859, -1457, -2543, -2255, -3131, 175, 2268, -3043, -4561, 657, 1608, -1230, -567, -741, -1289, 2634, 2394, -3087, -1127, 3734, 1832, 396, 1585, -42, 301, 3704, 2169, -1809, 1810, 4052, 875, 1058, 2064, -258, 1148, 4583, 459, -1958, 2260, 1774, -603, 1385, 449, -2226, 795, 2476, -2529, -2861, 404, -522, -1495, -230, -3125, -3603, 799, 94, -4915, -2847, 629, -1088, -1262, -876, -3726, -1658, 2894, -37, -3973, -490, 1386, -642, 349, -492, -2427, 2010, 4219, -1611, -2870, 2281, 2585, 1010, 2124, 153, -457, 4310, 3424, -2359, -165, 4163, 2678, 854, 1202, -1035, 532, 4590, 1260, -2987, 510, 2884, -432, -757, -904, -2640, 125, 2654, -2747, -3942, 283]
2895B83j18k128J148r88j214M177m03m994J440L897j714o85J282k240n57M576
2911A762j800l725L302K544k830L40M48k299L027L548m192k466M388L78j864J610
2927B171q41j839M005J398n378l59M247q11j257R72k816j45M365j771n305K451
2943i13L201k462m73L49k736J957L980m007l314M116J102k481J58n21j452L628
2959A32J830n479o19M517j69k333J168p77p21M415r84n175K685M658k531o69J154
2976A102k011J499L507k933l034M491J345l241P54N03j925K291K219m637j514
2991a584M564p23k817J615o68j681L623l51m562J290L488k434r38J767k342L39
3007a414L080k212l341K875J652k797M30Q96k443J607K681l488j573L780R8k364
$$ y = [283, 165, -1963, -815, -1803, -3017, 1160, 757, -4237, -2797, 1100, -614, -1299, -17, -2257, -2814, 1762, -38, -3763, -461, 2083, -747, -407, 41, -2258, 769, 4317, 125, -2341, 2047, 2425, 561, 2171, 1330, -509, 3496, 4894, -484, -843, 3404, 2593, 1336, 2308, -508, -653, 3712, 1941, -3364, -913, 2288, -174, -647, -298, -3034, -1077, 2903, -1104, -4418, -302, 800, -1681, -1523, -2044, -3496, 132, 1962, -3517, -4136, 381, 212, -2121, -953, -1730, -2451, 1964, 980, -4195, -1510, 3148, 617, -52, 1102, -909, 590, 4097, 1164, -1870, 2621, 3966, 725, 1479, 1982, 57, 2348, 4567, -70, -1584, 2980, 2257, -560, 1055, 387, -1294, 2329, 1978, -2584, -1294, 2194, -240, -1178, 589, -1753, -1414, 1666, -546, -3887, -1012, 640, -2157, -1727, -831, -3274, -1667, 1014, -2474, -4047, -267, -169, -2533]
3023b533K249j71k270L629J485m113M46L325j176n30K048k201p17M043m88m557
3039a531K490K132k099O73L32k782J134M183l471k963K949J503k362R41p08k250
3055a829L255J854m375j401L741o31j520P48k161p77M290q1n171J360L081j708
3071a325k42P73k566J326M442l169l210L566J749j881N14n52j521L068K178m368
3087a218j427M924l50j832Q95j202q94M110N3m753J227M085k037j105J263j981
3103b42O61L778k641l702L400K051l139M04O24k780J732K152l420j801L928m17
3119E88k478J244n99j816K859J162m734R21L514j632j277J783j651k66L653j156
3135A15l854K826K230k434K01J642k280J338L072l264j908L911L06k123J869l44
$$ y = [-2533, -284, -455, -2725, 904, 2389, -1724, -1278, 2047, 871, 341, 2389, 188, -529, 3514, 3026, -1531, 959, 3091, 992, 1665, 1997, -785, 349, 4532, 1061, -1902, 1047, 2550, 188, 1129, 421, -1829, 1426, 3280, -1095, -2496, 1245, 614, -906, -158, -2319, -3096, 1194, 1113, -4058, -2698, 383, -1325, -1567, -794, -3360, -2034, 2408, -761, -3971, -405, 1344, -537, -23, -575, -2096, 972, 3150, -1218, -2645, 2279, 1929, 97, 992, -210, -1104, 3006, 3059, -1694, -467, 3618, 1581, 476, 1739, -242, 419, 4197, 1556, -2146, 1254, 3305, 166, 570, 1194, -1586, 146, 2298, -1122, -2923, 1005, 588, -1890, -646, -1245, -3061, -202, 960, -3774, -2853, 661, -971, -2248, -465, -2116, -2382, 1271, 115, -3739, -913, 1317, -1117, -916, 726, -1554, -216, 2856, -408, -2316, 1595, 1901, -222, 1647, 1303]
3151A303k193K683J699l659l73L483j167j165J940j978j041L425j8m097J279J970
3167B091j855l04R64k329K35L663k612l392L069J029k209J207J8k518K361K176
3183A594m300n36L454l71j561J789j466j857L743L94l586J032K724j874P6J421
3199F76k121K12L872j543l234K565J731j776J243L87l228K150L542l806k002L690
3215B358J42j375R57j322k113L536J130m780j65L692j263r50R75k250m20M360
3231B512j372m784K302K518k205K15L45k820K061L254l381k928L565J096k208
3246a830J202p58j381L145J429m651j2L953j77j590J367j597k40M066q32l853
3262a759J668L087k466O3J152j682L81L389k840k661L475O89k316R59j15j834
$$ y = [1303, -890, 1793, 3492, -167, -540, 2943, 1776, 611, 2551, 573, -468, 2957, 2939, -1158, 121, 2091, 236, -68, 896, -1433, -1198, 2465, -147, -3539, -470, 559, -1650, -443, -425, -2943, -582, 1594, -2706, -3242, 212, -159, -1720, 69, -1397, -3254, 489, 883, -2703, -1671, 1053, -821, -745, 676, -1445, -1233, 2639, 1096, -2138, 427, 2158, 382, 1625, 2012, -1216, 934, 4476, 670, -1332, 2358, 2500, 1125, 2082, 760, -1353, 2183, 3313, -1467, -1632, 2060, 797, -153, 822, -1428, -1848, 2512, 1140, -3644, -1342, 1176, -1029, -814, -469, -3289, -1228, 2026, -1355, -4283, -718, 378, -1830, -628, -1386, -2767, 378, 1807, -2844, -2856, 1097, 920, -670, 697, -900, -1140, 2926, 2094, -1759, -91, 2996, 530, 593, 1745, 63, 444, 3833, 993, -1668, 1807, 2496, 180, 1139, 1024, -810]
3278h10K180J352l727o89L290p58j304J435j184j873L093J95l780J256J932j958
3294a350o2J638k285m48M060j810l143K090J368j803J317N31l155K024L109l237
3310a156j456K992L03r22J497j309j992L892J405m612M81L242j021k89J257k560
3326b48l44M198j151m037K107K089j817L74J05k322J444L054l253k397K875M33
3342A110j882O89l82k013K935J074m076J44L001j103r36J100j675m14L323p85
3358A10l593K334J956k184L62J173k076P53L360k556k040K905N24j912J902l94
3374F24j868J905K613l222p92K699r79l83J648j710j458L189Q74l635J35K183
3390A823j227K81P55k873K88M181j623l994J865J513j376Q15r09k503K368L040
$$ y = [-810, 1370, 2722, -1005, -1694, 1596, 838, -466, 969, -215, -2088, 1005, 1200, -2580, -1324, 608, -1350, -1412, 226, -2059, -2507, 1553, -257, -3400, -1310, 58, -1745, -428, 103, -3052, -1028, 2081, -1156, -2612, 380, 683, -239, 1258, -51, -2043, 1849, 3254, -1358, -877, 2365, 1344, 1055, 2312, -248, -592, 3606, 2455, -1582, 525, 2614, 797, 1171, 1276, -1046, 398, 3452, 199, -2198, 677, 1110, -772, -83, -465, -2478, 457, 1531, -2545, -2401, 600, -503, -1439, -339, -2014, -2428, 895, 110, -3483, -1149, 807, -1377, -1015, 158, -1918, -1165, 2195, -361, -2401, 504, 1028, -884, 1018, 624, -1244, 661, 3274, 52, -740, 1959, 980, 597, 2245, 535, -923, 2266, 3140, -495, -360, 1823, 596, 877, 1632, -1241, -953, 3228, 1605, -2389, -524, 989, -387, 428, -481, -2984, -616, 2424]
3406B424m047j857L031N62j129O90j387j432M134K22m628N95L464q28r76J251
3422H9k057N33L982j728l598K563K239j700k6K84j934K363K378l250j570L524
3438B092L47k317J239n33j416K633O17l787J65L203j186j238J678j362r84K720
3454A871o22l304J698J236k028P65Q77k823P21K939j737k061K049J72j328J361
3470b14k10l012K633K378l104p17K123j16k70J379k026j083L808O66l778M11K028
3487H96k32M23L65k514Q24L774j737l256K163J343j058O89p24k664K736K940l730
3504B38j985K788M83j278J136k070j312L786P38m383k7K708j133j68K87k084N76
3521a700L502j878l565K237K199j714J15J76k049J887K499l033j505L259K04j442
$$ y = [2424, -1623, -3480, -449, 113, -1016, -326, -1713, -3145, 989, 1211, -3417, -2822, 642, -186, -1162, 89, -1968, -1435, 2547, 819, -2779, -216, 2023, 323, 297, 581, -1353, 1010, 3388, 138, -1432, 2092, 2439, 122, 1361, 828, -588, 2045, 2662, -1125, -960, 2243, 1057, -181, 1497, 135, -849, 1871, 1249, -2055, -357, 879, -1149, -384, 493, -2330, -1609, 1330, -407, -2468, -419, -247, -1575, -214, -424, -3436, -803, 1575, -1529, -2246, -123, -239, -509, 870, -1156, -2239, 1569, 2235, -1543, -1132, 896, 664, 1087, 1452, -1062, -238, 3536, 1799, -1457, 706, 2049, 991, 1680, 956, -1708, 1028, 3968, 238, -1747, 1041, 1524, 246, 1382, -688, -2000, 1786, 2524, -1859, -1886, 822, -311, -479, -192, -2276, -1700, 1802, -76, -3641, -1404, 795, -919, -804, -628, -2677, -790, 1709, -1324, -2829, 430, 634, -808]
3537h08J100r92j127L213J175l733K39K927r46m32P89j597n12L758p21l304J212
3554B41J960j265J81M54k486J411K755k086l007K437Q65j580J333j299k113K731
3570E32J740l659q74K415k19o64O73j926m44L535k23m249J297K798j496j76P06
3587b34k379J577K931k061l058K719J567j669R49o10j530K640K146l507j035L178
3603A624J54j274N76o62q38K910L37l951J141K754j676l06R60j902j90L135j621
3620A171k669K206N15j865O05N03k478J643K256k778j630K349L0r42J411j489
3636a162k007L061J305l516m1K489q54N5P90j887o35L949j88l501P82K499j176
3653c7M65M91l006J912L747k668k716K291J228q66J010j425j674L290J867m067
$$ y = [-808, 292, -700, -1827, 1386, 2561, -1172, -933, 1994, 1048, 616, 1405, -192, -704, 3054, 2333, -971, 241, 2201, 936, 1117, 1571, -915, 496, 3251, 1165, -1842, 595, 1460, -120, 1213, -86, -2199, 532, 2272, -1387, -2261, 154, -65, -729, -56, -1982, -2426, 1109, 886, -3363, -2066, 732, -764, -940, -234, -2613, -1036, 1895, -166, -3224, -505, 1062, -607, 342, -268, -1798, 842, 2988, -519, -1554, 1624, 1778, 504, 1080, 418, -420, 2490, 2827, -1124, 17, 2771, 1095, 789, 1749, -153, -343, 2792, 1171, -1498, 708, 1223, -642, -37, 466, -2012, -369, 1887, -891, -2521, -172, -142, -1084, 327, -1162, -3169, -108, 1197, -2319, -2360, 129, -725, -670, 120, -1767, -2402, 1547, 1359, -2142, -1360, 1139, -37, 428, 919, -2087, -175, 3572, 904, -1812, 479, 1707, 841, 1851, 426, -1248, 2042, 3909, -158]
3669a58j237L138l0n19Qj835k36L691o66m247J032K693j372l58j85j984J418L367
3687B520l098k869K860J221j760K97m48j220K506J393l575r16L471m93q77R84
3703dr99q16K604J00l183J427K433j313m3P55j572J09L200j342k311J907R15j620
3721B47J106j01k107K084K417l147j707K042O72r46Q79j531j410K819N75l256
3737a364o02L064o00n67O09k588Q4L697j147l387J318J938j372N6j14j730J943
3754g62K533k661k258K610J016j412J026j101j124K963J361l954m64L611n16p04
3770A64O95j149l60L416j016l307K000J971j801k2K53j051R28K327k494j615J839
3787G78P53k092R88K75j459J396J466l410j97J992n78r13J405j299j542K752M43
$$ y = [-158, -1395, 1743, 1713, 1194, 1202, -633, -869, 2822, 2156, -2091, -1059, 1634, 262, -96, -281, -2265, -847, 2520, -578, -3447, -587, 634, -1126, -829, -1277, -2497, 9, 1402, -2173, -3089, 382, -111, -988, -4, -1003, -1819, 785, 885, -2298, -871, 1562, 249, 206, 961, -611, -502, 2698, 1356, -955, 952, 1867, 247, 1353, 1252, -855, 1229, 3646, 499, -1208, 834, 1506, 560, 1439, -92, -1502, 1317, 1892, -1364, -1966, 1098, 498, -69, 540, -2048, -1964, 1733, 586, -2801, -1483, 455, -917, -861, -975, -2705, -762, 1771, -890, -3148, -538, 478, -934, 92, -1009, -2133, 830, 2191, -1763, -2227, 1384, 868, 164, 859, -290, -650, 2766, 1750, -1557, 443, 2414, 613, 591, 844, -207, 721, 3048, 554, -1061, 778, 1531, -561, 427, 702, -757, 639, 2105, -1305, -1502, 490, -88, -1001, 404, -895, -2437, 315, 758]
3804G58k950M19J541r27N31L55k448L22L937j120l222J784J565j048J086p94k106
3821b317K632K405k656k241K811K79k94Q29j704n60L170N55l913j48K795L20r58
3838A005J24j993P24L563j685l734J994K205j711P1q41j274J736K250l215k122
3854b903L208P44j828L25r56p42K954L98l982L75L259j020j271R11j170Q8K793
3871A183j017l134K292J853j906M4J021j613Q90K601k194j509K346O35j545J083
3887A030k69j367K192J286k957n27K254n01o75J334j621r21L077l03l182Q78J687
3904A415r39l71M81k456R74K987k063l228K613J180j302N79r42j634K548J460
3920A302l100j026L064j19j216Q46j408p00L393J15l507O18K615o55j98L18j500
$$ y = [758, -2192, -1773, -232, -1159, -628, -273, -2721, -2399, 1538, 418, -2804, -1020, 545, -503, 583, -211, -2317, 315, 2720, 64, -2177, 634, 913, 619, 1448, -256, -816, 2354, 2909, -1004, -1152, 1643, 1963, 1005, 1129, -864, -140, 3423, 1738, -1996, -2, 2203, 492, 563, -278, -1552, 184, 2434, -781, -2903, 305, 1049, -779, -454, -1410, -2152, 802, 1200, -2782, -2407, 852, -168, -1439, -528, -1698, -1610, 1183, 166, -2968, -676, 1177, -729, -685, 336, -1277, -387, 2214, 20, -1489, 857, 1492, -53, 1030, 761, -606, 1586, 2872, -85, -612, 1642, 1141, 466, 1800, 179, -742, 2335, 2032, -1150, -272, 1415, 476, 105, 586, -1870, -896, 2091, 28, -3200, -587, 593, -709, -130, -1072, -2706, -158, 1302, -1798, -2824, 240, 121, -1095, -249, -1657, -2357, 1036, 1151, -2356, -1738, 877, 222, 24, 342, -1158]
3937a158P80K937j444k994K363J692j138j94j4j083J835J422k911r55K538J23
3953A799j282N26m26j270K487O0k859L64K135j308q21J154j689K1K159p57k676
3970b383J736R56j531N84O84k268Q61K444j935j854K335L37j057J199q19j786
3986b497K415J532k474p02K405M4o18Q40j515n34L540m28l196N12K367q19K6K82
4004A180j775J061L019k489k831K409J590j258K86p56j618K151J703l490j235
4019b053L330j91j471J8p94j17K584k59l645Q99K511j459p69N90j047Q61K433
4036A421k045k764K582J532j394K62K55j542J490J964k958q02L015Pj232J034
4052H25m21j376K245P33k869O19K352j129l82P78j511j31K837r10k776J493J366
$$ y = [-1158, -378, 2559, 1115, -1879, 484, 2176, 1038, 844, 830, -253, 1582, 3004, 93, -862, 1676, 1799, 517, 1043, 617, -653, 1834, 1894, -965, -601, 1534, 226, -595, 559, -1130, -1109, 1050, 293, -2383, -647, 309, -1222, -638, 46, -2222, -1361, 1083, -852, -2706, -371, -34, -1091, 108, -711, -2497, -82, 1450, -1024, -1726, 679, 723, 105, 945, -570, -1104, 2436, 2008, -1188, -676, 1691, 872, 898, 1180, -595, 466, 3485, 996, -1835, 574, 2164, 906, 1192, 436, -1182, 969, 2672, -818, -2053, 1277, 1086, -385, -367, -1161, -1278, 1306, 1047, -2598, -1699, 812, -647, -1416, -826, -1873, -1012, 1421, -624, -3388, -806, 726, -668, -406, -151, -1693, -203, 1761, -1197, -1999, 1016, 1023, -209, 825, 404, -972, 1273, 2006, -863, -244, 2108, 979, 597, 1375, -136, -267, 2570, 1660, -1116, 377, 1743]
4069A743j499N36M44k340J390J885k164j758K072K85j184J049j250j667K674R95
4085A211k962o02K615m63p47O03j825K55L339p60l268J041K220r80k47J30j048
4102a488J409J941k287k002K766J371k011J281n14j112J970J087l144k40L253
4117B280o05j229Q13j224j10K160m59k563R65J961j433o37P48j420N26K191j870
4134I4k141J728R96j457N19N02k053J362J690k602j046K753l47j039R34q91j307
4151b305K107J009l001Q10K050r25n97J333j673pL195p24l091J668J360j086N65
4168F88J00j436J524K391k863j835K635O02j226O04p14j361K625J041l677k56
4184a158K860p09p99J90j176L13K435j428k244J290J616k010R1L96j475J106J843
$$ y = [1743, 244, 780, 1224, -1116, 274, 2159, -5, -1763, 309, 594, -590, 459, -791, -2458, 216, 1211, -1751, -2353, 262, -201, -948, -345, -2170, -1915, 1424, 664, -2604, -1563, 657, -323, -570, -440, -1488, -79, 1862, -425, -2427, 339, 1710, -301, 980, 466, -646, 1324, 2411, -733, -973, 2280, 1675, 446, 1259, 35, -75, 2085, 1626, -937, 28, 1989, 556, -81, 667, -753, -227, 1964, 94, -2047, -319, 677, -780, -261, 241, -1812, -450, 1240, -1362, -2408, 345, -2, -1041, -107, -998, -2305, -198, 811, -2190, -1380, 670, -255, -852, 481, -1192, -1199, 1996, 1272, -1819, -151, 1209, 123, 688, 788, -648, 876, 3267, 404, -1431, 1204, 1806, 580, 1184, 470, -891, 1734, 2775, -902, -1158, 1702, 993, 194, 384, -792, -479, 1956, 528, -1716, -426, 1190, -820, -729, -333, -1808, -702, 1141]
4201A141k393j611K773M18j683O52J6j362J911J296k951j02K799j057p65J084
4217A66o05m41K306j21k532J132J789j386j95J319j549J56K643j616k177J842
4233G31J039j593R61j88j544J194K141k813j343K602l79q76R31j094j374K373
4249G68P63l190J84J899q01k60N79j802K6L197j424k875J793J432j398N14P3j497
4267b019J663K132k512j285K210P94j306M61n01o75K378O04l187O34K307q51p52
4284I5P55q80O0K332r94k712K177J773k095o8M15j256N80J818j901j487K193L93
4302A198k093J320m74j161J235J312l023j35K208q60p38J097j234p22K795l43
4318C82k559R12J631j183M19Q71j621L7K649j303k270K130R50j650J168J9j903
$$ y = [1141, -1252, -2863, -90, 328, -1355, -703, -687, -2049, -138, 1158, -1793, -1895, 904, -153, -918, 166, -439, -880, 1426, 1305, -1227, -95, 1694, 308, 113, 1432, -117, 39, 2682, 1066, -1111, 731, 1770, 177, 1138, 950, -594, 600, 2741, -72, -1415, 1187, 808, -68, 863, -231, -1605, 768, 1531, -1659, -1475, 424, -377, -637, -58, -1860, -1834, 1363, -61, -2936, -1143, 289, -1109, -595, -522, -2019, -356, 1776, -736, -2021, 189, 983, -323, 138, -363, -1038, 1340, 1944, -1243, -609, 1698, 847, 95, 850, -30, 30, 2362, 1368, -1344, 833, 2606, 511, 443, 858, -398, 182, 2000, 99, -1388, 805, 1198, -895, 425, -49, -1210, 25, 1337, -1686, -1821, 387, -473, -1211, -114, -1348, -2070, 725, 382, -2177, -1265, 366, -817, -398, 473, -1148, -1111, 1538, 235, -2035, 95, 1045, -605, 563, 582, -1321]
4335a321J757K013k615o99K255j03r83J348j387j006K699N85k895K19J827j051
4351F43J46q3j351N34K252j277k780J566J293j373K90M3j897J556J933k534j481
4368b520K952J15j593Q68n81q82J826O10k900K29K634p16r05J090j414j8J906
$$ y = [-1321, 436, 2449, -166, -865, 1390, 1287, 304, 1652, 265, -741, 1958, 2543, -352, -133, 1694, 643, 789, 706, -645, -111, 2141, 864, -1916, -350, 943, -430, -140, -97, -1994, -438, 1495, -1039, -2520, 432, 547, -1046, -178, -759, -1641, 185, 795, -2105, -1876, 758, 42, -863, 227, -1187, -1205, 701]
$$ [...]
8191B75
##END NTUPLES=NMR FID
##END=
