##TITLE=1H_EC-3202(II-5)
 CDCl3, 8 sc, 
 22.8.2019
##JCAMPDX= 6.0         $$ Bruker NMR JCAMP-DX V2.0
##DATA TYPE= NMR FID
##DATA CLASS= NTUPLES
##ORIGIN= UXNMR, Bruker Analytische Messtechnik GmbH
##OWNER= root
$$ XWIN-NMR		Version 3.5
$$ Thu Aug 22 14:09:16 2019 Russian Standard Time (UT+4h)  she@DPX200
##.OBSERVE FREQUENCY= 200.13155
##.OBSERVE NUCLEUS= ^1H
##.DELAY= (6, 6)
##.ACQUISITION MODE= SIMULTANEOUS
##.ACQUISITION SCHEME= undefined
##.AVERAGES= 8
##.DIGITISER RES= 18
##SPECTROMETER/DATA SYSTEM= spect
##.PULSE SEQUENCE= zg30
##.SOLVENT NAME= CDCl3
##.SHIFT REFERENCE= (INTERNAL, CDCl3, 0, 15.7039)
##AUDIT TRAIL= $$ (NUMBER, WHEN, WHO, WHERE, WHAT)
$$ ##TITLE= Audit trail, XWIN-NMR		Version 3.5
$$ ##JCAMPDX= 5.01
$$ ##ORIGIN= Bruker BioSpin GmbH
$$ ##OWNER= she
$$ F:/spectra/data/she/nmr/H-F/1/audita.txt
$$ ##AUDIT TRAIL=  $$ (NUMBER, WHEN, WHO, WHERE, WHAT)
(   1,<2019-08-22 14:08:06.70 +0400>,<she>,<DPX200>,
      <created by zg, POWCHK disabled, PULCHK disabled
       configuration hash MD5:
       00 E9 B6 7A A2 85 ED C7 34 08 36 98 17 FE 4E 26
       data hash MD5: 16K
       06 9D 37 39 F5 EF 00 93 61 48 C7 99 20 A0 A1 A6>)
$$ ##END=
$$ 
$$ hash MD5
$$ 34 2A 30 40 39 59 E2 0A 79 61 EE 93 CD 6E C3 D8
##$RELAX= 
##$RELAX= 
##$RELAX= 
##$RELAX= 
##$RELAX= 
##$RELAX= 
$$ Bruker specific parameters
$$ --------------------------
##$DU= <F:/spectra>
##$EXPNO= 1
##$NAME= <H-F>
##$PROCNO= 1
##$TYPE= <nmr>
##$USER= <she>
##$AMP= (0..31)
100 100 100 100 100 100 100 100 100 100 100 100 100 100 100 100 100 100 
100 100 100 100 100 100 100 100 100 100 100 100 100 100 
##$AQSEQ= 0
##$AQ_mod= 1
##$AUNM= <au_zg>
##$AUTOPOS= <>
##$BF1= 200.13
##$BF2= 200.13
##$BF3= 200.13
##$BF4= 200.13
##$BF5= 200.13
##$BF6= 200.13
##$BF7= 200.13
##$BF8= 200.13
##$BYTORDA= 1
##$CFDGTYP= 0
##$CFRGTYP= 5
##$CHEMSTR= <none>
##$CNST= (0..31)
1 1 145 1 1 1 1 1 1 1 1 1 1 1 1 1 1 1 1 1 1 1 1 1 1 1 1 1 1 1 1 1 
##$CPDPRG= <>
##$CPDPRG1= <>
##$CPDPRG2= <>
##$CPDPRG3= <>
##$CPDPRG4= <mlev>
##$CPDPRG5= <mlev>
##$CPDPRG6= <mlev>
##$CPDPRG7= <mlev>
##$CPDPRG8= <mlev>
##$CPDPRGB= <>
##$CPDPRGT= <>
##$D= (0..31)
0 1.2 0 0 0 0 0 0 0 0 0 0.03 0 0 0 0 0 0 0 0 0 0 0 0 0 0 0 0 0 0 0 0 
##$DATE= 1566468485
##$DBL= (0..7)
120 120 120 120 120 120 120 120 
##$DBP= (0..7)
150 150 150 150 150 150 150 150 
##$DBP07= 0
##$DBPNAM0= <>
##$DBPNAM1= <>
##$DBPNAM2= <>
##$DBPNAM3= <>
##$DBPNAM4= <>
##$DBPNAM5= <>
##$DBPNAM6= <>
##$DBPNAM7= <>
##$DBPOAL= (0..7)
0.5 0.5 0.5 0.5 0.5 0.5 0.5 0.5 
##$DBPOFFS= (0..7)
0 0 0 0 0 0 0 0 
##$DE= 6
##$DECBNUC= <off>
##$DECIM= 24
##$DECNUC= <off>
##$DECSTAT= 4
##$DIGMOD= 1
##$DIGTYP= 9
##$DL= (0..7)
0 120 120 120 120 120 120 120 
##$DP= (0..7)
150 150 150 150 150 150 150 150 
##$DP07= 0
##$DPNAME0= <>
##$DPNAME1= <>
##$DPNAME2= <>
##$DPNAME3= <>
##$DPNAME4= <>
##$DPNAME5= <>
##$DPNAME6= <>
##$DPNAME7= <>
##$DPOAL= (0..7)
0.5 0.5 0.5 0.5 0.5 0.5 0.5 0.5 
##$DPOFFS= (0..7)
0 0 0 0 0 0 0 0 
##$DQDMODE= 0
##$DR= 18
##$DS= 0
##$DSLIST= <SSSSSSSSSSSSSSS>
$$ [...]
##$SUBNAM2= <"">
##$SUBNAM3= <"">
##$SUBNAM4= <"">
##$SUBNAM5= <"">
##$SUBNAM6= <"">
##$SUBNAM7= <"">
##$SUBNAM8= <"">
##$SUBNAM9= <"">
##$SW= 24.9336996594482
##$SWIBOX= (0..15)
0 0 2 0 0 0 0 0 0 0 0 0 0 0 0 0 
##$SW_h= 4990.01996007984
##$TD= 16384
##$TD0= 1
##$TE= 0
##$TE2= 300
##$TE3= 300
##$TEG= 300
##$TL= (0..7)
0 120 120 120 120 120 120 120 
##$TP= (0..7)
150 150 150 150 150 150 150 150 
##$TP07= 0
##$TPNAME0= <>
##$TPNAME1= <>
##$TPNAME2= <>
##$TPNAME3= <>
##$TPNAME4= <>
##$TPNAME5= <>
##$TPNAME6= <>
##$TPNAME7= <>
##$TPOAL= (0..7)
0.5 0.5 0.5 0.5 0.5 0.5 0.5 0.5 
##$TPOFFS= (0..7)
0 0 0 0 0 0 0 0 
##$TUNHIN= 0
##$TUNHOUT= 0
##$TUNXOUT= 0
##$USERA1= <user>
##$USERA2= <user>
##$USERA3= <user>
##$USERA4= <user>
##$USERA5= <user>
##$V9= 5
##$VALIST= <valist>
##$VCLIST= <CCCCCCCCCCCCCCC>
##$VD= 0
##$VDLIST= <DDDDDDDDDDDDDDD>
##$VPLIST= <PPPPPPPPPPPPPPP>
##$VTLIST= <TTTTTTTTTTTTTTT>
##$WBST= 1024
##$WBSW= 4
##$XGAIN= (0..3)
0 0 0 0 
##$XL= 0
##$YL= 0
##$YMAX_a= 375305
##$YMIN_a= -569417
##$ZGOPTNS= <>
##$ZL1= 120
##$ZL2= 120
##$ZL3= 120
##$ZL4= 120
##$ABSF1= 10
##$ABSF2= 0
##$ABSG= 5
##$ABSL= 3
##$ALPHA= 0
##$AQORDER= 0
##$ASSFAC= 0
##$ASSFACI= 0
##$ASSFACX= 0
##$ASSWID= 0
##$AUNMP= <proc_1d>
##$AZFE= 0.1
##$AZFW= 0.1
##$BCFW= 1
##$BC_mod= 2
##$BYTORDP= 1
##$COROFFS= 0
##$CY= 11.3945322036743
##$DATMOD= 1
##$DC= 2
##$DFILT= <>
##$DTYPP= 0
##$F1P= 20.1720416913024
##$F2P= 0.152960286110954
##$FCOR= 0.5
##$FTSIZE= 0
##$FT_mod= 4
##$GAMMA= 1
##$GB= 0.15
##$INTBC= 1
##$INTSCL= 1
##$ISEN= 128
##$LB= 0.24
##$LEV0= 0
##$LPBIN= 0
##$MAXI= 10000
##$MC2= 0
##$MEAN= 0
##$ME_mod= 0
##$MI= 1.114404
##$NCOEF= 0
##$NC_proc= 0
##$NLEV= 6
##$NOISF1= 3.799351
##$NOISF2= 2.8
##$NSP= 1
##$NTH_PI= 0
##$NZP= 0
##$OFFSET= 15.70392
##$PC= 1
##$PHC0= -9211.952
##$PHC1= 14.00096
##$PH_mod= 1
##$PKNL= yes
##$PPARMOD= 0
##$PSCAL= 0
##$PSIGN= 0
##$REVERSE= no
##$SF= 200.130013532006
##$SI= 16384
##$SIGF1= 3
##$SIGF2= 2
##$SINO= 400
##$SIOLD= 16384
##$SREGLST= <1H.CDCl3>
##$SSB= 0
##$STSI= 0
##$STSR= 0
##$SW_p= 3612.71676300578
##$SYMM= 0
##$S_DEV= 0
##$TDeff= 0
##$TDoff= 0
##$TI= <>
##$TILT= no
##$TM1= 0
##$TM2= 0
##$TOPLEV= 0
##$USERP1= <user>
##$USERP2= <user>
##$USERP3= <user>
##$USERP4= <user>
##$USERP5= <user>
##$WDW= 1
##$XDIM= 8192
##$YMAX_p= 0
##$YMIN_p= 0
$$ End of Bruker specific parameters
$$ ---------------------------------
##NTUPLES= NMR FID
##VAR_NAME=  TIME,          FID/REAL,        FID/IMAG
##SYMBOL=    X,             R,               I
##VAR_TYPE=  INDEPENDENT,   DEPENDENT,       DEPENDENT
##VAR_FORM=  AFFN,          ASDF,            ASDF
##VAR_DIM=   8192,          8192,            8192
##UNITS=     SECONDS,       ARBITRARY UNITS, ARBITRARY UNITS
##FACTOR=    0.0002004,     1,               1
##FIRST=     0,             0,               0
##LAST=      1.6414764,     0,               0
##MIN=       0,             -569417,         0
##MAX=       1.6414764,     375305,          0
$$ Real data points
##PAGE= N=1
##DATA TABLE= (X++(R..R)), XYDATA
$$ [...]
$$ plain form
3085 -2810 -4091 -1226 -644 134 34 -4613 -3863 2342 1318 -4003 -3284 -423 340 1144 -737 -4633 -226
3102 -226 4668 780 -3141 -909 1946 2351 2645 -666 -2542 3060 5512 -248 -1805 2691 3673 2364
3118 2364 480 -2125 -219 5966 4182 -3435 -2604 2344 3086 1412 -570 -3553 305 4918 43
3133 43 -5162 -1608 2451 1294 -469 -3331 -4123 1199 3747 -3053 -5699 -636 1742 -74 -1764 -4595
3149 -4595 -3163 3080 2575 -4349 -4404 665 1169 509 -669 -2755 -804 3820 706 -3737 -154 3814
3165 3814 2202 196 -591 -1086 2547 5434 239 -2648 1690 3823 1207 836 26 -215 3565 3517 -1892
3182 -1892 -1717 2875 2326 387 261 -1486 -514 2791 603 -4073 -1376 2193 3 -1764 -1891 -3129
3198 -3129 -657 2853 -1504 -5593 -1952 457 -778 -863 -1719 -3161 -301 1731 -2377 -3330 1009 1226
$$ packed form
3085b810j281K865N82P78j00m647P50O205j024n321P19K861P63Q04j881l896M407
3102b26M894l888l921K232K855M05K94l311j876N602K452n760j557M496R82j309
3118B364j884k605J906O185j784p617Q31M948P42j674j982k983L858M613m875
3133D3n205L554M059j157j763k862p92N322K548o800k646N063K378j816j690k831
3149d595J432O243n05o924n5N069N04o60j178k086J951M624l114m443L583L968
3165C814j612k006p87m95L633K887n195k887M338K133k616l71q10k41L780m8n409
3182a892J75M592n49j939j26j747R72L305k188m676K697L569k190j767j27j238
3198c129K472L510m357m089L641K409j235q5q56j442K860K032m108r53M339K17
$$ plain form
3214 1226 -293 -275 -1394 -1586 2936 3224 -1844 -1561 2324 1427 1004 1731 -649 174 4400 2466 -1885
3231 -1885 248 3166 1881 1902 1025 -1555 914 4345 337 -2875 541 2503 571 -19 -1733 -2729
3247 -2729 2003 3752 -2545 -4483 -614 635 121 -803 -3679 -2687 1517 735 -4866 -3624 1224 961
3263 961 -391 -1965 -4316 -863 3657 55 -4825 -1221 2415 1436 -199 -1514 -2230 2749 5546 -737
3279 -737 -3944 1001 3670 2428 1319 -780 -566 4046 3706 -2150 -1574 3960 3204 550 -633 -1929
3295 -1929 938 5154 1457 -4290 -1256 3134 1134 -919 -1714 -1861 720 2816 -2610 -5334 107
3310 107 2510 -1077 -2529 -2938 -2300 1491 906 -4617 -3948 2044 1849 -1942 -2882 -2582 -112 3617 713
3327 713 -4781 -2165 2845 1742 -474 -367 -604 1332 3513 -17 -2733 1774 4665 1318 -644 220
$$ packed form
3214A226j519J8j119j92M522K88n068K83L885q97m23P27k380Q23M226j934m351
3231a885K133K918j285K1q77k580K469L431m008l212L416J962j932n90j714r96
3247b729M732J749o297j938L869J249n14r24k876R92M204p82n601J242M848k63
3263I61j352j574k351L453M520l602m880L604L636r79j635j315p16M979K797o283
3279g37l207M945K669j242j109k099K14M612l40n856N76N534p56k654j183j296
3295a929K867M216l697n747L034M390k000k053p95j47K581K096n426k724N441
3310A07K403l587j452m09O38L791n85n523O69N992j95l791r40L00K470L729k904
3327G13n494K616N010j103k216J07k37J936K181l530k716M507K891l347j962Q64
$$ plain form
3343 220 188 3584 3917 -780 -1953 2357 3022 83 299 352 8 2530 1916 -2607 -1542 2288 868
3360 868 -902 -419 -987 -968 1184 -658 -3552 -671 1452 -1420 -2708 -1855 -2293 -462 1585 -1683 -4063
3377 -4063 -384 544 -1265 -605 -398 -1893 527 1338 -2088 -1600 2483 1934 -612 24 -258 -17 3462
3394 3462 2688 -1671 -540 3245 2055 1176 1092 -288 980 4435 1858 -2561 -92 2818 1515 960
3410 960 66 -1750 1216 3181 -1198 -3147 864 2176 -531 -1259 -2764 -2438 1685 1967 -3393 -4171
3426 -4171 503 429 -1160 -1387 -2790 -1598 2178 -330 -4675 -1845 2275 626 -1097 -1903 -2061 1172
3442 1172 3736 -1067 -3593 1094 3982 1018 -909 -1321 59 3733 3763 -1693 -2552 3151 3875 797
3458 797 -150 -311 903 4312 1687 -3158 -366 4338 2634 -1299 -1569 -1128 1653 3518 -1136 -4720
$$ packed form
3343B20l2L396L33m697j173M310O65k939K16N3l44K522o14m523J065L830j420
3360H68j770M83n68J9K152j842k894K881K123k872j288Q53m38J831K047l268k380
3377d063L679R28j809O60K07j495K420Q11l426M88M083n49k546O36k82K41L479
3394C462p74m359J131L785j190q79q4j380J268L455k577m419K469K910j303n55
3410I60q94j816K966J965m379j949M011J312k707p28j505L26M123K82n360p78
3426d171M674p4j589k27j403J192L776k508m345K830M120j649j723q06j58L233
3442A172K564m803k526M687K888k964j927m12J380L674L0n456q59N703P24l078
3458G97r47j61J214L409k625m845K792M704j704l933k70M41K781J865m654l584
$$ plain form
3474 -4720 -216 2834 -535 -2776 -1593 -1093 906 904 -3402 -3814 1311 1711 -2389 -2666 -1148 -427 881
3491 881 -229 -4005 -1600 3003 730 -2511 -1188 256 895 2157 -413 -2862 938 3646 434
3506 434 -905 1062 1606 2011 2444 -698 -1027 3466 3746 66 -714 1211 871 2368 2223 -1369 -1258
3523 -1258 2671 1770 -1149 -93 -141 -408 1246 421 -3051 -952 1395 -253 -1685 -725 -1525 -1267 527
3540 527 -1107 -3709 -786 1069 -1475 -1554 -1120 -1690 -500 1301 -1339 -3230 398 1379 -1029 98
3556 98 -133 -749 1267 1827 -1021 -778 2603 1621 -537 792 371 726 2998 1720 -1630 625 3529
3573 3529 1351 -194 383 140 1495 2922 -261 -2951 997 3001 26 -864 -966 -1037 1408 1593 -3016
3590 -3016 -3332 1298 1663 -1830 -2783 -2749 -1075 2017 506 -4627 -3166 1229 734 -1990 -2066 -1781 -91
$$ packed form
3474d720M504L050l369k241J183N00J999km306m12N125M00m100k77J518P21J308
3491H81j110l776K405M603k273l241J323J444O39J262k570k449L800K708l212
3506D34j339J967N44M05M33l142l29M493K80l680p80J925l40J497j45l592J11
3523a258L929r01k919J056m8k67J654q25l472K099K347j648j432R60q00K58J794
3540E27j634k602K923J855k544p9M34n70J190J801k640j891L628R81k408J127
3556I8k31o16K016N60k848K43L381r82k158J329m21L55K272j278l350K255K904
3573C529k178j545N77k43J355J427l183k690L948K004k975q90j02p1K445J85m609
3590c016l16M630L65l493r53L4J674L092j511n133J461M395m95k724p6K85J690
$$ plain form
3607 -91 2055 -891 -3780 -727 2814 629 -1460 -808 -409 2001 3056 -1368 -2270 2688 3608 416
3623 416 -509 407 1357 3185 2232 -1906 -370 3742 2361 -1282 -518 780 1415 2530 -97 -3397 517
3640 517 3583 -218 -3004 -1245 592 1360 500 -2936 -3490 1297 2503 -2306 -3093 -906 24 76 -742
3657 -742 -3544 -2396 2178 826 -3479 -2407 -122 361 1031 -399 -3054 -504 3002 88 -2155 192
3673 192 915 1234 2198 93 -1348 1321 3201 338 -99 1725 1319 1391 1901 -339 -599 2781 2454 -724
3691 -724 -268 1325 86 779 1305 -1617 -925 2075 4 -1565 -226 19 -976 11 -410 -3063 -1038
3708 -1038 1147 -1102 -2351 -877 -1083 -797 128 -1659 -3156 207 1286 -1301 -1452 -446 -1020 581
3724 581 1658 -1542 -1759 2083 1921 -887 -71 519 907 2618 1389 -1772 -64 3315 1842 -340
$$ packed form
3607i1K146k946k889L053L541k185k089O52L99K410J055m424r02M958R20l192
3623D16r25R16R50J828r53m138J536M112j381l643P64J298O35J115k627l300L914
3640E17L066l801k786J759J837P68q60l436n54M787J206m809p87K187R30N2q18
3657g42k802J148M574j352m305J072K285M83O70j430k655K550L506k914k243K347
3673A92P23L19R64k105j441K669J880k863m37J824m06P2N10k240k60L380l27l178
3691g24M56J593j239O93N26k922O92L000k071j569J339K45r95R87m21k653K025
3708a038K185k249j249J474k06K86R25j787j497L363J079k587j51J006n74J601
3724E81J077l200k17L842j62k808Q16N90L88J711j229l161J708L379j473k182
$$ plain form
3740 -340 348 646 1463 3090 586 -2015 583 2829 557 -1014 197 34 920 1720 -1775 -2436 1247
3757 1247 1989 -1316 -2189 -941 -665 396 336 -3529 -2186 1975 335 -2905 -2167 -752 -167 717 -1079
3774 -1079 -3821 -789 2605 -179 -2606 -868 348 1182 1712 -1375 -2613 1864 3509 -380 -1551
3789 -1551 557 1385 2449 1766 -1584 -579 3971 2814 -957 -247 1573 1968 2356 845 -2015 691
3805 691 3561 528 -2201 -429 1068 625 469 -1277 -2342 823 2328 -1555 -2845 -328 494 -439
3821 -439 -883 -2498 -2199 1496 465 -3230 -2436 620 65 -568 -1293 -2561 -609 2247 -289 -2914 -397
3838 -397 1008 306 245 -259 -1357 1080 2888 -184 -1552 1478 2022 1038 1583 86 -744 2359 2732
3855 2732 -186 88 1836 1120 817 1398 -473 -408 2461 1174 -1325 -540 298 -400 182 331 -1708 -1137
$$ packed form
3740c40O88K98Q17J627k504k601K598K246k272j571J211j63Q86Q00l495o61L683
3757A247P42l305q73J248K76J061o0l865J343M161j640l240P38J415N85Q84j796
3774a079k742L032L394k784k427J738J216Q34N30l087j238M477J645l889j171
3789a551K108Q28J064o83l350J005M550j157l771P10J820L95L88j511k860K706
3805F91K870l033k729J772J497m43j56j746j065L165J505l883j290K517Q22r33
3821d39m44j615K99L695j031l695P94L056n55o33p25j268J952K856k536k625K517
3838c97J405p02o1n04j098K437J808l072j368L030N44r84N45j497q30L103L73
3855B732k918K74J748p16l03N81j871O5K869j287k499P85Q38o98N82J49k039N71
$$ plain form
3873 -1137 1100 -721 -2200 -1134 -871 -1108 114 -896 -3042 -994 875 -1266 -1825 -628 -721 -580
3889 -580 69 -1405 -2429 1049 1480 -1568 -940 389 119 975 1078 -1126 -183 3190 1669 -1037 98
3906 98 1827 1454 1736 597 -1168 1269 3659 544 -1340 492 1280 1364 1771 -909 -2022 1876 2983
3923 2983 -931 -2077 -359 194 466 -165 -2691 -2097 1618 771 -2821 -2063 -513 -708 -251 -1081 -3135
3940 -3135 -1122 1868 -773 -3087 -950 204 192 408 -916 -2448 440 1914 -1001 -1391 1037 1254
3956 1254 529 744 -552 -499 2965 2449 -1118 -408 2052 1780 983 947 -600 923 3568 1002 -2147
3973 -2147 80 2102 1148 665 -302 -1842 1085 2285 -1174 -2704 439 1456 -515 -856 -2214 -1898
3989 -1898 1000 1323 -2656 -2563 29 -334 -1023 -1051 -1846 -1231 1453 -109 -2949 -1226 841 -419 -166
$$ packed form
3873a137K237j821j479J066K63k37J222j010k146K048J869k141n59J197r3J41
3889e80O49j474j024L478M31l048O28J329k70Q56J03k204R43L373j521k706J135
3906I8J729l73K82j139j765K437K390l115j884J832P88Q4M07k680j113L898J107
3923B983l914j146J718N53K72o31k526N94L715q47l592P58J550j95M57q30k054
3940c135K013K990k641k314K137J154j2K16j324j532K888J474k915l90K428K17
3956A254p25K15j296N3L464n16l567P10K460k72p97l6j547J523K645k566l149
3973b147K227K022r54m83r67j540K927J200l459j530L143J017j971l41j358L16
3989a898K898L23l979R3K592l63o89k8p95O15K684j562k840J723K067j260K53
$$ plain form
4006 -166 18 -1460 -371 1861 -110 -1630 1018 1560 355 773 636 -725 1404 2793 283 -385
4022 -385 1815 1343 517 1635 672 -177 1827 1682 -942 -40 1469 176 314 936 -934 -599 1531
4039 1531 192 -2180 -691 -99 -868 -62 -610 -2775 -1030 1418 -1135 -2809 -913 -413 -875 252
4055 252 -1357 -2761 -68 1674 -1381 -1764 -180 99 77 422 -1287 -889 2830 1981 -1547 -838 1398
4072 1398 1426 1635 1079 -1431 441 3392 1420 -1370 771 2374 1621 1319 205 -1625 1274 3244
4088 3244 -344 -1653 790 1324 214 154 -1691 -1542 2084 1372 -2961 -2585 801 403 -569 -963 -2454
4105 -2454 -1177 1540 -279 -3496 -959 1027 -182 -1154 -1638 -2233 366 2316 -1186 -2826 197 1517
4121 1517 124 131 -853 -808 1770 2287 -1314 -861 2054 1659 537 753 -288 602 2989 1475 -1229 600
$$ packed form
4006a66J84j478J089K232j971j520K648N42j205M18j37j361K129J389k510o68
4022c85K200m72q26J118r63q49K004j45k624R02J509j293J38O22j870L35K130
4039A531j339k372J489N92p69Q06n48k165J745K448k553j674J896N00m62J127
4055B52j609j404K693J742l055l83J584K79k2L45j709L98L719q49l528P09K236
4072A398K8K09n56k510J872K951j972k790K141J603p53l02j114j830K899J970
4088C244l588j309K443N34j110o0j845J49L626p12m333L76L386l98r72l94j491
4105b454J277K717j819l217K537J986j209r72m84n95K599J950l502j640L023J320
4121A517j393Pr84M5K578N17l601M53K915l95j122K16j041Q90K387j514k704J829
$$ plain form
4139 600 2470 702 139 506 -329 1037 2579 -292 -2211 532 1517 -215 -388 -483 -1257 394 1059
4156 1059 -2164 -1857 860 179 -1389 -1151 -1463 -1455 502 373 -2659 -1589 684 -554 -1063 -116 -1418
4173 -1418 -1038 1325 45 -2123 -12 1372 103 -111 484 -956 410 2130 195 -611 1420 1560
4189 1560 320 878 828 -348 1556 2627 -140 -783 1438 711 772 1643 -153 -831 1486 1653 -1260
4206 -1260 -471 1057 107 111 -134 -1855 -990 1559 -30 -2738 -1239 -199 -790 -282 -1263 -2538 -774
4223 -774 1307 -1558 -2865 -631 71 -264 -218 -1639 -1747 1232 1789 -1684 -1476 1312 1324 829 64 -1276
4241 -1276 372 3127 1530 -2017 -436 2509 1614 1345 279 -703 1252 3536 450 -1918 1205 2584
4257 2584 1181 517 -860 -1203 1964 2167 -1553 -2247 1146 1017 -786 -1109 -1753 -1104 1370 -77 -3756
$$ packed form
4139F00J870j768n63L67q35J366J542k871j919K743R85j732j73r5p74J651O65
4156A059l223L07K717o81j568K38l12QJ957j29l032J070K273j238n09R47j302
4173a418L80K363j280k168K111J384j269k14N95j440J366J720j935q06K031J40
4189A560j240N58n0j176J904J071k767o43K221p27O1Q71j796o78K317J67k913
4206a260P89J528r50Mk45j721Q65K549j589k708J499J040n91N08r81j275J764
4223g74K081k865j307K234P02l35M6j421j08K979N57l473K08K788J2m95p65j340
4241a276J648K755j597l547J581K945q95k69j066r82J955K284l086k368L123J379
4257B584j403o64j377l43L167K03l720o94L393j29j803l23o44O49K474j447l679
$$ plain form
4274 -3756 -1964 808 -228 -1550 -1325 -1498 -413 1337 -1281 -3096 112 1632 -1065 -1419 -1025 -806
4290 -806 1178 1424 -1582 -1513 1721 1681 -274 -84 501 132 2502 1430 -1135 102 2932 1231 -37
4307 -37 845 293 802 2203 630 -1450 659 2903 72 -677 95 -529 338 1716 -877 -1939 665
4324 665 585 -1059 -625 -507 -1734 -62 379 -1935 -1922 673 -549 -2157 -666 -784 -1533 525 116 -2010
4342 -2010 -709 796 -254 -648 427 -687 -414 1757 156 -1371 952 1624 167 438 1308 -349
4358 -349 971 2158 268 -474 1642 1373 -15 823 592 -217 1821 2046 -753 -708 1383 360 25
4375 25 569 -817 -982 1425 225 -2462 -705 749 -191 -664 -722 -2188 -754 1282 -1069 -2735 -469
4392 -469 132 -696 -701 -1084 -2222 176 1414 -1834 -2295 663 529 -460 152 -873 -783 1705 1396 -1598
$$ packed form
4274c756J792K772j036j322K25j73J085J750k618j815L208J520k697l54L94K19
4290h06J984K46l006O9L234m0j955J90N85l69K370j072k565J237K830j701j268
4307c7Q82n52N09J401j573k080K109K244k831p49P72o24Q67J378k593j062K604
4324F65q0j644M34J18j227J672M41k314J3K595j222j608J491j18p49K058m09k126
4342b010J301J505j050l94J075j114K73K171j601j527K323O72j457K71Q70j657
4358c49J320J187j890p42K116k69j388Q38k31q09K038K25k799M5K091j023l35
4375B5N44j386j65K407j200k687J757J454r40m73n8j466J434K036k351j666K266
4392d69O01q28nl83j138K398J238l248m61K958j34r89O12j025R0K488l09k994
$$ plain form
4410 -1598 -553 2303 1169 163 422 -290 814 3180 812 -1573 880 2858 1323 126 104 -413
4426 -413 1714 2598 -1040 -1848 1453 1952 -417 -658 -1043 -471 1551 789 -2952 -1897 1576 321 -1671
4443 -1671 -1294 -1263 -935 1174 -1456 -3490 -762 1412 -735 -2031 -985 -1075 -77 849 -1560 -2036 1165
4460 1165 1595 -802 -689 203 62 1500 1315 -1122 -672 2583 1636 -788 609 1031 494 1449 943 -1078
4478 -1078 910 2996 202 -571 1192 727 345 1463 -59 -1253 946 1448 -927 -670 489 -471
4494 -471 -333 405 -1616 -1974 519 -310 -2222 -674 -113 -1586 -359 -91 -2166 -1361 1021 -497 -1569
4511 -1569 30 -654 -1084 889 519 -1566 -340 1098 -411 -91 944 -344 96 1879 518 -793
4527 -793 1119 1683 265 856 1247 -408 1183 2381 -32 -751 1582 939 -94 962 -91 -894 1263
$$ packed form
4410a598J045K856j134j006K59p12J104K366k368k385K453J978j535j197k2n17
4426d13K127Q84l638q08L301M99k369k41l85N72K022p62l741J055L473j255j992
4443a671L77L1L28K109k630k034K728K174k147j296J046r0R98R26k409m76L201
4460A165M30k397J13Q92j41J438j85k437M50L255r47k424J397M22n37R55n06k021
4478a078J988K086k794p73J763m65l82J118j522j194K199N02k375K57J159r60
4494d71J38P38k021l58K493q29j912J548N61j473J227K68k075Q05K382j518j072
4511a569J599o84m30J973l70k085J226J438j509L20J035j288M40J783j361j311
4527g93J912N64j418N91L91j655J591J198k413p19K333o43j033J056j053q03K157
$$ plain form
4544 1263 1165 -1561 -615 1227 19 -767 -207 -926 -971 935 -388 -2671 -495 694 -1162 -1224 -1044 -1757
4562 -1757 -314 1042 -1700 -2586 44 419 -1010 -726 -600 -692 829 1078 -1938 -1008 2046 1180 -353
4579 -353 58 -88 253 2310 1135 -1397 642 2560 1046 261 586 294 1533 2462 7 -1474 1241
4596 1241 2473 -228 -34 235 -69 1183 996 -1902 -1671 1586 721 -1757 -864 -775 -778 413 -480 -3038
4614 -3038 -910 1243 -714 -2150 -924 -868 -916 812 -1154 -2381 107 1059 -1148 -1122 284 -319 777
4631 777 741 -1217 -818 1958 1551 -888 233 983 430 1172 1276 -462 542 2604 867 -170 1175
4648 1175 769 353 1630 778 -1022 899 2109 -98 -854 747 17 -178 750 -711 -1845 435 478
4665 478 -1674 -849 -465 -1310 -347 35 -2038 -1766 283 -83 -1754 -665 -476 -1701 300 -191 -1648
$$ packed form
4544A263r8k726R46J842j208p86N60p19m5J906j323k283K176J189j856o2J80p13
4562a757J443J356k742q86K630L75j429K84J26r2J521K49l016R30L054q66j533
4579c53M11j46L41K057j175k532K039J918j514p85L25k92J239R29k455j481K715
4596A241J232k701J94K69l04J252j87k898K31L257q65k478Q93Q9lJ191q93k558
4614c038K128K153j957j436J226N6m8J728j966j227K488R52k207K6J406o03J096
4631G77l6j958L99K776m07k439J121P50n53P42J04j738J004K062j737j037J345
4648A175m06m16J277q52j800J921J210k207p56J601p30j95R28j461j134K280M3
4665D78k152Q25L84q45R63L82k073K72K049l66j671J089J89j225K001m91j457
$$ plain form
4682 -1648 -839 1016 -138 -1258 214 -411 -165 1591 445 -1342 439 1906 336 402 833 84 960
4699 960 2637 -146 -891 1755 1791 313 434 649 383 1277 1848 -901 -358 2102 1180 -646 -232 -270
4717 -270 -540 910 283 -2393 -759 1218 -844 -1206 -194 -947 -639 810 -1222 -2626 2 1244
4733 1244 -1513 -1318 -945 -1041 357 489 -1847 -1490 1374 953 -1350 -541 -97 -215 1514 765 -1661 1
4751 1 2542 771 -573 437 897 1220 1843 286 -1204 1775 2897 167 -387 768 899 1083 1607
4768 1607 -1093 -1029 1504 1377 -1264 -948 324 -366 357 8 -2356 -1175 1288 71 -2081 -917 -341
4785 -341 -558 -242 -640 -2306 -493 1012 -1291 -2100 -164 -363 -649 39 -1045 -1742 855 1461 -1139
4802 -1139 -15 1179 408 634 1117 -441 -262 2401 1294 -1039 871 1175 177 1105 1253 -541 573
$$ packed form
4682a648Q09J855j154j120J472o25K46J756j146j787J781J467j570O6M31p49Q76
4699I60J677k783p45K646L6j478J21K15k66Q94N71k749N43K460r22j826M14l8
4717b70k70J450o27k676J634J977k062l62J012p53L08J449k032j404K628J242
4733A244k757J95L73r6J398J32k336L57K864m21k303Q09M44j18J729p49k426J662
4751AK541j771j344J010M60L23O23j557j490K979J122k730n54J155J31J84N24
4768A607k700O4K533j27k641L16J272o90P23l49k364J181K463j217k152J164N76
4785c41k17L16l98j666J813J505k303q09J936j99k86O88j084o97K597O06k600
4802a139J124J194p71K26M83j558J79K663j107k333J910L04r98R28J48j794J114
$$ plain form
4819 573 2374 673 -765 963 953 -33 1198 64 -1392 623 1026 -819 -944 231 -534 -464 452
4836 452 -1264 -2221 327 603 -1798 -1038 -518 -1503 -282 211 -1926 -1634 469 -111 -1567 -849 -260 -643
4854 -643 740 390 -1566 -129 2016 300 -349 366 17 530 1694 335 -931 1287 2340 181
4870 181 147 752 383 1056 2023 -341 -1028 1862 1745 -295 20 758 77 854 684 -1392 -693 1772 183
4889 183 -1490 -361 -448 -245 839 -733 -2633 -158 1140 -1330 -1900 -983 -671 -141 -112 -1868 -2191 927
4907 927 940 -1312 -1335 279 -43 393 276 -1621 -930 2415 1147 -1599 -544 1146 621 1187 865 -1344
4925 -1344 999 2775 148 -742 1093 1012 638 1310 58 -892 1618 2071 -537 -990 1524 637 666 603
4943 603 -1186 -763 1295 245 -1988 -812 271 -695 -280 -620 -2063 -632 801 -1003 -2326 -217
$$ packed form
4819E73J801j701j438J728j0r86J231j134j456K015M03j845j25J175p65P0R16
4836D52j716r57K548K76k401P60N20r85J221M93k137K92K103n80j456P18N89l83
4854f43J383l50j956J437K145j716o49P15l49N13J164j359j266K218J053k159
4870A81l4O05l69O73R67k364o87K890j17k040L15P38o81P77j70k076O99K465j589
4889A83j673J129q7K03J084j572j900K475J298k470n70R17L12N30K9j756l23L118
4907I27J3k252k3J614l22M36j17j897O91L345j268k746J055J690n25N66l22k209
4925a344K343J776k627q90J835q1l74O72j252r50K510M53k608m53K514q87K9o3
4943F03j789M23K058j050k233J176J083r66M15l40j443J431J433j804j323K109
$$ plain form
4959 -217 23 -1052 -486 -948 -1492 334 745 -1365 -1213 611 333 -223 683 -262 -698 1274 1020 -1066
4977 -1066 266 1674 598 295 948 69 370 2325 1170 -333 1127 1140 168 1336 1245 -651 511
4994 511 1764 -90 -893 714 257 -297 640 -481 -1626 -241 516 -1259 -1347 72 -931 -550 234
5011 234 -1698 -2148 -35 421 -1466 -1171 -349 -1225 201 -8 -1658 -1538 508 13 -1509 -300 355
5028 355 -124 1135 558 -1559 369 2246 494 -395 947 727 745 1605 -5 -584 1906 2546 -83
5045 -83 -55 888 581 1164 1149 -765 -563 2025 1072 -1423 -487 531 -85 553 -210 -1807 -249 1107 -642
5064 -642 -2294 -666 19 -592 -267 -1427 -2343 89 957 -1920 -2043 -48 -196 -524 -359 -1593 -1342 1189
5082 1189 1175 -1674 -876 843 371 886 204 -931 450 2644 876 -1169 452 1383 908 1308 351
$$ packed form
4959b17K40j075N66m62n44J826M11k110J52J824k78n56R06r45m36J972k54k086
4977a066J332J408j076l03O53q79L01J955j155j503J460J3r72J168r1j896J162
4994E11J253j854q03J607m57n54R37j121j145J385P57j775q8J419j003L81P84
5011B34j932m50K113M56j887K95Q22q76J426k09j650J20K046m95j522J209O55
5028C55m79J259n77k117J928J877j752q89J342k20J8Q60j610n79K490O40k629
5045h3K8R43l07N83j5j914K02K588r53k495R36J018o16O38p63j597J558J356j749
5064f42j652J628O85o11L25j160r16K432Q68k877j23J995j48l28J65j234K51K531
5082A189j4k849P98J719m72N15o82j135J381K194j768k045J621R31m75M00r57
$$ plain form
5099 351 -570 1353 2323 -55 -619 1357 1251 216 698 -352 -505 1449 1367 -1403 -449 939 -6 -249
5117 -249 -18 -1453 -903 985 -472 -1997 -477 427 -919 -683 -668 -1876 -851 455 -1259 -1744 -233
5134 -233 -72 -587 -36 -529 -1404 909 1077 -923 -503 911 694 -36 862 232 -317 1523 1288 -257
5152 -257 147 1319 547 951 1392 -423 386 2188 788 -693 647 658 145 662 101 -1468 -56 1293
5170 1293 -399 -1158 -85 -229 -585 318 -828 -1962 -67 357 -1341 -1276 -297 -1035 -736 -190 -1691 -1560
5188 -1560 832 382 -1840 -1056 -257 -654 141 158 -1180 -661 1654 447 -1214 411 986 431 1449
5205 1449 377 -368 1344 2516 393 -548 1143 976 923 1107 -254 -387 2106 2059 -984 -368 1010
5222 1010 534 460 291 -1388 -361 1829 111 -1984 -384 650 -133 -547 -970 -2005 -351 1160 -1358
$$ packed form
5099C51r21J923R70k378n64J976j06j035M82j050j53J954q2k770R54J388r45k43
5117b49K31j435N50J888j457j525J520R04j346K36J5j208J025J306j714m85J511
5134b33J61n15N51m93q75K313J68k000M20J414k17p30Q98o30n49J840k35j545
5152b57M04J172p72M04M41j815Q09J802j400j481J340J1n13N17n61j569J412J349
5170A293j692p59J073j44l56R03j146j134J895M24j698O5R79p38K99N46j501J31
5188a560K392m50k222P84P99l97P95J7j338N19K315j207j661J625N75n55J018
5205A449j072p45J712J172k123r41J691j67n3J84j361j33K493m7l043O16J378
5222A010m76p4j69j679J027K190j718k095J600J034p83m14m23j035J654J511k518
$$ plain form
5239 -1358 -2258 -483 -75 -693 -393 -1984 -1584 568 820 -1867 -1668 726 86 -326 -34 -1029 -405 1971
5257 1971 615 -1473 129 1499 972 621 399 -225 900 2272 685 -943 1089 1533 567 755 430
5274 430 -618 1257 1377 -779 -447 1132 549 -326 448 -466 -567 645 115 -1989 -782 602 -507
5291 -507 -950 -619 -1014 -638 725 -834 -2384 -111 612 -898 -885 -296 -1505 -275 819 -883 -1389
5308 -1389 553 382 -497 460 -10 -625 1305 1330 -494 -342 1159 711 192 974 -15 -298 1914 1440
5326 1440 -438 434 1427 645 484 783 -708 115 2007 355 -1268 -83 532 64 711 -249 -1402
5343 -1402 -240 924 -1034 -1647 267 -210 -872 -396 -1466 -1592 945 346 -1811 -1454 58 -250 -478
5360 -478 -60 -1337 -614 1340 -70 -1380 31 1075 117 -65 39 -816 931 1925 -6 -1031 1257
$$ packed form
5239a358r00J775M08o18L00j591M00K152K52k687J99K394o40m12K92r95O24K376
5257A971j356k088J602J370n27l51k22o24J125J372j587j628K032M44r66J88l25
5274D30j048J875J20k156L32J579n83q75P74r14j01J212n30k104J207J384j109
5291e07m43L31l95L76J363j559j550K273P23j510J3N89j209J230J094j702n06
5308a389J942j71q79R57m70o15J930K5j824J52J501m48n19P82r89k83K212m74
5326A440j878Q72R93p82j61K99j491Q23J892j652j623J185O15m68O47r60j153
5343a402J162J164j958o13J914m77o62M76j070j26K537n99k157L57J512l08k28
5360d78M18j277P23J954j410j310J411J044r58j82J04q55J747R94j931j025K288
$$ plain form
5377 1257 1548 466 955 59 121 2024 2079 -420 -519 1410 1379 481 387 -372 171 1911 718 -1658 -651
5396 -651 1391 -63 -326 -717 -1210 -318 1287 -1085 -2257 -628 366 -994 -951 -1126 -1718 -44 722 -1443
5414 -1443 -2136 269 172 -709 -570 -515 -749 975 395 -1558 -602 850 293 -370 260 -88 318 1726 454
5433 454 -772 540 1879 482 245 705 415 1062 1931 164 -435 1387 1354 -394 -39 195 -171 1417
5451 1417 1107 -1006 -404 1167 373 -989 -157 -584 -369 822 -76 -1865 -451 767 -630 -941 -459
5468 -459 -1417 -1091 571 -844 -1915 -321 347 -857 -499 -457 -1246 181 1185 -639 -1343 554 674
5485 674 -198 582 -167 -340 1366 1597 -691 -348 1260 759 482 1307 167 159 1910 1103 -495 271 1276
5504 1276 547 272 374 -644 -83 1379 -120 -1428 -125 653 -398 -219 -630 -1482 74 997 -1696
$$ packed form
5377A257K91j082M89q96O2J903N5k499r9J929l1q98r4p59N43J740j193k376J007
5396f51K042j454k63l91m93Q92J605k372j172J629R94j360M3j75n92J674P66k165
5414a443o93K405r7q81J39N5k34J724n80j953R56J452n57o63O30l48M06J408j272
5433D54j226J312J339j397k37M60k90O47Q69j767n99J822l3j748L55K34l66J588
5451A417l10k113O02J571p94j362Q32m27K15J191q98j789J414J218j397l11M82
5468d59r58L26J662j415j071J594O68j204L58M2p89J427J004j824p04J897J20
5485F74q72P80p49j73J706K31k288L43J608n01k77Q25j140qJ751q07j598P66J005
5504A276p29k75J02j018N61J462j499j308J303P78j051J79m11q52J556R23k693
$$ plain form
5521 -1696 -1719 189 -202 -1008 -591 -1347 -736 581 -209 -2367 -983 1064 235 -858 -316 -959 67 1796
5539 1796 -278 -1864 343 1841 395 155 62 -180 1595 2237 -443 -567 1849 1856 151 479 46 400
5557 400 2048 1599 -1318 -479 1822 1018 -136 -160 -309 152 1029 -305 -2144 -631 806 -623 -1432
5574 -1432 -848 -1128 -490 461 -1836 -2215 -33 -35 -1615 -1132 -836 -934 31 -26 -1576 -1347 946 297 -855
5593 -855 -110 -60 313 1158 375 -926 543 2094 233 -197 798 530 945 1646 492 -434 1766 2135
5611 2135 176 12 972 464 999 1454 -526 -571 1462 821 -998 -226 -102 -427 345 241 -1379 -1138
5629 -1138 872 -558 -1215 -391 -874 -1102 0 -856 -2017 -631 228 -720 -1237 -413 -1141 -713 924 -797
5647 -797 -1602 155 569 -618 399 39 -791 592 1630 -434 -520 1415 833 299 686 311 -139 1844
$$ packed form
5521a696k3J908l91q06M17p56O11J317p90k158J384K047q29j093N42o43J026J729
5539A796k074j586K207J498j446k40r3k42J775O42k680j24K416Pj705L28m33L54
5557D00J648m49k917Q39K301q04j154k4j49M61Q77j334j839J513J437j429q09
5574a432N84k80O38R51k297l79K182kj580M83K96r8R65n7j550K29K293o49j152
5593h55P45N0L73Q45p83j301J469J551j861m30R95k68M15P01j154r26K200L69
5611B135j959j64R60n08N35M55j980m5K033o41j819P72J24l25P72j04j620K41
5629a138K010j430o57Q24m83k28J102q56j161J386Q59r48n17Q24p28M28J637j721
5647g97q05J757M14j187J017l60q30J383J038k064q6J935n82n34L87l75m50J983
$$ plain form
5665 1844 1306 -375 -110 1629 503 479 750 -249 315 1471 638 -1328 277 857 -50 -316 65 -853
5683 -853 95 818 -1123 -1506 281 323 -1049 -803 -1039 -1440 353 421 -2053 -1444 736 92 -1073 -1072 -936
5702 -936 -104 1084 20 -1895 56 1943 381 -662 -102 -164 1202 1603 -284 -1278 1137 2207 215
5719 215 -60 403 437 1582 1493 -828 -660 1905 1556 -259 -71 489 332 1328 548 -1647 4 1534
5737 1534 175 -828 -291 -290 -232 592 -695 -2174 -263 658 -1426 -1507 -306 -696 -54 201 -1423 -1366 518
5756 518 297 -1608 -712 -7 -318 328 449 -860 -287 1678 150 -858 223 1061 637 1226 237 -770
5774 -770 1102 1772 103 -227 1221 948 976 1365 -155 -598 1732 1423 -436 -153 874 172 664 976
5792 976 -833 -608 1065 221 -871 -230 -337 -839 307 91 -1975 -1189 308 -833 -1381 -307 -943
$$ packed form
5665A844n38j681K65J739j126k4K71r99N64J156q33j966J605N80r07k66L81r18
5683h53R48P23j941l83J787M2j372K46k36m01J793O8k474O09K180o44j165JJ36
5702i36Q32J188j064j915J951J887j562j043N60o2J366M01j887r94K415J070j992
5719B15k75M63L4J145q9k321J68K565l49j815J88N60j57R96p80k195J651J530
5737A534j359j003N37JN8Q24j287j479J911R21k084q1J201l90O42K55j624N7J884
5756E18k21j905Q96P05l11O46J21j309N73J965j528j008J081Q38m24N89r89j007
5774g70J872O70j669l30J448k73K8L89j520m43K330l09j859K83J027p02M92L12
5792I76j809K25J673q44j092O41j07n02J146k16k066P86J497j141n48J074o36
$$ plain form
5809 -943 -897 198 -441 -1876 -494 790 -830 -656 239 -717 -3 675 -696 -768 635 555 -260 148 520
5828 520 -219 690 1239 -296 -107 1601 832 -266 520 700 57 1512 843 -847 443 1540 15
5845 15 -354 513 -16 178 1076 -542 -1619 381 674 -770 -877 -224 -692 152 242 -1573 -1629 908 485
5864 485 -1450 -1018 -457 -498 679 -271 -2039 -811 1143 -200 -1157 -393 -444 149 888 -184 -1621 640
5882 640 1872 -85 -657 224 329 1143 1408 -353 -835 1739 1891 -327 15 898 576 922 742 -481
5900 -481 -258 1836 880 -1344 -284 437 -75 671 -102 -1578 332 1229 -612 -1673 -235 -400 -505
5917 -505 -191 -1255 -1445 250 555 -1446 -886 -239 -193 -469 -194 -1162 -824 1155 128 -1486 -212 242
5935 242 28 251 -26 -471 229 1766 149 -399 924 674 673 1154 446 -492 1271 1944 -120 -274 1156
$$ packed form
5809i43M6J095o39j435J382J284j620J74Q95r56P14O78j371p2J403q0q15M08L72
5828E20p39R09N49j535J89J708p69j098P86J80o43J455o69j690J290J097j525
5845A5l69Q67n29J94Q98j618j077K000K93j444j07O53m68Q44R0j815n6K537m23
5864D85j935M32N61m1J177r50j768J228J954j343r57P64n1N93P39j072j437K261
5882F40J232j957n72Q81J05Q14K65j761m82K574J52k218L42Q83l22L46j80j223
5900d81K23K094r56k224J060P21n12P46p73j476J910Q97j841j061J438j65j05
5917e05L14j064j90J695L05k001N60O47M6k76K75r68L38J979j027j614J274M54
5935B42k14K23k77m45P00J537j617n48J323k50jM81p08r38J763O73k064j54J430
$$ plain form
5954 1156 551 734 876 -185 -527 1323 897 -907 -330 596 -335 227 518 -1476 -675 934 -385 -1304
5972 -1304 -753 -589 -829 -76 -448 -1946 -558 780 -968 -1478 -434 -499 -418 481 -612 -1471 371 706
5990 706 -900 -710 528 -215 -24 1123 -490 -179 1903 1049 -581 467 1082 504 1078 1153 -588 211
6008 211 1986 583 -457 544 808 357 958 -229 -786 638 1501 -475 -940 334 79 -58 433
6025 433 -897 -1528 853 353 -1541 -1354 -240 -634 -127 -348 -1824 -1172 791 171 -1723 -681 -146
6042 -146 -571 148 -225 -1567 -15 1439 -57 -966 206 342 -4 842 -436 -788 1421 1625 -208
6059 -208 -235 1127 829 700 770 -401 -224 1703 1039 -489 317 971 421 401 199 -918 -58 1529 -371
6078 -371 -1443 314 294 -659 120 -634 -1148 -4 411 -1392 -1392 231 -289 -908 -450 -1229 -1331 323 3
$$ packed form
5954A156o05J83J42j061l42J850m26j804N77R26r31N62K91j994Q01J609j319r19
5972a304N51J64k40P53l72j498J388J338j748n10J044o5Q1Q99j093q59J842L35
5990G06j606J90J238p43J91J147j613L11K082q54j630J048O15n78N74P5j741P99
6008B11J775j403j040J001K64m51O01j187n57J424Q63j976m65J274k55j37M91
6025D33j330o31K381n00j894J87J114l94N07k21j476O52J963o20j894J042N35
6042a46m25P19l73j342J552J454j496r09J172J36l46Q46j278l52K209K04j833
6059b08k7J362k98j29P0j171J77J927o64j528Q06O54n50k0k02j117Q60J587j900
6078c71j072J757k0r53P79p54n14J144M15j803%J623n20o19M58p79j02J654l20
$$ plain form
6097 3 -1395 -1071 740 99 -10 -144 -930 -353 1409 265 -1013 206 816 334 651 434 -532 942
6115 942 1747 172 -272 927 914 376 1546 360 -628 1008 1756 -236 -421 742 362 90 801 -510
6133 -510 -1052 572 399 -1036 -696 -74 -792 -392 -116 -1488 -720 300 -607 -1625 -232 -291 -887 -68
6151 -68 -545 -1657 -33 650 -1030 -1242 461 281 -210 245 -626 -557 1156 989 -737 -284 1050 764
6169 764 562 778 14 411 2306 838 -673 512 1486 620 606 388 -411 813 1942 -165 -1083 500
6187 500 705 -256 213 -291 -1222 610 835 -1469 -1289 167 -490 -223 -145 -1144 -1336 364 11 -1622 -1205
6206 -1205 137 -842 -558 -315 -1237 -430 946 -472 -1417 -120 484 -305 -17 217 -1072 668 1611 -368
6224 -368 -435 1365 1105 455 605 150 55 1711 1157 -530 341 1641 678 221 479 -250 451 1525 205
$$ packed form
6097Cj398L24J811o41j09j34p86N77J762j144j278J219O10m82L17k17r66J474
6115I42Q05j575m44J199j3n38J170j186r88J636P48j992j85J163l80k72P11j311
6133e10n42J624j73j435L40O22p18M00K76j372P68J020r07j018J393n9n96Q19
6151f8m77j112J624O83j680k12J703j80m91M55q71O9J713j67j726M53J334k86
6169G64k02K16p64L97J895j468j511J185R74q66j4k18p99J224J129k107r18J583
6187E00K05r61M69n04r31J832K25k304J80J456o57K67P8r99j92J700l53j633M17
6206a205J342r79K84K43r22Q07J376j418r45J297O04p89K88K34j289J740R43j979
6224c68o7J800k60o50J50m55r5J656n54j687Q71J300r63m57K58p29P01J074j320
$$ plain form
6243 205 -1251 340 841 7 -130 -277 -944 -12 624 -1067 -1643 -68 251 -912 -524 -795 -1364 131
6261 131 270 -1605 -1187 384 -403 -627 -139 -421 -631 811 297 -1261 -393 530 129 -39 791 -384
6279 -384 104 1460 516 -178 736 853 422 782 937 -275 702 1304 179 -52 853 613 -199 904 -263
6298 -263 -598 675 470 -736 -664 444 -340 -126 191 -874 -968 757 -43 -1779 -442 0 -431 -267
6316 -267 -351 -1430 -307 600 -577 -1849 16 595 -249 -83 -551 -743 388 961 -1005 -637 942 281
6334 281 223 706 -21 -108 1629 1201 -792 -86 1438 868 372 628 -259 241 1774 366 -1044 281
6352 281 1468 183 90 -135 -669 792 1510 -681 -1719 599 351 -684 -225 -940 -983 550 253 -1648
6370 -1648 -1080 259 -156 -573 -407 -1085 -613 563 -351 -2075 -170 741 -174 -235 -354 -695 -14 1230
$$ packed form
6243B05j456J591N01q34j37j47o67R32O36j691n76J575L19j163L88k71n69J495
6261A31J39j875M18J571p87k24M88k82k10J442n14j558Q68R23m01j68Q30j175
6279c84M88J356r44o94R14J17m31L60J55j212R77O02j125k31R05k40q12J103j167
6298b63l35J273k05j206P2J108p84K14L17j065r4J725q00j736J337M42m31J64
6316b67q4j079J123R07j177j272J865N79q44J66m68j92J131N73j966L68J579o61
6334B81n8M83p27q7J737m28j993P06J524n70m96K56q87N00J533j408j410J325
6352B81J187j285r3k25n34J461P18k191j038K318k48j035M59p15m3J533k97j901
6370a648N68J339m15m17J66o78M72J176r14j724J905R11r15o1j19l41O81J244
$$ plain form
6388 1230 -385 -1162 692 1069 -79 -103 -13 -12 814 1077 -923 -285 1811 843 266 482 262 576 1425
6407 1425 1064 -1065 482 1341 150 -372 143 -199 150 922 -511 -1132 350 875 -512 -598 -436 -921
6425 -921 97 528 -1069 -1365 212 -39 -1054 -355 -702 -964 -7 217 -1327 -635 676 -22 -679 235
6443 235 -417 -570 802 97 -925 173 1130 167 315 710 -122 543 1282 199 -403 928 787 388
6461 388 675 684 -275 615 987 -121 -76 1008 272 -270 233 -87 -628 573 405 -997 -492 485 -327 -596
6481 -596 18 -1021 -419 949 -877 -1421 -382 272 -822 -730 -402 -1040 -4 687 -708 -1245 531 698
6499 698 -687 -288 -423 -405 831 1042 -940 -538 1035 943 336 312 -27 383 1775 886 -903 435 1266
6518 1266 483 232 163 -222 391 1214 9 -1109 958 883 -300 -127 -15 -165 17 761 -1064 -1032 779
$$ packed form
6388A230j615p77J854L77j148k4R0JQ26K63k000O38K096r68n77K16k20L14Q49
6407A425l61k129J547Q59j191n22N15l42L49P72j433o21J482N25j387q6J62m85
6425i21J018M31j597k96J577k51j015O99l47k62R57K24j544O92J311o98o57R14
6443B35o52j53J372p05j022J098R57r63J48L95q32O65P39j083o02J331j41l99
6461C88K87Rr59Q90L72j108M5J084p36n42N03l20n41J201j68j402N05R77q12k69
6481e96O14j039O02J368j826n44J039O54j094R2L28o38J036O91j395n37J776J67
6499F98j385L99j35J8J236K11j982M02J573r2o07k4l39M10J392q89j789J338Q31
6518A266p83k51o9l85O13Q23j205j118K067p5j183J73J12j50J82P44j825L2J811
$$ plain form
6537 779 126 -1016 -468 -249 -829 328 -237 -1774 -645 777 -617 -1238 -418 -446 -242 273 -787 -1517
6555 -1517 401 798 -867 -290 124 -65 492 706 -532 -541 1324 841 -214 153 600 400 1475 947
6573 947 -484 163 1639 914 -299 688 548 496 1311 368 -842 31 1192 -166 -329 264 -450 -272
6591 -272 545 -450 -1481 133 295 -1139 -568 -485 -1150 -371 -127 -1346 -1248 345 -427 -1137 -420 -518 -785
6610 -785 307 93 -1091 -186 819 -394 -376 224 108 61 716 -11 -445 996 1207 152 279 907 443
6629 443 675 902 -182 -72 1347 1097 -149 102 474 -130 352 624 -869 -379 820 -43 -474 -199
6647 -199 -391 -448 415 -183 -1638 -553 285 -684 -921 -679 -714 -377 636 -584 -1502 -133 583 -588 -569
6666 -569 -264 -679 360 460 -719 -742 959 587 -46 98 112 176 1329 600 -739 132 1468 669 238
$$ packed form
6537G79o53j142N48K19n80J157n65j537J129J422j394o21Q20k8K04N15j060p30
6555a517J918L97j665N77M14j89N57K14j238rJ865m83j055L67M47k00J075n28
6573I47j431O47J476p25j213R87j40n2Q15r43j210Q73J161j358j63N93p14J78
6591b72Q17r95j031J614J62j434N71Q3o65P79K44j219R8J593p72p10P17r8k67
6610g85J092k14j184R05J005j213J8O00j16m7O55p27m34J441K11j055J27O28m64
6629D43K32K27j084J10J419k50j246K51L72o04M82K72j493M90J199q63m31K75
6647a99j92n7Q63n98j455J085Q38r69k37K42l5L37J013j220r18J369P16j171J9
6666e69L05m15J039J00j179k3J701l72o33J44J4O4J153p29j339Q71J336p99m31
$$ plain form
6685 238 657 362 730 1298 398 -816 642 1318 -26 -102 356 -158 340 851 -635 -1078 681 197 -839
6704 -839 -481 -226 -661 118 -129 -1563 -866 476 -278 -1414 -473 -447 -578 -75 -482 -1544 -211 722 -572
6723 -572 -833 45 -101 281 592 -412 -754 820 1003 -142 -289 886 9 864 974 -250 241 1612
6741 1612 608 146 248 593 487 913 541 -662 467 1306 320 -396 410 -71 -34 552 -430 -946 -152
6760 -152 792 -844 -685 -311 -324 -355 233 -867 -1274 333 -12 -824 -816 -92 -834 -152 201 -741 -586 535
6780 535 -385 -730 305 21 -237 431 272 -470 322 1375 3 -57 799 556 522 1071 441 -242 1139
6799 1139 1176 -229 223 991 141 352 695 -631 -272 1115 540 -975 -290 163 -261 248 -73 -1271
6817 -1271 -529 901 -321 -1255 -444 -529 -545 412 -554 -1511 64 523 -757 -887 -214 -662 209 341 -996
$$ packed form
6685B38M19k95L68N68r00j214J458O76j344p6M58n14M98N11j486m43J759m84j036
6704h39L58K55m35P79k47j434O97J342p54j136R41K6j31N03m07j062J333R33j294
6723e72k61Q78j46L82L11j004l42J574J83j145j47J175q77Q55J10j224M91J371
6741A612j004m62J02L45j06M26l72j203J129Q39r86p16Q06m81L7N86r82n16P94
6760a52R44j636J59L74j3l1N88j100m07J607l45q12QP24p42O82L53r42J55J121
6780E35r20l45J035k84k58O68j59p42P92J053j372o0Q56k43l4N49o30o83J381
6799A139L7j405M52P68q50K11L43j326L59J387n75j515O85M53m24N09l21j198
6817a271P42J430j222r34Q11q5j6R57r66r57J575M59j280j30O73m48Q71J32j337
$$ plain form
6836 -996 -1222 196 470 -716 -255 216 -51 759 851 -547 -86 1184 268 -477 371 637 197 971 680
6855 680 -527 281 1429 -60 -259 725 498 315 421 -234 -430 981 842 -751 -502 420 46 211
6873 211 220 -552 -612 636 47 -1598 -361 64 -278 -72 -615 -1264 -307 659 -650 -1495 -413 -86 -158 -41
6893 -41 -873 -887 516 798 -664 -435 581 357 206 299 -155 -376 807 704 -218 45 793 137 246 740
6913 740 -112 120 1246 413 -366 486 467 -234 398 546 -544 -145 688 -523 -152 220 53 -297 140
6932 140 -175 -1074 -37 94 -1094 -206 -313 -606 -584 -57 -934 -738 456 75 -960 -529 174 -407 134
6951 134 121 -806 -101 1147 -150 -826 15 435 509 704 169 -445 740 1324 -41 -125 540 474 442 915
6971 915 -292 -320 1237 1046 -139 -191 594 -4 649 544 -887 -166 853 284 -733 -253 -44 -450 302
$$ packed form
6836i96k26J418K74j186M61M71k67Q10R2j398M61J270r16p45Q48K66m40P74k91
6855F80j207Q08J148j489j99R84k27j83J06o55j96J411j39j593K49R22l74J65
6873B11Rp72o0J248n89j645J237M25l42K06n43o49R57R66j309q45J082L27p2J17
6893d1q32j4J403K82j462K29J016k24j51R3m54k21J183j03r22K63P48o56J09M94
6913G40q52K32J126q33p79Q52j9p01O32J48j090L99Q33j211L71L72j67l50M37
6932A40l15q99J037J31j188Q88j07k93K2N27q77J96J194l81j035M31P03n81N41
6951A34j3r27P05J248j297o76Q41M20P4J95n35o14J185N84j365q4O65o6l2M73
6971I15j207k8J557j91j185n2P85n98O53j05j431P21J019n69j017M80K09m06P52
$$ plain form
6990 302 -236 -1595 -443 324 -380 -1217 -538 -458 -435 62 -393 -1310 156 275 -777 -725 245 -384 -49 261
7010 261 -449 -280 851 506 -761 144 584 302 416 232 -205 493 1314 687 -464 1025 1066 294 445
7029 445 221 -517 891 1306 -374 -619 590 546 118 274 -415 -423 794 316 -1190 -649 493 -413 -400
7048 -400 -215 -1099 -186 568 -299 -1686 -356 260 -826 -255 -148 -1010 -58 528 -605 -807 658 -105
7066 -105 -481 322 -254 -266 538 607 -391 103 807 376 434 531 120 -16 1085 691 -216 661 1006 293 254
7087 254 513 -66 446 1061 365 -554 468 306 -415 313 111 -527 455 236 -968 -660 428 -641 -878
7106 -878 -65 -624 -999 6 -137 -1145 -580 57 -414 -283 200 -783 -535 578 -180 -874 196 387 343
7125 343 329 427 -621 480 1205 -73 -233 553 562 479 820 214 -176 847 1211 144 -93 898 414 296
$$ packed form
6990C02n38j359J152P67p04q37O79Q0K3M97m55r17J466J19j052N2R70o29L35L10
7010B61p10J69J131l45j267R05M40k82J14j84m37O98Q21o27j151J489M1p72J51
7029D45k24p38J408M15j680k45J209m4m28J56o89qJ217m78j506N41J142r06J3
7048d00J85q84R13P54q67j387J330O16j086N71J07q62R52N86j133k02J465p63
7066a05l76Q03n76j2Q04O9r98M94P04m31N8R7m11j36J101l94r07Q77L45p13l9
7087B54K59n79N12O15o96r19J022j62p21P28k02o38R82k19j204L08J088j069k37
7106h78Q13n59l75J005j43j008N65O37m71J31M83r83K48J113p58o94J070J91m4
7125C43j4R8j048J101P25j278j60P86Rq3L41o06l90J023L64j067k37R91m84j18
$$ plain form
7145 296 598 -150 -417 1104 678 -747 -354 266 -141 164 204 -961 -479 757 -96 -951 -203 -287 -585
7164 -585 -391 -455 -1283 -94 472 -596 -965 -106 87 -275 -155 -355 -574 477 279 -920 -247 358 186
7183 186 -211 406 -227 95 1350 475 -467 583 1008 450 221 541 -48 578 1344 -183 -830 962 872
7202 872 55 140 -200 -144 867 440 -963 -316 811 52 -371 -26 -635 -406 449 -82 -1742 -407 271
7221 271 -619 -459 -520 -715 -297 466 -223 -1024 18 -73 -304 167 -249 -537 71 551 -483 -339 544 6
7241 6 -365 755 221 -255 701 957 -191 355 990 -114 25 975 224 292 540 375 -88 716 574 -225
7261 -225 35 548 -64 -84 696 -305 -719 392 -6 -658 -31 -130 -732 -39 17 -1048 -850 296 -310 -726
7281 -726 -337 -596 -682 317 -239 -1052 -212 189 -249 -32 -108 -719 -28 730 82 -794 71 731 -109 228 496
$$ packed form
7145B96L02p48k67J521m26j425L93O20m07L05M0j165M82J236q53q55P48q4k98
7164e85J94o4q28J189N66j068l69Q59J93l62J20k00k19J051j98j199O73O05j72
7183A86l97O17o33L22J255q75r42J050M25n58k29L20n89O26P66j527o47J792r0
7202H72q17Q5l40N6J011m27j403O47J127p59m23L45o09K29Q55n31j660J335O78
7221B71q90J60o1j95M18P63o89q01J042r1k31M71m16k88O08M80j034J44Q83n38
7241Fl71J120n34m76R56K56j148N46O35j104J39R50p51O8K48j65m63Q04j42p99
7261b25K60N13o12k0P80j001m14J111l98o52O27r9o02O93N6j065J98J146o06m16
7281g26L89k59q6R99n56q13Q40M01m38K17p6o11O91P58o48q76Q65O60q40L37K68
$$ plain form
7302 496 -411 645 1486 127 -205 796 744 44 815 345 -418 961 918 -613 -17 633 -99 56 343
7321 343 -603 -292 758 -227 -732 -134 278 -570 -362 -163 -732 -378 318 -622 -1065 487 -186 -880 -507
7340 -507 -497 -655 201 527 -757 -898 763 -111 -410 -145 -200 -217 649 76 -820 200 1178 183 158 434
7360 434 166 492 1097 220 -768 707 1129 466 662 128 61 582 947 -307 -687 690 171 -140 375
7379 375 -223 -526 485 664 -957 -458 344 -491 -717 -4 -559 -754 96 -146 -945 -318 213 -759 -272
7398 -272 -179 -561 -474 297 -637 -846 411 351 -792 -52 445 -239 308 294 -233 131 1260 245 -218 806
7418 806 253 130 1057 590 -522 413 900 168 -274 546 -29 110 773 291 -498 340 736 -310 -131
7437 -131 115 -436 49 677 -703 -789 405 -63 -522 -102 -633 -809 270 205 -1153 -583 332 -353 -315 -106
$$ packed form
7302D96r07J056Q41j359l32J001n2p00P71m70p63J379m3j531N96O50p32J55K87
7321C43r46L11J050r85n05N98M12q48K08J99n69L54O96r40m43J552o73o94L73
7340e07J0j58Q56L26j284j41J661q74k99K65n5j7Q66n73q96J020R78r95k5K76
7360D34k68L26O05q77r88J475M22o63J96n34o7N21L65j254l80J377n19l11N15
7379C75n98l03J011J79j621M99Q02q35k26P13n55j95Q50k42p99O27N31r72M87
7398b72R3l82Q7P71r34k09J257o0j143P40M97o84N47j4n27L64J129j015m63J024
7418H06n53j23R27m67j112R35M87p32m42Q20n75J39O63m82p89Q38L96j046J79
7437a31K46n51M85O28j380q6J194m68m59M20n31j76J079o5j358N70R15o85L8K09
$$ plain form
7457 -106 -727 -501 322 199 -1020 -53 759 -317 -14 105 -110 526 610 153 -428 775 573 -20 147
7476 147 401 -348 508 1031 -225 -201 439 456 -95 474 76 -160 717 425 -868 -131 783 -417 -529 -88
7496 -88 -289 -547 296 -368 -1071 1 354 -579 -419 -58 -792 -127 -261 -1000 -619 559 128 -838 44 -94
7516 -94 -551 59 39 -1127 -224 977 298 -595 682 174 -163 931 243 -287 498 1180 499 395 438 200
7536 200 478 1131 75 -394 571 988 -20 204 186 -426 311 914 -292 -502 596 126 -657 -134 -442
7555 -442 -867 58 266 -1091 -909 302 -523 -541 177 -810 -377 89 -307 -991 108 250 -401 -117 -10
7574 -10 -438 -323 684 -155 -539 486 618 -513 175 366 14 404 837 141 435 769 188 -103 658
7593 658 296 78 806 398 -291 453 894 104 -194 462 -342 -19 705 -261 -657 414 312 -666 -301 -122
$$ packed form
7457a06o21K26Q23j23j219R67Q12j076L03J19k15O36Q4m57n81J203k02n93J67
7476A47K54p49Q56N23j256K4O40J7n51N69l98k36Q77k92j293P37R14j200j12M41
7496h8k01k58Q43o64p03J072L53r33J60L61p34O65j34p39L81J178m31r66Q82j38
7516i4m57O10k0j166R03J201o79q93J277n08l37J094o88n30P85O82o81j04M3k38
7536B00K78O53j056m69R65M17j008K24j8o12P37O03j206k10J098m70p83N23l08
7555d42m25R25K08j357J82J211q25j8P18r87M33M66l96o84J099J42o51K84J07
7574a0m28J15J007q39l84J025J32j131O88J91l52L90M33o96K94L34n81k91P61
7593F58l62k18P28m08o89P44M41p90k98O56q04L23P24r66l96J071j02r78L65J79
$$ plain form
7613 -122 -578 23 190 -890 -1128 85 -171 -627 -185 -500 -534 366 278 -1152 -804 523 -237 -581 -213
7632 -213 -410 -382 803 3 -1007 121 459 -297 -139 626 60 481 1094 -225 -264 767 626 41 455
7651 455 720 -130 381 493 -619 -180 1125 331 -306 274 492 97 206 101 -775 260 400 -407 -710
7670 -710 244 -516 -516 405 -1004 -966 163 562 -813 -541 -41 -413 -156 169 -1036 -505 589 -1 -468
7689 -468 -113 -24 -240 628 278 -769 -238 964 129 -149 476 281 280 742 217 -79 763 871 335 215
7709 215 569 -58 482 564 -94 -427 662 375 -183 191 523 -401 94 439 -777 -221 271 -418 -586 -167
7729 -167 -333 -447 -214 218 -836 -18 35 -662 -391 130 -504 -643 314 -224 -779 555 49 -548 -307 364
7749 364 -90 103 626 -400 -170 808 573 46 419 434 -114 807 665 -377 217 1229 256 20 724
$$ packed form
7613a22m56O01J67j080k38J213k56m56M42l15l4R00q8j430L48J327p60l44L68
7632b13j97K8J185q00j010J128L38p56J58P65n66M21O13j319l9J031j41n85M14
7651D55K65q50N11J12j112M39J305p94o37N80K18l95J09j05q76J035J40q07l03
7670g10R54p60%R21j409L8J129L99j375K72N00l72K57L25j205N31J094n90m67
7689d68L55Q9k16Q68l50j047N31J202q35k78O25j95jM62n25k96Q42J08n36j20
7709B15L54o27N40Q2o58l33J089k87n58L74L32r24M95L45j216N56M92o89j68M19
7729a67j66j14K33M32j054Q18N3o97K71N21o34j39R57n38n55J334n06n97K41O71
7749C64m54J93N23j026K30R78k35n27L73J5n48R21j42j042N94J012r73k36P04
$$ plain form
7768 724 84 -37 758 249 -642 103 640 -71 -307 147 -282 11 537 -341 -798 386 130 -711 -474 -146
7788 -146 -949 -222 43 -935 -795 183 -251 -814 -451 -149 -503 189 28 -913 -357 707 -277 -432 613
7807 613 -162 89 664 92 -402 555 984 -85 83 651 9 349 701 11 -122 1074 548 -433 378
7826 378 452 132 481 183 -740 134 684 10 -426 156 41 -335 -30 -399 -1018 56 531 -762 -828 193
7846 193 -356 118 -111 -558 -831 194 48 -1051 -375 -93 -548 -93 167 -513 -149 434 68 -605 449
7865 449 629 -264 334 421 -435 324 1279 106 -37 621 444 200 582 369 -161 784 506 -13 192 273
7885 273 -33 -34 562 -162 -505 654 -9 -338 -23 -11 -576 21 -173 -644 -713 329 -240 -657 87 -240 -785
7906 -785 -66 -100 -930 -180 41 -444 -393 310 48 55 504 -152 -912 614 552 -298 75 407 153 407 840
$$ packed form
7768G24o40j21P95n09q91P45N37p11k36M54m29K93N26q78m57J184k56q41K37L28
7788a46q03P27K65r78J40R78m34n63L63L02l54O92j61r41N56J064r84j55J045
7807F13p75K51N75n72m94R57M29j069J68N68o42L40L52o90j33J196n26r81Q11
7826C78P4l20L49k98r23Q74N50o74m36N82j15l76L05l69o19J074M75j293o6J021
7846A93n49M74k29m47k73J025j46j099O76K82m55M55K60o80L64N83l66o73J054
7865D49J80q93N98Q7q56P59R55j173j43O58j77k44L82k13n30R45k78n19K05Q1
7885B73l06jN96p24l43J159o63l29L15J2n65N97j94m71o9J042n69m17P44l27n45
7906g85P19l4q30P50K21m85N1P03k62PM49o56p60J526o2q50L73L32k54K54M33
$$ plain form
7927 840 -207 -25 1020 552 -410 501 502 401 622 506 -216 73 1014 291 -358 698 111 -92 760 240
7947 240 -973 18 393 -459 -113 -12 -383 -239 258 -793 -732 25 126 -797 -186 -197 -645 -306 225 -1078
7967 -1078 -231 424 -144 -569 -113 120 -416 324 -84 -880 289 837 -403 -599 549 309 84 470 286
7986 286 -97 937 736 -48 -70 594 19 544 294 -372 62 1062 57 -571 100 188 -50 163 -140 -649
8006 -649 71 772 -239 -927 -38 -49 -510 86 -80 -1132 69 738 -770 -614 194 -477 -357 -60 -486
8025 -486 -595 393 251 -767 -14 296 -340 -4 349 263 -290 825 -122 -66 364 619 99 676 622 116
8045 116 773 408 -346 -105 518 425 -25 274 -42 -36 645 314 -529 -395 388 7 -262 130 -271 -649 359
8066 359 -102 -523 -382 284 -386 -283 -174 -943 -147 420 -389 -721 -132 -125 -602 423 -54 -808 265 546
$$ packed form
7927H40j047J82J045m68r62R11Jj01K21j16p22K89R41p23o49J056n87k03Q52n20
7947B40j213R91L75q52L46J01l71J44M97j051O1P57J01r23O11j1m48L39N31j303
7967a078Q47O55n68m25M56K33n36P40m08p96J169N48j240j96J148k40k25L86j84
7986B86l83J034k01p84k2O64n75N25k50o66M34J000j005o28O71Q8k38K13l03n09
8006f49P20P01j011o88Q89j1m61N96j66j052J201O69j508J56Q08o71J20K97m26
8025d86j09R88j42j018P53L10o36L36L53q6n53J115r47N6M30K55n20N77n4n06
8045A16O57l65p54K41O23r3m50K99l16OO81l31q43J34P83l81k69L92m01l78J008
8066C59m61m21J41O66o70J03J09p69P96N67q09l32N89Pm77J025m77p54J073K81
$$ plain form
8086 546 -514 -337 179 29 -26 492 219 -291 735 357 -169 677 434 -165 285 751 -253 106 896
8105 896 205 122 459 238 7 660 555 -616 -26 729 -233 -635 91 85 -178 18 -482 -750 25 356 -727
8126 -727 -454 14 -442 -394 -149 -533 -502 428 -102 -988 -278 41 -88 -65 -53 -467 301 595 -125 -595 370
8147 370 597 0 521 270 -498 423 901 -145 -175 607 314 168 60 71 33 491 313 -433 35 602 -129
8168 -129 416 -169 -348 84 755 -56 -797 139 397 -337 -209 -240 -787 69 381 -777 -812 58 3 -440 -102
8189 -102 -400 -682
$$ packed form
8086E46j060J77N16j50n5N18k73n10J026l78n26Q46k43n99M50M66j004L59P90
8105H96o91q3L37k21k31O53j05j171N90P55r62m02P26ok63J96n00k68P75L31j083
8126g27K73M68m56M8K45l84L1R30n30q86P10L19j29K3J2m14P68K94p20m70R65
8147C70K27n97N21k51p68R21M78j046l0P82k93j46j08J1l8M58j78p46M68N67p31
8168a29N45n85j79M32O71q11p41R36K58p34J28l1n47Q56L12j158l5Q70n5m43L38
8189a02k98k82
8191f82
$$ Imaginary data points
##PAGE= N=2
##DATA TABLE= (X++(I..I)), XYDATA
$$ plain form
0 0 0 0 0 0 0 0 -8 8 -8 8 -16 15 -16 24 -24 30 -38 44 -49 58 -70 79 -92 107 -123 139 -158 181 -204 229
30 229 -258 289 -323 362 -403 449 -497 552 -612 679 -750 834 -921 1018 -1130 1256 -1397
47 -1397 1559 -1748 1966 -2229 2549 -2947 3460 -4147 5117 -6592 9085 -14119 28241 -147296
61 -147296 -569417 -229326 233502 241250 -143404 -366711 -194149 113399 73179 -227581 -295290
72 -295290 -21128 150526 6761 -222106 -217945 24013 188699 36219 -165477 -86603 113396
83 113396 119804 -15560 -89351 -24513 112416 155840 41651 -37187 22031 57736 14010 25869
95 25869 91121 102141 39686 -50895 -63454 79966 196074 76969 -109010 -98425 42731
106 42731 111521 50501 -62600 -74074 46026 85476 -43741 -113764 -15862 67270 22875
$$ packed form
0@%%%%%%qJ6j6J6k4L1l1M0m8N4o8Q2r3J07j28J49j71J99k30K62k97L39l85M33
30B29m87N47o12O85p65Q52r46J049j164J291j429J584j755J939k148K386k653
47a397K956l307L714m195M778n496O407p607R264j1709J5677k3204M2360j75537
61a47296m22121L40091M62828P748l84654k23307J72562L07548m0220l00760o7709
72b95290K74162J71654j43765k28867M161K41958J64686j52480k01696P8874J99999
83A13396O408j35364p3791O4838J36929M3424j14189p8838N9218L5705m3726J1859
95B5869O5252J1020o2455r0581j2559J43420J16108j19105j85979J0585J41156
106D2731O8790o1020j13101j1474J20100L9450j29217p0023R7902Q3132m4395
$$ plain form
117 22875 -78149 -125048 -27806 122670 84518 -113750 -168990 -21030 103913 79353 -42600
128 -42600 -132591 -69235 71170 85889 -16990 -72551 -46823 11615 53448 2186 -86309 -51512
140 -51512 57406 66193 -2042 -38566 -33765 12838 65483 24497 -51305 -11203 82071 84396
152 84396 18574 -39441 -44014 44942 130303 68787 -53205 -72998 -15208 45877 82064 33022
164 33022 -62304 -64061 2720 7374 -31391 -42889 -31981 2211 25740 -33111 -93140 -36691
176 -36691 41756 25551 -30022 -56074 -39583 25232 57527 -10411 -58174 3199 55064 23786
188 23786 -19981 -34112 -11005 41070 43218 -14163 -15640 30781 15642 -21293 -147 26376
200 26376 23031 8734 -23744 -28312 42322 75074 -2657 -52022 1533 48410 23609 -28543
$$ packed form
117B2875j01024m6899R7242J50476l8152j98268n5240J47960J24943k4560j21953
128d2600q9991O3356J40405J4719j02879n5561K5728N8438M1833n1262q8495L4797
140e1512J08918Q787o8235l6524M801M6603N2645m0986p5802M0102R3274K325
152H4396o5822n8015m573Q8956Q5361o1516j21992j9793N7790O1085L6187m9042
164C3022r5326j757O6781M654l8765j1498J0908L4192K3529n8851o0029N6449
176c6691P8447j6205n5573k6052J6491O4815L2295o7938m7763O1373N1865l1278
188B3786m3767j4131K3107N2075K148n7381j477M6421j5139l6935K1146K6523
200B6376l345j4297l2478m568P0634L2752p7731m9365N3555M6877k4801n2152
$$ plain form
212 -28543 -46858 22055 101476 33097 -104666 -80202 70150 117832 14029 -104009 -95202
223 -95202 52288 141841 19148 -125823 -58811 94884 98223 -33623 -122759 -47710 108625
234 108625 108833 -73007 -149916 -5783 117099 50758 -90587 -132636 -24951 98955 48004
245 48004 -109400 -116476 23190 81020 3774 -76938 -71454 11570 61500 -2756 -62258 2398
257 2398 69569 22489 -39460 -24883 28326 66357 39090 -37397 -39780 45259 67462 4902
269 4902 -17074 14907 31418 18682 -18183 -33424 27555 75965 8498 -66145 -23562 54351
281 54351 60934 3546 -65866 -61180 38565 89416 7041 -68986 -38595 23290 45680 11146
293 11146 -53325 -50316 31640 49909 -25899 -58338 -12212 33010 39568 -5709 -68482 -43054
$$ packed form
212b8543j8315O8913P9421o8379j37763K4464J50352M7682j03803j18038Q807
223i5202J47490Q9553j22693j44971O7012J53695L339j31846q9136P5049J56335
234A08625K08j81840p6909J44133J22882o6341j41345m2049J07685J23906n0951
245D8004j57404p076J39666N7830p7246q0712N484Q3024M9930o4256n9502O4656
257B398O7171m7080o1949J4577N3209L8031k7267p6487k383Q5039K2203o2560
269D902k1976L1981J6511j2736l6865j5241O0979M8410o7467p4643M2583P7913
281E4351O583n7388o9412M686R9745N0851q2375p6027L0391O1885K2390l4534
293A1146o4471L009Q1956J8269p5808l2439M6126M5222O558m5277o2773K5428
$$ plain form
305 -43054 50109 57070 -26586 -66149 -27745 38780 70815 9055 -83189 -63048 32465 54563
317 54563 5856 -31612 -38632 -5194 35584 8593 -41758 -15927 30672 12398 -21814 -26731
329 -26731 -11656 26295 46497 -533 -39446 -8821 20681 15047 15452 5124 -19364 -1826 32450
342 32450 23364 4483 -2238 -20476 -9270 38025 35750 -17036 -32749 -8837 16962 37185 16302
355 16302 -38087 -35630 13866 14741 -12964 -8208 530 433 5962 -11349 -36742 -9331 26819 9520
369 9520 -15290 -18378 -22795 -4308 33446 22032 -20062 -24694 -7882 10434 35644 18115 -40233
382 -40233 -33150 39569 59915 12474 -33015 -36740 13999 67114 26171 -51669 -28073 50990
394 50990 55462 -5474 -49545 -29629 46698 73812 -16802 -90833 -23866 68980 52429 -28632
$$ packed form
305d3054R3163O961q3656l9563L8404O6525L2035o1760r2244K0141R5513K2098
317E4563m8707l7468p020L3438M0778k6991n0351K5831M6599j8274l4212m917
329b6731J5075L7951K0202m7030l8913L0625K9502n634M05j0328k4488J7538L4276
342C2450r086j8881o721j8238J1206M7295k275n2786j5713K3912K5799K0223k0883
355A6302n4389K457M9496Q75k7705M756Q738r7N529j7311k5393K7411L6150j7299
369I520k4810l088m417J8487L7754j1414m2094m632J6812J8316K5210j7529n8348
382d0233P083P2719K0346m7441m5489l725N0739N3115m0943p7840K3596P9063
394E0990M472o0936m4071J9916P6327K7114r0614p4031O6967R2846j6551q1061
$$ plain form
406 -28632 -73188 -34499 48508 52153 -43656 -83635 -11670 42008 14534 -29548 -44218 -14658
418 -14658 26993 4716 -52598 -33147 29788 24908 -19476 -29390 -10992 15819 25738 -8217 -28661
431 -28661 9246 28831 -7153 -15949 17635 30956 17184 -4457 -21237 9128 57078 32083
443 32083 -28345 -16123 37912 51293 25680 -10733 -21730 24166 60897 15899 -33638 -11353
455 -11353 25687 28111 10227 -22113 -33008 7931 28986 -18987 -53864 -27362 5878 15767
467 15767 -3870 -52012 -59593 1473 32439 -10035 -45382 -36633 -6123 27322 16863 -39040
479 -39040 -40350 25547 44180 -4220 -33540 -17458 20745 47022 12804 -39844 -13671 50365
491 50365 42764 -11447 -30331 -7216 33632 49011 1473 -37801 2926 45294 15550 -21011
$$ packed form
406b8632m4556L8689Q3007L645r5809l9979P1965N3678k7474m4082j4670K9560
418a4658M1651k2277n7314J9451O2935m880m4384r914J8398K6811R919l3955k0444
431b8661L7907J9585l5984q796L3584J3321j3772k1641j6780L0365M7950k4995
443C2083o0428J2222N4035J3381k5613l6413j0997M5896L6731m4998m9537K2285
455a1353L7040K424j7884l2340j0895M0939K1055m7973l4877K6502L3240R889
467A5767j9637m8142p581O1066L0966m2474l5347Q749L0510L3445j0459n5903
479c9040j310O5897J8633m8400k9320J6082L8203K6277l4218n2648K6173O4036
491E0365p601n4211j8884K3115M0848J5379m7538l9274M0727M2368k9744l6561
$$ plain form
503 -21011 -12728 10237 24454 9402 -30506 -25512 26561 28204 -23769 -34979 -2462 15838 8625
516 8625 -19147 -38530 -2105 38863 6025 -38808 -15751 23002 19559 -5825 -26722 -13212
528 -13212 33785 37293 -22050 -40567 9179 35336 12098 -18294 -32664 -10704 30947 18191
540 18191 -31322 -27478 13490 16338 -5349 -17871 -17373 8571 32776 5663 -26924 -4834 26318
553 26318 23871 13375 -1485 -13111 13441 39952 12433 -17268 -2441 14979 16461 13557 -8643
566 -8643 -25961 -473 18272 -5998 -20906 -8193 -2005 534 -2486 -27094 -29378 9027 17428
579 17428 -15849 -27644 -14975 -4692 8323 4857 -23621 -22738 7381 5119 -15003 -9822 -2687
592 -2687 -3267 5102 1920 -10348 4668 19152 -2227 -11104 12677 22213 14411 12088 3454 4217
$$ packed form
503b1011Q283K2965J4217j5052l9908M994N2073J643n1973j1210L2517J8300p213
516H625k7772j9383L6425M0968l2838m4833K3057L8753l443k5384k0897J3510
528a3212M6997L508n9343j8517M9746K6157k3238l0392j4370K1960M1651j2756
540A8191m9513L844M0968K848k1687j2522M98K5944K4205k7113l2587K2090L1152
553B6318k447j0496j4860j1626K6552K6511k7519k9701J4827J7420J482k904k2200
566h643j7318K5488J8745k4270j4908J2713O188K539l020k4608k284L8405Q401
579A7428l3277j1795J2669J0283J3015l466k8478Q83L0119k262k0122N181P135
592b687n80Q369l182j2268J5016J4484k1379q877K3781R536p802k323q634P63
$$ plain form
606 4217 27035 25836 -1547 1544 21033 14455 5985 7616 -598 2514 18503 4150 -19114 -5197
620 -5197 12222 2962 -2956 -6696 -18488 -4788 19375 6823 -16594 -16034 -9642 2444 17618
633 17618 -2194 -34420 -15485 17825 5958 -20971 -27157 -18162 5823 13351 -26646 -50724 -6817
646 -6817 30689 4496 -33847 -36483 -3844 35693 23747 -33187 -33507 31064 51681 5600 -26108
659 -26108 -8970 35133 57130 13525 -39764 -8873 53833 41244 -14298 -24345 9571 39788
671 39788 25201 -30795 -44030 19699 53504 622 -43947 -20385 19332 24236 -10684 -42836
683 -42836 -12039 41886 17313 -52418 -48796 14717 41826 7063 -46332 -50900 12359 49539
695 49539 -8123 -60590 -18360 42519 33151 -21100 -49167 -9723 57557 49773 -30828 -53094
$$ packed form
606D217K2818j199k7383L091J9489o578q470J631q214L112J5989j4353k3264J3917
620e197J7419r260n918l740j1792J3700K4163j2552k3417N60O392J2086J5174
633A7618j9812l2226J8935L3310j1867k6929o186Q995K3985P528l9997k4078M3907
646f817L7506k6193l8343k636L2639L9537j1946n6934l20O4571K0617m6081l1708
659b6108J7138M4103K1997m3605n3289L0891O2706j2589n5542j0047L3916L0217
671C9788j4587n5996j3235O3729L3805n2882m4569K3562L9717M904l4920l2152
683d2836L0797N3925k4573o9731L622O3513K7109l4763n3395m568O3259L7180
695D9539n7662n2467M2230O0879r368n4251k8067L9444O7280p784q0601k2266
$$ plain form
707 -53094 14286 60156 31791 -20478 -36053 8059 55556 23076 -41878 -30746 26672 34774
719 34774 -1119 -27562 -23758 9380 27512 -7416 -34642 -3251 25429 6045 -16889 -16706 696
732 696 26778 23426 -16224 -25512 9742 22479 6768 -576 -4588 -6034 6585 4572 -12982 -4442
746 -4442 12583 -4012 -24254 -15999 -2828 8889 11980 -14912 -36866 -10278 17608 6297 -8266
759 -8266 -7394 -6819 2924 8271 -7947 -9029 17184 18254 -7533 -11131 1754 8111 13742 6367 -11828
774 -11828 1359 27437 12780 -16953 -12326 6776 20854 27851 8264 -19305 -11079 12006 13841
787 13841 14240 15034 -3065 -15143 -3882 1482 4008 16127 7173 -17729 -16206 -2625 -6182 -2180
801 -2180 8732 -2306 -15224 -11726 -10499 -3791 13042 3220 -22822 -14524 9243 7567 -5547
$$ packed form
707e3094O7380M5870k8365n2269j5575M4112M7497l2480o4954J1132N7418Q102
719C4774l5893k6443L804L3138J8132l4928k7226L1391K8680j9384k2934J83J7402
732F96K6082l352l9650r288L5254J2737j5711p344m012j446J2619k013j7554Q540
746d442J7025j6595k0242Q255J3171J1717L091k6892k1954K6588K7886j1311j4563
759h266Q72N75R743N347j6218j082K6213J070k5787l598J2885O357N631p375j8195
774a1828J3187K6078j4657k9733M627J9102J4078O997j9587k7569Q226K3085J835
787A3841L99P94j8099j2078J1261N364K526J2119q954k4902J523J3581l557M002
801b180J0912j1038j2918L498J227O708J6833r822k6042Q298K3767j676j3114
$$ plain form
814 -5547 -14940 -16726 6193 24404 -3936 -34483 -14160 11886 5506 -6882 -8937 -2284 10949
827 10949 975 -29156 -13840 36090 36418 -12048 -33838 -8355 32984 46942 6806 -32489 -4210
840 -4210 42124 27521 -11441 -10486 15850 29216 10948 -24639 -18879 33168 40161 -18406 -47520
853 -47520 -10447 29869 28382 -11163 -44623 -19303 29956 17781 -32599 -33573 6545 21985 883
866 883 -29909 -31616 8953 29433 -10486 -39076 -5687 26004 9435 -23504 -34066 -3108 41624
879 41624 29783 -29991 -42525 6038 32730 15333 -8297 -12363 8954 25944 111 -27376
891 -27376 1926 40771 24015 -14973 -26168 -5957 26906 32655 -6364 -28725 2007 24063
903 24063 4922 -14144 -11408 3546 20872 12213 -21099 -22666 9795 16848 -1512 -8259 -6289
$$ packed form
814e547r393j786K2919J8211k8340l0547K0323K6046o380j2388k055O653J3233
827A0949r974l0131J5316M9930L28m8466k1790K5483M1339J3958m0136l9295K8279
840d210M6334j4603l8962R55K6336J3366j8268l5587N760N2047O993n8567k9114
853d7520L7073M0316j487l9545l3460K5320M9259j2175n0380r74M0118J5440k1102
866H83l0792j707M0569K0480l9919k8590L3389L1691j6569l2939j0562L0958M4732
879D1624j1841n9774j2534M8563K6692j7397k3630m066K1317J6990k5833k7487
891b7376K9302L8845j6756l8988j1195K0211L2863N749l9019k2361L0732K2056
903B4063j9141j9066K736J4954J7326q659l3312j567L2461P053j8360o747J970
$$ plain form
916 -6289 -1883 6747 -2694 -19655 -4816 18835 6537 -15945 -18680 -11310 3700 15433 -2087
929 -2087 -21005 -6809 7499 -3709 -8859 -1900 204 5116 4639 -12919 -13069 12975 17529 -2547
943 -2547 -7305 167 4222 10686 7016 -6776 2361 19436 6808 -8283 1280 11103 10487 10059 -927
958 -927 -10109 5396 16175 2293 -2982 5707 644 -5349 -193 -2439 -2899 6791 1165 -13477 -5718
973 -5718 2315 -8776 -9063 2214 -773 -7724 -7545 -12942 -9259 7226 1505 -17380 -9504 6090
987 6090 -393 -10510 -11657 -7403 11001 19439 -8348 -27165 -1681 21164 12089 -2583 -7528
1000 -7528 -1342 15762 14199 -9065 -4835 23103 19898 -7743 -12009 4495 21623 22516 -5420
1013 -5420 -24456 3829 32393 9351 -20128 -11415 11442 17612 2058 -22229 -14622 22727 21511
$$ packed form
916f289M406Q630r441j6961J4839K3651j2298k2482k735P370J5010J1733j7520
929b087j8918J4196J4308j1208n150O959K104M912m77j7558j50K6044M554k0076
943b547m758P472M055O464l670j3792R137J7075j2628j5091R563R823o16m28j0986
958i27r182J5505J0779j3882n275Q689n063n993N156k246m60R690n626j4642P759
973e718Q033j1091k87J1277k987o951J79n397L683J6485n721j8885P876J5594
987F090o483j0117j147M254J8404Q438k7787j8817K5484K2845r075j4672m945
1000g528O186J7104j563k3264M230K7938l205k7641m266J6504J7128Q93k7936
1013e420j9036K8285K8564k3042k9479Q713K2857O170j5554k4287P607L7349j216
$$ plain form
1026 21511 -20314 -29299 4523 22926 7156 -21366 -29929 3745 34816 5094 -39809 -26000
1038 -26000 15673 23055 -2418 -27861 -24334 10033 22667 -11645 -28862 685 20065 2102
1050 2102 -19152 -19279 4738 31372 15601 -26528 -24375 15582 27983 8232 -7871 -9239 6177
1063 6177 20712 4096 -15431 3052 23554 9750 -8022 -7176 1638 12917 12719 -8361 -11156
1076 -11156 14725 19501 -6000 -15804 -4759 7395 17103 7547 -16350 -15267 5516 4780 -7657
1089 -7657 -3400 -152 -3843 -4423 -11857 -18431 -860 13917 -2456 -17824 -12355 -4470 3268 7861
1103 7861 -5695 -15249 1392 12692 1637 -3814 -1288 -1033 7057 12160 -1564 -5986 9205 9304
1117 9304 -3070 -1201 5379 5975 9429 3069 -10963 -2006 16259 10191 -2533 -371 1632 2676
$$ packed form
1026B1511m1825q985L3822J8403j5770k8522q563L3674L1071k9722m4903J3809
1038b6000M1673P382k5473k5443L527L4367J2634l4312j7217K9547J9380j7963
1050B102k1254j27K4017K6634j5771m2129K153L9957J2401j9751j6103j368J5416
1063F177J4535j6616j9527J8483K0502j3804j7772Q46Q814J1279j98k1080k795
1076a1156K5881M776k5501r804J1045J2154R708r556k3897J083K0783p36j2437
1089g657M257L248l691n80p434o574J7571J4777j6373j5368N469P885P738M593
1103G861j3556r554J6641J1300j1055n451K526K55Q090N103j3724m422J5191R9
1117I304j2374J869O580N96L454o360j4032Q957J8265o068j2724K162K003J044
$$ plain form
1131 2676 9799 3963 -5875 3311 9938 -2352 -4226 4897 718 -4486 -1980 -5619 -5305 4409 -1467
1146 -1467 -16373 -10792 -1237 -4514 -3314 -751 -10752 -12556 -3329 -3314 -3475 5027 290 -10177 -2227
1161 -2227 5125 -2609 -1291 6263 4034 3986 4323 -6466 -5553 13939 14376 -2830 -3069 5686 7406 8420
1177 8420 1916 -8168 4515 24290 11521 -9938 -6998 5293 11746 12050 -471 -10190 4277
1190 4277 12299 -7193 -15868 338 8438 2045 -7943 -18766 -12332 8865 5326 -17858 -14682 3300
1204 3300 3762 -5726 -10941 -10243 4391 14950 -4092 -18123 822 15190 2710 -7971 -6112
1217 -6112 2140 13328 8211 -14599 -13953 11603 14709 -3597 -8423 -2862 4592 10477 869 -13139
1231 -13139 301 19320 7647 -8077 -3809 3681 10171 13045 -479 -10411 4578 14061 1132
$$ packed form
1131B676P123n836r838R186O627j2290j874R123m179n204K506l639L14R714n876
1146a467j4906N581R555l277J200K563j0001j804R227J5j61Q502m737j0467P950
1161b227P352p734J318P554k229m8L37j0789R13J9492M37j7206k39Q755J720J014
1177H420o504j0084J2683J9775j2769k1459K940J2291O453L04j2521r719J4467
1190D277Q022j9492q675J6206Q100o393r988j0823O434K1197l539k3184L176J7982
1204C300M62r488n215O98J4634J0559j9042j4031J8945J4368j2480j0681J859
1217f112Q252J1188n117k2810O46K5556L106j8306m826N561P454N885r608j4008
1231a3139J3440J9019j1673j5724M268P490O490K874j3524r932J4989R483j2929
$$ plain form
1244 1132 -6067 -1519 -159 4536 7224 -5986 -12710 291 3953 -3713 -1936 -953 -6183 -779 2200
1259 2200 -7814 -6323 5765 3480 -3149 -1605 -5382 -6636 4422 4955 -7208 -4576 3250 -2774
1273 -2774 -6137 -2273 -4505 -1221 7133 -1962 -12474 -705 8831 1682 -2583 -1347 648 9879
1287 9879 11591 -5831 -9113 10977 16369 3359 -2420 -1844 3238 12365 6157 -10541 -4010 14489
1301 14489 7968 -7059 -7167 -1332 5912 9994 -3840 -14264 1493 12971 -307 -8663 -3001
1314 -3001 241 3128 3796 -8133 -10382 4099 4577 -9469 -8281 -1345 -3377 -2170 -3360 -11160 -6934
1329 -6934 5159 -1562 -10094 -2792 951 -2801 1773 2127 -3296 2587 7815 -634 -818 9240 6702
1344 6702 2496 5902 2673 -488 8977 9727 -765 247 6288 2465 4160 6366 -2974 -5176 6932
$$ packed form
1244A132p199M548J360M695K688j3210o724J3001L662p666J777R83n230N404K979
1259B200j0014J491J2088k285o629J544l777j254J1058N33j2163K632P826o024
1273b774l363L864k232L284Q354r095j0512J1769R536p149m265J236J995R231
1287I879J712j7422l282K0090N392j3010n779N76N082R127o208j6698O531J8499
1301A4489o521j5027j08N835P244M082j3834j0424J5757J1478j3278q356N662
1314c001L242K887O68j1929k249J4481M78j4046J188O936k032J207j190p800M226
1329f934J2093o721q532P302L743l752M574L54n423N883N228q449j84J0058k538
1344F702m206L406l229l161R465P50j0492J012O041l823J695K206r340k202J2108
$$ plain form
1359 6932 7254 -1868 -1840 -1125 -1696 5680 4407 -10107 -7211 6888 3458 -7366 -7406 -6731 -2358 5349
1375 5349 -4708 -18264 -7408 6589 -1590 -10937 -9763 -5685 2144 6409 -6808 -12385 3333
1388 3333 8474 -1984 -3013 3116 4353 7340 5397 -5032 -497 14319 8551 -3635 828 5733
1402 5733 4321 6284 2110 -4183 4278 10881 144 -4581 4571 3806 -526 2675 451 -1961 5687
1417 5687 4292 -6970 -3479 4465 -1043 -3684 666 -4134 -5710 981 -2372 -8861 -2758 -1341 -7078
1432 -7078 -2351 1551 -7221 -8291 308 -215 -1829 1285 -3854 -6097 4361 4464 -6078 -2229 6906
1447 6906 3589 -588 -1211 -5120 1861 12992 3034 -9789 -978 8582 3889 384 -1496 -1603 8715
1462 8715 10865 -5572 -9479 7883 12848 3201 -2073 -3065 1336 10536 4529 -10977 -2299 14616
$$ packed form
1359F932L22r122K8P15n71P376j273j4514K896J4099l430j0824m0O75M373P707
1375E349j0057j3556J0856J3997q179r347J174M078P829M265j3217n577J5718
1388C333N141j0458j029O129J237K987j943j0429M535J4816n768j2186M463M905
1402E733j412J963m174o293Q461O603j0737m725R152p65m332L201k224k412P648
1417E687j395j1262L491P944n508k641M350m800j576O691l353o489O103J417n737
1432g078M727L902q772j070Q599n23j614L114n139k243J0458J03j0542L849R135
1447F906l317m177o23l909O981J1131r958j2823Q811R560m693l505j880j07J0318
1462H715K150j6437l907J7362M965r647n274r92M401R200o007j5506Q678J6915
$$ plain form
1476 14616 7060 -9277 -10121 -3192 7271 11008 -5993 -18227 -2440 10333 -1499 -10727 -6197
1489 -6197 -295 4748 1318 -14013 -13428 6714 9400 -6569 -10319 -3308 983 4518 -1516 -11876
1503 -11876 -4266 11722 4601 -8657 -5493 1217 4283 7873 640 -8325 1817 11991 2864 -2785
1517 -2785 3355 5650 5280 5973 -1110 -2054 11487 11635 -3513 -5574 3760 6385 7194 3090 -8177
1532 -8177 -5835 8254 4552 -8017 -4593 2136 217 -1394 -6627 -11311 -333 9212 -3859 -14829
1546 -14829 -6089 1205 1208 -1252 -9545 -10841 4930 9452 -8112 -13629 -2020 5516 6358 1686 -9016
1561 -9016 -7334 8133 7955 -3397 -711 6447 3282 720 -104 -1763 6867 14298 2433 -7821
1575 -7821 864 6897 3930 4791 3943 -949 2855 4147 -4143 -833 8563 2553 -5513 -613 1024
$$ packed form
1476A4616p556j6337q44O929J0463L737j7001j2234J5787J2773j1832r228M530
1489f197N902N043l430j5331N85K0142K686j5969l750P011M291L535o034j0360
1503a1876P610J5988p121j3258L164O710L066L590p233q965J0142J0174r127n649
1517b785O140K295l70O93p083r44J3541J48j5148k061R334K625Q09m104j1267
1532h177K342J4089l702j2569L424O729j919j611n233m684J0978R545j3071j0970
1546a4829Q740P294Lk460q293j296J5771M522j7564n517J1609P536Q42m672j0702
1561i016J682J5467j78j1352K686P158l165k562q24j659Q630P431j1865j0254
1575g821Q685O033k967Q61q48m892L804J292q290L310R396o010q066M900J637
$$ plain form
1590 1024 -2120 262 -2280 -5826 1892 4941 -7311 -10071 -705 40 -2193 -259 -3483 -6348 -366
1605 -366 -2307 -7439 604 6514 -3842 -8351 -1538 903 2110 3365 -3929 -5869 4169 3463 -5835
1620 -5835 -1038 8486 4439 -2553 -4696 -3304 7540 14328 -849 -12152 2076 14449 6632 -3195
1634 -3195 -5439 1470 15125 12050 -10208 -12598 8698 15917 2566 -6957 -6506 2447 11266 696
1648 696 -15022 -4265 13929 6229 -11316 -12713 -3325 8270 9629 -8285 -17619 -952 9837
1661 9837 -2128 -9557 -3700 1205 3175 -2550 -12679 -6783 10811 6121 -12006 -10566 1381 5412
1675 5412 3288 -5078 -9891 2976 14052 331 -12187 -1783 10081 10424 4384 -4736 -5358 9546
1689 9546 13974 -827 -4974 6849 9918 4035 -1309 -5918 1190 14691 8444 -9888 -9393 2999
$$ packed form
1590A024l144K382k542l546P718L049j2252k760R366P45k233J934l224k865N982
1605c66j941n132Q043N910j0356m509O813K441J207J255p294j940J0038p06r298
1620e835M797R524m047o992k143J392J0844O788j5177j1303J4228J2373p817r827
1634c195k244O909J3655l075k2258k390K1296P219j3351r523M51Q953Q819j0570
1648F96j5718J0757J8194p700j7545j397R388J1595J359j7914r334J6667J0789
1661I837j1965p429N857M905J970n725j0129N896J7594m690j8127J440J1947M031
1675E412k124q366m813J2867J1076j3721j2518J0404J1864L43o040r120o22J4904
1689I546M428j4801m147J1823L069n883n344m609P108J3501o247j8332M95J2392
$$ plain form
1703 2999 6015 4274 -1778 -9692 -3827 7195 636 -10209 -4726 2354 130 -1870 -6509 -10330
1717 -10330 -1052 6241 -3994 -10209 -2988 -459 -2478 -1868 -5208 -5236 4605 4772 -7765 -7261 3448
1732 3448 4831 4034 3826 -2038 -1222 7716 4870 -732 6426 10335 2192 -484 1420 1894 7799 10176
1748 10176 -861 -6065 3540 5680 -325 87 121 -2388 2196 2168 -6207 -4438 3377 -424 -4558 -677
1764 -677 -1988 -4646 -481 -1619 -5613 -302 2012 -6647 -6527 -102 -2206 -3148 1368 -1488 -5544 -1901
1780 -1901 -1567 -2507 4516 5907 -5137 -5669 3079 4964 4194 4242 -1065 -556 7764 5169 -3593 2001
1796 2001 9076 3872 -1103 -1877 -1251 5466 8013 -3873 -9371 3527 8755 -479 -6383 -4212 1105
1811 1105 8573 4102 -10439 -8098 7967 7428 -3552 -5297 -1605 2393 4224 -4300 -11177 1142
$$ packed form
1703B999L016j741o052p914N865J1022o559j0845N483P080k224k000m639l821
1717a0330R278P293j0235o215P221K529k019O10l340k8R841J67j2537N04J0709
1732C448J383p97k08n864Q16Q938k846n602P158L909q143k676J904M74N905K377
1748A0176j1037n204R605K140o005M12L4k509M584k8q375J769P815l801m134L881
1764f77j311k658M165j138l994N311K314q659J20O425k104r42M516k856m056L643
1780a901L34r40P023J391j1044n32Q748J885p70M8n307N09Q320k595q762N594
1796B001P075n204m975p74O26O717K547j1886n498J2898N228r234n904K171N317
1811A105P468m471j4541K341J6065n39j0980j745L692L998J831q524o877J2319
$$ plain form
1825 1142 11628 -329 -12499 -7939 754 6679 4456 -8278 -11893 2631 7651 -3552 -6707
1838 -6707 -28 2883 3114 -1004 -7614 -1968 10097 4364 -7607 -3642 4548 4313 1582 -3146 -5762
1853 -5762 4062 10411 -1482 -8236 465 6251 4161 1671 -2402 -1865 7188 7125 -3754 -2286 7593
1868 7593 6201 341 -1405 -2546 2156 9673 2845 -9168 -4583 3928 2627 -237 -2711 -7478 -3373
1883 -3373 3430 -3005 -8654 -2113 1513 -1994 -2724 -5316 -7482 1145 5683 -3216 -7232 -1262 689
1898 689 -352 1167 -2524 -3862 4436 5269 -3911 -3528 2472 2191 3341 4709 -947 -1405 5216 3983
1914 3983 646 5502 5830 541 1688 3885 1212 3991 6873 725 -1848 3346 1274 -2963 995
1929 995 1564 -2478 -734 -486 -6492 -4098 1074 -2206 -4600 -1271 -3720 -5458 11 -543 -5682 -2437
$$ packed form
1825A142J0486j1957j2170M560Q693N925k223j2734l615J4524N020j1203l155
1838f707O679K911K31m118o610N646J2065n733j1971L965Q190k35k731m728k616
1853e762R824O349j1893o754Q701N786k090k490m073N37R053o3j0879J468R879
1868G593j392n860j746j141M702P517o828j2013M585Q511j301k864k474m767M105
1883c373O803o435n649O541L626l507p30k592k166Q627M538q899m016N970J951
1898F89j041J519l691j338Q298Q33r180L83O000k81J150J368n656m58O621j233
1914C983l337M856L28n289J147K197k673K779K882o148k573N194k072m237L958
1929I95N69m042J744K48o006K394N172l280k394L329k449j738N469n54n139L245
$$ plain form
1945 -2437 929 -2975 -1888 -48 -5097 -3624 4454 1817 -3978 -2067 -467 -322 4130 1621 -5005
1960 -5005 682 8492 3747 -1633 -31 1530 5514 9021 1362 -4700 4453 10542 2826 -2495 7
1975 7 3231 7333 5896 -5360 -7162 5568 6953 -2607 -5112 -1776 579 2493 -2286 -10466 -3919
1990 -3919 6576 854 -7965 -5261 -1105 -345 364 -4575 -6414 2635 4553 -6344 -8321 477 4265
2005 4265 1522 -1885 -5898 -2647 7012 2942 -7358 -3202 6434 5311 324 -2855 -3601 4453 11089
2020 11089 1850 -6522 1369 8012 3852 567 -1513 -870 6989 7503 -3700 -6307 2998 5684 2097
2035 2097 -128 -2815 -2765 3632 3183 -4374 -2618 3484 853 -1359 -241 -2815 -2281 3144 626 -4582
2051 -4582 -1309 969 -2713 -1561 -285 -4261 -2506 2208 -1744 -5009 -1476 -1445 -3129 968 377 -4217
$$ packed form
1945b437L366l904J087J840n049J473Q078k637n795J911J600J45M452k509o626
1960e005N687P810m745n380J602J561L984L507p659o062R153O089p716n321K502
1975GL224M102j437j1256j802J2730J385r560k505L336K355J914m779q180O547
1990c919J0495n722q819K704M156P60P09m939j839R049J918j0897j977Q798L788
2005D265k743l407m013L251R659m070j0300M156R636j123m987l179p46Q054O636
2020A1089r239q372P891O643m160l285k080O43P859N14j1203k607R305K686l587
2035B097k225k687N0O397m49p557J756O102k631k212J118k574N34N425k518n208
2051d582L273K278l682J152J276l976J755M714l952l265L533L1j684M097n91m594
$$ plain form
2067 -4217 -1098 2080 -2613 -2480 2146 1003 -158 2689 -150 -1693 4574 4441 -1966 158 4796
2082 4796 2587 2588 2647 -1794 797 7568 3838 -2598 1034 4048 1794 2427 285 -3197 2667 6163
2098 6163 -1024 -5850 -84 1779 763 754 -4065 -5920 1630 3819 -4778 -6528 -1702 -833 -1013 -1047 -5833
2115 -5833 -5293 2223 1422 -6112 -3610 277 230 439 -1244 -5404 -1052 6500 1515 -5158 -362 3119
2131 3119 2751 3000 -453 -3056 3809 8198 339 -2996 2894 4827 3639 2386 -1932 -798 7546
2146 7546 6311 -3864 -3300 3966 4889 2188 -1184 -5059 -210 7434 1286 -7925 -2809 3826 1451
2161 1451 -2212 -5133 -5712 1478 5278 -5001 -9338 -731 2935 -1422 -4471 -5941 -2846 4832 2312
2176 2312 -8123 -6469 3061 3244 -1557 -2425 -2869 680 5191 -884 -6718 1571 8173 2712 -2096
$$ packed form
2067d217L119L178m693J33M626j143j161K847k839j543O267j33o407K124M638
2082D796k209JN9m441K591O771l730o436L632L014k254O33k142l482N864L496
2098F163p187m826N766J863j016rm819j855P550K189q597j750M826Q69j80l4m786
2115e833N40P516q01p534K502L887m7K09j683m160M352P552m985o673M796L481
2131C119l68K49l453k603O865M389p859l335N890J933j188j253m318J134Q344
2146G546j235j0175N64P266R23k701l372l875M849P644o148r211N116O635k375
2161A451l663k921n79P190L800j0279m337Q607L666m357l049j470L095P678k520
2176B312j0435J654R530J83m801q68m44L549M511o075n834Q289O602n461m808
$$ plain form
2191 -2096 -1258 697 4809 6307 -1361 -3254 5804 6750 -395 -2118 986 2800 5841 3577 -4073
2206 -4073 -2444 4954 2760 -1910 130 536 1 2060 -773 -5255 -870 3206 -375 -2824 -1265
2221 -1265 -3187 -3073 805 -1181 -4538 -1527 -488 -3883 -1837 -748 -4364 -2367 2283 -960 -3910
2236 -3910 -893 -1047 -825 2162 528 -3455 1113 3802 -795 -1439 2235 1572 1706 3142 -560 -1291
2252 -1291 5051 4449 -1659 -180 4362 3412 2510 983 -2205 1429 7372 2313 -3510 1135 3961 1595
2268 1595 5 -1729 -1866 3707 5144 -4344 -7723 484 3225 -423 -2865 -5916 -3683 3386 969
2283 969 -9245 -7670 1717 2845 -1479 -5041 -7531 -2553 5481 1152 -6684 -2491 3820 1365 -1465
2298 -1465 -2631 -2432 4880 7889 -680 -6313 1036 6238 3832 1734 -222 -351 5511 5799 -2033 -1473
$$ packed form
2191b096Q38J955M112J498p668j893R058R46p145j723L104J814L041k264p650
2206d073J629P398k194m670K040M06n35K059k833m482M385M076l581k449J559
2221a265j922J14L878j986l357L011J039l395K046J089l616J997M650l243k950
2236c910L017j54K22K987j634l983M568K689m597o44L674o63J34J436l702p31
2252a291O342o02o108J479M542r50r02j527l188L634N943n059n823M645K826k366
2268A595j590j734j37N573J437r488l379Q207K741l648k442l051K233P069k417
2283I69j0214J575R387J128m324l562k490M978Q034m329p836M193O311k455k830
2298a465j166J99P312L009q569n633P349N202k406k098j956j29N862K88p832N60
$$ plain form
2314 -1473 6193 5444 1168 -12 -1085 1361 5622 1457 -5047 -226 5711 734 -4210 -3583 -2544
2329 -2544 2365 3661 -5055 -9244 -614 4003 -1565 -4716 -3801 -1931 2429 486 -7301 -4902 5243
2344 5243 4101 -4323 -5947 -2174 2513 6137 263 -8234 -2562 6572 3305 -2516 -2717 -212 2967
2359 2967 4792 -1228 -4967 2571 7000 1130 -1687 420 1412 3742 4213 -1402 -1298 5434 4377 -1643
2375 -1643 -385 1965 1520 2833 2135 -3121 -1533 2763 43 -1679 1474 -9 -3461 -1355 -1220 -2529
2391 -2529 1010 1810 -3958 -4173 -618 -1258 -1522 879 -1664 -4328 -644 214 -2910 -1044 98 -2502
2407 -2502 -482 2276 -1994 -3405 1822 2064 260 1414 -157 -1773 3553 4249 -1455 -545 4876 3314
2423 3314 964 775 -1275 2064 7693 2912 -5409 -2200 4430 3686 1506 -1160 -3978 878 5517
$$ packed form
2314a473P666p49m276j180j073K446M261m165o504M821N937m977m944O27J039
2329b544M909J296q716m189Q630M617n568l151R15J870M360j943p787K399J0145
2344E243j142q424j624L773M687L624n874q497N672R134l267n821k01K505L179
2359B967J825o020l739P538M429n870k817K107R92K330M71n615J04O732j057o020
2375a643J258K350m45J313o98n256J588M296k720j722L153j483l452K106J35j309
2391b529L539Q00n768k15L555o40k64K401k543k664L684Q58l124J866J142k600
2407b502K020K758m270j411N227K42j804J154j571j616N326O96n704R10N421j562
2423C314k350j89k050L339N629m781q321L209O630p44k180k666k818M856M639
$$ plain form
2438 5517 -538 -5481 390 4068 492 -1812 -3911 -2675 4359 4690 -4787 -6317 1128 2617 -1039
2453 -1039 -3078 -4364 -1309 4182 -149 -8264 -4772 2726 1781 -1968 -3470 -3934 158 3530 -2032
2468 -2032 -5698 1879 6164 428 -3309 -1912 1282 7180 6496 -3413 -4850 4686 7278 1651 -383
2483 -383 139 2261 6047 2541 -4659 -896 7439 4657 -1917 -2432 -1165 2636 4985 -995 -6341 578
2499 578 5412 -880 -5898 -3922 -720 3019 2237 -6260 -8442 548 3381 -2954 -4483 -2755 -1511
2514 -1511 1263 -1086 -6465 -2407 5382 2235 -4362 -3063 615 3091 4676 -286 -5407 1011 7206
2529 7206 2009 -2201 402 1909 3286 3597 -1603 -3025 3991 5890 -473 -1626 1413 1899 2952
2544 2952 2127 -2340 -910 5204 2806 -3233 -2096 584 1159 3212 726 -5250 -3069 2380 243
$$ packed form
2438E517o055m943N871L678l576k304k099J236P034L31r477j530P445J489l656
2453a039k039j286L055N491m331q115L492P498r45l749j502m64M092L372n562
2468b032l666P577M285n736l737J397L194N898o84r909j437R536K592n627k034
2483c83N22K122L786l506p200L763Q335k782o574n15J267L801K349n980n346O919
2499E78M834o292n018J976L202L739p82q497k182Q990K833o335j529J728J244
2514a511K774k349n379M058P789l147o597J299L678K476J585m962n121O418O195
2529G206n197m210K603J507J377L11n200j422P016J899o363j153L039M86J053
2544B952q25m467J430O114k398o039J137K680N75K053k486n976K181N449k137
$$ plain form
2559 243 -2053 -711 -2376 -3307 -423 -1628 -4635 -736 1740 -3142 -3652 -1693 -2148 108 2248 -2177
2575 -2177 -4588 379 2250 -1221 -225 102 -733 2510 3198 -2301 -2746 4087 3970 700 957 137 567
2592 567 4571 2968 -2799 1036 6587 2834 -1868 -1535 -6 4166 7025 -535 -6721 -509 5287
2607 5287 1648 -1886 -2495 -1926 2590 2678 -5191 -6569 1938 4224 -2330 -5296 -3914 -662 4075 480
2623 480 -8046 -4598 4026 2740 -3578 -3934 -2151 1766 4413 -1392 -7175 -573 5745 788 -3012
2638 -3012 -1430 209 2392 3150 -2768 -3117 5055 5791 -1780 -3327 783 3708 5644 2279 -4259 -1097
2654 -1097 6884 4231 -2570 -939 2524 3419 2880 -1619 -4937 2013 7100 118 -5708 -2406 1060
2669 1060 2162 1113 -4776 -5781 2195 4363 -4151 -6500 -1957 290 1733 -441 -6434 -5098 2761
$$ packed form
2559B43k296J342j665r31K884j205l007L899K476m882n10J959m55K256K140m425
2575b177k411M967J871l471R96L27q35L243O88n499m45O833j17l270K57q20M30
2592E67M004j603n767L835N551l753m702L33J529M172K859p560o186O212N796
2607E287l639l534o09N69M516Q8p869j378Q507K286o554k966J382L252M737l595
2623D80q526L448Q624j286o318l56J783L917K647n805n783O602O318m957l800
2638c012J582J639K183P58n918l49Q172P36p571j547M110K925J936l365o538L162
2654a097P981k653o801J631L463Q95n39m499l318O950N087o982n826L302L466
2669A060J102j049n889j005P976K168q514k349M543K247J443k174n993J336P859
$$ plain form
2684 2761 2132 -4107 -3391 -333 28 1033 -653 -4320 -557 5383 1381 -3523 -561 1342 2068 3719
2700 3719 1029 -2392 2259 5267 552 -621 2253 2258 1965 3366 -452 -1482 4051 4235 -1118 -555
2716 -555 1796 665 897 1338 -2583 -1586 3332 676 -3702 -1674 128 -668 661 -1451 -5333 -2055
2732 -2055 2682 -1042 -4056 -1663 -1157 -997 868 -2772 -5240 505 3589 -1979 -4081 -1957 -457
2747 -457 2282 2511 -3503 -4009 3125 4352 -853 -1893 544 2130 4814 2817 -3996 -1815 6338 5018
2763 5018 -498 -363 874 2498 4582 1166 -3911 1080 6297 1658 -2832 -917 899 2588 3141
2778 3141 -3003 -4771 2096 3928 -2224 -4336 -1419 354 1144 -517 -6197 -3697 3305 1024 -5342
2793 -5342 -4203 -72 471 829 -3344 -6105 -363 5074 -881 -5800 -2232 2006 2561 1435 -3419 -3996
$$ packed form
2684B761o29o239P16L058L61J005j686l667L763N940m002m904K962J903P26J651
2700C719k690l421M651L008m715j173K874Nk93J401l818j030N533J84n353N63
2716e55K351j131K32M41l921R97M918k656m378K028J802p96J329k112l882L278
2732b055M737l724l014K393N06J60J865l640k468N745L084n568k102K124J500
2747d57K739K29o014n06P134J227n205j040K437J586K684j997o813K181Q153j320
2763E018n516J35J237J624K084l416n077M991N217m639m490J915J816J689N53
2778C141o144j768O867J832o152k112K917J773P90j661n680K500P002k281o366
2793e342J139M131N43L58m173k761N742N437n955m919L568M238N55j126m854n77
$$ plain form
2809 -3996 3726 6217 -1409 -3486 1484 3821 3776 1952 -2321 -989 7048 4928 -2771 -1554 3475
2824 3475 3909 3233 78 -3668 943 6329 1674 -3659 -849 1399 1071 275 -2253 -3870 1208 3445
2840 3445 -2919 -4958 -617 293 -831 -964 -3713 -3510 2337 1052 -5563 -3863 760 388 -662 -1386
2856 -1386 -4077 -1714 3213 320 -4467 -547 2335 300 344 -537 -2339 2272 5491 18 -3229 1537
2872 1537 3189 2119 2101 55 -1049 3816 4990 -822 -1439 2727 2324 1397 1895 -1172 -981 4062 2617
2889 2617 -2759 -1180 1752 193 581 -368 -3718 -1565 3131 -106 -4424 -2042 -402 -1359 -558 -1856
2905 -1856 -4735 -1001 2154 -2779 -4245 -879 -514 -911 -272 -2744 -3396 2266 2828 -2364 -2538 1588
2921 1588 1820 2042 1663 -2017 -533 5388 3409 -2059 39 2956 2793 2944 1167 -2442 1866 6445
$$ packed form
2809c996P722K491p626k077M970K337m5j824m273J332Q037k120p699J217N029
2824C475M34o76l155l746M611N386m655n333K810K248l28p96k528j617N078K237
2840C445o364k039M341R10j124j33k749K03N847j285o615J700M623l72j050p24
2856a386k691K363M927k893m787L920K882k035M4q81j802M611L219n473l247M766
2872A537J652j070j8k046j104M865J174n812o17M166m03r27M98l067J91N043j445
2889B617n376J579K932j559L88r49l350K153M696l237m318K382J640r57Q01j298
2905a856k879L734L155m933j466L366L65l97O39k472o52N662N62n192j74M126
2921A588K32K22l79l680J484N921j979n468K098K917j63J51j777l609M308M579
$$ plain form
2937 6445 1415 -3332 319 2922 2758 2132 -2205 -3678 2790 5372 -1927 -4254 57 1637 981 -87
2953 -87 -3991 -3195 3046 1583 -5295 -4061 520 547 -782 -2794 -5609 -1263 3716 -820 -6048 -2194
2969 -2194 1686 627 -646 -2919 -3397 2167 4222 -2435 -4374 1422 3466 882 -199 -1814 364
2984 364 5880 3569 -3440 -1455 4499 4270 1137 59 -1063 2569 6382 1455 -3925 582 4929
2999 4929 2090 -41 -1253 -1705 2300 4153 -2300 -5144 744 2405 -1000 -2094 -3723 -3021 1472
3014 1472 1350 -4880 -4768 249 -302 -2061 -1655 -2727 -1990 1923 -271 -4283 -1319 2143 32 -413
3030 -413 -65 -1535 301 3104 -75 -2269 1842 2819 -182 418 946 56 2682 3772 -541 -996 3339
3047 3339 2750 316 980 655 148 3776 2874 -2348 -1027 3080 1565 315 -50 -2205 -860 3044
$$ packed form
2937F445n030m747L651K603j64o26m337j473O468K582p299k327M311J580o56j068
2953h7l904P96O241j463o878J234M581K7j329k012k815M346M979m536n228L854
2969b194L880j059j273k273m78N564K055o657j939N796K044k584j081j615K178
2984C64N516k311p009J985N954k29l133j078j122L632L813m927n380M507M347
2999D929k839k131j212m52M005J853o453k844N888J661l405j094j629P02M493
3014A472j22o230J12N017n51j759M06j072P37L913k194m012K964L462k111m45
3030d13L48j470J836K803l179k194M111R77l001O00N28q90K626J090m313m55M335
3047C339n89k434O64l25n07L628r02n222J321M107j515j250l65k155J345L904
$$ plain form
3063 3044 156 -3989 -1443 1340 -173 -1193 -1749 -3772 -611 2964 -1810 -5955 -1671 566 -460
3078 -460 -989 -3080 -4131 1203 2768 -2985 -4294 88 1361 638 55 -2517 -1727 3772 3148 -2849
3094 -2849 -1628 2657 2786 2055 889 -1628 1771 5952 2163 -2806 515 4241 2643 1701 -402 -1586
3110 -1586 2859 4789 -1087 -3250 1696 2648 -499 -1412 -2630 -618 3612 1217 -5656 -4333 2112
3125 2112 2219 -1573 -3290 -3941 -681 3447 -932 -6422 -1934 2975 501 -2594 -2770 -2367 1680 3755
3141 3755 -2747 -5455 837 3564 185 -1977 -1929 -202 4526 3578 -3356 -3228 3695 3995 801 -120
3157 -120 -219 1134 4533 2369 -3018 491 5049 1954 -876 -593 209 2431 4553 -644 -3944 1238
3173 1238 3820 -245 -1656 -974 -979 1565 1417 -3615 -3620 1483 1092 -2682 -2276 -1682 -1887 766 -519 -4936
$$ packed form
3063C044k888m145K546K783j513j020n56k023L161L575m774m145M284K237j026
3078d60n29k091j051N334J565n753j309M382J273p23n83k572P90N499o24n997
3094b849J221M285J29p31j166k517L399M181l789m969L321L726j598r42k103j184
3110a586M445J930n876k163M946R52l147r13j218K012M230k395o873J323O445
3125B112J07l792j717o51L260M128m379n490M488M909k474l095j76M03M047K075
3141C755o502k708O292K727l379k162M8J727M728r48o934J28O923L00l194r21
3157a20r9J353L399k164n387L509M558l095k830K83Q02K222K122n197l300N182
3173A238K582m065j411O82nK544j48n032nN103l91l774M06N94k05K653j285m417
$$ plain form
3191 -4936 -2133 1873 -172 -2939 -2116 -1776 203 2452 -775 -4392 -256 3605 1148 -55 92 -528
3207 -528 1452 3594 -313 -1598 3007 3718 352 325 544 587 3529 3765 -939 -1252 3000 2489 453
3224 453 639 -535 -300 2894 1402 -3294 -1296 2748 182 -909 -869 -2488 -945 2230 -868 -4502
3240 -4502 -616 1603 -1691 -2628 -2333 -2551 997 2306 -3895 -5299 436 1718 -580 -1371 -1886 -1652
3256 -1652 2328 1656 -3479 -2093 3038 2822 -142 -823 -988 1244 5175 1422 -3115 417 4904 2359
3272 2359 -167 -416 -127 3693 4988 -515 -4147 1745 4798 1315 -732 -1387 -754 2756 2448 -3392
3288 -3392 -2842 2651 2437 -2256 -2724 -1767 -7 2575 -532 -5678 -2608 2271 219 -3060 -2649 -1792
3304 -1792 176 1483 -2927 -5012 891 3393 -1124 -3018 -1263 198 2067 1628 -2780 -2239 3764
$$ packed form
3191d936K803M006k045k767Q23L40J979K249l227l617M136L861k457j203J47o20
3207e28J980K142l907j285M605P11l366k7K19M3K942K36m704l13M252n11k036
3224D53J86j174K35L194j492m696J998M044k566j091M0j619J543L175l098l634
3240d502L886K219l294r37K95k18L548J309o201j404N735J282k298p91n15K34
3256a652L980o72n135J386N131k16k964o81j65K232L931l753m537L532M487k545
3272B359k526k49K89L820J295n503l632N892L053l483k047o55O33L510l08n840
3288c392N50N493k14m693m68R57J760K582l107n146L070M879k052l279M11Q57
3304a792J968J307m410k085N903K502m517j894J755J461J869m39m408N41O003
$$ plain form
3319 3764 3402 -1684 -1632 385 2334 4229 1488 -3438 -588 4991 3004 -467 300 979 1548 3246
3335 3246 34 -2397 2046 4442 -101 -2479 -416 590 1886 1934 -2432 -3422 1498 2079 -1922 -1983
3351 -1983 -735 -1086 174 -134 -3408 -2949 1358 7 -2808 -1650 -1109 -1604 229 -521 -3249 -539
3367 -539 2395 -1081 -2488 -200 211 381 1968 -516 -2626 1228 3255 274 195 1467 481 1348 2567
3384 2567 -598 -579 3422 2820 -512 274 1157 1148 3040 2398 -2086 -1206 3103 1770 -823 -426 -707 -65
3402 -65 2299 -225 -4180 -1459 1962 -6 -1587 -1492 -2608 -656 1250 -2236 -4437 76 1946 -1759
3418 -1759 -2521 -2075 -1396 1614 1828 -3507 -3706 1435 2088 -580 -1084 -625 104 2742 1171 -3091 -75
3435 -75 4246 2258 -943 -413 563 2589 4207 -64 -2685 1821 5055 1091 -1449 -117 1265 3024
$$ packed form
3319C764l62n086N2K017J949J895k741m926K850N579j987l471P67O79N69J698
3335C246l212k431M443K396m543k378K063J006J296M8m366r90M920N81m001o1
3351a983J248l51J260l08l274M59M307j351k815J158N41m95J833p50k728K710
3367e39K934l476j407K288M11J70J587k484k110L854K027k981p9J272r86Q67J219
3384B567l165J9M001o02l332P86Q83rJ892o42m484Q80M309j333k593L97k81O42
3402f5K364k524l955K721L421j968j581R5j116J952J906l486k201M513J870l705
3418a759p62M46O79L010K14n335j99N141O53k668n04M59P29K638j571m262L016
3435g5M321j988l201N30R76K026J618m271k621M506L234l964k540J332J382J759
$$ plain form
3451 3024 2737 -2633 -3156 3139 3458 -1370 -2236 -761 342 1707 -100 -4268 -1813 3397 559 -4002
3467 -4002 -3246 -655 902 1474 -2337 -5499 -588 3104 -1089 -3794 -1408 -116 676 524 -2836 -3183
3483 -3183 2086 2934 -2119 -2182 955 1486 1602 851 -1559 -195 4329 1739 -1965 -65 2358 1980 2145
3500 2145 324 -1455 1286 4320 496 -1397 1349 1769 650 951 -1162 -1450 2334 2554 -1976 -2479
3516 -2479 217 74 221 193 -2720 -2749 792 613 -3133 -1894 -258 -1079 -41 -299 -3467 -2001 1464
3533 1464 -412 -2241 -670 -561 -1087 896 179 -2458 223 2330 -30 -1068 528 586 919 2487
3549 2487 384 -1441 1856 3153 676 284 1369 430 1637 2337 -223 -140 3056 2108 -1039 38
3565 38 1068 183 1710 887 -2185 -410 2557 418 -2018 -754 -294 42 742 -1556 -3862 -145 2015
$$ packed form
3451C024k87n370n23O295L19m828q66J475J103J365j807m168K455N210k838m561
3467d002P56K591J557N72l811l162M911L692m193k705K386J292P92j52l360l47
3483c183N269Q48n053o3L137N31J16p51k410J364M524k590l704J900K423l78J65
3500B145j821j779K741L034l824j893K746M20j119L01k113k88L784K20m530n03
3516b479K696j43J47k8k913k9L541j79l746J239J636q21J038k58l168J466L465
3533A464j876j829J571J09n26J983p17k637K681K107k360j038J596N8L33J568
3549B487k103j825L297J297k477l92J085r39J207P00k560Q3L196r48l147J077
3565C8J030q85J527q23l072J775K967k139k436J264M60L36P00k298k306L717K160
$$ plain form
3582 2015 -1320 -2909 -1183 -960 40 418 -2819 -3399 1570 1758 -2226 -2663 -948 267 1975 579
3598 579 -3371 -1702 3460 2348 -1450 -971 545 1175 2606 533 -2354 1436 4586 1387 -1462 409
3614 409 1550 2081 2610 -910 -1656 2786 3656 -829 -1704 442 945 1745 677 -2858 -1602 2728 1103
3631 1103 -3462 -2105 256 312 -58 -1813 -4156 -431 2446 -1366 -4535 -1534 759 200 -331 -2664
3647 -2664 -3339 1587 2399 -2376 -3195 464 1355 631 -109 -1802 -686 3257 1946 -2753 -1164 2587
3663 2587 2118 1383 367 -1489 781 3914 1266 -1758 605 2204 1395 1632 303 -723 1553 3198
3679 3198 -332 -1468 1424 707 -340 169 -1112 -1626 1187 1118 -2587 -2197 123 -551 -759 -581 -2357
3696 -2357 -1997 660 -336 -2648 -1032 8 -1415 -687 -670 -2488 -806 1727 -419 -2066 18 557
$$ packed form
3582B015l335j589J726K23J000L78l237n80M969J88l984m37J715J215J708j396
3598E79l950J669N162j112l798M79J516O30J431k073k887L790L150l199k849J871
3614D09J141N31N29l520p46M442Q70m485q75K146N03Q00j068l535J256M330j625
3631A103m565J357K361N6l70j755k343L725K877l812l169L001K293n59n31k333
3647b664o75M926Q12m775q19L659Q91p24p40j693J116L943j311m699J589L751
3663B587m69p35j016j856K270L133k648l024K363J599q09K37j329j026K276J645
3679C198l530j136K892p17j047N09j281n14K813o9l705L90K320o74k08J78j776
3696b357L60K657r96k312J616J040j423P28J7j818J682K533k146j647K084N39
$$ plain form
3712 557 -78 1248 118 -1551 1318 2985 -108 -552 1027 1442 1624 2125 -213 -597 2822 2589 -698
3729 -698 -458 1195 1251 1489 1209 -1622 -354 2961 1262 -2235 -704 327 336 1194 -707 -3106 -614
3746 -614 2073 -1044 -2972 -1048 -474 -580 -91 -2283 -3187 720 1347 -2720 -3144 -234 132 311 -318
3763 -318 -2427 -1600 2483 1122 -2494 -1274 1047 1347 1430 -34 -2007 844 4172 698 -1857 381
3779 381 2497 1973 1559 -604 -1287 2708 4113 -284 -1892 1356 2291 1526 702 -1399 -1017 3175 1912
3796 1912 -2651 -1665 1096 851 223 -1016 -2786 -786 2634 -317 -3840 -1498 992 -408 -1122 -2024
3812 -2024 -2533 405 1514 -2595 -3432 221 1269 -548 -1246 -1422 -1301 2030 1509 -2704 -1281 2348
3828 2348 1455 -87 67 -302 848 3404 1189 -2004 805 3145 1394 337 643 35 1333 3151
$$ packed form
3712E57o35J326j130j669K869J667l093m44J579M15J82N01k338l84L419k33l287
3729f98K40J653N6K38k80k831J268L315j699l497J531J031RQ58j901k399K492
3746f14K687l117j928J924N74j06M89k192r04L907O27m067m24K910L66J79o29
3763c18k109Q27M083j361l616J220K321L00Q3j464j973K851L328l474k555K238
3779C81K116n24m14k163o83L995J405m397j608L248R35p65q24k101L82M192j263
3796A912m563R86K761k45o28j239j770K000L420k951l523K342K490j400p14r02
3812b024n09K938J109m109q37L653J048j817o98j76J21L331n21m213J423L629
3828B348q93j542J54l69J150K556k215l193K809K340j751j057L06o08J298J818
$$ plain form
3844 3151 -39 -1448 1456 2250 216 440 -256 -986 1063 2183 -1380 -1982 943 360 -985 -281 -1373
3861 -1373 -1519 875 195 -3159 -1631 193 -956 -1167 -209 -2045 -1450 792 -420 -2719 -879 426
3877 426 -686 121 -169 -1656 -140 2210 -46 -1302 1007 986 127 802 357 -439 2264 2858 -664
3894 -664 -811 1911 1842 1034 1531 -158 131 2912 1537 -1559 -128 1969 901 217 -536 -1687 233
3911 233 2603 -338 -3215 -397 1228 -327 -857 -2065 -2656 525 1652 -2178 -3720 -381 562 -454
3927 -454 -1120 -2461 -2029 1671 922 -2962 -2141 884 791 -412 -383 -1428 584 3280 725 -2204 188
3944 188 2338 1240 864 364 -791 1527 3277 4 -1112 1845 2417 288 557 -94 334 2557 2069
3961 2069 -1617 -750 2105 1264 -216 -599 -957 -164 1864 -401 -3546 -1129 1552 -88 -1311 -1332 -1981
$$ packed form
3844C151l190j409K904P94k034K24o96p30K049J120l563o02K925n83j345P04j092
3861a373j46K394o80l354J528J824j149k11R58j836N95K242j212k299J840J305
3877D26j112Q07k90j487J516K350k256j256K309k1q59O75m45p96K703N94l522
3894f64j47K722o9q08M97j689K89K781j375l096J431K097j068o84p53j151J920
3911B33K370k941k877K818J625j555n30j208n91L181J127l830j542L339R43j016
3927d54o66j341M32L700p49l884Q21L025r3j203K9j045K012K696k555k929K392
3944A88K150j098l76n00j155K318J750l273j116K957N72k129K69o51M28K223m88
3961B069l686Q67K855q41j480l83l58P93K028k265l145K417K681j640j223k1o49
$$ plain form
3978 -1981 -465 999 -1759 -3409 315 1156 -1561 -2145 -1343 -955 1495 1553 -2538 -2500 978 922 -607
3995 -607 -184 -306 62 2129 1098 -1885 -117 2815 1349 303 855 36 819 2740 898 -849 1496
4012 1496 2416 401 -62 645 67 1110 2282 -480 -1182 1067 587 -727 -29 -339 -1168 297 431
4029 431 -2119 -1477 476 -596 -1567 -563 -1532 -1908 669 -200 -2567 -1446 362 -1024 -870 -418 -1676
4046 -1676 -548 1678 -196 -2102 336 1392 216 433 -90 -955 1342 2900 -133 -1178 1813 2094
4062 2094 708 906 85 391 2881 2370 -1363 -832 2449 1926 569 576 -1115 -4 2688 344 -2698
4079 -2698 -391 1898 181 -571 -1435 -2050 420 1683 -1823 -3245 -68 657 -1083 -1460 -1739 -1576 1000
4096 1000 598 -3379 -2413 1256 901 -720 -957 -1953 -163 1967 463 -2527 -193 2491 562 -838
$$ packed form
3978a981J516J464k758j650L724Q41k717n84Q02L88K450N8m091L8L478n6j529
3995f07M23j22L68K067j031k983J768K932j466j046N52q19P83J921j842j747K345
4012A496R20k015m63P07n78J043J172k762p02K249m80j314O98l10q29J465J34
4029D31k550O42J953j072r71J004r69l76K577q69k367J121J808j386J54M52j258
4046a676J128K226j874j906K438J056j176K17n23q65K297J558l033j045K991K81
4062B094j386J98q21L06K490n11l733N31L281n23j357Pj691J111K692k344l042
4079b698K307K289j717p52q64o15K470J263l506j422L177P25j740l77k79J63K576
4096A000m02l977R66L669l55j621k37r96J790K130j504k990K334K684j929j400
$$ plain form
4112 -838 -270 -215 1562 2957 -138 -1820 1913 3365 688 243 352 268 2130 2442 -733 -1245 2295
4129 2295 2181 -249 87 55 -324 1302 550 -2081 -779 1933 -255 -1801 -489 -888 -525 1075 -1141
4146 -1141 -3144 -512 1343 -908 -1596 -611 -1622 -444 297 -1986 -2087 714 622 -1874 -1195 65 -573
4163 -573 1227 1292 -1914 -971 1981 1016 -486 182 332 169 2111 1283 -1264 689 2696 822 448
4180 448 985 206 785 2116 264 -1079 1285 1890 -289 -149 361 -619 805 1520 -961 -2071 666
4197 666 923 -954 66 -1112 -1904 109 413 -2123 -1776 407 -644 -1323 -635 -1919 -1464 990 -311
4214 -311 -3011 -620 1207 -564 -459 -414 -1099 326 2216 -131 -2014 1237 2072 420 272 170 -224
4231 -224 2355 2514 -812 -606 2607 2222 162 391 -29 650 2997 1375 -2448 -539 2391 1436 -449
$$ packed form
4112h38N68N5J777J395l095j682L733J452k677m45J09q4J862L12l175n12L540
4129B295j14k430L36l2l79J626p52k631J302K712k188j546J312l99L63J600k216
4146a141k003K632J855k251o88R85j011J178P41k283j01K801r2k496O79J260o38
4163e73J800O5l206R43K952r65j502O68J50j63J942q28k547J953K007j874l74
4180D48N37p79N79J331j852j343K364O05k179J40N10r80J424P15k481j110K737
4197F66K57j877J020j178p92K013L04k536L47K183j051o79O88j284M55K454j301
4214c11k700K391J827j771J05M5o85J425J890k347j883L251Q35j652j48j02l94
4231b24K579J59l326K06L213l85k060K29m20O79K347j622l823J909K930r55j885
$$ plain form
4248 -449 -642 -1226 523 2001 -881 -2879 171 1999 -872 -1762 -1572 -1509 620 911 -2572 -3231 413
4265 413 579 -2101 -1640 -1088 -720 932 -164 -3228 -1213 1893 685 -1344 -470 -78 677 1732 70
4282 70 -1543 1519 2977 111 -645 942 1030 1879 2088 -314 -904 2337 2531 -248 -44 1034 642 1590
4300 1590 1087 -1689 -344 2411 714 -1558 -345 -50 -222 569 -323 -2886 -528 1070 -890 -2113
4316 -2113 -604 -901 -690 307 -1617 -2706 -25 690 -1393 -1197 4 -1037 -381 607 -1288 -1249 1030
4333 1030 608 -1249 226 721 177 1290 1275 -830 -130 2115 825 -282 1224 919 508 1992 992
4350 992 -675 707 2357 181 76 1282 -115 324 1943 -205 -1215 1181 946 -1000 -630 -221
4366 -221 -1122 -4 883 -1875 -2418 522 242 -1447 -678 -1153 -1566 535 -110 -2646 -1583 1251 -359
$$ packed form
4248d49j93n84J749J478k882j998L050J828k871q90J90O3K129K91l483o59L644
4265D13J66k680M61N52L68J652j096l064K015L106j208k029Q74L92P55J055j662
4282G0j613L062J458k866p56J587Q8Q49K09k402n90L241J94k779K04J078l92R48
4300A590n03k776J345K755j697k272J213K95j72P91q92k563K358J598j960j223
4316b113J509k97K11R97j924j089K681P15k083J96J201j041O56R88j895L9K279
4333A030m22j857J475M95n44J113j5k105P00K245j290j107J506l05m11J484j000
4350I92j667J382J650k176j05J206j397M39J619k148j010K396k35j946L70M09
4366b21r01J118Q87k758n43K940k80j689P69m75m13K101o45k536J063K834j610
$$ plain form
4383 -359 -931 -262 -1104 -285 1853 -448 -2264 190 1698 50 -327 260 -304 1151 2435 -466 -1398
4400 -1398 1683 2137 274 419 496 399 2295 1851 -1048 -326 2755 1311 -462 37 225 445 1879 219
4418 219 -2644 185 2371 -161 -1658 -726 -651 364 725 -1908 -2782 627 1450 -1789 -2257 -910 -661
$$ packed form
4383c59n72O69q42Q19K138k301j816K454J508j648l77N87n64J455J284k901r32
4400a398L081M54j863J45P7r7J896m44k899P22L081j444j773M99J88K20J434j660
4418B19k863K829K186k532j497R32P5J015L61k633q74L409Q23l239m68J347K49
$$ [...]
8191E30
##END NTUPLES=NMR FID
##END=
