##TITLE=1H_EC-3202(II-4)
 CDCl3, 8 sc, 
 22.8.2019
##JCAMPDX= 6.0         $$ Bruker NMR JCAMP-DX V2.0
##DATA TYPE= NMR FID
##DATA CLASS= NTUPLES
##ORIGIN= UXNMR, Bruker Analytische Messtechnik GmbH
##OWNER= root
$$ XWIN-NMR		Version 3.5
$$ Thu Aug 22 13:57:26 2019 Russian Standard Time (UT+4h)  she@DPX200
##.OBSERVE FREQUENCY= 200.13155
##.OBSERVE NUCLEUS= ^1H
##.DELAY= (6, 6)
##.ACQUISITION MODE= SIMULTANEOUS
##.ACQUISITION SCHEME= undefined
##.AVERAGES= 8
##.DIGITISER RES= 18
##SPECTROMETER/DATA SYSTEM= spect
##.PULSE SEQUENCE= zg30
##.SOLVENT NAME= CDCl3
##.SHIFT REFERENCE= (INTERNAL, CDCl3, 0, 15.7039)
##AUDIT TRAIL= $$ (NUMBER, WHEN, WHO, WHERE, WHAT)
$$ ##TITLE= Audit trail, XWIN-NMR		Version 3.5
$$ ##JCAMPDX= 5.01
$$ ##ORIGIN= Bruker BioSpin GmbH
$$ ##OWNER= she
$$ F:/spectra/data/she/nmr/H-F/1/audita.txt
$$ ##AUDIT TRAIL=  $$ (NUMBER, WHEN, WHO, WHERE, WHAT)
(   1,<2019-08-22 13:56:14.43 +0400>,<she>,<DPX200>,
      <created by zg, POWCHK disabled, PULCHK disabled
       configuration hash MD5:
       00 E9 B6 7A A2 85 ED C7 34 08 36 98 17 FE 4E 26
       data hash MD5: 16K
       B9 4E 7C CF 27 AF 9C 91 D4 80 55 D0 3D BD 84 E5>)
$$ ##END=
$$ 
$$ hash MD5
$$ B7 7D 48 9A 5B 91 23 B4 24 DF 4B 82 B2 F7 91 3A
##$RELAX= 
##$RELAX= 
##$RELAX= 
##$RELAX= 
##$RELAX= 
##$RELAX= 
$$ Bruker specific parameters
$$ --------------------------
##$DU= <F:/spectra>
##$EXPNO= 1
##$NAME= <H-F>
##$PROCNO= 1
##$TYPE= <nmr>
##$USER= <she>
##$AMP= (0..31)
100 100 100 100 100 100 100 100 100 100 100 100 100 100 100 100 100 100 
100 100 100 100 100 100 100 100 100 100 100 100 100 100 
##$AQSEQ= 0
##$AQ_mod= 1
##$AUNM= <au_zg>
##$AUTOPOS= <>
##$BF1= 200.13
##$BF2= 200.13
##$BF3= 200.13
##$BF4= 200.13
##$BF5= 200.13
##$BF6= 200.13
##$BF7= 200.13
##$BF8= 200.13
##$BYTORDA= 1
##$CFDGTYP= 0
##$CFRGTYP= 5
##$CHEMSTR= <none>
##$CNST= (0..31)
1 1 145 1 1 1 1 1 1 1 1 1 1 1 1 1 1 1 1 1 1 1 1 1 1 1 1 1 1 1 1 1 
##$CPDPRG= <>
##$CPDPRG1= <>
##$CPDPRG2= <>
##$CPDPRG3= <>
##$CPDPRG4= <mlev>
##$CPDPRG5= <mlev>
##$CPDPRG6= <mlev>
##$CPDPRG7= <mlev>
##$CPDPRG8= <mlev>
##$CPDPRGB= <>
##$CPDPRGT= <>
##$D= (0..31)
0 1.2 0 0 0 0 0 0 0 0 0 0.03 0 0 0 0 0 0 0 0 0 0 0 0 0 0 0 0 0 0 0 0 
##$DATE= 1566467773
##$DBL= (0..7)
120 120 120 120 120 120 120 120 
##$DBP= (0..7)
150 150 150 150 150 150 150 150 
##$DBP07= 0
##$DBPNAM0= <>
##$DBPNAM1= <>
##$DBPNAM2= <>
##$DBPNAM3= <>
##$DBPNAM4= <>
##$DBPNAM5= <>
##$DBPNAM6= <>
##$DBPNAM7= <>
##$DBPOAL= (0..7)
0.5 0.5 0.5 0.5 0.5 0.5 0.5 0.5 
##$DBPOFFS= (0..7)
0 0 0 0 0 0 0 0 
##$DE= 6
##$DECBNUC= <off>
##$DECIM= 24
##$DECNUC= <off>
##$DECSTAT= 4
##$DIGMOD= 1
##$DIGTYP= 9
##$DL= (0..7)
0 120 120 120 120 120 120 120 
##$DP= (0..7)
150 150 150 150 150 150 150 150 
##$DP07= 0
##$DPNAME0= <>
##$DPNAME1= <>
##$DPNAME2= <>
##$DPNAME3= <>
##$DPNAME4= <>
##$DPNAME5= <>
##$DPNAME6= <>
##$DPNAME7= <>
##$DPOAL= (0..7)
0.5 0.5 0.5 0.5 0.5 0.5 0.5 0.5 
##$DPOFFS= (0..7)
0 0 0 0 0 0 0 0 
##$DQDMODE= 0
##$DR= 18
##$DS= 0
##$DSLIST= <SSSSSSSSSSSSSSS>
$$ [...]
##$SUBNAM2= <"">
##$SUBNAM3= <"">
##$SUBNAM4= <"">
##$SUBNAM5= <"">
##$SUBNAM6= <"">
##$SUBNAM7= <"">
##$SUBNAM8= <"">
##$SUBNAM9= <"">
##$SW= 24.9336996594482
##$SWIBOX= (0..15)
0 0 2 0 0 0 0 0 0 0 0 0 0 0 0 0 
##$SW_h= 4990.01996007984
##$TD= 16384
##$TD0= 1
##$TE= 0
##$TE2= 300
##$TE3= 300
##$TEG= 300
##$TL= (0..7)
0 120 120 120 120 120 120 120 
##$TP= (0..7)
150 150 150 150 150 150 150 150 
##$TP07= 0
##$TPNAME0= <>
##$TPNAME1= <>
##$TPNAME2= <>
##$TPNAME3= <>
##$TPNAME4= <>
##$TPNAME5= <>
##$TPNAME6= <>
##$TPNAME7= <>
##$TPOAL= (0..7)
0.5 0.5 0.5 0.5 0.5 0.5 0.5 0.5 
##$TPOFFS= (0..7)
0 0 0 0 0 0 0 0 
##$TUNHIN= 0
##$TUNHOUT= 0
##$TUNXOUT= 0
##$USERA1= <user>
##$USERA2= <user>
##$USERA3= <user>
##$USERA4= <user>
##$USERA5= <user>
##$V9= 5
##$VALIST= <valist>
##$VCLIST= <CCCCCCCCCCCCCCC>
##$VD= 0
##$VDLIST= <DDDDDDDDDDDDDDD>
##$VPLIST= <PPPPPPPPPPPPPPP>
##$VTLIST= <TTTTTTTTTTTTTTT>
##$WBST= 1024
##$WBSW= 4
##$XGAIN= (0..3)
0 0 0 0 
##$XL= 0
##$YL= 0
##$YMAX_a= 304366
##$YMIN_a= -438668
##$ZGOPTNS= <>
##$ZL1= 120
##$ZL2= 120
##$ZL3= 120
##$ZL4= 120
##$ABSF1= 10
##$ABSF2= 0
##$ABSG= 5
##$ABSL= 3
##$ALPHA= 0
##$AQORDER= 0
##$ASSFAC= 0
##$ASSFACI= 0
##$ASSFACX= 0
##$ASSWID= 0
##$AUNMP= <proc_1d>
##$AZFE= 0.1
##$AZFW= 0.1
##$BCFW= 1
##$BC_mod= 2
##$BYTORDP= 1
##$COROFFS= 0
##$CY= 11.3945322036743
##$DATMOD= 1
##$DC= 2
##$DFILT= <>
##$DTYPP= 0
##$F1P= 20.1720416913024
##$F2P= 0.152960286110954
##$FCOR= 0.5
##$FTSIZE= 0
##$FT_mod= 4
##$GAMMA= 1
##$GB= 0.15
##$INTBC= 1
##$INTSCL= 1
##$ISEN= 128
##$LB= 0.24
##$LEV0= 0
##$LPBIN= 0
##$MAXI= 10000
##$MC2= 0
##$MEAN= 0
##$ME_mod= 0
##$MI= 1.114404
##$NCOEF= 0
##$NC_proc= 0
##$NLEV= 6
##$NOISF1= 3.799351
##$NOISF2= 2.8
##$NSP= 1
##$NTH_PI= 0
##$NZP= 0
##$OFFSET= 15.70392
##$PC= 1
##$PHC0= -9218.325
##$PHC1= 23.80096
##$PH_mod= 1
##$PKNL= yes
##$PPARMOD= 0
##$PSCAL= 0
##$PSIGN= 0
##$REVERSE= no
##$SF= 200.130013532006
##$SI= 16384
##$SIGF1= 3
##$SIGF2= 2
##$SINO= 400
##$SIOLD= 16384
##$SREGLST= <1H.CDCl3>
##$SSB= 0
##$STSI= 0
##$STSR= 0
##$SW_p= 3612.71676300578
##$SYMM= 0
##$S_DEV= 0
##$TDeff= 0
##$TDoff= 0
##$TI= <>
##$TILT= no
##$TM1= 0
##$TM2= 0
##$TOPLEV= 0
##$USERP1= <user>
##$USERP2= <user>
##$USERP3= <user>
##$USERP4= <user>
##$USERP5= <user>
##$WDW= 1
##$XDIM= 8192
##$YMAX_p= 0
##$YMIN_p= 0
$$ End of Bruker specific parameters
$$ ---------------------------------
##NTUPLES= NMR FID
##VAR_NAME=  TIME,          FID/REAL,        FID/IMAG
##SYMBOL=    X,             R,               I
##VAR_TYPE=  INDEPENDENT,   DEPENDENT,       DEPENDENT
##VAR_FORM=  AFFN,          ASDF,            ASDF
##VAR_DIM=   8192,          8192,            8192
##UNITS=     SECONDS,       ARBITRARY UNITS, ARBITRARY UNITS
##FACTOR=    0.0002004,     1,               1
##FIRST=     0,             0,               0
##LAST=      1.6414764,     0,               0
##MIN=       0,             -438668,         0
##MAX=       1.6414764,     304366,          0
$$ Real data points
##PAGE= N=1
##DATA TABLE= (X++(R..R)), XYDATA
$$ [...]
$$ plain form
2969 -2152 3090 1026 -2411 -854 -324 162 2197 -1276 -4635 -141 3691 -666 -3371 -1753 -819 1158
2985 1158 2361 -2966 -4856 1569 3259 -1337 -2466 -1121 -572 2389 2258 -3403 -2603 3696 3159 -1173
3001 -1173 -894 108 1500 4439 1968 -3640 -769 4983 2699 -508 36 -274 1075 4084 351 -3606
3017 -3606 556 3368 -337 -1896 -480 -1097 657 2429 -2601 -4352 758 1656 -1727 -1724 -823 -1761 248
3034 248 1020 -3475 -2432 2383 426 -2694 -606 -272 -451 1748 271 -3612 109 3778 155 -2024
3050 -2024 -109 568 1582 2814 -842 -3255 2205 4023 -378 -1246 698 538 1785 2182 -2523 -2129
3066 -2129 4161 3380 -2239 -1874 -413 854 3632 1792 -3953 -2650 3431 1837 -1777 -448 -592 292
3082 292 2824 -520 -4597 -336 3521 -70 -2508 -1195 -1413 669 2858 -2199 -4442 500 2852
$$ packed form
2969b152N242k064l437J557N30M86K035l473l359M494L832m357k705J618R34J977
2985A158J203n327j890O425J690m596j129J345N49K961j31n661Q00O299n37m332
3001a173K79J002J392K939k471n608K871N752k284l207N44l10J349L009l733l957
3017c606M162K812l705j559J416o17J754J772n030j751N110Q98l383LR01r38K009
3034B48P72m495J043M815j957l120K088L34j79K199j477l883L721L669l623k179
3050b024J915O77J014J232l656k413N460J818m401q68J944j60J247L97m705L94
3066b129O290p81n619L65J461J267K778j840n745J303O081j594l614J329j44Q84
3082B92K532l344m077M261L857l591k438J313k18K082K189n057k243M942K352
$$ plain form
3097 2852 -1163 -1878 -1599 -1422 1900 2927 -2704 -3135 2001 1671 -942 383 970 -158 1660 1137 -2571
3114 -2571 836 4817 1055 -1839 29 83 1375 3620 203 -3047 667 3238 -646 -1372 1135 270
3130 270 655 1348 -2631 -2532 3163 2322 -2607 -2316 -139 -295 1634 178 -4539 -2036 3791 1429 -3194
3147 -3194 -2391 -685 524 3353 252 -4670 -1212 2962 -176 -2370 29 48 677 1765 -2149 -3930
3163 -3930 2221 4871 -323 -2855 -1159 -592 2319 3725 -1551 -3348 2498 2269 -916 -582 804 517
3179 517 2686 1438 -3051 -863 3585 1620 -1469 -110 607 657 2184 -326 -3377 1015 4053 -476
3195 -476 -2676 -1298 -640 280 2344 -1451 -3498 511 1091 -2851 -1785 638 -44 40 -514 -4186 -2238
3212 -2238 3699 1903 -3028 -2073 -522 11 2297 526 -3207 -73 4153 292 -2512 8 1114
$$ packed form
3097B852m015p15K79J77L322J027n631m31N136l30k613J325N87j128J818n23l708
3114b571L407L981l762k894J868N4J292K245l417l250L714K571l884p26K507q65
3130B70L85O93l979R9N695q41m929K91K177j56J929j456m717K503N827k362m623
3147c194Q03J706J209K829l101m922L458M174l138k194K399J9O29J088l914j781
3163c930O151K650n194k532J696N67K911J406n276j797N846k29l185L34J386k87
3179E17K169j248m489K188M448j965l089J359P17N0J527k510l051M392L038m529
3195d76k200J378O58R20K064l795k047M009N80l942J066K423o82Q4n54l672J948
3212b238N937j796m931R55J551N33K286j771l733L134M226l861k804K520J106
$$ plain form
3227 1114 2053 2870 -420 -3251 1616 4191 -110 -1076 893 1036 1449 2022 -2345 -2303 3568 3982 -1700
3244 -1700 -2513 -890 -299 2260 1888 -2804 -2520 1921 494 -2811 -760 330 -58 834 -1456 -4604
3260 -4604 -554 3570 94 -2937 -1053 -633 -203 1295 -1518 -3332 1957 2873 -1804 -2400 -165 164
3276 164 1742 2258 -1779 -2452 2309 1707 -1874 645 2215 529 803 -186 -2570 550 5605 1732
3292 1732 -2586 -1107 412 984 3027 396 -2867 812 3052 -1218 -2143 848 1124 553 676 -2296
3308 -2296 -3421 2100 2519 -2475 -2222 449 -75 456 -248 -3475 -1544 3672 1758 -3615 -2632 -277
3324 -277 287 2247 834 -3241 -1573 2532 -230 -2195 1088 1775 412 589 -1703 -2876 2721 4661
3340 4661 -413 -2286 -180 558 1993 2588 -779 -2135 2303 2362 -1526 -752 1179 418 1485 1238 -2279
$$ packed form
3227A114R39Q17l290k831M867K575m301r66J969J43M13N73m367M2N871M14n682
3244a700q13J623N91K559l72m692K84M441j427l305K051J090l88Q92k290l148
3260d604M050M124l476l031J884M20M30J498k813j814N289R16m677n96K235L29
3276A64J578N16m037o73M761o02l581K519J570j686K74r89k384L120N055l873
3292A732m318J479J519N72K043k631l263L679K240m270r25K991K76n71J23k972
3308b296j125N521M19m994K53K671n24N31p04l227J931N216j914n373R83K355
3324b77N64J960j413m075J668M105k762j965L283O87j363J77k292j173N597J940
3340D661n074j873K106P38J435N95l367j356M438N9l888P74J931p61J067k47l517
$$ plain form
3357 -2279 -1352 2861 971 -2251 95 1331 -409 125 -1188 -3226 881 3986 -687 -3558 -1066
3372 -1066 -416 -74 1788 -529 -2878 165 970 -2646 -1504 1713 843 -321 -942 -2867 -1086 3729
3388 3729 2216 -2706 -1638 812 534 1652 639 -2248 272 4087 601 -2457 -93 1299 1118
3403 1118 1996 456 -2256 1184 3158 -916 -1693 1704 1865 544 552 -2561 -2228 3066 3689 -1647 -2889
3420 -2889 -731 -113 1111 1882 -2153 -2451 1654 281 -2875 -842 879 -282 268 -1142 -3525 -792
3436 -792 2875 83 -2812 -663 142 -18 1317 -701 -2636 1241 2980 -1161 -1886 1003 404 348 1923
3453 1923 -762 -967 2396 1603 -2327 6 2779 1302 798 -396 -2453 -161 4380 1502 -2718 -652
3469 -652 693 152 1155 195 -2051 704 2656 -1782 -3239 354 1499 392 239 -2513 -3015 1943
$$ packed form
3357b279R27M213j890l222K346J236j740N34j313k038M107L105m673k871K492
3372a066O50L42J862k317k349L043Q05l616J142L217q70j164o21j925J781M815
3388C729j513m922J068K450k78J118j013k887K520L815l486l058K364J392j81
3403A118Q78j540k712L440J974m074p77L397J61j321Ql113L33N294O23n336j242
3420b889K158O18J224P71m035k98M105j373l156K033J721j161N50j410k383K733
3436g92L667k792k895K149Q05j60J335k018j935L877J739m141p25K889n99n6J575
3453A923k685k05L363p93l930K333K773j477n04j194k057K292M541k878m220K066
3469f52J345n41J003r60k246K755J952m438j457L593J145j107j53k752n02M958
$$ plain form
3485 1943 2570 -2503 -2935 766 587 67 -249 -2998 -1796 3385 1736 -3016 -2157 590 167 1282 633
3502 633 -2683 -320 3218 444 -2540 438 1854 910 1195 -531 -2579 1527 3784 217 -1488 790
3518 790 951 677 1851 -195 -1269 2026 1845 -2093 -1064 1717 489 530 1127 -1722 -1054 2216 312
3535 312 -2621 -148 1514 -784 -874 -986 -2341 141 2532 -1618 -3220 -154 558 -549 453 -844
3551 -844 -2022 1191 1760 -2552 -2225 1720 1532 -26 153 -1805 -923 3259 2277 -2073 -1325 1917 1239
3568 1239 862 519 -1744 189 3864 1295 -2359 -16 1476 898 1156 337 -2190 580 2876 -200
3584 -200 -1894 826 1143 -281 231 -1314 -2461 1300 2363 -1655 -2247 510 -92 -7 957 -1618 -1728
3601 -1728 1138 485 -2406 -676 854 -686 -578 -52 -2038 -443 2192 -221 -2482 186 1113 -395
$$ packed form
3485A943O27n073m32L701j79n20l16k749J202N181j649m752Q59K747m23J115o49
3502F33l316K363L538k774k984K978J416r44K85j726k048M106K257l567j705K278
3518G90J61k74J174k046j074L295j81l938J029K781j228M1N97k849O68L270j904
3535C12k933K473J662k298r0j12j355K482K391m150j602L066P12j107J002j297
3551h44j178L213N69m312L27L945j88j558J79j958Q82M182r82m350P48L242o78
3568A239l77l43k263J933L675k569l654K343J492n78K58q19k527K770K296l076
3584b00j694K720L17j424N12j545j147L761J063m018n92K757o02Q5R64k575j10
3601a728K866o53k891J730J530j540J08N26j986J595K635k413k261K668R27j508
$$ plain form
3617 -395 580 -319 -1863 1474 2591 -1273 -1778 1283 1401 596 911 -332 -892 2413 1855 -2002 -830
3634 -830 2530 1548 617 -63 -1956 -129 3769 1225 -2857 -1259 1045 458 550 -480 -2670 10 2470
3651 2470 -861 -3271 -378 1268 -183 33 -1895 -2712 1404 2457 -1933 -2555 -5 623 158 251 -1743
3668 -1743 -1587 2302 1915 -2071 -1154 1226 712 660 826 -1474 -155 2827 551 -2227 525 2131 210
3685 210 670 15 -1365 1522 3232 -197 -2274 1094 1328 -207 721 -637 -1057 1751 1811 -2233 -1736
3702 -1736 1815 792 -404 -804 -1981 -779 2499 270 -3705 -1278 1568 -51 -486 -1445 -2197 205
3718 205 2540 -830 -3356 196 1545 -323 -436 -706 -1676 1391 2620 -1782 -2522 1416 1795 352
3734 352 376 -1217 -1193 2661 2193 -1537 -1057 2018 1563 203 761 -850 87 2818 513 -2585 -209
$$ packed form
3617c95R75q99j544L337J117l864n05L061J18q05L15j243n60L305n58l857J172
3634h30L360r82r31o80j893J827L898k544m082J598K304n87R2j030k190K680K460
3651B470l331k410K893J646j451K16j928q17M116J053m390o22K550O28m65R3j994
3668a743J56L889l87l986R17K380n14n2J66k300J319K982k276k778K752J606j921
3685B10M60o55j380K887J710l429k077L368K34j535R28j358m20K808O0m044M97
3702a736L551j023j196m00j177J202L278k229l975K427K846j619m35r59p52K402
3718B05K335l370k526L552J349j868j13k70r70L067J229m402p40L938L79j443
3734C52K4j593K4L854m68l730M80L075m55j360N58j611R37K731k305l098K376
$$ plain form
3751 -209 2174 398 5 -278 -1512 159 2514 -871 -2358 517 882 -932 -400 -836 -1730 831 1530
3768 1530 -2085 -2157 827 122 -1021 -371 -913 -1202 1485 360 -2882 -818 1627 237 -372 -222 -1282
3785 -1282 -16 2321 42 -2314 422 1793 -313 263 483 -753 1597 2887 -667 -1805 1417
3800 1417 1904 -130 506 -214 -576 2002 2175 -1732 -1236 2013 923 -255 166 -1638 -829 2241 554
3817 554 -2638 -878 1216 -111 -489 -191 -1948 -427 2205 -646 -2979 -69 1030 -29 -506 -939
3833 -939 -1932 582 2271 -1398 -2349 1218 913 -164 -44 -1193 -1168 2153 1901 -1918 -1091 1410 625
3850 625 316 1100 -669 -252 2659 881 -1833 549 2185 315 217 60 -882 696 2664 -368 -2257
3867 -2257 632 1489 -74 -172 -613 -1124 1380 1719 -1937 -2099 1163 480 -1360 -367 -1150 -660 1709 -84
$$ packed form
3751b09K383j776l93k83j234J671K355l385j487K875L65j814N32m36q94K561O99
3768A530l615p2K984p05j143O50n42k89K687j125l242K064K445j390o09J50j060
3785a282J266K337k279k356K736J371k106N76K20j236K350J290l554j138L222
3800A417M87k034O36p20l62K578J73l907M96L249j090j178M21j804Q09L070j687
3817E54l192J760K094j327l78K98j757J521K632k851k333K910J099j059m77m33
3833i39r93K514J689l669r51L567l05j077J20j149K5L321k52l819Q27K501p85
3850F25l09P84j769M17K911j778k714K382J636j870r8j57r42J578J968l032j889
3867b257K889Q57j563r8m41n11K504L39l656j62L262o83j840R93p83M90K369j793
$$ plain form
3885 -84 -3399 -1290 1815 467 -1478 -1117 -1644 153 2386 -149 -2778 116 1969 -149 -173 -319 -594
3902 -594 1569 2334 -1212 -2086 1650 2327 182 144 -397 -282 2562 2046 -1482 -1094 1995 1561 -130 133
3920 133 -1035 -188 2390 867 -2022 -416 1614 -35 -725 -22 -712 175 1294 -1093 -2739 172
3936 172 1384 -896 -931 -818 -1766 240 1237 -1105 -1876 850 185 -1418 -154 62 -461 1116 275 -2256
3954 -2256 -509 2217 347 -1030 70 -147 216 1979 2 -1999 939 2826 344 -342 111 -495
3970 -495 1236 2411 -327 -1875 1160 1786 -404 -122 140 -84 1484 1182 -2276 -1660 1695 1398 -446
3987 -446 -456 -1318 -1382 1760 768 -2522 -1404 1148 -446 -1113 -214 -1009 -766 1425 -190 -2692 -720 940
4005 940 -574 -285 178 -1401 -18 1403 -1224 -2127 1266 1258 -355 579 -42 -1163 1611 1865 -863
$$ packed form
3885h4l315K109L105j348j945L61n27J797K233k535k629K894J853k118k4j46k75
3902e94K163P65l546q74L736O77k145l8n41J15K844n16l528L88L089m34j691K63
3920A33j168Q47K578j523k889J606K030j649o90P03o90Q87J119k387j646K911
3936A72J212k280l5J13r48K006R97k342p71K726o65j603J264K16n23J577q41k531
3954b256J747K726j870j377J100k17L63J763j977k001K938J887k482o86M53o06
3970d95J731J175k738j548L035O26k190K82K62k24J568l02l458O16L355k97j844
3987d46j0q62o4L142r92l290J118K552j594o67Q99p95K43K191j615k502J972J660
4005I40j514K89M63j579J383J421k627r03L393qj613R34o21j121K774K54k728
$$ plain form
4022 -863 -446 1744 439 -710 1388 613 -92 1791 457 -1909 468 2273 796 -269 301 -593
4038 -593 -122 1759 -360 -1999 961 1728 -579 -907 -629 -1182 817 1716 -1911 -2576 642 375 -1347
4055 -1347 -600 -645 -771 954 248 -2884 -1633 1940 808 -701 -963 -1555 -486 2414 948 -2255 -297
4072 -297 1938 3 -458 597 -583 893 2378 -330 -1958 1210 1907 200 307 220 -556 1608 2003
4089 2003 -1380 -1294 1865 1336 -716 -129 -663 -989 1559 1161 -1925 -624 899 -537 -1589 315 -533
4106 -533 -134 1019 -1537 -3202 625 2016 -572 -1544 -642 -1243 364 1532 -1158 -2317 1548 1086
4122 1086 -1412 -757 142 -192 1452 1094 -2147 -991 2195 1365 -900 153 342 545 2041 343 -2536
4139 -2536 406 3052 939 -335 -214 -505 650 2291 189 -1741 812 1488 -1399 -606 558 -229
$$ packed form
4022h63M17K190j305j149K098p75p05J883j334k366K377J805j477j065N70q94
4038e93M71J881k119j639K960P67k307l28K78n53J999Q99l627o65L218k67j722
4055a347P47m5j26J725p06l132J251L573j132j509k62n92J069K900j466l203J958
4072b97K235j935m61J055j180J476J485k708j628L168O97j707J07q7p76K164L95
4089B003l383Q6L159n29k052N87n34l26K548l98l086J301J523j436j052J904q48
4106e33L99J153k556j665L827J391k588r72R02o01J607J168k690j159L865m62
4122A086k498O55Q99l34J644l58l241J156L186q30k265J053J89K03J496j698k879
4139b536K942K646k113j274J21k91J155J641k102j930K553O76k887P93J164p87
$$ plain form
4155 -229 472 1249 -1961 -2305 1693 1096 -922 -616 -463 -1238 576 844 -1930 -758 994 -447 -1539
4172 -1539 118 -168 -747 1333 5 -1999 406 1445 -622 -840 788 181 375 1151 -1222 -1544 1256
4189 1256 2171 -199 -146 197 -640 1187 2224 -814 -548 1975 395 -931 358 712 113 1673 444
4206 444 -2069 -359 2088 638 -786 22 -738 -305 1433 -247 -2260 284 1467 -713 -948 -51
4222 -51 -1136 -114 1390 -878 -2243 405 660 -1376 -553 -7 -947 454 688 -2248 -1693 1874 704
4239 704 -686 134 -327 -1001 1490 1353 -1241 -53 1875 190 -803 670 273 857 2203 66 -2009
4256 -2009 1178 2126 -143 -272 501 -237 685 1292 -1250 -1238 1955 1474 -784 -357 -406 -882 987 1096
4274 1096 -1963 -1007 1337 -47 -1954 -374 -510 -272 1232 -954 -3030 -517 1975 -109 -983 -519
$$ packed form
4155b29P01P77l210l44L998n97k018L06J53p75J814K68k774J172J752j441j092
4172a539J657k86n79K080j328k004K405J039k067k18J628o07J94P76k373l22K800
4189A256R15k370N3L43q37J827J037l038K66K523j580j326J289L54n99J560j229
4206D44k513J710K447j450j424Q08p60M33J738j680k013K544J183k180k35Q97
4222e1j085J022J504k268j365K648K55k036Q23N46r40J401K34k936N55L567j170
4239G04j390Q20m61o74K491j37k594J188J928j685r93J473l97N84J346k137k075
4256b009L187R48k269j29P73p38R22O07k542J2L193m81k258M27m9m76J869J09
4274A096l059R56K344j384j907J580j36K38J504k186k076K513K492k084q74M64
$$ plain form
4290 -519 -981 -7 1353 -855 -2175 1146 1543 -1121 -482 248 -146 1184 1328 -1277 -935 2106 1272
4307 1272 -670 430 855 385 1501 755 -1883 28 2543 430 -890 110 -167 241 1638 127
4323 127 -1825 911 1286 -1124 -1137 196 -183 497 838 -1943 -1979 860 1031 -1368 -761 -165 -992 632
4341 632 419 -1909 -1275 1918 366 -1567 210 117 -269 1172 187 -1772 188 2114 -250 -1039 479
4358 479 172 472 1432 -622 -1224 1498 2083 -455 -619 825 -12 647 1460 -751 -935 1961 711 -1608
4376 -1608 88 728 -19 721 402 -2094 -582 1819 -36 -1441 59 263 -485 1014 -399 -2156
4392 -2156 -118 1577 -1118 -1541 76 -879 -247 856 -829 -1680 748 1183 -1459 -674 697 -223 409
4409 409 996 -1582 -1101 1934 895 -800 320 210 -351 1243 852 -1226 -328 1772 279 -584 513
$$ packed form
4290e19m62R74J360k208j320L321L97k664O39P30l94J330J44k605L42L041q34
4307A272j942J100M25m70J116p46k638J911K515k113j320J000k77M08J397j511
4323A27j952K736L75k410j3J333l79O80L41k781l6K839J71k399O07N96q27J624
4341F32k13k328O34L193j552j933J777r3l86J441r85j959J960J926k364p89J518
4358D79l07L00R60k054o02K722N85k538j64J444q37O59Q13k211j84K896j250k319
4376a608J696O40p47P40l19k496J512K401j855j405J500K04p48J499j413j757
4392b156K038J695k695m23J617r55O32J103j685q51K428M35k642P85J371r20O32
4409D09N87k578M81L035j039j695J120j10n61J594l91k078Q98K100j493q63J097
$$ plain form
4426 513 239 126 1359 -135 -1452 1052 1928 -398 -411 776 -375 114 1344 -1041 -1652 1103 934
4443 934 -1105 -238 211 -704 187 300 -1574 -946 1404 -265 -1816 -282 241 -466 692 -216 -2163
4460 -2163 -289 1960 -379 -1309 52 -120 9 915 -253 -1551 885 1892 -827 -672 595 346
4476 346 983 1775 -848 -846 2034 1580 -899 31 779 21 1314 1221 -1592 -349 2150 418 -962 188
4494 188 167 -158 1168 68 -2148 298 1329 -858 -1281 49 -432 -285 683 -1324 -1893 795 1151
4511 1151 -1422 -700 370 -789 -371 658 -1227 -1042 1472 143 -1741 -124 704 -19 438 364 -1310
4528 -1310 312 2486 201 -1042 877 739 441 1232 35 -1208 1084 2063 -626 -744 1063 535
4544 535 563 1094 -933 -1306 1853 1406 -1633 -566 474 159 327 784 -1962 -1200 1623 276 -1757
$$ packed form
4426E13k74j13J233j494j317K504Q76k326j3J187j151M89J230k385o11K755j69
4443I34k039Q67M49r15Q91J13j874O28K350j669j551J534N23p07J158r08j947
4460b163J874K249k339r30J361j72J29R06j168j298K436J007k719J55J267k49
4476C46O37P92k623KK880m54k479R30P48p58J293r3k813J243K499j732j380J150
4494A88k1l25J326j100k216K446J031k187m23J330m81J47R68k007n69K688L56
4511A151k573P22J070j159M18J029j885J85K514j329j884J617Q28p23M57p4j674
4528a310J622K174k285j243J919j38k98P91j197j243K292R79k689j18J807n28
4544E35K8N31k027l73L159m47l039J067J040l15J68M57k746P62K823j347k033
$$ plain form
4561 -1757 -350 -28 -398 657 -215 -2179 -264 1689 -637 -1672 406 -161 -523 810 -281 -1590
4577 -1590 529 1168 -874 -588 1024 -1 87 1144 -640 -915 1616 1131 -796 466 989 -13 418
4594 418 788 -571 10 2098 146 -1260 618 945 18 951 304 -1509 844 1728 -825 -1287 712
4611 712 303 -171 687 -859 -1469 974 1125 -1274 -1313 425 -554 -384 214 -1675 -1297 1387 118 -1845
4629 -1845 -298 169 -511 509 77 -1996 -491 1851 46 -1461 614 476 27 1367 278 -1376
4645 -1376 1034 1997 -543 -504 995 321 216 1424 -248 -927 1632 1175 -900 -171 908 36 480
4662 480 792 -1127 -330 1663 194 -1692 140 79 -497 360 -59 -1623 -199 1404 -906 -1832 182
4679 182 268 -460 463 -946 -1733 644 1459 -1434 -941 672 -122 131 717 -1236 -1062 1647 1361 -1474
$$ packed form
4561a757J407L22l70J055q72j964J915J953k326j035K078n67l62J333j091j309
4577a590K119O39k042K86J612j025Q8J057j784k75K531m85j927J262N23j002M31
4594D18L70j359N81K088j952j406J878L27r27R33o47j813K353Q84k553m62J999
4611G12m09m74Q58j546o10K443J51k399l9J738r79J70N98j889L78K684j269j963
4629a845J547M67o80J020m32k073J505K342j805j507K075j38m49J340j089j654
4645a376K410R63k540L9J499o74j05J208j672o79K559m57k075P29J079q72M44
4662D80L12j919P97J993j469j886J832o1n76Q57m19j564J424J603k310r26K014
4679A82Q6p28R23j409p87K377Q15k893M93J613p94K53N86j953J74K709k86k835
$$ plain form
4697 -1474 -103 928 108 778 1011 -977 109 2138 681 -1302 430 1080 222 1145 349 -1524 337
4714 337 2033 -264 -881 661 134 19 823 -398 -1234 1109 1214 -1741 -989 511 -91 44 521 -1337
4732 -1337 -1109 1187 58 -1958 -504 447 -509 -121 89 -1509 -410 1561 -242 -1465 670 394
4748 394 -596 458 -172 -897 845 1625 -1153 -1132 1111 796 266 1017 -925 -729 1875 1314 -1132 -156
4766 -156 1279 637 222 774 -721 -43 1726 551 -1254 8 815 -526 426 115 -1447 177 1361
4783 1361 -637 -1737 551 94 -152 324 -395 -1330 303 1440 -1523 -1213 267 -145 -534 562 -848
4800 -848 -1132 1328 168 -1767 -732 864 -328 143 356 -1240 6 1710 312 -1394 778 885
4816 885 3 668 -28 -1051 891 2105 -447 -587 1016 568 -164 901 102 -762 1375 1078 -1561
$$ packed form
4697a474J371J031q20O70K33j988J086K029j457j983J732O50q58R23p96j873J861
4714C37J696k297o17J542n27j15Q04j221q36K343J05k955P52J500o02J35M77j858
4732a337K28K296j129k016J454R51r56L88K10j598J099J971j803j223K135k76
4748C94r90J054o30p25J742P80k778K1K243l15n30P51j942J96K604n61k446R76
4766a56J435o42m15N52j495O78J769j175j805J262Q07j341R52l11j562J624J184
4783A361j998j100K288m57k46M76p19r35J633J137k963L10J480m12l89J096j410
4800h48k84K460j160j935J035J596j192M71K13j596J246J704j398j706K172J07
4816H85q82O65o96j023J942J214k552j40J603m48p32J065p99q64K137k97k639
$$ plain form
4833 -1561 -721 852 639 135 633 -1380 -1130 1431 135 -2034 -191 249 -650 -308 -165 -1463 -357
4850 -357 1496 -999 -1956 65 335 -666 75 -470 -1562 92 1115 -1239 -1084 644 356 -62 590
4867 590 -569 -906 1634 1278 -786 -188 1336 72 471 809 111 288 1915 310 -1395 735 1246
4884 1246 464 675 319 -1149 381 1834 -368 -1360 472 328 -363 153 -327 -1221 759 631 -1332
4901 -1332 -1459 487 -358 -732 72 -1032 -1141 867 483 -1879 -548 786 -19 -63 251 -1555 -443
4918 -443 1721 -105 -1237 560 651 -212 230 423 -509 1194 1594 -427 -1203 993 1325 395 952 -321
4936 -321 -722 1292 1462 -848 -411 1296 191 53 325 -743 -463 994 -131 -1354 -114 872 -102
4953 -102 -379 14 -1136 -11 1152 -947 -2053 68 608 -281 -24 -494 -1605 130 876 -1162 -944
$$ packed form
4833a561Q40J573k13n04M98k013K50K561j296k169J843M40q99L42J43j298J106
4850c57J853k495r57K021K70j001P41n45j092J654J023k354J55J728k88m18O52
4867E90j159l37K540l56k064N98J524j264L99L38o98J77J627j605j705K130N11
4884A246p82K11l56j468J530J453k202r92J832j44o91N16m80q94J980j28j963
4901a332j27J946q45l74Q04j104j09K008l84k362J331J334q05m4L14j806J112
4918d43K164j826j132J797R1q63M42J93r32J703M00k021p76K196L32r30N57j273
4936c21m01K014J70k310M37J707j105j38K72j068K80J457j125j223J240R86r74
4953a02k77L93j150J125J163k099j106K121N40q89K57m70j111J735P46k038K18
$$ plain form
4970 -944 1110 347 -663 139 -387 -766 1277 1035 -1509 -601 1232 628 204 781 -624 -282 1774 401
4988 401 -1226 769 1363 -122 363 662 -755 283 1869 -359 -1161 771 697 -564 249 -19 -823
5005 -823 878 1174 -1512 -894 762 369 -474 178 -646 -983 571 406 -1548 -355 851 -365 -887
5022 -887 -665 -861 -446 1563 -384 -1874 -51 876 -219 -166 -44 -1011 683 1370 -822 -1143 1135 702
5040 702 -122 467 17 -625 941 1254 -891 -396 1286 527 55 416 -110 -48 1584 855 -1449 -96
5058 -96 1424 -5 102 533 -936 -469 1236 -277 -1464 376 478 -885 -557 -72 -1432 418 510
5075 510 -932 -1221 677 -62 -881 -57 -377 -806 513 433 -1528 -357 1003 242 -477 138 -658 -312
5093 -312 1356 177 -1423 487 1382 -288 6 383 -195 850 1278 -426 -1238 877 950 -45 189 32
$$ packed form
4970i44K054p63j010Q02n26l79K043k42k544R08J833o04m24N77j405L42K056j373
4988D01j627J995N94j485M85K99j417J038J586k228q02J932p4j261Q13k68q04
5005h23J701K96k686O18J656l93q43O52q24l37J554j65j954J193J206j216n22
5022h87K22j96M15K009j947j490J823R27j095N3J22r67J694O87k192l21K278m33
5040G02q24N89m50o42J566L13k145M95J682p59m72L61n26O2J632p29k304J353
5058i6J520j429J07M31j469M67J705j513j187J840J02j363L28M85j360J850R2
5075E10j442k89J898p39q19Q24l20m29J319q0j961J171J360p61p19O15p96L46
5093c12J668j179j600J910Q95j670K94L77n78J045M28j704q12K115P3r95K34j57
$$ plain form
5111 32 -694 814 986 -675 -721 1284 679 -258 87 -402 -473 834 522 -1449 -750 703 -374 -516 182
5130 182 -923 -540 1009 -97 -1540 -124 486 -546 -449 35 -1263 129 1060 -683 -908 904 425
5147 425 -517 -61 84 -284 1093 768 -949 -436 1420 628 -198 415 -317 -175 1262 444 -1215 197
5165 197 1130 352 -173 725 -353 47 1236 -436 -1252 447 969 -839 -268 73 -848 835 807 -1194
5183 -1194 -1512 766 464 -674 -199 -726 -772 566 521 -1389 -631 1003 -199 -855 34 -447 -206 1086
5201 1086 132 -1756 -89 1290 -43 133 169 -540 22 1049 -273 -1349 620 731 -205 408 196
5218 196 -215 581 1222 -269 -565 1227 745 -352 565 190 -1 948 633 -1209 63 1106 -167 -535
5236 -535 290 -461 -380 1048 -419 -1512 525 853 -813 -669 -243 -452 93 845 -1116 -1462 521 522 -562
$$ packed form
5111C2p26J508J72j661m6K005o05r37L45m89p1J307l12j971O99J453j077j42O98
5130A82j105L83J549j106j443J416O10j032R7M84j298J392R31j743k25J812m79
5147D25r42M56J45l68J377l25j717N13J856p92q26O13p32J42J437q18j659J412
5165A97R33p78n25Q98j078M00J189j672q16J699N22j808N71L41r21J683k8k001
5183a194l18K278l02j138M75n27m6J338m5j910P58J634j202o56Q89m81K41J292
5201A086r54j888J667J379j333J76L6p09N62J027j322j076J969J11r36O13k12
5218A96m11P96O41j491k96J792m82j097R17l75j91R49l15j842J272J043j273l68
5236e35Q25p51Q1J428j467j093K037L28j666J44M26k09N45P52j961l46J983Jj084
$$ plain form
5255 -562 -124 -109 -520 602 305 -1349 -698 1255 242 -464 368 -406 -221 958 538 -1197 396 1548
5273 1548 335 -213 640 -234 408 1373 16 -1316 817 1139 -258 192 343 -368 483 772 -570 -740
5291 -740 1092 477 -908 108 -23 -538 454 -39 -1392 -488 762 -258 -679 66 -155 -528 435 -277
5309 -277 -1439 177 793 -782 -402 268 -522 -28 908 3 -692 507 972 -507 -7 194 -341 704
5327 704 1143 -1021 -453 1315 544 -454 491 -104 -165 1010 536 -802 -62 1369 -71 -494 310 -102
5345 -102 -105 1077 -199 -1594 273 673 -530 -593 -126 -489 48 662 -838 -1128 665 173 -786 -355 -173
5364 -173 -846 273 257 -1217 -712 873 -8 -836 -28 -223 -217 936 430 -1284 227 965 -251 -187 410
5383 410 -300 155 1384 -202 -711 587 1119 -319 308 118 -560 704 1318 -437 -559 930 891 -506
$$ packed form
5255e62M38J5m11J122k97j654O51J953j013p06Q32p74J85J179m20j735J593J152
5273A548j213n48Q53q74O42R65j357j332K133L22j397M50J51p11Q51K89j342j70
5291g40J832o15j385J016j31n15R92m93j353R04J250j020m21P45k21l73R63p12
5309b77j162J616O16j575L80O70p90M94R36r05o95J199M65j479N00K01n35J045
5327G04M39k164N68J768p71r98R45n95o1J175m74j338P40J431j440m23Q04m12
5345a02lJ182j276j395J867M00j203o3M67l63N37O14j500k90J793m92r59M31J82
5364a73o73J119j6j474N05J585q81q28Q08j95OJ153n06j714J511P38j216O4N97
5383D10p10M55J229j586n09J298N32j438O27j90o78J264O14j755j22J489l9j397
$$ plain form
5401 -506 -153 43 2 708 456 -1121 -704 1105 71 -830 -8 -112 -617 749 -527 -1543 -84 973
5419 973 -707 -874 -541 -450 -393 327 -917 -1306 671 557 -933 -558 96 -132 369 815 -973 -367 1219
5438 1219 634 -551 97 347 67 1070 332 -910 250 1700 -4 -433 428 145 90 1351 -170
5455 -170 -1174 429 1139 -244 -463 355 -296 -23 594 -1012 -1307 998 411 -1113 -288 -195 -916 -51
5473 -51 184 -1465 -1004 536 -530 -825 -116 -314 -721 661 -316 -1507 -28 995 -651 -219 345 -227
5491 -227 -380 636 44 -556 1132 950 -494 -95 771 298 526 1218 -191 -335 1385 552 -647 292
5509 292 575 -113 547 112 -779 214 1530 -292 -1130 171 35 -563 575 -199 -1262 171 786 -827
5527 -827 -1235 45 -999 -88 740 -743 -1202 326 643 -701 -472 100 -453 239 711 -1004 -328 1074
$$ packed form
5401e06L53J96m1P06k52j577M17J809j034r01Q22j04n05J366j276j016J459J057
5419I73j680j67L33R1N7P20j244l89J977j14j490L75O54k28N01M46j788O06J586
5438A219n85j185O48K50k80J003p38j242J160J450j704m29Q61k83n5J261j521
5455a70j004J603P10j383k19Q18o51K73O17j606k95K305n87j524Q25R3p21Q65
5473e1K35j649M61J540j066k95P09j98m07J382r77j191J479J023j646M32N64n72
5491b27j53J016n92o00J688j82j444L99Q66m73K28O92j409j44J720q33j199R39
5509B92K83o88O60m35q91R93J316j822q38J301j36n98J138p74j063J433O15j613
5527h27m08J280j044R11Q28j483m59J528L17j344K29N72n53O92M72j715O76J402
$$ plain form
5545 1074 358 -134 591 310 -155 1050 473 -1030 230 1201 79 -167 803 -175 341 832 250 -622
5563 -622 715 1224 -125 -211 776 -66 96 603 -605 -747 840 492 -1305 -87 154 -627 12 8 -1200
5582 -1200 -846 704 -511 -1144 102 -306 -567 385 -1 -1214 136 1321 -831 -865 223 -93 295
5599 295 882 -246 -1102 993 871 -606 -224 381 49 768 945 -972 -354 1324 627 -774 175 541
5617 541 -204 907 665 -916 78 1839 239 -564 368 64 -141 794 -247 -1292 328 1142 -873
5634 -873 -756 98 -284 -536 379 -672 -1152 589 277 -1208 -454 308 -564 -41 366 -1229 -662 1296
5652 1296 217 -1318 -73 461 43 363 116 -858 363 1385 -208 -547 590 207 42 492 -247
5669 -247 -723 832 1035 -680 -483 856 141 547 701 -493 -691 1048 643 -1221 -421 538 -502 248
$$ packed form
5545A074p16m92P25k81m65J205n77j503J260R71j122k46R70r78N16M91n82q72
5563f22J337N09j349q6R87q42J62N07j208j42J587l48j797J218K41p81O39mj208
5582a200L54J550j215o33J246m08k61R52l86j213J350J185k152l4J088l16L88
5599B95N87j128q56K095j22j477L82O05l32P19J77j917O18J678o97j401R49L66
5617E41p45J111k42j581R94J761j600q03R32l04k05R35j041j045J620Q14k015
5634h73J17Q54l82k52R15j051m80J741l12j485P54P62q72N23M07j595N67J958
5652A296j079j535J245N34m18L20k47r74J221J022j593l39J137l83j65M50p39
5669b47m76J555K03j715J97J339p15M06J54j194j98J739m05j864Q00R59j040P50
$$ plain form
5687 248 151 -1379 -542 912 159 -732 205 4 -391 80 -120 -972 189 907 -353 -1140 406 105 -164
5706 -164 344 -526 -745 323 732 -648 -93 654 -288 -224 797 -535 -501 1288 171 -655 469 595
5724 595 -72 302 295 -737 -14 1420 -200 -453 546 156 -108 468 375 -1093 197 1153 -359 -571 752
5743 752 -113 -479 560 -592 -1080 569 372 -1089 -658 195 -283 -263 614 -806 -766 871 41 -818 187
5762 187 351 -608 250 -117 -958 -180 1201 -338 -815 386 -77 -488 975 55 -1191 593 848 -342
5780 -342 -28 241 -361 144 1031 -313 -839 968 653 -748 57 331 -186 667 607 -555 -271 1122 22
5799 22 -961 341 -40 -202 781 230 -799 -190 1080 -467 -672 337 -360 -281 456 -425 -1205 374 344
5818 344 -1052 -553 407 -341 -251 577 -600 -628 1295 309 -898 58 377 -140 554 163 -620 -214 1304
$$ packed form
5687B48r7j530Q37J454p53q91R37k01l95M71k00q52J161P18j260p87J546l01k69
5706a64N08q70k19J068M09j380N55P47r42O4J021j332L4J789j117q26J124J26
5724E95o67L74pj032P23J434j620k53R99l90k64N76r3j468J290R56j512k12J323
5743G52q65l66J039j152m88J649j97j461M31Q53m78K0Q77j420M0J637q30q59J005
5762A87J64r59Q58l67q41P78J381j539m77J201m63m11J463r20j246J784K55j190
5780c42L14K69o02N05Q87j344n26J807l15j401Q05K74n17Q53o0j162K84J393j100
5799B2r83J302l81j62R83n51j029O09J270j547k05J009o97P9P37q81p80J579l0
5818C44j396M99R60p48R0Q28j177k8J923r86j207R56L19n17O94l91p83M06J518
$$ plain form
5837 1304 -103 -478 746 584 -112 748 303 -717 940 1386 -730 -618 711 252 -202 551 -326 -303
5855 -303 1180 464 -986 -462 685 106 165 271 -1115 -461 1102 -5 -1302 -130 446 -442 30 -435
5873 -435 -993 80 899 -762 -1115 265 157 -799 32 -309 -899 468 770 -539 -314 434 336 79 282
5892 282 -319 -423 1076 555 -501 179 672 -70 289 296 -446 -71 1235 -212 -970 377 324 -543 107
5911 107 437 -396 257 711 -792 -415 880 238 -677 221 -166 -647 657 595 -991 -754 312 -584 -458
5930 -458 59 -781 -429 730 40 -1416 368 504 -471 -35 327 -723 -168 855 -220 -805 516 416
5948 416 -186 606 -224 -783 690 1160 -285 15 844 56 256 654 44 -404 891 628 -493 -13 660
5967 660 -327 -166 792 -49 -227 817 229 -1139 99 127 -427 516 419 -957 -424 658 -339 -818 93
$$ packed form
5837A304j407l75J224j62o96Q60m45j020J657M46k116J12J329m59m54P53q77K3
5855c03J483p16j450N24J147n79N9J06j386O54J563j107j297J172N76q88M72m65
5873d35n58J073Q19j661l53J380j08r56Q31l41n90J367L02j309K25P48r8k57K03
5892B82o01j04J499n21j056O80M93p42L59Pp42L75J306j447p58J347n3q67O50
5911A07L30q33O53M54j503L77J295o42r15Q98l87m81J304o2j586K37J066q96J26
5930d58N17q40L52J159o90j456J784J36r75M36L62j050N55J023j075n85J321j00
5948D16o02P92q30n59J473M70j445L00Q29p88K00L98o10m48J295k63j121M80O73
5967F60r87J61R58q41j78J044n88j368J238K8n54R43r7j376N33J082r97m79R11
$$ plain form
5986 93 -54 -764 84 -222 -748 270 258 -934 -628 574 -306 -236 437 -350 -707 711 490 -855 -224
6005 -224 547 41 393 710 -245 141 1022 280 -448 573 751 -13 494 144 -375 692 1395 -248 -564
6024 -564 486 -47 240 508 -359 -863 181 682 -1019 -836 210 -378 -330 39 -870 -827 392 8 -1031
6043 -1031 -170 216 -698 -151 -123 -959 -140 737 -516 -870 542 210 -220 327 120 -551 579 1141 -785
6062 -785 -224 777 215 -297 713 162 -367 783 1198 -644 342 1120 352 169 595 -344 169 1115 82
6081 82 -581 544 1024 -507 25 10 -660 -96 780 -1272 -1250 511 248 -649 -309 -336 -860 208 243 -1156
6101 -1156 -861 285 -45 -512 45 -622 -272 657 176 -755 196 824 75 -116 520 -305 474 1270 328
6120 328 -426 804 710 58 741 422 -274 503 926 -417 -304 855 173 -285 579 196 -592 147 404
$$ packed form
5986I3j47p10Q48l06n26J018j2j192L06J202q80P0O73p87l57J418k21j345O31
6005b24P71n06L52L17r55L86Q81p42p28J021J78p64N07l50n19J067P03j643l16
6024e64J050n33K87K68q67n04J044N01j701J83J046n88M8L69r09M3J219l84j039
6043a031Q61L86r14N47K8q36Q19Q77j253l54J412l32m30N47k07o71J130N62j926
6062g85N61J001n62n12J010n51n29J150M15j842R86P78p68j83M26r39N13R46j033
6081H2o63J125M80j531N32j5o70N64Q76k052K2J761k63q97L40k7n24J068L5j399
6101a156K95J146l30m67N57o67L50R29m81r31R51O28p49j91O36q25P79P96r42
6120C28p54J230r4o52O83l19o96P77M23j343J13J159o82m58Q64l83p88P39K57
$$ plain form
6139 404 -1071 -48 737 -629 -502 185 -254 -625 458 -318 -1078 379 273 -899 -333 140 -633 -333
6157 -333 641 -420 -943 144 120 -601 64 97 -508 709 712 -217 -433 788 201 -255 383 204 -412 597
6177 597 653 -579 303 871 -1 -147 808 -551 -163 1060 339 -785 412 408 -210 116 535 -631 -291
6196 -291 712 -444 -1192 227 79 -563 378 -168 -1046 223 416 -947 -799 268 -442 -651 79 -199
6214 -199 -702 261 328 -884 -27 663 -287 2 382 -453 -62 935 277 -544 556 530 -122 479 663 -448
6234 -448 196 946 -385 -257 752 490 -124 498 -64 -218 680 736 -741 -420 601 91 -111 170 -589
6253 -589 -335 1020 -123 -1147 -278 578 -436 62 -103 -765 -106 967 -570 -1292 210 300 -332 -44
6271 -44 -91 -524 189 598 -628 -676 709 70 -510 247 122 -45 716 505 -376 -28 778 44 -255 360
$$ packed form
6139D04j475J023P85j366J27O87m39l71J083p76p60J457j06j172N66M73p73L00
6157c33R74j061n23J087k4p21O65L3o05J217Lr29k16J221n87m56O38j79o16J009
6177E97N6j232Q82N68q72j46R55j359L88J223p21j124J197mo18L26M19j166L40
6196b91J003j156p48J419j48o42R41n46q78J269J93j363J48J067p10k09P30k78
6214a99n03R63O7j212Q57O90r50K89L80q35L91R97o58q21J100k6o52O01J84j111
6234d48O44P50j331J28J009k62o14O22n62j54Q98N6j477L21J021n10k02K81p59
6253e89K54J355j143j024Q69Q56j014M98j65o62O59J073j537p22J502R0o32K88
6271d4m7m33P13M09j226m8J385o39n80P57j25j67P61k11q81L48Q06p34k99O15
$$ plain form
6291 360 -263 -84 1066 -23 -706 277 681 11 -98 482 -374 236 882 -472 -609 727 338 -600 -210
6310 -210 267 -463 134 421 -862 -291 478 -79 -626 95 -391 -345 469 259 -946 213 619 -345 -538
6329 -538 334 -188 -253 478 40 -668 324 175 -473 -61 434 -277 363 631 -702 -471 654 213 -419 385
6349 385 115 -83 276 596 -931 1 1017 -112 -152 648 -192 -411 889 -32 -740 90 716 -515 -150
6368 -150 592 -434 -531 573 -335 -694 523 89 -421 -31 267 -463 20 556 -492 -446 460 -163 -424
6387 -424 176 -285 -693 405 560 -462 -13 358 -22 -317 459 -149 -550 467 200 -814 105 661 -116
6406 -116 79 554 -273 70 829 -56 -606 948 142 -186 281 205 -491 633 742 -329 -264 667 341 -233
6426 -233 413 -102 -444 412 165 -989 -146 715 -319 -322 -27 -642 -370 554 -158 -906 -69 454 -574 -121
$$ packed form
6291C60o23J79J150j089o83R83M04o70j09N80q56O10O46j354j37J336l89r38L90
6310b10M77p30N97K87j283N71P69n57n47P21m86M6Q14k10j205J159M06r64j93
6329e38Q72n22o5P31m38p08R92j49o48M12M95p11O40K68j333K31J125m41o32Q04
6349C85k70j98L59L20j527R32J016j129m0Q00q40k19J300r21p08Q30O26j231L65
6368a50P42j026r7J104r08l59J217m34n10L90K98p30M83N36j048M6R06o23k61
6387d24O00m61m08J098J55j022M49L71l80k95P76o08m01J017k67j014R19N56p77
6406a16J95M75q27L43P59q85n50J554q06l28M67p6o96J124J09j071O5R31l26n74
6426b33O46n15l42Q56k47j154Q43Q61j034lK95o15K72R24p12p48Q37N23j028M53
$$ plain form
6446 -121 -16 -506 156 503 -562 -1055 456 484 -207 187 -96 -502 365 581 -364 -444 869 135 -301 444
6466 444 72 -103 867 468 -640 607 894 -326 -271 281 -55 41 779 198 -427 638 605 -694 5
6485 5 93 -103 466 413 -844 -268 703 170 -935 -158 187 -676 572 -126 -1084 69 675 -215 -869 -59
6505 -59 -443 -324 749 -138 -932 -63 626 -502 -448 187 -208 139 820 -605 -500 769 620 -368 93
6524 93 446 -246 889 544 -260 -68 766 117 -210 406 418 -353 386 384 -542 205 589 -59 -594 262 -95
6545 -95 -405 157 -14 -647 129 13 -753 -489 254 -720 -377 361 -210 -548 394 13 -1016 -72 153 -586
6565 -586 131 113 -565 -183 912 -21 -507 305 444 0 780 206 -155 716 914 -131 220 883 -155
6584 -155 113 674 -106 -210 543 402 -417 320 296 -627 175 639 -581 -550 647 383 -460 199 -88 -708
$$ packed form
6446a21J05m90O62L47j065m93J511K8o91L94k83m06Q67K16r45q0J313p34m36P45
6466D44l72j75R70l99j108J247K87j220N5N52l36R6P38n81o25J065l3j299O99
6485EQ8j96N69n3j257N76R71n33j105P77L45q63J248o98r58J153O06q90o54Q10
6505e9l84J19J073q87p94Q69O89j128N4O35l95L47O81j425J05J269j49r88M61
6524I3L53o92J135l45q04J92Q34o49l27O16J2p71P39kr26P47L84o48n35Q56l57
6545i5l10N62j71o33P76j16p66K64P43r74L43P38n71l38R42l81j029R44K25p39
6565e86P17j8o78L82J095r33m86Q12J39m44P80n74l61Q71J98j045L51O63j038
6584a55K68N61p80j04P53j41q19P37k4r23Q02M64j220L1J197k64q43O59k87o20
$$ plain form
6604 -708 160 333 -966 -584 493 -616 -604 -231 -485 -613 292 20 -1188 -165 352 -315 -372 325 -334
6623 -334 7 598 -226 -537 518 634 -357 111 662 -78 472 824 -346 124 917 425 -122 580 588 -72
6643 -72 866 461 -448 -178 759 -82 -93 115 -114 -309 615 -168 -975 491 217 -650 -427 -273 -357 -391 313
6664 313 -483 -955 456 43 -920 -292 -191 -368 129 284 -1060 -198 719 275 -406 415 -64 -190 583
6683 583 27 -844 387 896 -21 -236 527 191 334 761 28 -643 692 1083 -461 -14 257 72 531
6702 531 656 -645 -368 554 168 -462 254 256 -393 -95 -63 -907 -100 472 -524 -718 -57 -335 -451 211 -487
6723 -487 -961 247 130 -372 -432 107 184 -335 438 -121 -514 521 528 -729 113 736 -258 90 210 -315
6743 -315 -102 918 379 -219 558 389 -13 494 405 -322 397 916 -136 -153 633 -70 -329 425 -410 -402 80
$$ packed form
6604g08Q68J73j299L82J077j109J2L73k54j28R05k72j208J023N17o67n7O97o59
6623c34L41N91q24l11J055J16r91M68N51p40N50L52j170M70P93m92n47P02Qo60
6643g2R38m05r09K70R37q41j1K08k29j95R24p83q07J466k74q67K23J54q4l4P04
6664C13p96m72J411m13r63O28J01j77M97J55j344Q62R17m44o81Q21m79j26P73
6683E83n56q71J231N09r17k15P63l36J43M27p33o71J335L91j544M47K71j85M59
6702E31J25j301K77R22l86o30P16Ko49K98L2q44Q07N72r96j94O61k78j16O62o98
6723d87m74J208j17n02o0N39P7n19P73n59l93J035Pj257Q42O23r94L48J20n25
6743c15K13J020n39n98P77j69m02N07q9p27P19N19j052j7P86p03k59P54q35QM82
$$ plain form
6764 80 395 -581 -266 339 -477 -178 328 -324 -577 246 72 -652 49 -122 -573 -307 299 -428 -480 651
6784 651 -115 -596 175 -27 -281 213 280 -478 105 707 -148 -8 359 -214 -377 583 194 -371 402 605
6804 605 -449 330 319 -216 124 806 -141 -64 488 421 -305 386 243 -388 286 375 -694 -390 610 -57
6824 -57 -464 213 -173 -380 271 175 -687 -404 293 -629 -456 292 -309 -128 232 -635 -856 285 240 -390 -113
6845 -113 390 -404 140 535 -561 -177 835 336 -362 141 228 -44 296 362 -530 -32 889 -2 -498 388
6865 388 -55 85 412 -93 -716 356 788 -509 -22 229 -221 69 432 -509 -671 468 69 -548 -44
6884 -44 17 -265 33 84 -739 -489 398 -163 -695 27 -77 -151 450 19 -833 52 769 -249 -108 106 13
6905 13 -43 133 -158 -472 662 564 -652 -224 754 -112 -81 329 -334 -75 1160 552 -194 381 326 43 373
$$ packed form
6764H0L15r76L15O05q16K99N06o52k53Q23j74p24P01j71m51K66O06p27n2J131
6784F51p66m81P71k02k54M94O7p58N83O02q55J40L67n73j63R60l89n65P73K03
6804F05j054P79j1n35L40O82r47P7N52o7p26O91j43o31O74Q9j069L04J000o67
6824e7m07O77l86k07O51r6q62K83O97r22J73P48o01J81L60q67k21J141m5o30K77
6845a13N03p94N44L95j096L84J012m99o98N03Q7k72L40O6q92M98R21q91m96Q86
6865C88m43J40L27n05o23J072M32j297M87K51m50K90L63r41j62J139l99o17N04
6884d4O1k82K98N1q23K50Q87n61n32P22j04p4O01m31q52Q85P17j018J41K14r3
6905A3n6J76k91l14J134r8j216M28R78q66L1M10o63K59J235o08p46N75n5k83L30
$$ plain form
6926 373 192 -267 21 938 -222 -638 480 300 -373 328 -6 -934 325 206 -544 -570 354 -474 -122
6945 -122 412 -268 -507 521 119 -787 -56 457 -463 48 656 -521 -494 460 -104 -411 333 193 -699 -90
6965 -90 339 -595 427 665 -253 -347 492 354 -261 351 93 -420 275 463 -31 39 711 -80 -50 532 -81
6986 -81 -175 457 85 -731 28 124 -529 243 481 -539 -53 186 -224 -750 -24 -213 -714 -21 130 -576 -464
7007 -464 431 -449 -318 362 86 -161 166 -6 -527 130 714 -747 228 277 -64 133 320 -279 -764 743
7027 743 196 -348 253 156 -109 498 649 -461 -176 640 270 -162 445 312 -515 464 249 -828 292
7046 292 769 -578 -397 408 -336 -296 512 62 -806 70 114 -732 -190 192 -237 -158 365 -600 -287 721
7066 721 -88 -685 -95 156 -317 101 110 -704 217 627 -368 -504 472 86 -143 435 -104 -500 439 417 -448
$$ packed form
6926C73j81m59K88R17j160m16J118j80o73P01l34r28J259j19p50k6R24q28L52
6945a22N34o80k39J028m02r06P31N13r20N11O08j177K7R54n64l07P44j40q92O09
6965i0M29r34J022K38r18r4Q39j38o15O12k58n13O95J88m94P0O72p91L0N82o13
6986h1r4O32l72q16P59R6o53P72K38j020M86K39m10n26P26j89n01O93J51p06J12
7007d64Q95q80J31O80k76k47L27j72n21O57N84j461R75M9l41J97J87n99m85J507
7027G43n47n44O01r7k65O07J51j110K85Q16l70m32O07j33q27R79k15j077J120
7046B92M77j347J81Q05p44M0Q08m50q68Q76M4q46N42L82m29P9N23r65L13J008
7066G21q09n97N90K51m73M18Rq14R21M10r95j36R76l86k29N78n39l96R39k2q65
$$ plain form
7087 -448 -187 451 199 166 402 -394 -216 905 335 -378 17 604 -141 -252 329 -435 -243 695 -153 -789
7107 -789 -13 394 -336 297 152 -657 -237 306 -543 -698 259 -285 -410 269 -335 -439 361 540 -728 -325
7127 -325 641 -306 -338 325 -55 -78 712 -196 -398 356 511 -449 23 131 -94 105 965 223 -79 651 238
7148 238 -122 380 106 -590 276 619 -403 -110 539 54 -280 273 188 -371 468 169 -896 118 135 -442
7168 -442 -210 173 -236 -425 200 -221 -805 -147 159 -294 129 256 -492 59 548 -382 -310 243 -223 -546
7188 -546 255 11 -280 414 283 -50 65 668 18 265 265 -28 -68 657 155 -42 552 492 -268 5 446
7209 446 -394 -79 796 350 -213 409 -37 -269 208 52 -407 76 510 -324 -338 434 -40 -579 81 -157
7229 -157 -998 -396 351 -802 -72 210 -662 -363 378 -507 -434 675 -148 -774 -82 65 -448 -86 582 -581
$$ packed form
7087d48K61O38k52l3K36p96J78J121n70p13L95N87p45j11N81p64J92R38q48o36
7107g89P76M07p30O33j45q09M20N43q49j55R57n44j25O79o04j04Q00J79j268M03
7127c25R66r47l2O63l80k3P90r08k02P54J55r60M72J08k25J99Q60p42l02P30m13
7148B38l60N02k74o96Q66L43j022K93O49m85l34N53q5n59Q39k99j065J014J7n77
7168d42K32L83m09j89O25m21n84O58L06m53M23J27p48N51M89r30P2N53m66l23
7188e46Q01k44k91O94j31l33J15O03o50K47%k93m0P25n02j97N94o0p60K73M41
7209D46q40L15Q75m46n63O22m46k32M77j56m59M83M34q34j4P72m74n39O60k38
7229a57q41O02P47j153P30K82q72K99P41q85P3J109q23o26O92J47n13L62O68j163
$$ plain form
7249 -581 246 772 -389 -250 450 93 168 396 280 -591 448 1089 -191 86 522 374 -1 399 -47
7268 -47 -388 598 232 -569 128 289 -413 -228 351 -638 -106 261 21 -615 221 333 -490 81 -305 -604
7288 -604 -120 612 -553 -779 162 -92 -497 378 -60 -672 244 454 -438 -206 379 -4 212 93 -192 -230
7308 -230 648 268 -399 217 923 -44 -282 567 -155 260 836 167 -311 267 481 -256 311 276 -526 -12
7328 -12 673 -384 -463 513 1 -342 327 -79 -553 44 -54 -747 -616 376 -385 -358 -10 -409 -273 467 -421
7349 -421 -815 140 594 -301 -509 23 -466 -92 389 -379 -224 162 490 -210 481 130 -359 538 595 -367
7369 -367 -195 694 102 -401 318 -151 -223 511 650 -364 110 577 -192 -164 418 -245 -520 351 -49 -505
7389 -505 118 175 -527 -51 65 -485 -95 466 -280 -564 459 -236 -853 -29 84 -558 119 294 -507 -15
$$ packed form
7249e81Q27N26j161J39P00l57P5K28j16q71J039O41j280K77M36j48l75M00m46
7268d7l41R86l66q01O97J61p02J85N79r89N32L67k40o36Q36J12q23N71l86k99
7288f04M84P32j165k26R41k54m05Q75m38o12R16K10q92K32N85l83K16j19k85l8
7308b30Q78l80o67O16P06r67k38Q49p22M15N76o69m78N78K14p37N67l5q02N14
7328a2O85j057p9R76n12l43O69m06m74N97r8o93J31R92p61K7L48l99J36P40q88
7349d21l94R55M54q95k08N32m89L74M81p68J55L86L28p00O91l51m89Q97N7r62
7369c67J72Q89n92n03P19m69p2P34J39j014M74M67p69K8N82o63k75Q71m00m56
7389e05O23N7p02M76J16n50L90N61p46k84J023o95o17Q24J13o42O77J75q01M92
$$ plain form
7409 -15 569 -261 -380 299 11 -430 549 178 -600 138 363 -6 73 732 -56 -362 616 47 -396 354 394
7430 394 -87 495 129 -576 159 563 -381 -286 649 308 -201 158 -178 -629 375 300 -648 -296 521 -262
7450 -262 -106 267 -332 -733 216 -89 -599 45 227 -567 -341 -20 -466 -296 424 -216 -363 357 370 -305
7470 -305 218 339 -606 193 650 -271 -257 656 4 -241 638 99 -106 891 420 -443 27 821 103 -92
7490 -92 553 110 155 479 -65 -733 369 412 -359 193 263 -258 178 240 -369 -913 426 194 -574 70 -239
7511 -239 -346 62 127 -570 -597 28 41 -479 242 -442 -690 367 -125 -754 -75 328 -396 -188 322 -42 88
7532 88 498 -3 -525 346 430 -120 -30 582 -247 72 431 27 -81 695 270 -304 265 80 -57 238 285
7553 285 -350 63 591 -399 -303 62 -77 -116 458 -121 -642 118 309 -678 -386 133 -379 -204 219 -327 -627
$$ packed form
7409a5N84q30j19O79k88m41R79l71p78P38K25l69P9O59p88l06R78n69m43P50M0
7430C94m81N82l66p05P35M04r44R5R35l41n09L59l36m51J004p5r48L52Q17p83
7450b62J56L73n99m01R49l05n10O44J82p94K26L21m46J70P20o40j47P20J3o75
7470c05N23J21r45P99M57r21J4R13o52k45Q79n39k05R97m71q63M70P94p18j95
7490i2O45m43M5L24n44o68J102M3p71N52P0n21M36O2o09n44J339k32p68O44l09
7511b39j07M08O5o97k7O25J3n20P21o84k48J057m92o29O79M03p24K08N10l64J30
7532H8M10n01n22Q71Q4n50R0O12q29L19L59m04j08P76m25n74N69j85j37K95M7
7553B85o35M13N28r90R6L65j39l9N74n79n21P60J91r87K92N19n12J75M23n46l00
$$ plain form
7574 -627 582 -228 -658 -101 -8 -487 -19 389 -581 -279 778 -427 -232 293 9 -76 111 330 -459 256
7594 256 448 158 34 830 87 56 492 96 -266 309 453 -421 243 312 -242 -38 473 -64 -628 466
7614 466 161 -601 493 153 -857 -42 448 -500 -190 245 -272 -494 17 -104 -541 156 -9 -600 -325
7633 -325 480 -553 -255 82 -649 -69 300 -106 -404 323 288 -321 -36 350 -254 233 429 -140 -224 389
7653 389 35 -76 306 341 -402 360 548 -257 66 737 -201 -170 316 -146 -396 624 377 -583 273 258 -300
7674 -300 -426 -89 -281 -17 630 -491 -824 229 313 -721 125 41 -301 57 231 -893 -784 514 -157
7693 -157 -609 97 -477 -295 69 309 -492 -250 529 -170 -128 -77 8 25 704 -151 -482 104 564 -203 140
7714 140 122 61 268 711 -93 -262 507 382 -47 105 223 -253 22 346 -586 -63 473 -63 -682 71 -47
$$ packed form
7574f27J209q10m30N57R3m79M68M08r70L02J057j205J95N25k84q5J87K19p89P15
7594B56J92k90j24P96p43l1M36l96l62N75J44q74O64O9n54K04N11n37n64J094
7614D66l05p62J094l40j010Q15M90r48L10M35n17k22N11j21m37O97j65n91K75
7633c25Q05j033K98L37p31N80L69m06k98P27l5o09K85L86o04M87J96n69q4O13
7653C89l54j11L82L5p43P62J88q05L23O71r38L1M86m62k50J020k47r60Q56j5n58
7674c00j26L37j92K64O47j121l33J053Q4j034Q46q4l42L58J74j124J09J298o71
7693a57m52P06n74J82L64K40q01K42P79o99M2N1Q5J7O79q55l31N86M60p67L43
7714A40j8o1K07M43q04j69P69j25m29J52J18m76K75L24r32N23N36n36o19P53j18
$$ plain form
7735 -47 -201 100 -374 -779 58 208 -474 -501 24 84 -206 297 -177 -839 350 266 -644 64 226 -429 105
7756 105 461 -449 -37 441 34 -557 -59 401 -155 545 422 -622 216 1110 -8 -247 439 40 138 289
7776 289 431 -271 131 478 -168 -36 302 50 -223 555 -202 -404 231 466 -666 103 299 -515 26 225
7796 225 -596 -369 527 -288 -446 8 -73 -332 173 350 -527 -204 271 -394 -338 597 57 -309 717 61
7816 61 -403 412 525 -356 64 547 -117 -9 580 -209 -160 403 242 -415 501 578 -304 265 339 -376 -224
7837 -224 766 8 -416 306 143 -381 385 151 -694 6 358 -292 -468 411 -348 -64 173 -190 -632 114
7857 114 233 -198 -68 113 -549 34 679 -352 -713 236 -53 -730 266 34 -120 -126 306 -329 -135 466
7877 466 46 -319 494 -50 -164 709 346 -215 348 640 -371 78 424 -89 104 347 183 -477 341 638
$$ packed form
7735d7j54L01m74m05Q37J50o82k7N25O0k90N03m74o62J189q4r10P08J62o55N34
7756A05L56r10M12M78m07n91M98M60n56P00j23j044Q38Q94j118k39O86l99R8J51
7776B89J42p02M02L47o46J32L38k52k73P78p57k02O35K35j132P69J96q14N41J99
7796B25q21K27Q96q15j58M54q1k59N05J77q77L23M75o65N6R35n40l66J026o56
7816F1m64Q15J13q81M20M83o64J08N89p89M9N63j61o57R16P7q82N69P4p15J52
7837b24R90p58m24P22j63n24P66k34q45P00L52o50j76Q79p59K84K37l63m42P46
7857A14J19m31J30J81o62N83O45j031l61R49k89o77R96k32j54oM32o35J94O01
7877D66m20l65Q13n44j14Q73l63n61N63K92j011M49L46n13J93K43j64o60Q18K97
$$ plain form
7897 638 -576 278 371 -280 40 95 -552 -362 550 -172 -277 178 52 -764 37 -35 -733 -495 399 -342 -581
7918 -581 372 -115 -182 640 -116 -586 293 440 -147 -94 421 -298 108 177 -398 -274 200 460 -700 -56 431
7939 431 -411 -55 96 -638 -214 814 49 -357 159 45 -126 223 403 -691 -20 709 -328 -124 376
7958 376 -260 -450 193 -290 -489 376 408 -700 -33 220 -380 26 155 -282 -685 402 -52 -862 -65 307
7978 307 -444 -10 102 -332 -155 69 -213 -140 487 509 -602 410 -195 -271 170 486 -230 0 751 -3
7998 -3 -164 721 38 -332 661 297 -59 -51 466 -236 -118 397 -154 -272 430 -165 -645 391 389 -463 -22 231
8020 231 -479 -160 490 -236 -273 483 -184 -163 -39 -150 -560 69 43 -580 -286 192 -233 -211 223 -371 -524
8041 -524 611 363 -798 195 445 -541 224 518 -79 103 429 -78 -395 235 263 -456 448 432 -324 245
$$ packed form
7897F38j214Q54R3o51L20N5o47J90R12p22j05M55j26q16Q01p2o98K38Q94p41k39
7918e81R53m87o7Q22p56m70Q79J47n87N3N15p19M06O9n75J24M74K60j160O44M87
7939D31q42L56J51p34M24J028p65m06N16j14j71L49J80j094O71P29j037K04N00
7958C76o36j90O43m83j99Q65L2j108O67K53o00M06J29m37m03J087m54q10P97L72
7978C07p51M34J12m34J77K24k82P3O27K2j111J012o05p6M41L16p16K30P51p54
7998cj61Q85o83l70R93l64l56QN17p02J18N15n51j18P02n95m80J036kq52M41K53
8020B31p10L19O50p26l7P56o67K1J24j11m10O29k6o23K94M78m25K2M34n94j53
8041e24J135k48j161R93K50r86P65K94n97J82L26n07l17O30K8p19R04j6p56N69
$$ plain form
8061 245 1085 37 -127 210 -221 -377 405 -101 -450 363 -144 -563 -89 -31 -524 -458 113 -473 -464 142 -288
8082 -288 -636 -197 163 -188 -116 172 -525 -480 562 -213 -524 345 22 -413 233 46 -385 324 547 -318
8102 -318 -13 247 62 48 563 -160 -516 706 538 -119 154 271 -95 36 758 -173 -198 648 271 -373
8122 -373 315 187 -184 255 224 -686 -68 252 -317 -667 261 159 -295 7 -362 -818 -183 397 -715 -459
8142 -459 170 -469 -224 146 -174 -102 474 23 -355 260 69 -611 226 491 59 -241 437 30 -187 351
8162 351 329 117 466 356 -447 -68 498 -242 -423 269 -104 -191 160 -97 -227 427 -4 -616 -45 147 -462
8183 -462 -110 318 -153 -287 523 123 -635 -24
$$ packed form
8061B45Q40j048j64L37m31j56P82n06l49Q13n07m19M74N8m93O6N71n86RO06m30
8082b88l48M39L60l51P2K88o97M5J042p75l11Q69l23m35O46j87m31P09K23q65
8102c18L05K60j85j4N15p23l56J222j68o57K73J17l66J31P22r31k5Q46l77o44
8122c73O88j28l71M39l1r10O18L20n69l50R28j02m54L02l69m56O35N80j112K56
8142d59O29o39K45L70l20P2N76m51l78O15j91o80Q37K65m32l00O78m07k17N38
8162C51k2k12L49j10q03L79N66p40j81O92l73q7L51k57j30O54m31o12N71J92o09
8183d62L52M28m71j34Q10m00p58O11
8191b4
$$ Imaginary data points
##PAGE= N=2
##DATA TABLE= (X++(I..I)), XYDATA
$$ plain form
0 0 0 0 0 0 0 0 -8 8 -1 8 -8 8 -15 16 -17 24 -25 32 -39 43 -54 61 -69 80 -93 104 -119 135 -151 173 -194 216
32 216 -242 271 -301 335 -371 413 -458 508 -561 621 -688 763 -844 939 -1044 1166 -1307 1470
50 1470 -1667 1907 -2205 2587 -3102 3828 -4935 6809 -10590 21227 -110848 -438668 -194294
63 -194294 168242 219537 -50426 -272681 -209133 33009 68230 -118905 -183480 -20838 75093
74 75093 -20194 -158218 -151191 23121 159121 42082 -144465 -101035 85510 138345 46564
85 46564 -47213 -42246 70097 149153 73298 -19304 3161 43113 41214 68843 95854 55087
97 55087 -13187 -62369 -45566 80541 170184 48686 -135894 -138169 752 101630 82243
108 82243 -37296 -115442 -45024 32199 -19501 -65888 -2736 55246 19307 -71732 -134555 -57909
$$ packed form
0@%%%%%%qJ6rRj6J6k3L1l3M1m9N7p1Q2r7J15j30J49j73J97k23K54k86L24l67M10
32B16m58N13n72O36p06P84q71R66j069J182j309J451j607J783j983K210k473K777
50A470l137L574m112M792n689O930q763J1744j7399L1817j32075l27820K44374
63a94294L62536N1295k69963k22255O3548K42142L5221j87135o4575J62642R5931
74G5093r5287j38024P027J74312J36000j17039j86547M3430J86545N2835r1781
85D6564r3777M967J12343P9056p5855r2602K2465L9952j899K7629K7011m0767
97E5087o8274m9182J6803J26107Q9643j21498j84580k275J38921J00878j9387
108H2243j19539p8146P0418P7223n1700m6387O3152N7982l5939r1039o2823P6646
$$ plain form
120 -57909 113196 129616 -53782 -165571 -74460 70708 113348 14641 -119848 -95887 63483
131 63483 110251 -6624 -94847 -63811 30382 99274 46979 -73673 -76335 31040 68865 24053
143 24053 -5291 -9048 14131 48200 14879 -42881 391 85918 78878 9206 -49457 -62100
155 -62100 17590 119740 89588 -31627 -81870 -44902 20193 74944 44891 -52564 -70731 -5067
167 -5067 15392 -15835 -34229 -38012 -10288 28654 -12546 -90201 -66492 18576 41473 8815
179 8815 -38386 -68655 -23476 49876 32094 -28810 -19645 18491 24516 19940 -413 -20551 18310
192 18310 62212 31178 -8459 -2712 -2495 4205 42399 43208 -2198 -20502 -16940 -11244 25427 37879
206 37879 -20067 -46163 5571 29204 -9105 -45714 -45916 11774 82008 33455 -100720 -109819
$$ packed form
120e7909J71105J6420j83398j11789R1111J45168M2640r8707j34489K3961J59370
131F3483M6768j16875q8223L1036R4193O8892n2295j20652k662J07375L7825m4812
143B4053k9344l757K3179L4069l3321n7760M3272Q5527p040o9672n8663j2643
155f2100P9690J02150l0152j21215n0243L6968O5095N4751l0053r7455j8167O5664
167e067K0459l1227j8394l783K7724L8942m1200p7655K3709Q5068K2897l2658
179H815m7201l0269M5179P3352j7782o0904R165L8136O025m576k0353k0138L8861
192A8310M3902l1034l9637N747K17O700L8194Q09m5406j8304L562N696L6671J2452
206C7879n7946k6096N1734K3633l8309l6609k02N7690P0234m8553j34175r099
$$ plain form
218 -109819 24903 112138 61861 -53136 -110336 -22588 102995 70358 -61082 -68971 36374
229 36374 80487 14822 -76344 -72263 56878 131298 6765 -134573 -81739 66320 108743
240 108743 14567 -104415 -98439 42103 107451 -5850 -105594 -51442 44392 61011 891
251 891 -65317 -44612 42582 48961 -24716 -27575 33801 39688 -7105 -33558 -12656 53144 83763
264 83763 7200 -68284 -21664 52785 45797 8937 -4573 -1385 11130 -5081 -43113 -5834
276 -5834 77086 47954 -72275 -104509 -15794 78971 76268 -41247 -134727 -53915 87367 72662
288 72662 -52121 -97549 -29372 57316 58888 -40615 -92692 3793 92402 28375 -68950 -54270
300 -54270 35239 91333 38761 -76402 -78807 60569 129131 28846 -82320 -73062 25341 108911
$$ packed form
218a09819J34722Q7235n0277j14997n7200Q7748J25583l2637j31440p889J05345
229C6374M4113o5665r1166M081J29141P4420j24533j41338N2834J48059M2423
240A08743r4176j18982N976J40542O5348j13301r9744N4152R5834J6619o0120
251H91o6208K0705Q7194O379p3677k859O1376N887m6793k6453K0902O5800L0619
264H3763p6563p5484M6620P4449o988l6860j3510L188J2515j6211l8032L7279
276e834Q2920k9132j20229l2234Q8715R4765k703j17515r3480Q0812J41282j4705
288G2662j24783m5428O8177Q6688J572r9503n2077R6485Q8609o4027r7325J4680
300e4270Q9509N6094n2572j15163k405J39376O8562j00285j11166R258R8403Q3570
$$ plain form
312 108911 71378 -52149 -83909 4800 58077 27429 -6270 -18562 -12270 8209 -4206 -33422
324 -33422 -3055 39548 7109 -42330 -38230 -13085 12946 29305 -2772 -42593 -24853 1615
336 1615 -2119 10562 21518 -13840 -38974 -13164 17441 33212 27234 -25168 -55469 5390 65174
349 65174 36586 -19214 -37713 -15883 37276 57762 302 -41625 -3283 29980 12394 -3663
361 -3663 -4778 3071 25058 12159 -40302 -36461 29099 48263 7274 -34637 -52924 -21911 45690
374 45690 50018 -20308 -55981 -30781 4261 34200 29034 -27955 -53789 -5284 30630 16070
386 16070 -5520 -23525 -20487 21356 31873 -18336 -33493 13817 37716 14350 -20159 -40245
398 -40245 -2369 67068 49239 -44447 -65500 6771 65221 53332 -16013 -72785 -26700 67480
$$ packed form
312A08911l7533j23527l1760Q8709N3277l0648l3699j2292O292K0479j2415k9216
324c3422L0367M2603l2439m9439M100K5145K6031J6359l2077l9821J7740K6468
336A615l734J2681J0956l5358k5134K5810L0605J5771n978n2402l0301O0859N9784
349F5174k8588n5800j8499K1830N3159K0486n7460m1927L8342L3263j7586j6057
361c663j115P849K1987j2899n2461L841O5560J9164m0989m1911j8287L1013O7601
374D5690M328p0326l5673K5200L5042K9939n166n6989k5834M8505L5914j4560
386A6070k1590j8005L038M1843J0517n0209j5157M7310K3899k3366l4509k0086
398d0245L7876O9437j7829r3686k1053P2271N8450j1889o9345n6772M6085R4180
$$ plain form
410 67480 61841 -23364 -51768 -11461 29688 35166 -6381 -42127 -2837 43862 5044 -47037
422 -47037 -24216 21863 32344 5402 -42768 -49348 13117 45944 -2057 -37407 -18847 -2615
434 -2615 1286 4336 -5520 -4448 7866 -14836 -37069 8490 52655 16097 -37567 -37599 5984 54291
448 54291 45450 -29888 -54619 21266 68956 18314 -36092 -24739 27863 61153 14068 -63465
460 -63465 -36755 66322 73202 -26380 -84091 -34950 57921 83812 -12917 -110888 -57046 65883
472 65883 72740 -22767 -80646 -45962 35086 59843 -18883 -78103 -15518 59474 28182 -40205
484 -40205 -48522 3548 59056 41244 -43019 -62370 21402 71419 25711 -29184 -35396 370
496 370 42999 32936 -18854 -21459 17087 11035 -16120 -4534 15981 12515 -5075 -29401 -26167
$$ packed form
410F7480n639q5205k8404M0307M1149N478m1547l5746L9290M6699l8818n2081
422d7037K2821M6079J0481k6942m8170o580O2465L2827m8001l5350J8560J6232
434b615L901L050r856J072J2314k2702k2233M5559M4165l6558n3664l2M3583M8307
448E4291q841p5338k4731P5885M7690n0642n4406J1353N2602L3290m7085p7533
460f3465K6710J03077O880r9582n7711M9141R2871K5891r6729r7971N3842J22929
472F5883O857r5507n7879L4684Q1048K4757p8726n9220O2585P4992l1292o8387
484d0205q317N2070N5508j7812q4263j9351Q3772N0017m5708n4895o212L5766
496C70M2629j0063n1790k605L8546o052k7155J1586K0515l466j7590k4326L234
$$ plain form
509 -26167 23787 41123 -16412 -49731 -10021 27641 22761 -5567 -29926 -9860 37335 23640
521 23640 -33533 -24624 36616 48310 2791 -40828 -33992 34527 79135 15154 -68621 -45086
533 -45086 35698 60083 15726 -45941 -57309 7758 53415 3269 -53300 -31850 10357 14296
545 14296 -10061 -39784 -32488 18793 30357 -25258 -50558 -12373 24244 27878 5214 -32970
557 -32970 -29394 27093 49677 15250 -9393 -8999 1526 32273 48119 16176 -11206 949 13411
570 13411 21429 31606 12886 -14296 -2162 14976 1193 -5278 2609 -1537 -3120 -5030 -28593
583 -28593 -31888 7354 19578 -16039 -39913 -35864 -15065 16766 14719 -32384 -48032 -10533 12770
596 12770 6903 -2345 -18021 -21972 4430 17988 1278 100 6680 -5514 -2747 21203 19950
$$ packed form
509b6167M9954J7336n7535l3319L9710L7662m880k8328k4359K0066M7195j3695
521B3640n7173Q909O1240J1694m5519m3619O836O8519M4608o3981q3775K3535
533d5086Q0784K4385m4357o1667j1368O5067M5657n0146n6569K1450M2207L939
545A4296k4357k9723P296N1281J1564n5615k5300L8185L6617L634k2664l8184
557c2970L576N6487K2584l4427k4643L94J0525L0747J5846l1943k7382J2155J2462
570A3411Q018J0177j8720k7182J2134J7138j3783o471P887m146j583j910k3563
583b8593l295L9242J2224l5617k3874M049K0799L1831k047m7103j5648L7499K3303
596A2770n867r248j5676l951K6402J3558j6710j178O580j2194K767K3950j253
$$ plain form
609 19950 4488 3012 -13 3711 25491 21609 -5329 832 23180 10650 -8577 -326 16222
622 16222 30267 22518 -25691 -46900 12094 63396 29399 -34290 -53313 -14597 45201 45576 -29342
635 -29342 -65150 -7157 39520 10388 -37472 -46012 -7208 36939 11070 -60252 -58065 17866
647 17866 42867 -7182 -53444 -45254 11020 49356 4213 -60012 -33013 39031 45985 -1101
659 -1101 -31911 -18378 29979 54507 12596 -22184 10417 40941 19441 -1734 9297 30059
671 30059 40728 15638 -26939 -13243 42236 41944 -8193 -25823 -5120 12717 8341 -21030 -35047
684 -35047 3456 29998 -18651 -66927 -38263 16435 26707 -13479 -62968 -51492 18936 37809
696 37809 -25863 -58984 -11608 37021 28165 -22285 -52663 -5718 68127 52619 -28579 -46814
$$ packed form
609A9950j5462j476l025L724K1780l882k6938O161K2348j2530j9227Q251J6548
622A6222J4045p749m8209k1209N8994N1302l3997o3689j9023L8716N9798L75p4918
635b9342l5808N7993M6677k9132m7860q540L8804M4147k5869p1322K187P5931
647A7866K5001n0049m6262Q190N6274L8336m5143o4225K6999P2044O954m7086
659a101l0810J3533M8357K4528m1911l4780L2601L0524k1500k1175J1031K0762
671C0059J0669k5090m2577J3696N5479k92n0137j7630K0703J7837m376k9371j4017
684c5047L8503K6542m8649m8276K8664N4698J0272m0186m9489J1476P0428J8873
696C7809o3672l3121M7376M8629q856n0450l0378M6945P3845j5508q1198j8235
$$ plain form
708 -46814 13556 59816 45421 -7977 -34699 13853 66527 30421 -34433 -25611 27855 49048
720 49048 22162 -26586 -40626 7332 41512 4970 -30870 -13269 9102 4334 -13524 -30105
732 -30105 -16139 23817 21710 -25524 -39559 -11133 7893 11977 7797 -10126 -15692 -3392 -6122
745 -6122 -7827 19103 26744 -6754 -27289 -13146 8734 26347 18851 -17260 -24970 9153 19131
758 19131 -4833 -11045 62 7284 10889 -3304 -24613 -7551 24421 12673 -14935 -10687 5013
771 5013 11848 9338 -12402 -23223 11089 39770 13597 -21839 -25694 -8974 21269 40012 11950
784 11950 -25790 -24077 -4681 8684 23103 17704 -11856 -20866 -7058 -3952 568 13547 6956
797 6956 -7598 -8675 -15725 -19567 9048 30340 6244 -23512 -26076 -9329 20703 30797 -7200
$$ packed form
708d6814O0370M6260j4395n3398k6722M8552N2674l6106o4854Q822N3466K1193
720D9048k6886m8748j4040M7958L4180l6542l5840J7601K2371m768j7858j6581
732c0105J3966L9956k107m7234j4035K8426J9026M084m180j7923n566J2300k730
745f122j705K6930P641l3498k0535J4143K1880J7613p496l6111p710L4123R978
758A9131k3964o212J1107P222L605j4193k1309J7062L1972j1748k7608M248J5700
771E013O835k510k1740j0821L4312K8681k6173l5436l855J6720L0243J8743k8062
784A1950l7740J713J9396J3365J4419n399k9560r010J3808L106M520J2979o591
797F956j4554j077p050l842K8615K1292k4096k9756k564J6747L0032J0094l7997
$$ plain form
810 -7200 -36655 -7065 27964 19411 -7125 -25701 -16675 22722 37621 -3152 -32780 -11859 10733
823 10733 11428 6166 -2021 -3518 7082 -5142 -29280 -8254 35097 32079 -8434 -35307 -30707
836 -30707 8632 45586 25217 -21346 -23123 -399 5665 8986 14933 9218 3986 -3653 -19905
849 -19905 -8080 30749 30212 -11706 -27417 -6998 15444 20711 -3540 -31745 -11285 29071 16103
862 16103 -26892 -31284 -4307 16719 13971 -15597 -30254 1638 21985 -11941 -36074 -4506
874 -4506 33189 29997 -12312 -53313 -31095 44541 64944 1937 -47444 -27946 18241 41139
886 41139 19498 -18891 -12242 26330 19810 -19488 -18325 17232 34343 17184 -20988 -38254 1730
899 1730 41304 15403 -27943 -22398 5833 15751 2659 -23281 -24614 12184 26937 -8373 -30229
$$ packed form
810g200k9455K9590L5029q553k6536j8576R026L9397J4899m0773k9628K0921K2592
823A0733O95n262q187j497J0600j2224k4138K1026M3351l018m0513k6873M600
836c0707L9339L6954k0369m6563j777K2724O064L321N947n715n232p639j6252
849a9905J1825L8829n37m1918j5711K0419K2442N267k4251k8205K0460M0356j2968
862A6103m2995m392K6977K1026k748k9568j4657L1892K0347l3926k4133L1568
874d506L7695l192m2309m1001K2218P5636K0403o3007m9381J9498M6187K2898
886D1139k1641l8389O649L8572o520l9298J163L5557J7111j7159l8172j7266L9984
899A730L9574k5901m3346N545K8231R918j3092k5940j333L6798J4753l5310k1856
$$ plain form
912 -30229 -11522 5082 5942 1150 -7603 -2953 10178 -5363 -28393 -5178 31832 24943 -8060
925 -8060 -27365 -19084 15783 36099 6160 -22787 -3272 17540 4486 -10558 -7198 8605 26266
938 26266 12548 -28985 -30302 15048 33209 6002 -18923 -20641 -320 21401 5987 -26897
950 -26897 -14965 22392 20780 -9913 -25898 -18178 10847 32384 8720 -26913 -18353 8597 11144
963 11144 5420 1373 -4456 2200 9433 -5888 -13197 8011 18052 5771 -1978 -7419 -11860 2600
977 2600 15715 3987 -4536 -523 -5825 -7478 5115 2898 -8476 -1121 4925 -3466 -6166 -7196
991 -7196 -13094 448 19396 5677 -17518 -16048 -5403 4983 16978 7709 -13196 -9776 3272
1004 3272 138 2046 12698 6764 -2602 -1346 -4677 -2344 15583 16291 -3205 -5987 2425 -1416
$$ packed form
912c0229J8707J6604Q60m792q753M650J3131j5541k3030K3215L7010o889l3003
925h060j9305Q281L4867K0316k9939k8947J9515K0812j3054j5044L360J5803J7661
938B6266j3718m1533j317M5350J8161k7207k4925j718K0321K1721j5414l2884
950b6897J1932L7357j612l0693j5985P720K9025K1537k3664l5633Q560K6950K547
963A1144n724m047n829O656P233j5321p309K1208J0041j2281p749n441m441J4460
977B600J3115j1728q523M013n302j653J2593k217j1374P355O046q391k700j030
991g196n898J3542J8948j3719k3195J470J0645J0386J1995r269k0905L420J3048
1004C272l134J908J0652n934r366J256l331K333J7927P08j9496k782Q412l841
$$ plain form
1018 -1416 1404 9893 3818 -1748 1263 -5671 -8402 8527 9910 -10508 -12363 2291 7827 4702
1032 4702 -8474 -24859 -8922 25290 19278 -17477 -28789 -10005 11537 21229 1941 -24109
1044 -24109 -10768 16614 5959 -15700 -7426 11894 18443 4883 -24734 -27300 16794 43138
1056 43138 8272 -29746 -23962 5908 28544 19218 -16706 -24067 10614 24367 -2054 -16195
1068 -16195 -3535 10995 15611 302 -20100 -6497 21761 11137 -17134 -11505 9888 16218
1080 16218 4977 -16585 -22291 8454 29388 3485 -21551 -10973 4629 6304 1436 -7317 -3269
1093 -3269 13254 3329 -25772 -16455 20029 25193 -1500 -24999 -24022 8259 34480 8454 -29767
1106 -29767 -17353 17227 19498 -1205 -16519 -10325 17102 24580 -10191 -29392 2131 28652
$$ packed form
1018a416K820Q489o075n566L011o934k731J6929J383k0418j855J4654N536l125
1032D702j3176j6385J5937L4212o012l6755j1312J8784K1542R692j9288k6050
1044b4109J3341K7382j0655k1659Q274J9320O549j3560k9617k566M4094K6344
1056D3138l4866l8018N784K9870K2636r326l5924p361L4681J3753k6421j4141
1068a6195J2660J4530M616j5309k0402J3603K8258j0624k8271N629K1393O330
1080A6218j1241k1562n706L0745K0934k5903k5036J0578J5602J675m868q753M048
1093c269J6523r925k9101R317L6484N164k6693k3499R77L2281K6221k6026l8221
1106b9767J2414L4580K271k0703j5314O194K7427P478l4771j9201L1523K6521
$$ plain form
1118 28652 12653 -13976 -22369 -3197 27261 19858 -22353 -29215 8840 27929 8640 -15822
1130 -15822 -22887 -2679 25271 14792 -17779 -15268 9791 10868 -1226 -5796 -3398 9560 16059
1143 16059 -5522 -20002 2523 21517 8911 -5831 -9066 -4831 9224 13206 -5352 -10851 5408
1156 5408 4933 -9635 -6889 1415 1892 1730 -7609 -18544 -4508 12634 -543 -16678 -9221 60
1170 60 2366 1936 -9629 -14631 4824 15178 -2555 -10808 599 5707 7155 7029 -2924 -2036 15783
1185 15783 14590 -3659 -3530 8387 10854 12686 7680 -6976 -5085 12048 10614 -606 -498 -2333
1199 -2333 -5919 2243 3805 -8527 -7995 -175 -5192 -7622 -3797 -10218 -10997 1601 -315 -14163 -12464
1214 -12464 -3120 -1180 2375 -975 -15034 -9813 10831 8457 -5689 -6098 -469 5397 13365 4911
$$ packed form
1118B8652j5999k6629q393J9172L0458p403m2211o862L8055J9089j9289k4462
1130a5822p065K0208K7950j0479l2571K511K5059J077j2094m570K398J2958O499
1143A6059k1581j4480K2525J8994j2606j4742l235M235J4055L982j8558n499J6259
1156E408m75j4568K746Q304M77j62r339j0935J4036J7142j3177j6135P457R281
1170F0K306m30j1565n002J9455J0354j7733q253J1407N108J448j26r953Q88J7819
1185A5783j193j8249J29J1917K467J832n006j4656J891J7133j434j1220J08j835
1199b333l586Q162J562j2332N32P820n017k430L825o421p79J2598j916j3848J699
1214a2464R344J940L555l350j4059N221K0644k374j4146m09N629N866P968q454
$$ plain form
1228 4911 -10270 1029 18296 9929 -2508 614 5180 11463 13529 -1477 -9732 9981 19912
1241 19912 2582 -8529 -2475 3871 10499 6903 -11245 -11172 9188 8480 -9568 -10006 -506 1436
1255 1436 651 -7637 -16181 -1912 13563 -3566 -21646 -10022 5698 6789 -1032 -14660 -15426 7581
1269 7581 14975 -8626 -18215 1812 13413 6049 -5878 -13665 -81 23783 13610 -16782 -13783
1282 -13783 14378 22475 7916 -9749 -13577 9877 29831 8029 -19635 -6931 17686 17145 681
1295 681 -13180 -9518 14434 20450 -10195 -24830 -44 18184 7034 -12171 -20832 -7856 17173
1308 17173 11189 -20389 -22720 4086 12519 -592 -11865 -13570 409 14923 -110 -20113 -5027
1321 -5027 16008 8036 -7195 -9898 -1953 13608 15849 -7264 -16186 7110 19120 3369 -7813
$$ packed form
1228D911j5181J1299J7267q367j2437L122M566O283K066j5006q255J9713R931
1241A9912j7330j1111O054O346O628l596j8148P3K0360p08j8048m38R500J942
1255A436p85q288q544J4269J5475j7129j8080J1624J5720J091p821j3628p66K3007
1269G581P394k3601r589K0027J1601p364j1927p787J3584K3864j0173l0392K999
1282a3783K8161Q097j4559j7665l828K3454J9954k1802k7664J2704K4617n41j6464
1295F81j3861L662K3952O016l0645j4635K4786J8228j1150j9205q661J2976K5029
1308A7173n984l1578k331K6806Q433j3111j1273j705J3979J4514j5033k0003J5086
1321e027K1035p972j5231k703P945J5561K241k3113q922K3296J2010j5751j1182
$$ plain form
1334 -7813 -4347 3985 13338 6121 -13095 -7190 15598 10177 -10523 -11628 206 9749 10005 -7515
1348 -7515 -21067 -2029 18992 4947 -14517 -11084 189 8373 7497 -8786 -14862 6053 15220
1361 15220 -2857 -11634 -1335 6551 9714 3415 -12094 -8432 13821 13810 -4840 -8446 -621 3928
1375 3928 8576 3116 -10630 -5576 9160 4170 -5817 -2850 -2132 -3489 2219 597 -7658 -1662 3238
1390 3238 -5681 -5794 2072 -954 -3033 2678 -1248 -6910 939 3728 -1079 3076 4614 -5601 -3328
1405 -3328 7514 5366 831 3196 -450 -1845 8126 7150 -3514 1081 7540 818 -226 3664 -37
1420 -37 653 6616 -656 -6428 2703 4128 -5490 -2918 2144 -1686 -969 -1467 -9278 -5648 6745 1292
1436 1292 -10577 -4992 784 -1948 -1610 -3982 -7772 3089 9440 -6681 -14645 19 9845 6560
$$ packed form
1334g813L466Q332R353p217j9216N905K2788n421k0700j105J1834R543K56j7520
1348g515j3552J9038K1021j4045j9464L433J1273Q184q76j6283o076K0915R167
1361A5220j8077q777J0299P886L163o299j5509L662K2253j1j8650l606P825M549
1375C928M648n460j3746N054J4736m990r987K967P18j357N708j622q255N996M900
1390C238q919j13P866l026k079N711l926n662P849K789m807M155J538j0215K273
1405c328J0842k148m535K365l646j395R971r76j0664M595O459o722j044L890l701
1420c7O90N963p272n772R131J425r618K572N062l830P17m98p811L630J2393n453
1436A292j1869N585N776k732L38k372l790J0861O351j6121p964J4664R826l285
$$ plain form
1450 6560 278 -9104 -7180 12242 14069 -6406 -10202 6611 12807 6418 -3215 -10702 1683 21399
1464 21399 11752 -13308 -10175 7599 12341 5762 -4743 -10063 4333 15626 -2373 -18016 -3366
1477 -3366 13283 8471 -4479 -15533 -12728 8914 15225 -7340 -17086 -1655 6360 -163 -6120
1490 -6120 -9675 -1817 12033 3517 -16962 -10471 9687 8962 -2160 -6911 -5238 5716 12177 -3975
1504 -3975 -15403 2988 18071 6348 -8494 -10172 -1572 13479 13886 -7236 -12652 6949 11844
1517 11844 -2664 -7937 -332 9145 12748 -1984 -21322 -7347 20104 16271 -7170 -15686 -7897
1530 -7897 7145 14861 -643 -16541 -2493 13716 2985 -10797 -8114 1496 9934 7646 -10673
1543 -10673 -15180 5136 13254 -2399 -10231 -3407 4016 8031 594 -15641 -9678 12795 12631 -4810
$$ packed form
1450F560o282r382J924J9422J827k0475l796J6813O196o389r633p487J2385J9716
1464B1399r647k5060L133J7774M742o579j0505n320J4396J1293j7999j5643J4650
1477c366J6649m812j2950j1054K805K1642O311k2565r746J5431Q015o523n957
1490f120l555P858J3850q516k0479O491K0158p25j1122m751J673J0954O461j6152
1504c975j1428J8391J5083j1723j4842j678Q600J5051M07k1122n416J9601M895
1517A1844j4508n273P605R477L603j4732j9338J3975K7451l833k3441q516P789
1530g897J5042P716j5504j5898J4048J6209j0731j3782K683R610Q438k288j8319
1543a0673m507K0316Q118j5653p832O824P423M015p437j6235N963K2473j64j7441
$$ plain form
1557 -4810 -10329 -5940 -538 7359 4413 -5698 -1093 5448 -5248 -9351 3362 9827 5846 24
1571 24 -9924 -10263 8140 15468 546 -5987 -100 896 1989 4333 -915 -458 8743 3689 -8218
1586 -8218 -2685 5941 2995 1524 205 -4726 173 6977 -2786 -10341 191 6762 2405 -567 -7163
1601 -7163 -12569 -947 10273 2283 -5342 -5361 -8482 -5751 5699 4534 -3319 -1633 -2363 -8099 -2450
1616 -2450 5099 2430 1983 2858 -6542 -8724 4446 9649 4228 1611 -2890 -5779 5146 11270 238
1631 238 -4400 4068 5915 3402 1842 -5136 -4263 9478 10814 -2969 -5730 179 -784 597 2295
1646 2295 -1849 387 5589 -4974 -15151 -3016 10019 6404 -1532 -10587 -14040 -32 11692
1659 11692 904 -8650 -1993 313 -3364 -2522 -1959 528 9060 3776 -12359 -8666 8557 10450
$$ packed form
1557d810n519M389N402P897k946j0111M605O541j0696m103J2713O465l981n822
1571B4r948l39J8403P328j4922o533N887R96J093K344n248M57R201n054j1907
1586h218N533Q626k946j471j319m931M899O804r763p555J0532O571m357k972o596
1601g163n406J1622J1220p990p625j9l121K731J1450j165p853J686p30n736N649
1616b450P549k669m47Q75r400k182J3170N203n421k617m501k889J0925O124j1032
1631B38m638Q468J847k513j560o978Q73J3741J336j3783k761N909r63J381J698
1646B295m144K236N202j0563j0177J2135J3035l615p936r055l453J4008J1724
1659A1692j0788r554O657K306l677Q42N63K487Q532n284j6135L693J7223J893
$$ plain form
1673 10450 977 -3576 -4086 3073 11735 837 -12522 -505 15252 9434 -3793 -9001 -5951 7836
1687 7836 14645 -311 -11035 1147 7962 -2143 -7272 -2051 5391 11397 1714 -18690 -14174 10853
1701 10853 16449 64 -10878 -10578 -233 10962 3440 -11650 -4099 11095 4250 -8760 -8076
1714 -8076 330 8969 9995 -5523 -13873 1972 12376 996 -8022 -2571 4611 8493 1776 -13843
1728 -13843 -10429 11458 14807 -2611 -10933 -6963 154 7078 3253 -7234 -1790 7909 -1297 -12231
1742 -12231 -3914 8103 9539 3981 -9493 -13828 3835 16221 3309 -8035 -2494 3437 5347
1755 5347 3922 -5267 -4229 10115 10294 -4951 -7617 1428 5073 4986 932 -6283 -1409 8458 444
1770 444 -11293 -4015 7260 6141 -288 -9277 -13824 -761 11633 2210 -8763 -6028 -3199 -2718
$$ packed form
1673A0450r473m553n10P159Q662j0898j3359J2017J5757n818j3227n208L050J3787
1687G836O809j4956j0724J2182O815j0105n129N221P442O006r683k0404M516K5027
1701A0853N596j6385j0942L00J0345J1195p522j5090P551J5194o845j3010O84
1714h076Q406Q639J026j5518q350J5845J0404j1380r018N451P182L882o717j5619
1728a3843L414K1887L349j7418q322L970P117O924l825j0487N444R699r206j0934
1742a2231Q317J2017J436n558j3474m335J7663J2386j2912j1344N541N931J910
1755E347j425r189J038J4344J79j5245k666R045L645q7m054p215M874R867q014
1770D44j1737P278J1275j119o429q989m547J3063J2394r423j0973K735K829M81
$$ plain form
1784 -2718 979 -473 -2682 2857 1676 -9546 -7526 4632 6636 2632 78 -6306 -4307 7207
1798 7207 7247 -1863 -255 4072 2118 2718 3296 -1909 -86 8154 4942 -1275 1366 434 -2348 3431
1814 3431 5754 -203 349 1675 -4408 -4728 3006 3242 346 708 -5400 -10693 -1044 6022 893 -2258
1830 -2258 -4762 -9281 -4037 4760 122 -5097 -857 -1132 -4987 -1562 618 -1301 3169 3484 -5339
1845 -5339 -4167 5520 4709 -479 1022 537 1576 7754 3728 -6133 -483 10161 7124 1365 -1079
1860 -1079 -2915 1824 9360 2595 -4327 1956 5330 -2257 -4940 -1180 1900 6155 2545 -11807 -12413
1875 -12413 3948 8960 -1040 -7893 -8399 -3563 5102 2107 -9863 -6072 6419 3408 -6730 -6540
1889 -6540 -1810 5060 8632 -1880 -11104 185 11209 3728 -5165 -3085 2494 8929 7194 -6465
$$ packed form
1784b718L697j452k209N539j181j1222K020J2158K004m004k554o384J999J1514
1798G207M0r110J608M327j954O00N78n205J823Q240l212o217K641r32k782N779
1814C431K323n957N52J326o083l20P734K36k896L62o108n293R649P066n129l151
1830b258k504m519N244Q797m638n219M240k75l855L425K180j919M470L15q823
1845e339J172R687q11n188J501m85J039O178m026r861N650J0644l037n759k444
1860a079j836M739P536o765o922O283L374p587k683L760L080M255l610j4352o06
1875a2413J6361N012j0000o853n06M836Q665k995j1970L791J2491l011j0138J90
1889f540M730O870L572j0512r224J1289J1024p481q893K080N579O435j735j3659
$$ plain form
1903 -6465 -9912 6311 13195 1288 -5654 -3652 927 6597 3848 -7017 -3938 8192 4217 -8368
1917 -8368 -7171 1433 6081 5706 -4636 -13020 -1706 11033 2838 -7733 -4300 1464 4093 2544
1931 2544 -5786 -7180 6770 10523 -3753 -9364 -819 5264 6075 672 -7802 -3644 9635 6315
1945 6315 -8102 -7062 3140 6412 3598 -4172 -10603 -900 10445 2501 -8905 -4541 2517 2551
1959 2551 850 -4813 -6262 4362 8388 -3921 -8987 285 5343 3669 314 -5348 -3723 7027
1973 7027 6557 -4288 -3868 4236 4111 1552 -182 -3630 765 8595 2889 -6182 -1424 4601 2034
1988 2034 813 -651 -3477 1966 5270 -2454 -6367 1527 4025 -71 -1101 -3178 -4364 2373 4050
2003 4050 -4460 -5493 951 189 -1892 -536 -3134 -3357 3037 1718 -5617 -2880 2145 -45 202 1003
$$ packed form
1903f465l447J6223O884j1907o942K002M579N670k749j0865L079J2130l975j2585
1917h368J197Q604M648l75j0342q384J1314J2739q195j0571L433N764K629j549
1931B544q330j394J3950L753j4276n611Q545O083Q11n403q474M158J3279l320
1945F315j4417J040J0202L272k814p770o431R703J1345p944j1406M364P058L4
1959B551j701n663j449J0624M026j2309n066R272N058j674l355n662J625J0750
1973G027m70j0845M20Q104j25k559j734l448M395P830n706r071M758O025k567
1988B034j221j464k826N443L304p724l913P894K498m096j030k077j186O737J677
2003D050q510j033O444p62k081J356k598k23O394j319p335K737N025k190K47Q01
$$ plain form
2019 1003 -3794 -1918 4890 1750 -3552 96 2746 1179 3179 2107 -3868 844 7215 2953 -1372
2034 -1372 1139 602 1198 5712 2045 -3649 1491 5464 -27 -1829 419 -471 1936 3063 -3953 -6794
2050 -6794 1913 3817 -2601 -4257 -3047 -2807 1470 1496 -6849 -6196 2839 1752 -4192 -3519 -1868 -120
2066 -120 3212 -555 -7324 -774 7212 1739 -4677 -1575 1739 4729 5401 -2645 -5883 4183 9562
2081 9562 682 -3936 -67 2754 5767 4087 -5258 -3693 7676 6729 -4571 -5272 905 4312 5287
2096 5287 -1468 -9340 -2494 9113 3571 -7045 -6055 151 3622 3506 -4318 -9060 1299 8128 -1209
2111 -1209 -7856 -2563 2270 3619 537 -7155 -6278 6452 7218 -4937 -7656 -264 4245 4464 -760
2126 -760 -7722 -2325 8460 3834 -6336 -3882 3184 4021 1902 -2937 -5618 3401 9721 -804 -7973
$$ packed form
2019A003m797J876O808l140n302L648K650j567K000j072n975M712O371m262m325
2034a372K511n37N96M514l667n694N140L973n491j802K248q90K407J127p016k841
2050f794Q707J904o418j656J210K40M277K6q345O53R035j087n944O73J651J748
2066a20L332l767o769O550P986n473o416L102L314K990O72q046l238J0066N379
2081I562q880m618L869K821L013j680r345J565J1369r47j1300p01O177L407R75
2096E287o755p872O846J1607n542j0616R90O206L471j16p824m742J0359O829r337
2111a209o647N293M833J349l082p692Q77J2730P66j2155k719P392M509K19n224
2126g60o962N397J0785m626j0170K454P066Q37k119m839k681R019O320j0525p169
$$ plain form
2141 -7973 -271 6018 5253 732 -5254 -4316 7155 8276 -4006 -6452 2723 5427 2533 -1343 -5365
2156 -5365 -903 8244 3575 -7821 -4341 4274 4259 154 -4452 -6612 1211 7687 -877 -9748 -3110
2171 -3110 4074 2015 -1083 -4760 -5503 2428 5008 -3896 -6862 990 3104 -287 -1824 -3622 -1722
2186 -1722 5864 4011 -5314 -3770 3899 3512 1181 176 -1699 365 6346 2046 -4029 530 5712
2201 5712 2535 645 160 -1887 2386 5807 -622 -4138 1701 3511 -785 -1046 -1120 -2355 2860 2969
2217 2969 -4491 -5263 1331 1112 -1237 -779 -3167 -3569 2340 1057 -4994 -3121 1681 229 -1165 -468
2233 -468 -3942 -1474 4871 1703 -4207 -1294 1585 471 1793 1282 -2868 600 5753 215 -3641
2248 -3641 925 3066 2496 2874 -1185 -4708 2675 6743 364 -2769 658 917 1347 2590 -2295 -2901
$$ packed form
2141g973P702O289p65m521n986R38J1471J121j2282k446R175K704k894l876m022
2156e365M462R147m669j1396L480Q615j5m105m606k160P823O476q564q871O638
2171c110P184k059l098l677p43P931K580q904k966P852K114l391j537j798J900
2186a722P586j853r325J544P669l87k331j005j875K064N981m300o075M559N182
2201E712l177j890m85k047M273L421o429l516N839J810m296k61p4j235N215J09
2217B969p460p72O594k19k349M58k388m02N909j283o051J873M802j452j394O97
2233d68l474K468O345l168n910K913K879j114J322n11m150L468N153n538l856
2248c641M566K141n70L78m059l523P383M068o379l133L427K59M30J243m885o06
$$ plain form
2264 -2901 4365 4089 -3760 -3328 1027 1697 2415 24 -5805 -2401 5073 1448 -5493 -2987 1135 1689
2280 1689 1474 -2646 -7040 128 6533 -274 -5903 -2049 705 883 442 -2734 -3309 4623 5041 -5123
2296 -5123 -6581 2392 5948 4227 -298 -6522 -3179 7767 5941 -3685 -3221 2584 2773 1699 -1636
2311 -1636 -4332 2103 7942 603 -7563 -1690 4026 3401 675 -4008 -4810 3760 6822 -3762 -7790
2326 -7790 705 5603 3482 -669 -5922 -4149 5682 5884 -3697 -3970 2718 1627 -1149 -2430 -3009 2699
2342 2699 7691 -845 -10108 -3764 5533 4965 219 -4813 -6167 1118 5979 -1903 -6505 745 3740
2357 3740 -470 -3248 -3906 -1108 5261 4114 -5675 -5095 3888 4307 -107 -1808 -1566 2545 8035 2337
2373 2337 -6865 -2252 6970 5929 1777 -1119 -3618 747 6183 1534 -3218 2123 3785 -1818 -3500
$$ packed form
2264b901P266k76p849M32M355O70P18k391n829L404P474l625o941K506M122N54
2280A689k15m120m394P168O405o807n629L854K754J78m41l176n75P932M18j0164
2296e123j458Q973L556j721m525o224L343J0946j826r626M64N805J89j074l335
2311a636k696O435N839p339q166N873N716o25k726m683q02Q570L062j0584m028
2326g790Q495M898k121m151n253J773R831K02r581k73O688j091k776j281n79N708
2342B699M992q536r263O344R297n68m746n032j354P285M861p882m602P250K995
2357C740m210k778o58K798O369j147r789N80Q983M19m414j701K42M111N490n698
2373B337r202M613R222j041m152k896k499M365N436m649m752N341J662n603j682
$$ plain form
2388 -3500 -1426 399 4566 3237 -6687 -8611 806 3500 -214 -2119 -4277 -4173 956 855 -5565
2403 -5565 -2828 3000 605 -2805 -1969 -2380 394 4358 922 -4007 532 4016 27 -1531 313
2418 313 1186 4298 5642 -1776 -5453 1858 5788 3111 1589 -788 -2817 1364 4303 -216 -939 3359
2434 3359 1030 -2729 -1435 -995 182 4932 1956 -6215 -4337 2046 1556 376 41 -3774 -2519 2740
2450 2740 -135 -5172 -1308 2817 486 -539 -2068 -5037 -965 4545 119 -3562 14 414 -1891
2465 -1891 -520 -304 -856 3824 3603 -4399 -5288 2090 4602 3256 1608 -2614 -2988 4065 4479 -919
2481 -919 299 4037 1639 -461 -266 -1709 2138 6641 903 -5424 -1194 2654 811 -365 -1670
2496 -1670 -2831 2258 3520 -4970 -7854 347 4420 1632 -1909 -5447 -5417 2776 4297 -3106 -3510 1758
$$ packed form
2388c500K074J825M167j329r924j924R417K694l714j905k158J04N129j01o420
2403e565K737N828k395l410Q36m11K774L964l436m929M539L484l989j558J844
2418C13Q73L112J344p418l677P311L930k677j522k377k029M181K939m519p23M298
2434C359k329l759J294M40J177M750k976q171J878O383m90j180l35l815J255N259
2450B740k875n037L864M125k331j025j529k969M072N510m426l681L576M00k305
2465a891J371K16n52M680k21q002q89P378K512j346j648m222l74P053M14n398
2481i19J218L738k398k100J95j443L847M503n738o327M230L848j843j176j305
2496a670j161N089J262q490k884Q201M073k788l541l538L0Q193J521p403m04N268
$$ plain form
2512 1758 727 -2196 -1943 -2088 1869 7152 1001 -8012 -3471 4925 5038 1820 -1808 -4329 937 6222
2528 6222 -105 -5090 764 4431 846 -1314 -2861 -2512 3764 5119 -2835 -4555 2118 2546 -1335
2543 -1335 -1423 -1260 1295 5846 1011 -7371 -3694 5582 5232 1053 -1517 -3942 -420 4780 1595 -3190
2559 -3190 1479 4143 -1752 -4057 -1843 814 4646 4081 -5227 -7614 1269 4672 -46 -2647 -3584
2574 -3584 -1841 2785 1457 -5868 -4288 3477 3192 -1652 -2609 -2684 -17 4351 1282 -4324 203 5268
2590 5268 758 -3136 -1094 1298 4736 5950 -2224 -6997 863 6460 3501 708 -847 -2806 1275
2605 1275 3871 -698 -1392 3528 1806 -3418 -2199 -590 775 3837 901 -5748 -3668 2911 872
2620 872 -2210 -1091 -1792 -1024 2215 -1211 -5265 -757 3437 -387 -1589 -669 -2123 -655 1971 -1278
$$ packed form
2512A758j031k923K53j45L957N283o151r013M541Q396J13l218l628k521N266N285
2528F222o327m985N854L667l585k160j547L49O276J355p954j720O673M28l881
2543a335q8J63K555M551m835q382L677R276l50m179k570k425L522N200l185m785
2559c190M669K664n895k305K214K657L832n65r308k387Q883L403m718k601r37
2574c584J743M626j328p325J580P765k85m844r57p5K667M368l069n606M527N065
2590E268m510l894K042K392L438J214q174m773P860N597k959k793j555j959M081
2605A275K596m569o94M920j722n224J219J609J365L062k936o649K080O579k039
2620H72l082J119p01P68L239l426m054M508M194l824j202R20j454J468K626l249
$$ plain form
2636 -1278 -2199 2875 2728 -3317 -2567 86 1290 4408 3089 -4296 -4604 3121 4114 1292 948 -816
2652 -816 -958 2894 2110 -1866 757 5051 1713 -2183 -912 -607 2116 5320 27 -5415 -578 3548
2668 3548 401 -1049 -1433 -2399 1273 3633 -2989 -6315 -227 2785 50 -1024 -2554 -3710 846
2683 846 2169 -3171 -3054 2437 852 -2332 -2135 -1991 445 5062 1712 -5321 -2503 3368 2415 471
2699 471 532 -1419 260 4131 -238 -3269 2251 4805 207 -1376 -676 -322 3376 4526 -2362 -3563
2715 -3563 2946 3291 -949 -2002 -642 330 3783 1085 -5532 -3148 3876 2604 -2019 -2232 -2143 -2
2731 -2 3196 -862 -5760 21 4551 -246 -3815 -2647 -932 2896 4135 -3014 -5749 1133 4176 -293
2747 -293 -2383 -1420 -525 3145 2409 -4497 -3240 4238 3850 -1337 -2102 -1324 845 4542 1987 -4234 -426
$$ packed form
2636a278r21N074j47o045P50K653J204L118j319p385l08P725R93k822l44j764
2652h16j42L852p84l976K623M294l338l896J271L05K723L204n293n442M837M126
2668C548l147j450l84r66L672K360o622l326O088L012k735j074j530j156M556
2683H46J323n340J17N491j585l184J97J44K436M617l350p033K818N871r53j944
2699D71O1j951J679L871m369l031N520K554m598j583P00L54L698J150o888j201
2715c563O509L45m240j053J360R72L453k698o617K384P024j272m623k13Q9K141
2731bL198m058m898N781M530m797l569J168J715L828J239p149k735O882L043m469
2747b93k090R63Q95L670p36o906J257P478l88n187p65P78K169L697k555o221L808
$$ plain form
2764 -426 4945 1484 -2123 -823 124 2662 4258 -1469 -4939 1158 5373 514 -1864 -487 -274 1865
2780 1865 2586 -2810 -3313 3207 3027 -2574 -2557 -474 -15 2100 471 -5015 -2709 3629 589 -3652
2796 -3652 -2067 -158 376 1743 -1974 -5576 -265 4673 -41 -2940 -1026 -170 1437 2734 -1389
2811 -1389 -3237 2893 4209 -1344 -1883 1329 1469 3479 2505 -2911 -2121 4608 3668 -954 -674 472
2827 472 651 2802 1130 -3447 -503 4105 580 -2931 -527 -38 534 1979 -1516 -4823 240 3481
2843 3481 -1478 -3147 -755 -770 595 1939 -2581 -4591 1474 3077 -1784 -1638 -742 -1238 1306 1544
2859 1544 -2883 -1731 3188 1366 -2197 -1016 380 677 3306 1146 -3990 -710 3929 1553 -1344
2874 -1344 -88 -231 780 2986 -156 -3046 1692 4020 -690 -1385 598 532 1611 2404 -2214 -2933
$$ packed form
2764d26N371l461l607J300R47K538J596n727l470O097M215m859k378J377K13K139
2780A865P21n396n03O520j80n601J7K083M59K115j629n486K306O338l040m241
2796c652J585J909N34J367l717l602N311M938m714k899J914Q56J607J297m123
2811a389j848O130J316n553n39L212J40K010r74n416P90O729r40m622K80J146
2827D72J79K151j672m577K944M608l525l511K404M89N72J445l495l307N063L241
2843C481m959j669K392j5J365J344m520k010O065J603m861J46Q96m96K544K38
2859A544m427J152M919j822l563J181J396K97K629k160n136L280M639k376k897
2874a344J256j43J011K206l142k890M738K328m710o95J983o6J079P93m618p19
$$ plain form
2890 -2933 3045 3123 -2009 -1320 53 -123 2156 1147 -3605 -2346 3144 961 -2793 -1405 -579 -413
2906 -413 1522 -1340 -4808 61 3974 -559 -4033 -1744 -438 1461 2748 -2540 -5039 1575 4339
2921 4339 -699 -2393 -217 111 2502 2276 -2741 -2446 4560 3671 -1660 -1362 555 1324 3665 1385
2937 1385 -4168 -902 5116 2403 -2091 -1090 -31 1031 3262 -38 -4184 337 3864 -636 -2293
2952 -2293 -66 -161 641 1459 -2840 -3306 2619 3053 -2458 -2914 -107 -4 1156 663 -3916 -2288 3430
2969 3430 660 -3462 -1487 543 233 1106 -1053 -3969 346 4622 -467 -3941 -313 1342 1422 2006
2985 2006 -1833 -3515 3077 4970 -1342 -2391 684 1717 2622 1951 -2338 -1980 4559 3619 -1848 -1570
3001 -1570 1305 1675 2591 832 -3859 -1628 4616 1713 -3282 -1596 -418 -152 1754 -955 -4777 -814
$$ packed form
2890b933N978P8n132O89J373j76K279j009m752J259N490k183l754J388Q26J66
2906d13J935k862l468M869L913m533l474K289J306J899J287n288k499O614K764
2921D339n038j694K176L28K391k26n017K95P006q89n331K98J917P69K341k280
2937A385n553L266O018k713m494J001J059J062K231l300m146M521L527m500j657
2952b293K227r5Q02Q18m299m66N925M34n511m56K807J03J160m93m579J628N718
2969C430k770m122J975K030l10Q73k159k916M315M276n089l474L628J655Q0N84
2985B006l839j682O592J893o312j049L075J033R05o71m289L58O539r40n467K78
3001a570K875L70R16j759m691K231O244k903m995J686J178K66J906k709l822L963
$$ plain form
3017 -814 2688 -1413 -3961 -961 -764 73 910 -2292 -4099 967 2764 -1587 -2068 320 -506 645
3033 645 1269 -1889 -1462 3601 1974 -2359 79 1738 691 1830 921 -2290 902 4276 411 -2700
3049 -2700 901 1806 1248 1766 -692 -2927 1815 4071 -880 -2446 553 653 105 813 -2439 -2335 3190
3066 3190 2739 -3820 -3128 704 972 1695 302 -4515 -2899 3521 1695 -2957 -1548 49 -264 1338
3082 1338 -399 -4250 -358 4047 -149 -3346 -1047 450 821 2229 -1721 -3650 1690 4067 -667
3097 -667 -2065 405 595 2143 3175 -1821 -2824 2907 3258 -381 80 1556 -327 1223 1269 -1797
3113 -1797 335 4480 579 -3765 -1018 1381 858 1677 -623 -4205 -161 2918 -1006 -2573 606
3128 606 358 -1049 -158 -2424 -2505 2306 2470 -3385 -2999 880 963 735 -50 -2954 -1492 4017 1801 -4070
$$ packed form
3017h14L502m101k548L000J97Q37Q37l202j807N066J797m351m81K388q26J151
3033F45O24l158M27N063j627m333K438J659j047J139r09l211L192L374l865l111
3049b700L601R05n58N18k458k235M742K256m951j566K999J00n48P08l252J04N525
3066C190m51o559O92L832K68P23j393m817J616O420j826m652J409J597l13J602
3082A338j737l851L892M405m196l197K299J497L71J408l950j929N340K377m734
3097f67j398K470J90J548J032m996j003N731L51l639M61J476j883J550M6l066
3113a797K132M145l901m344K747K399n23Q19k300l582M044L079l924j567L179
3128F06k48j407Q91k266q1M811J64n855L86L879Q3k28p85k904J462N509k216n871
$$ plain form
3146 -4070 -1769 1504 1534 2202 129 -3828 -455 4365 1103 -2442 462 1526 615 1041 -1189 -2618
3162 -2618 2712 5196 -1128 -3509 8 1054 2372 2664 -1773 -3124 2030 3016 -1158 -1114 1207 263
3178 263 593 531 -2988 -1594 3404 1365 -2718 -1260 163 -587 317 -805 -3280 110 3064 -1479
3194 -1479 -4482 -703 382 236 1165 -1678 -3748 454 2553 -1633 -1702 2167 838 -317 -64 -2177
3210 -2177 -331 5309 3001 -3112 -1946 2008 1732 2399 1168 -1997 10 4406 1035 -3061 508
3225 508 2631 1369 1406 -819 -3076 1127 4088 -642 -2840 536 1054 -86 -454 -2265 -2302 2695 2989
3242 2989 -3409 -3987 -380 868 1284 672 -3354 -3139 2066 1001 -2590 -795 1507 -407 -163 -727
3258 -727 -2854 182 4328 3 -3276 -110 918 493 1536 -240 -1916 2034 3496 -1556 -2482 1724
$$ packed form
3146d070K301L273L0O68k073l957L373M820l262l545K904J064r11M26k230j429
3162b618N330K484o324k381L517J046J318K92m437j351N154R86m174M4K321r44
3178B63L30o2l519J394M998k039m083J458J423p50R04j122k475L390K954m543
3194a479l003L779J085j46R29k843k070M202K099m186o9L869j329j155K53k113
3210b177J846N640k308o113J166L954k76O67j231l165K007M396l371m096L569
3225E08K123j262L7k225k257M203K961m730k198L376N18j140l68j811l7M997K94
3242B989o398n78L607J248M16o12m026K15N205j065l591J795K302j914K44n64
3258g27k127L036M146m325l279L166J028m25J043j776j676L950J462n052r26M206
$$ plain form
3274 1724 2276 1629 1743 -1301 -2217 2295 2780 -1439 -273 2426 424 -744 -312 -1472 452 4210
3290 4210 252 -4226 -1510 1108 789 1159 -767 -3520 -175 2448 -1638 -3240 502 984 -489 -333
3306 -333 -2198 -2730 1993 2356 -2809 -2542 1039 457 -657 -267 -1819 -512 3919 1791 -3923 -1996
3322 -1996 1947 2072 2148 927 -2564 -836 3520 1167 -1470 1735 2521 -12 -57 -545 -1284 2846 4493
3339 4493 -1167 -3755 206 1773 1336 1195 -1536 -2466 1819 2139 -2147 -1870 1037 516 -331 -2 -2547
3356 -2547 -1782 2294 523 -3236 -705 1178 -925 -944 -1129 -1973 862 3567 -806 -4384 -554 1426
3372 1426 625 1633 167 -2615 176 2053 -1494 -617 2842 1389 -714 -558 -1016 215 3936 2722
3388 2722 -2839 -1239 2133 1237 633 680 -1184 -27 3488 449 -2958 -190 2308 756 634 -499
$$ packed form
3274A724N52o47J14l044r16M512M85m219J166K699k002j168M32j160J924L758
3290D210l958m478K716K618l19L70j926k753L345K623m086j602L742M82j473J56
3306c33j865n32M723L63n165K67L581n82j114L90j552J307M431k128n714J927
3322a996L943J25P6j221l491J728M356k353k637L205P86k533m5m88p39M130J647
3339D493n660k588L961J567m37j41k731r30M285L20m286K77K907n21q47L29k545
3356b547P65M076j771l759K531J883k103j9j85q44K835K705m373l578L830J980
3372A426q01J008j466k782K791J877l547Q77L459j453k103J56m58J231L721j214
3388B722n561J600L372q96o04M7j864J157L515l039l407K768K498j552j22j133
$$ plain form
3404 -499 -2491 213 2917 -858 -2655 1047 1591 -770 -1301 -2583 -2163 2677 3048 -3088 -4429 -231
3420 -231 827 821 792 -2135 -2408 1728 1041 -2445 -94 2104 255 -417 -481 -1925 527 4257 889 -2803
3438 -2803 180 1963 683 1232 387 -1569 1776 3220 -717 -1886 1394 1655 175 1160 -478 -1235
3454 -1235 1518 1637 -1847 -837 2612 478 -1349 -898 -1732 -11 3424 447 -4022 -1761 1124 -68
3470 -68 -273 -430 -2256 -208 1898 -1566 -3667 536 2096 -512 -1250 -1682 -1686 2072 2460 -2365 -2983 1695
3488 1695 1755 -172 -231 -1626 -839 3580 2333 -2928 -1950 2101 1931 861 790 -1311 -575 3277 1130
3505 1130 -2547 502 2692 284 203 -664 -1701 1374 3811 -710 -2941 142 1223 -481 429 -486
3521 -486 -2045 940 1514 -2509 -2130 1369 296 -1148 -711 -1513 -1614 1530 379 -2940 -592 1787
$$ packed form
3404d99j992K704K704l775j797L702N44k361n31j282M20M840L71o136j341M198
3420b31J058ok9k927k73M136o87l486K351K198j849o72o4j444K452L730l368l692
3438b803K983J783j280N49q45j956L345J444l937j169L280K61j480R85j638p57
3454a235K753J19l484J010L449k134j827M51q34J721L435k977m469K261K885j192
3470f8k05j57j826K048K106l464k101M203J560k608p38m32mL758L88m825o18M678
3488A695O0j927n9j395P87M419j247n261R78M051j70j070p1k101P36L852k147
3505A130l677L049K190k408q1q67j037L075K437m521k231L083J081j704R10r15
3521d86j559K985N74m023L79L499j073j444M37q02j01L144j151l319K348K379
$$ plain form
3537 1787 -383 -1669 -616 -1076 412 2536 -1002 -3209 672 2372 444 -113 197 -531 1252 2296
3553 2296 -1231 -1449 2864 2496 -266 -376 -736 -76 3078 2228 -2419 -1436 2329 1569 -396 16 -1473
3570 -1473 -248 2863 480 -3355 -805 2158 468 -142 -176 -2061 -429 2141 -1017 -2767 325 1283
3586 1283 -954 -894 -1157 -1638 1270 2062 -1978 -2717 847 640 -422 635 -940 -1460 1247 1201 -2068
3603 -2068 -454 2189 206 -599 415 -617 -120 2703 464 -2291 587 2507 168 -13 909 -433
3619 -433 1393 2508 -886 -2184 1491 2035 -543 39 -313 -744 1402 1512 -2262 -1879 2046 956 -1451
3636 -1451 -883 -1657 -559 2498 391 -3750 -1967 1381 573 -1093 -748 -2189 -381 2409 -585 -3562
3652 -3562 40 1767 -222 -452 -854 -1532 1272 2978 -1196 -2639 1311 2155 130 329 -598 -984 2945
$$ packed form
3537A787k170j286J053m60J488K124l538k207L881J700j928n57L10p28J783J044
3553B296l527k18M313l68k762j10l60O60L154q50m647R83L765p60j965M12j489
3570a473J225L111k383l835K550K963j690o10l4j885J632K570l158j750L092R58
3586A283k237O0k63m81K908P92m040p39L564k07j062J057j575n20K707m6l269
3603b068J614K643j983q05J014j032M97K823k239k755K878J920k339j81R22j342
3619d33J826J115l394j298L675N44k578N82l52m31K146J10l774L83L925j090k407
3636a451N68p74J098L057k107m141J783L348q08j666L45j441J808K790k994k977
3652c562L602J727j989k30m02o78K804J706m174j443L950Q44k025J99r27l86L929
$$ plain form
3669 2945 2572 -1912 -949 2135 1422 180 597 -868 -240 2563 583 -2426 141 2625 227 -409
3685 -409 -419 -1490 858 2200 -1300 -3097 327 1474 -924 -647 -552 -1212 685 1144 -2900 -2167 2166
3702 2166 1155 -1977 -1310 -613 -383 1920 230 -3404 -1150 2439 286 -1312 -361 -844 527 2677
3718 2677 -367 -2855 838 2960 177 -529 154 -241 1616 2459 -1585 -2001 2400 2684 -180 -614 -478
3735 -478 -378 2101 1938 -2255 -1773 2133 1017 -730 -136 -723 -261 1631 -7 -2805 -691 1744 -265
3752 -265 -1529 -388 -1338 -456 1555 -921 -3105 465 1389 -1171 -710 -359 -1166 807 1377 -1632 -1756
3769 -1756 1563 1180 -1194 140 177 -80 1550 1074 -1785 -326 2480 804 -648 391 135 203 2407
3786 2407 654 -2304 654 2313 79 -632 346 -355 537 2138 -824 -2351 1135 1945 -671 -767 -263
$$ packed form
3669B945l73m484R63L084p13j242M17j465O28K803j980l009K567K484k398o36
3685d09j0j071K348J342l500j797L424J147k398K77R5o60J897M59m044P33M333
3702B166j011l132O67O97K30K303j690l634K254L589k153j598R51m83J371K150
3718B677l044k488L693K122k783p06O83l95J857Q43m044m16M401K84k864m34J36
3735d78J00K479j63m193M82L906j116j747N94n87M62J892j638k798K114K435k009
3752b65j264J141r50Q82K011k476k184L570R24k560M61L51q07J973N70l009j24
3769a756L319l83k374J334L7k57J630m76k859J459K806j676j452J039k56O8K204
3786B407j753k958K958J659k234p11R78p01Q92J601k962j527L486Q10k616r6N04
$$ plain form
3803 -263 -952 941 1351 -2365 -1890 1822 602 -1411 -585 -1046 -907 1310 547 -2915 -1336 1764 153
3820 153 -1004 -525 -824 -219 1832 -266 -2529 -17 2145 -8 -460 -105 -907 949 2336 -998 -2120
3837 -2120 1443 2163 -201 159 81 -300 2286 2222 -1436 -1288 2030 1367 -457 318 66 -578 1771 686
3855 686 -2379 -493 2006 153 -1437 -460 -928 -44 1749 -874 -3091 175 1582 -1148 -1187 -540 -1315
3872 -1315 483 953 -2228 -2330 1344 1126 -1597 -625 -194 -516 1299 543 -2601 -772 3079 645 -1690
3889 -1690 -576 -400 830 2674 336 -2576 437 2870 238 -936 571 69 1005 1663 -1191 -1927
3905 -1927 2034 2924 -590 -957 -181 -402 1551 1647 -2256 -1859 1853 1075 -1583 -818 -879 -753 1351 479
3923 479 -2717 -1387 1250 -176 -1653 27 -463 -599 1126 -694 -2451 775 2160 -712 -1487 -465
$$ packed form
3803b63o89J893M10l716M75L712j220k013Q26m61J39K217p63l462J579L100j611
3820A53j157M79k99O05K051k098k263K512K162k153m52L55q02J856J387l334j122
3837b120L563P20k364L60p8l81K586o4l658J48L318o63j824P75k52o44K349j085
3855F86l065J886K499j853j590R77m68Q84J793k623k217L266J407k730l9O47p75
3872a315J798M70l181j02L674k18k723R72M31l22J815p56l144J829L851k434k335
3889a690J114J76J230J844k338k912L013K433k632j174J507n02R36O58k854p36
3905a927L961Q90l514l67P76k21J953R6l903L97L712p78k658P65o1J26K104q72
3923D79l196J330K637j426j477J680m90j36J725j820j757L226J385k872p75J022
$$ plain form
3939 -465 -450 782 1940 -1004 -1875 1572 1234 -846 251 971 228 1043 760 -1346 7 2728 953
3956 953 -1330 576 818 218 1449 327 -1666 615 2711 -361 -1452 148 271 432 1241 -531
3972 -531 -2296 742 1709 -1342 -1297 413 -226 -106 107 -2307 -2108 2169 1058 -1875 -1476 -831 -494 1188
3990 1188 1019 -2283 -1439 1603 -11 -1473 204 -161 -387 1796 573 -1717 182 1866 -236 -434
4006 -434 897 -105 147 1829 -39 -1158 1906 2039 -503 -409 758 -584 1259 2335 -839 -1059
4022 -1059 1471 546 -1170 680 867 -240 492 -126 -2072 -502 1964 -415 -1630 -180 -491 -598
4038 -598 803 -936 -2418 49 1472 -1413 -1650 -172 -316 633 1219 -1388 -2282 1033 1241 -1174 -602
4055 -602 450 183 1065 903 -2051 -659 3200 1638 -1478 -569 -58 710 2833 1397 -1725 -280 2247
$$ packed form
3939d65J5J232J158k944q71L447l38k080J097P20p43Q15k83k106J353K721j775
3956I53k283J906K42o00J231j122j993K281K096l072j091J600J23J61Q09j772
3972e31j765L038R67l051M5J710o39J20K13k414J99M277j111k933L99O45L37J682
3990A188j69l302Q44L042j614j462J677l65k26K183j223k290J899J684k102j98
4006d34J331j002K52J682j868j119L064J33k542R4J167j342J843J076l174k20
4022a059K530r25j716J850J87j107P32o18j946J570K466k379j215J450l11j07
4038e98J401j739j482K467J423k885k37J478j44R49N86k607q94L315K08k415N72
4055f02J052k67Q82j62k954J392L859j562l116R09N11P68K123j436l122J445K527
$$ plain form
4072 2247 455 -406 880 120 739 1837 -690 -2273 973 2171 -395 -1087 -56 -558 177 1046 -1503
4089 -1503 -1647 1499 920 -1899 -1232 -532 -681 806 345 -2073 -1602 1363 -608 -1716 241 233 -447 131
4107 131 -789 -2241 1230 2557 -358 -1963 287 -187 282 1657 -233 -1664 1866 1750 -919 -364
4123 -364 1132 608 877 945 -1412 -801 2498 1419 -1541 -458 614 520 753 236 -2074 -59 2820
4140 2820 85 -2011 -748 -413 -220 1538 -74 -2464 39 1176 -1014 -1164 479 -209 -386 702
4156 702 -1735 -2073 1539 1643 -1504 -872 -116 -630 596 1183 -1472 -1114 1644 313 -1159 692 686 -195
4174 -195 999 441 -1516 81 2156 -312 -919 1474 809 158 671 -477 -1479 1738 2386 -878 -942
4191 -942 310 -42 374 1541 -928 -1200 1323 845 -1889 66 945 -253 614 -125 -2035 -661 2043
$$ packed form
4072B247j792q61J286p60O19J098k527j583L246J198k566o92J031n02P35Q69k549
4089a503j44L146n79k819O67P00j49J487m61k418M71K965j971j108J957qo80N78
4107A31r20j452L471J327k915j605K250m74M69J375j890j431L530j16k669N55
4123c64J496n24K69O8k357O11L299j079k960J083J072r4K33n17k310K015K879
4140B820k735k096J263L35J93J758j612k390K503J137k190j50J643o88j77J088
4156G02k437l38L612J04l147O32P56n14J226N87k655L58K758j331j472J851oq81
4174a95J194n58j957J597K075k468o07K393o65o51N13j148j002L217O48l264o4
4191i42J252l52M16J167k469k72K523m78k734J955Q79j198Q67p39j910J374K704
$$ plain form
4208 2043 -25 -1826 -389 -552 -849 853 -43 -2117 204 1731 -729 -1508 45 -119 70 1384
4224 1384 -867 -2216 727 1331 -798 -511 944 -38 761 754 -1270 -776 2375 1573 -971 -447 293 -148
4242 -148 1514 1320 -1171 -94 1590 -29 -1025 870 696 194 1037 -422 -2011 836 1949 -634
4258 -634 -1250 122 -287 -8 746 -1315 -1957 1507 1105 -1900 -1480 -251 -830 175 602 -1896 -1514 1046
4276 1046 56 -1791 -186 278 65 686 -200 -2250 332 2541 227 -1401 195 493 228 1797 -37
4293 -37 -1300 1480 2095 -782 -554 1284 334 772 1296 -1315 -1095 2196 1381 -1391 -418 1085 162 455
4311 455 131 -2269 -598 2181 -43 -2307 -690 193 -357 557 -403 -2161 -22 1388 -1393 -1932 424
4328 424 198 -296 198 -1517 -1573 1365 1563 -1293 -1360 497 426 452 839 -905 -703 2525 868 -1485 142
$$ packed form
4208B043k068j801J437j63k97J702q96k074K321J527k460p79J553j64J89J314
4224A384k251j349K943O04k129K87J455r82P99pk024M94L151q02k544N24P40m41
4242a48J662j94k491J077J684j619r96J895j74n02Q43j459j589K847J113k583
4258f34o16J372m09K79P54k061o42L464m02l005M20J229n79J005M27k498L82K560
4276A046r90j847J605M64k13O21q86k050K582K209k314j628J596K98k65J569j834
4293c7j263K780O15k877K28J838r50M38N24k611K20L291q15k772R73J503r23K93
4311D55l24k400J671K779k224k264J617Q83n50R14r60j758K139J410k781n39K356
4328D24k26m94M94j715n6K938J98k856o7J857p1K6L87j744K02L228j657k353J627
$$ plain form
4347 142 1196 296 1085 776 -1300 295 2374 43 -1017 827 1161 -86 598 -98 -1552 1020 2069
4364 2069 -1192 -1319 768 42 12 899 -937 -1152 1111 265 -2339 -635 1031 -408 -502 91 -1410
4381 -1410 -867 1946 -176 -2147 32 647 -496 122 -97 -1986 256 1859 -469 -1527 526 455
$$ packed form
4347A42J054r00P89l09k076J595K079k331j060J844L34j247O84o96j454K572J049
4364B069l261j27K087p26l0Q87j836k15K263q46k604J704J666j439r4N93j501
4381a410N43K813k122j971K179O15j143O18k19j889K242J603k328j058K053p1
$$ [...]
8191D80
##END NTUPLES=NMR FID
##END=
