##TITLE=1H_EC-3202(II-3)
 CDCl3, 8 sc, 
 22.8.2019
##JCAMPDX= 6.0         $$ Bruker NMR JCAMP-DX V2.0
##DATA TYPE= NMR FID
##DATA CLASS= NTUPLES
##ORIGIN= UXNMR, Bruker Analytische Messtechnik GmbH
##OWNER= root
$$ XWIN-NMR		Version 3.5
$$ Thu Aug 22 13:49:18 2019 Russian Standard Time (UT+4h)  she@DPX200
##.OBSERVE FREQUENCY= 200.13155
##.OBSERVE NUCLEUS= ^1H
##.DELAY= (6, 6)
##.ACQUISITION MODE= SIMULTANEOUS
##.ACQUISITION SCHEME= undefined
##.AVERAGES= 8
##.DIGITISER RES= 18
##SPECTROMETER/DATA SYSTEM= spect
##.PULSE SEQUENCE= zg30
##.SOLVENT NAME= CDCl3
##.SHIFT REFERENCE= (INTERNAL, CDCl3, 0, 15.7039)
##AUDIT TRAIL= $$ (NUMBER, WHEN, WHO, WHERE, WHAT)
$$ ##TITLE= Audit trail, XWIN-NMR		Version 3.5
$$ ##JCAMPDX= 5.01
$$ ##ORIGIN= Bruker BioSpin GmbH
$$ ##OWNER= she
$$ F:/spectra/data/she/nmr/H-F/1/audita.txt
$$ ##AUDIT TRAIL=  $$ (NUMBER, WHEN, WHO, WHERE, WHAT)
(   1,<2019-08-22 13:46:20.48 +0400>,<she>,<DPX200>,
      <created by zg, POWCHK disabled, PULCHK disabled
       configuration hash MD5:
       00 E9 B6 7A A2 85 ED C7 34 08 36 98 17 FE 4E 26
       data hash MD5: 16K
       83 DE 06 75 3B 13 A5 10 28 1D 97 14 EE 3B 4D 3D>)
$$ ##END=
$$ 
$$ hash MD5
$$ 34 75 26 3A 16 23 97 0F E6 7D 08 FD 51 60 30 4E
##$RELAX= 
##$RELAX= 
##$RELAX= 
##$RELAX= 
##$RELAX= 
##$RELAX= 
$$ Bruker specific parameters
$$ --------------------------
##$DU= <F:/spectra>
##$EXPNO= 1
##$NAME= <H-F>
##$PROCNO= 1
##$TYPE= <nmr>
##$USER= <she>
##$AMP= (0..31)
100 100 100 100 100 100 100 100 100 100 100 100 100 100 100 100 100 100 
100 100 100 100 100 100 100 100 100 100 100 100 100 100 
##$AQSEQ= 0
##$AQ_mod= 1
##$AUNM= <au_zg>
##$AUTOPOS= <>
##$BF1= 200.13
##$BF2= 200.13
##$BF3= 200.13
##$BF4= 200.13
##$BF5= 200.13
##$BF6= 200.13
##$BF7= 200.13
##$BF8= 200.13
##$BYTORDA= 1
##$CFDGTYP= 0
##$CFRGTYP= 5
##$CHEMSTR= <none>
##$CNST= (0..31)
1 1 145 1 1 1 1 1 1 1 1 1 1 1 1 1 1 1 1 1 1 1 1 1 1 1 1 1 1 1 1 1 
##$CPDPRG= <>
##$CPDPRG1= <>
##$CPDPRG2= <>
##$CPDPRG3= <>
##$CPDPRG4= <mlev>
##$CPDPRG5= <mlev>
##$CPDPRG6= <mlev>
##$CPDPRG7= <mlev>
##$CPDPRG8= <mlev>
##$CPDPRGB= <>
##$CPDPRGT= <>
##$D= (0..31)
0 1.2 0 0 0 0 0 0 0 0 0 0.03 0 0 0 0 0 0 0 0 0 0 0 0 0 0 0 0 0 0 0 0 
##$DATE= 1566467179
##$DBL= (0..7)
120 120 120 120 120 120 120 120 
##$DBP= (0..7)
150 150 150 150 150 150 150 150 
##$DBP07= 0
##$DBPNAM0= <>
##$DBPNAM1= <>
##$DBPNAM2= <>
##$DBPNAM3= <>
##$DBPNAM4= <>
##$DBPNAM5= <>
##$DBPNAM6= <>
##$DBPNAM7= <>
##$DBPOAL= (0..7)
0.5 0.5 0.5 0.5 0.5 0.5 0.5 0.5 
##$DBPOFFS= (0..7)
0 0 0 0 0 0 0 0 
##$DE= 6
##$DECBNUC= <off>
##$DECIM= 24
##$DECNUC= <off>
##$DECSTAT= 4
##$DIGMOD= 1
##$DIGTYP= 9
##$DL= (0..7)
0 120 120 120 120 120 120 120 
##$DP= (0..7)
150 150 150 150 150 150 150 150 
##$DP07= 0
##$DPNAME0= <>
##$DPNAME1= <>
##$DPNAME2= <>
##$DPNAME3= <>
##$DPNAME4= <>
##$DPNAME5= <>
##$DPNAME6= <>
##$DPNAME7= <>
##$DPOAL= (0..7)
0.5 0.5 0.5 0.5 0.5 0.5 0.5 0.5 
##$DPOFFS= (0..7)
0 0 0 0 0 0 0 0 
##$DQDMODE= 0
##$DR= 18
##$DS= 0
##$DSLIST= <SSSSSSSSSSSSSSS>
$$ [...]
##$SUBNAM2= <"">
##$SUBNAM3= <"">
##$SUBNAM4= <"">
##$SUBNAM5= <"">
##$SUBNAM6= <"">
##$SUBNAM7= <"">
##$SUBNAM8= <"">
##$SUBNAM9= <"">
##$SW= 24.9336996594482
##$SWIBOX= (0..15)
0 0 2 0 0 0 0 0 0 0 0 0 0 0 0 0 
##$SW_h= 4990.01996007984
##$TD= 16384
##$TD0= 1
##$TE= 0
##$TE2= 300
##$TE3= 300
##$TEG= 300
##$TL= (0..7)
0 120 120 120 120 120 120 120 
##$TP= (0..7)
150 150 150 150 150 150 150 150 
##$TP07= 0
##$TPNAME0= <>
##$TPNAME1= <>
##$TPNAME2= <>
##$TPNAME3= <>
##$TPNAME4= <>
##$TPNAME5= <>
##$TPNAME6= <>
##$TPNAME7= <>
##$TPOAL= (0..7)
0.5 0.5 0.5 0.5 0.5 0.5 0.5 0.5 
##$TPOFFS= (0..7)
0 0 0 0 0 0 0 0 
##$TUNHIN= 0
##$TUNHOUT= 0
##$TUNXOUT= 0
##$USERA1= <user>
##$USERA2= <user>
##$USERA3= <user>
##$USERA4= <user>
##$USERA5= <user>
##$V9= 5
##$VALIST= <valist>
##$VCLIST= <CCCCCCCCCCCCCCC>
##$VD= 0
##$VDLIST= <DDDDDDDDDDDDDDD>
##$VPLIST= <PPPPPPPPPPPPPPP>
##$VTLIST= <TTTTTTTTTTTTTTT>
##$WBST= 1024
##$WBSW= 4
##$XGAIN= (0..3)
0 0 0 0 
##$XL= 0
##$YL= 0
##$YMAX_a= 295054
##$YMIN_a= -427478
##$ZGOPTNS= <>
##$ZL1= 120
##$ZL2= 120
##$ZL3= 120
##$ZL4= 120
##$ABSF1= 10
##$ABSF2= 0
##$ABSG= 5
##$ABSL= 3
##$ALPHA= 0
##$AQORDER= 0
##$ASSFAC= 0
##$ASSFACI= 0
##$ASSFACX= 0
##$ASSWID= 0
##$AUNMP= <proc_1d>
##$AZFE= 0.1
##$AZFW= 0.1
##$BCFW= 1
##$BC_mod= 2
##$BYTORDP= 1
##$COROFFS= 0
##$CY= 11.3945322036743
##$DATMOD= 1
##$DC= 2
##$DFILT= <>
##$DTYPP= 0
##$F1P= 20.1720416913024
##$F2P= 0.152960286110954
##$FCOR= 0.5
##$FTSIZE= 0
##$FT_mod= 4
##$GAMMA= 1
##$GB= 0.15
##$INTBC= 1
##$INTSCL= 1
##$ISEN= 128
##$LB= 0.24
##$LEV0= 0
##$LPBIN= 0
##$MAXI= 10000
##$MC2= 0
##$MEAN= 0
##$ME_mod= 0
##$MI= 1.114404
##$NCOEF= 0
##$NC_proc= 0
##$NLEV= 6
##$NOISF1= 3.799351
##$NOISF2= 2.8
##$NSP= 1
##$NTH_PI= 0
##$NZP= 0
##$OFFSET= 15.70392
##$PC= 1
##$PHC0= -9221.486
##$PHC1= 29.00096
##$PH_mod= 1
##$PKNL= yes
##$PPARMOD= 0
##$PSCAL= 0
##$PSIGN= 0
##$REVERSE= no
##$SF= 200.130013532006
##$SI= 16384
##$SIGF1= 3
##$SIGF2= 2
##$SINO= 400
##$SIOLD= 16384
##$SREGLST= <1H.CDCl3>
##$SSB= 0
##$STSI= 0
##$STSR= 0
##$SW_p= 3612.71676300578
##$SYMM= 0
##$S_DEV= 0
##$TDeff= 0
##$TDoff= 0
##$TI= <>
##$TILT= no
##$TM1= 0
##$TM2= 0
##$TOPLEV= 0
##$USERP1= <user>
##$USERP2= <user>
##$USERP3= <user>
##$USERP4= <user>
##$USERP5= <user>
##$WDW= 1
##$XDIM= 8192
##$YMAX_p= 0
##$YMIN_p= 0
$$ End of Bruker specific parameters
$$ ---------------------------------
##NTUPLES= NMR FID
##VAR_NAME=  TIME,          FID/REAL,        FID/IMAG
##SYMBOL=    X,             R,               I
##VAR_TYPE=  INDEPENDENT,   DEPENDENT,       DEPENDENT
##VAR_FORM=  AFFN,          ASDF,            ASDF
##VAR_DIM=   8192,          8192,            8192
##UNITS=     SECONDS,       ARBITRARY UNITS, ARBITRARY UNITS
##FACTOR=    0.0002004,     1,               1
##FIRST=     0,             0,               0
##LAST=      1.6414764,     0,               0
##MIN=       0,             -427478,         0
##MAX=       1.6414764,     295054,          0
$$ Real data points
##PAGE= N=1
##DATA TABLE= (X++(R..R)), XYDATA
$$ [...]
3051B566r48M22l225r94N950N21o028l98L970m41k43l09l802J006O665k416o335
$$ 2566 1618 2040 -1185 -2179 3771 4292 -1736 -2134 1836 1395 1152 843 -2959 -1953 4712 2296 -4039
3068d039R17L525M51J146k022n170K948N813l274m607K690J182l70J674k854l180
$$ -4039 -3122 403 854 2000 -22 -5192 -2244 3569 295 -4312 -1622 -440 -810 864 -1990 -5170
3084e170N169L668n219k274L011K16P02K236m169k041O228R12n062L28K660o95
$$ -5170 -1 3667 -1552 -3826 -815 -599 103 2339 -1830 -3871 2357 3269 -1793 -1465 1195 500
3100E00J788R07m723J29N192j421l609K795J082k212J047m72k867L529L499n043
$$ 500 2288 3195 -1528 -1399 3793 2372 -1237 1558 2640 428 1475 1003 -1864 1665 5164 121
3116A21l620L869J015l33J192l237k546M512J774n897L15L975o24j324k39k640
$$ 121 -3499 370 1385 1052 2244 -993 -3539 973 2747 -3150 -2835 1140 516 -808 -1047 -3687
3132c687J029N974j791o551J802L671M64n83j614l339L650N596m060n409K907
$$ -3687 -2658 3316 1525 -5026 -3224 447 911 328 -1286 -4625 -975 4621 561 -4848 -1941
3147a941K698O0J293k482l621M247L756m616j688L593R20j356L93l098k47O503
$$ -1941 757 817 2110 -372 -3993 254 4010 -606 -2294 1299 2219 863 1256 -1842 -2089 4414
3163D414J082o617j277L149P60J639N53m917o17N424j283m192K362J830j646J90
$$ 4414 5496 -1121 -2398 751 1511 3150 3703 -1214 -1831 3593 2310 -1882 480 2310 664 854
3179H54r10l060K797M117m321l136L599J085j929M45j805j646M755J824n710j791
$$ 854 -56 -3116 -319 3798 -523 -3659 -60 1025 -904 -459 -2264 -3910 845 2669 -3041 -4832
3195d832M051M10l47J117k582r20M420q72m378K881L851j779j560m85j988L367
$$ -4832 -781 -371 -718 399 -2183 -3103 1317 445 -3933 -1052 2799 1020 -540 -1025 -3013 354
3211C54N611l822n419K501K849n51J331j820k745L393L111m806k065M241N79j216
$$ 354 5965 2143 -3276 -775 2074 1523 2854 1034 -1711 1682 4793 -13 -2078 2163 2742 1526
3227A526L27k762j512M974J198n555m11L696n70j119j79k885J090O055j801o418
$$ 1526 1853 -909 -2421 2553 3751 -1804 -2215 1481 911 -208 -387 -3272 -2182 3873 2072 -4346
3243d346Q46L163K8J322n89l959J325L750l038k695M419J249k114j70j436j487
$$ -4346 -3500 -337 -309 1013 424 -3535 -2210 1540 -1498 -4193 226 1475 -639 -809 -2245 -3732
3259c732N207K665n314k016L660L19o90J389k304m78M812k37n695J146L883m37
$$ -3732 1475 4140 -1174 -3190 470 789 99 1488 -816 -1294 3518 3281 -2414 -1268 2615 2178
3275B178l28M4k776P02M194k035l970L482K315k866p93r28j464L942L884n852
$$ 2178 1850 1894 -882 -180 4014 1979 -1991 1491 3806 940 147 -781 -2245 1697 5581 -271
3291b71l777L542J420j091J371j703k695L659J081n257M83M511m45k038j72k082
$$ -271 -4048 -506 914 -177 1194 -509 -3204 455 1536 -3721 -3238 1273 828 -1210 -1382 -3464
3307c464N25N437r88n493J580L625j565p20L95j885K589M470m148m663L294L054
$$ -3464 -2939 2498 1510 -3983 -2403 1222 -343 -1063 -668 -2553 36 4506 358 -4305 -1011 2043
3323B043q18K26m85k650K501K750m272r55M978J38k987j37j786N84N492j46o520
$$ 2043 1225 1451 966 -1684 817 3567 -705 -1660 3318 3456 469 332 -1454 -870 4622 4476 -2044
3340b044k73L725j68j44N63k851m1L718j248m784K652K891j940l06l33k704J861
$$ -2044 -2317 1408 1240 1096 1659 -1192 -1233 2485 1237 -3547 -895 1996 56 -250 -583 -3287 -1426
3357a426L849l200k963L441J502k733J47j011k79L740J939n761j094L366N03m47
$$ -1426 2423 -777 -3740 -299 1203 -1530 -1383 -2394 -2673 1067 3006 -2755 -3849 -483 20 -427
3373d27J714j489j941L423l29l690K624M068k736k123O25j083K299M256l258m478
$$ -427 1287 -202 -2143 1280 951 -2739 -115 3953 1217 -906 -281 -1364 935 5191 1933 -2545
3389b545K905K538j891Q5N2j961K543K397m619k441M737J047k408K09j058j621
$$ -2545 360 2898 1007 1092 1144 -817 1726 4123 -496 -2937 1800 2847 439 648 -410 -2031
3405b031L985M37n383N30M383n56k581n73j777J331N508j437o196K70L677m39
$$ -2031 1954 2391 -2992 -2462 1921 1365 -1216 -1789 -3566 -2235 3273 1836 -4360 -4090 -413 -852
3421h52J060Kk887Q91L601k951k490L821J959k327j78o48j514L935K757m834j732
$$ -852 208 210 -2677 -1786 1815 -1136 -3626 195 2154 -173 -351 -999 -2513 1422 4179 -655 -2387
3438b387L481N09j220J285j233j055L464L95m690O20L615j666n14J260j330o58
$$ -2387 1094 1603 383 1668 435 -620 2844 3239 -1451 -831 2784 1118 604 1864 534 -124
3454a24K740k008l420L897K675l376j778J57j027L036K873m572l307L744J366
$$ -124 2616 608 -2812 1085 3760 384 -1394 -1237 -2264 772 3645 -927 -4234 -490 876
3469H76j993L93q5j239K952j92n028R53N051J9l200q1p70M94M570j287n173J503
$$ 876 -1117 -724 -809 -2048 904 712 -4316 -3363 1688 1707 -1493 -1574 -2344 -1850 2720 1433 -3740 -2237
3487b237M546j282j505K3j467K253L815l019m092K863K867j740M0j74j931K520
$$ -2237 2309 1027 -478 -455 -1922 331 4146 1127 -2965 -102 2765 1025 1065 891 -1040 1480
3503A480K019l807j658M213Q39k534p3j039r66M179J101m744l92K861j508o05
$$ 1480 3499 -308 -1966 2247 3086 552 479 -560 -1526 2653 3754 -990 -1382 1479 -29 -634
3519f34J567j528l65K217j691l306K803L055l355q43J274j295R64K513l097j848
$$ -634 933 -595 -960 1257 -434 -3740 -937 2118 -1237 -2080 -806 -2101 -1137 1376 -1721 -3569
3535c569M155P82l432L26Q46m79K557M53m088j61M485k71k632J278q3l36K944
$$ -3569 586 1368 -2064 -1738 -892 -1371 1186 1639 -2449 -2610 1875 1604 -1028 250 167 -169 2775
3552B775r42m580K357M545j980k289N9o54J887L246k781m053K717K960k402n23
$$ 2775 1833 -2747 -390 4155 2175 -114 -55 -709 1178 4424 1643 -2410 307 3267 865 342
3568C42K41j527J964K133l764k423L587J681k883N91n69j663K827J165l959l81
$$ 342 583 -944 1020 3153 -611 -3034 553 2234 -649 -58 -627 -2290 537 1702 -2257 -2638
3584b638L705q10j850Q25j117k40L559m60m459J677K288j293m19J512j597J22
$$ -2638 1067 257 -1593 -768 -1885 -2125 1434 974 -3485 -1808 480 -813 -1232 280 -1317 -1195
3600a195K652j876j986L199J669l176O30N35j067K056J489l488r42M171j82k602
$$ -1195 1457 -419 -2405 794 2463 -713 -83 452 -615 1441 2930 -558 -1500 2671 2489 -113
3616a13P62K02n96K602l40m321J092M011j458k485J133j096J80L104k121m164
$$ -113 649 851 255 2857 2517 -1804 -712 3299 1841 -644 489 -607 -427 2677 556 -3608
3632c608L338L296k912k026O91j074K241K716m354k661L546J952k046m5n32r80
$$ -3608 -270 3026 114 -1912 -1221 -2295 -54 2662 -1692 -4353 -807 1145 -901 -946 -1478 -2458
3648b458K866J287m439o66M657J2k139L50o24M6L230j68m471J471L518j280j557
$$ -2458 408 1695 -2744 -3410 1247 1259 -880 -530 -1154 -1108 2122 1954 -2517 -1046 2472 1192 -365
3665c65J176j259L50L661k170l249K659K129k330j23P73j343J531Q91k933j322
$$ -365 811 -448 -98 3563 1393 -1856 803 2932 602 479 1252 -91 1440 2331 -602 -1924
3681a924M133J54l115J83L99l52K046K10m279L56M033j367k464R65R2j27K041
$$ -1924 2209 2363 -752 -569 -170 -522 1524 1734 -2545 -2189 1844 477 -1987 -1022 -930 -1057 984
3698I84j371l629K957L384k825k155J228j09J242J827l030k606M474J889k861
$$ 984 -387 -4016 -1059 2325 -500 -2655 -1427 -1536 -294 1533 -1497 -4103 371 2260 -601
3713f01o35N92m70K315J202m022l92M242J35l000J008O78m77K164o39l619J162
$$ -601 -1236 -644 -1114 1201 2403 -1619 -2011 2231 2366 -634 374 1052 575 2739 2100 -1519 -357
3730c57M037j899k269P12k57L00K731j972l227K299K198k323q65J359j098O69
$$ -357 3680 1781 -488 224 -33 267 2998 1026 -2201 98 2296 -27 -892 467 -631 38
3746C8J508k933j511M031K01l366M24J032p43J310O74l562O5M025r87k624J404
$$ 38 1546 -1387 -2898 1133 1334 -2032 -1608 -576 -1319 -9 665 -2897 -2832 1193 206 -2418 -1014
3763a014M72n01K037m28l364K022K953k325r75J372k41M1K260k224k674L932J966
$$ -1014 -542 -1043 994 566 -2798 -776 2177 -148 -1123 249 8 49 2309 85 -2589 1343 3309
3780C309l388j08R21o19J375J366l105r60L460k64k192N86M94q99J842M8l997
$$ 3309 -79 -187 734 115 1490 2856 -249 -1209 2251 1987 -205 381 875 -24 1818 1866 -2131
3797b131J089L618j542k457J489k95o88J930j260k860J931K881k372j169J240
$$ -2131 -1042 2576 1034 -1423 66 -229 -917 1013 -247 -3107 -1176 1705 -667 -1836 -596
3812e96r35M52K007k336k034L517J002k722L25P62n15J554P47l355m41M210M55
$$ -596 -1531 -1079 928 -1408 -3442 75 1077 -1645 -1320 -558 -1073 481 1228 -2127 -2568 1642 2097
3829B097k882O70o5k91K424j94l710J508L112j223j778R83l34M70K330j560l351
$$ 2097 -785 -115 -180 -471 1953 1759 -1951 -443 2669 1446 -332 651 317 787 3117 1557 -1794
3846a794K588K238k609l11O42q98R26J691l436j454L821P63l405K06P74o88J476
$$ -1794 794 3032 423 112 754 -144 782 2473 -963 -2417 1404 2167 -1238 -1032 -258 -946 530
3863E30M18l322q2L724j111k551J384J01n27K015r09l096K393K567k257j395J756
$$ 530 948 -2374 -2456 1268 157 -2394 -1010 -909 -1436 579 -330 -3426 -1033 1534 -723 -2118 -362
3880c62Q3J64J378k474j397L862J802l426j152J818k0J734P32l761l85M497n90
$$ -362 -279 -115 1263 -1211 -2608 1254 3056 -370 -1522 296 276 2010 2742 -1019 -1404 3093 2503
3897B503l132O99J080o6J261q31l817J641M460j788l272J328j74O62J661k064
$$ 2503 -629 70 1150 1084 2345 1514 -2303 -662 3798 2010 -1262 66 -108 554 2215 151
3913A51k684K461K441k822j454J474o03P37J486k672k075L756O26l139P43J585
$$ 151 -2533 -72 2369 -453 -1907 -433 -1036 -299 1187 -1485 -3560 196 822 -2317 -1574 11
3929A1q99O79M83l142Q32L817r08k773J211P12j026J965P9k455J227K436k407
$$ 11 -888 -209 274 -2868 -2036 1781 873 -1900 -689 23 -1003 962 1041 -1414 -187 2249 -158
3946a58j087K706j09r08J364j854j412L484J390l574m91K112n25k3Q72k687J46
$$ -158 -1245 1461 1352 444 1808 -46 -1458 2026 3416 -158 -649 1463 938 915 1787 -900 -754
3963g54L517l01l616M41J275p83J201l2l139J118K711j706k350J981M12l81J072
$$ -754 2763 2462 -1154 -713 562 -221 980 948 -2191 -1073 1638 -68 -2418 -437 -25 -406 666
3980F66j553k629K714L114k807j921J408m23O38K230k300j775K684J347k866N52
$$ 666 -887 -3516 -802 2312 -495 -2416 -1008 -1431 -793 1437 -863 -2638 46 1393 -1473 -921
3996i21J580j406J351J149k703o36L171j57j750Q37P53j148J381M05l033J389
$$ -921 659 -747 604 1753 -950 -1586 1585 1428 -322 515 1268 120 1501 1906 -1127 262
4012B62K937j652j834J347n70p00K029n05k151J320J251k791P9K263r68p09J264
$$ 262 3199 1547 -287 1060 490 -210 1819 1314 -837 483 1734 -1057 -978 1285 317 -392 872
4029H72k731p65L867M01k961n52J390q62J123O20l022P03L713j560l224J537J020
$$ 872 -1859 -2624 1243 1644 -1317 -1869 -479 -1341 -218 402 -2620 -1917 1796 236 -2988 -1451 -431
4046d31j91J454j083k662J900L311k343j721J773L64R3J111j872k242L873K272
$$ -431 -622 832 -251 -2913 -1013 2298 -45 -1766 7 371 464 1575 -297 -2539 1334 3606
4062C606l058j050Q38m77J446J617k668j469L203J26l071J311R02r13J102l1l175
$$ 3606 548 -502 336 -141 1305 2922 254 -1215 1988 2114 -957 354 1256 343 1445 1414 -1761
4079a761J022L091j287k436J216m8p40J332m74k069J996K032l112j284J935l02
$$ -1761 -739 2352 1065 -1371 -155 -203 -943 389 -85 -2154 -158 1874 -1238 -2522 -587 -889
4095h89p1J428j660j481K746L76k917R60K430q78j70R9k435R38M378r52l448P17
$$ -889 -960 468 -1192 -2673 73 449 -2468 -1508 922 44 -126 -27 -2462 -1524 2854 1902 -1546 -829
4113h29J307m03J219k05k140J375K816k771j896K535J109j138J233k303j681L028
$$ -829 478 75 1294 1089 -1051 324 3140 369 -1527 1008 2117 979 2212 -91 -1772 1256
4129A256J966l279j192K364m85P2N38k635o36M045K5l510nJ456q64J176M59k509
$$ 1256 3222 -57 -1249 1115 630 702 1240 -1395 -2031 2014 2039 -1471 -1476 -20 -884 292 751 -1758
4147a758J35K693j527j776J644J186j259M05l70k301K097L059k540j594J956n94
$$ -1758 -1623 1070 -457 -2233 -589 597 -662 -257 -627 -2928 -831 2228 -312 -1906 50 -544
4163e44l47J679q66j778K880L71k738J24K646o18m40Q85j572q3K648n52k994J693
$$ -544 -891 788 -78 -1856 1024 1395 -1343 -1219 1427 809 369 1254 -318 -401 2247 1695 -1299 394
4181C94J588j118J56n23j854J431L534k469k487J853Q2p19J627p01k340J928J321
$$ 394 1982 864 1020 497 -1357 74 3608 1139 -1348 505 587 -132 1495 794 -1546 382 1703
4198A703l249l96K726l90q69R97k135j316L758O66l294J70J388q44N69J193k295
$$ 1703 -1546 -1942 784 394 -475 522 -1613 -2929 829 1495 -1799 -1629 -241 -1085 -516 677 -1618
4215a618l22K995p84k688J630P96p57J244K33k372J073K501k250o26J956L97j098
$$ -1618 -1940 1055 271 -2417 -787 9 -748 496 729 -1643 -570 1931 -319 -945 1011 1408 310
4232C10J141j297j590K750K118l314q23J948r77M47J691j817r62K247j38k882
$$ 310 1451 154 -1436 1314 3432 118 -705 1243 266 713 2404 587 -375 1872 1734 -1148
4248a148R68K195j723M98k54k248M91L133j495k476J312Q44r24R00m96k123J687
$$ -1148 -180 2015 292 790 536 -1712 -1221 1912 417 -2059 -747 97 -827 73 -423 -2546 -859
4265h59K176k355j960K531M1l75J464j709j472L131O49l065N5K472j31o7M64k437
$$ -859 1317 -1038 -2998 -467 -426 -801 663 -1046 -2518 613 1262 -1803 -1748 724 593 526 990 -1447
4283a447j31M016l61l141J267P32n05O57M89k144J414K209k416j993K187J036
$$ -1447 -1578 2438 2077 -1064 203 935 430 1087 1576 -568 846 3055 639 -1354 833 1869
4299A869j029M91r51j895K223K152l401q61K060K9j041M23j336o44K959r6l227
$$ 1869 840 1331 380 -1515 708 2860 -541 -1402 658 687 -354 69 -1267 -1911 1048 952 -2275
4316b275M89K004j123J48P13k036P39K503j364k813K109J580j323L00l02j656
$$ -2275 -1786 218 -905 -757 -44 -2080 -1341 1162 -202 -3015 -906 674 -649 -349 -651 -2307
4332b307K296K380k698j881K754K46r04R54p30j297K665Q88l171L7K461q83m4
$$ -2307 -11 2369 -329 -2210 544 790 -114 840 110 -1187 1478 2366 -805 -768 1693 810 766
4349G66Q14j874m85L001m01l083J517J484j571L29K88j698O36K833k232j837J821
$$ 766 1580 -294 -779 2222 1821 -1262 255 1739 168 497 785 -913 -277 2556 324 -1513 308
4366C08O02j655N78L9j820J936J287k926o05K755j74j243N81p25j069K844r1k741
$$ 308 910 -745 -167 -128 -1948 -12 1275 -1651 -2256 499 325 -918 -337 -1062 -2131 713 622 -2119
4384b119O94K186r55p89R75j207K09K615q30l046J965J519j112N55o6j636Q88
$$ -2119 -1425 761 -194 -983 -8 -1215 -1006 1609 779 -2267 -302 1217 105 660 594 -1042 -154
4401a54L157l112j012K450M49j536Q45k75j881K270J697k990o25K049r59l56J498
$$ -154 3003 -109 -1121 1329 1778 242 1087 812 -1069 1201 2898 -92 -717 1332 373 17 1515
4418A515j433r53K306k6l098J377J149j433o5Q37j476j42K792j299k627K223O51
$$ 1515 82 -871 1435 1409 -1689 -312 837 -596 -661 176 -1300 -1442 1350 51 -2576 -353 298
4435B98j629P02L70j750J412J801k189j263K270M35j234R93k63j557K485M44k737
$$ 298 -1331 -629 -259 -2009 -597 1204 -985 -2248 22 457 -777 216 -47 -1604 881 1325 -1412
4452a412K25K959q93r52R02j770K37L439r60l378J150K418j113N6J30j787J255
$$ -1412 -1187 1772 879 -73 829 -941 -704 2735 1775 -1603 -453 1965 852 908 1038 -749 506
4469E06K412k031k470K145J134j223j1o46j524K231J695l031j413K661l03q77
$$ 506 2918 887 -1583 562 1696 473 462 -184 -1708 523 2218 -813 -2226 435 132 -745
4485g45Q45j043j396K648O72l485O04K295j305J24P54j647j15L142j274k421J822
$$ -745 100 -943 -2339 309 981 -2504 -1900 395 -910 -786 -32 -1679 -1794 1348 74 -2347 -525
4502e25J129j011P40o0j440J301J941k223j371K714J11j744J035j69o10J597Q85
$$ -525 604 -407 333 273 -1167 134 2075 -148 -1519 1195 1306 -438 597 428 -182 1415 2300
4519B300k924r5L239j081j336P58j167LK670m76l619J182K558j767o77N77j175
$$ 2300 -624 -719 2520 1439 103 861 -306 -303 2367 1891 -1728 -546 2012 245 -432 145 -1030
4536a030N45K611k504k209J890K202k283J18jj040J520J732k836j640L095K14
$$ -1030 -485 2126 -378 -2587 -697 1505 -778 -660 -661 -1701 -181 1551 -1285 -2925 170 384
4552C84j361M95n23j019K539N12k443R4K214r95k84J175r07l26K578j064k848
$$ 384 -977 -482 -1005 -2024 515 1027 -1416 -1322 892 -103 -387 788 -119 -445 2133 1069 -1779
4569a779J688K002j408j84J033j914Q87J974j804j332K309L72k126R69r2j091
$$ -1779 -91 1911 503 319 1352 -562 325 2299 495 -837 1472 1844 -282 687 595 -496
4585d96J573Q85k704j70K104k93j839J087m08o79K189p06k905R88K721j899l42
$$ -496 1077 1962 -742 -912 1192 899 -940 147 -261 -940 1249 543 -2362 -1374 1347 -552 -894
4602h94L94p49K01K016j283k676K478J363j662J84L01j462J774J416k428j068
$$ -894 -500 -1249 -1048 968 -315 -2991 -513 850 -812 -628 -327 -1789 -15 1401 -1027 -2095
4618b095K679N83j654R59m66j266K302J079k995j01K683p52m30L88n87o30K202
$$ -2095 584 1167 -487 472 6 -1260 1042 2121 -874 -975 1708 956 526 914 327 -303 1899
4635A899K12k866R09J663j310m77R48j348J06K533j952j906J749J197j969M77
$$ 1899 2111 -755 154 1817 507 30 978 -370 -264 2269 317 -1589 160 1357 -612 -135
4651a35M96j711J058J113k326n86K441k67j475J019n25p11J539M76k668P77K354
$$ -135 361 -1350 -292 821 -1505 -2091 350 83 -1392 -373 -898 -1609 -70 406 -2262 -1485 869
4668H69j174j059J218p04j09K427j264k482K089K062j510l26M86j258R79K286
$$ 869 -305 -1364 -146 -850 -959 1468 204 -2278 -189 1873 363 37 523 -735 244 2530
4684B530k251j596K742L21j592N21K02j107J730J146l064p69K682j46j015J79
$$ 2530 279 -1317 1425 1746 154 675 877 -230 1500 2646 -418 -1187 1495 1349 334 513
4700E13q50l19K281o05k976Q32K156j130n21M09q82j78K365j242k387J854J786
$$ 513 -337 -656 1625 1020 -1956 -1124 1032 -98 -619 -210 -1092 -1270 1095 -147 -2534 -680 1106
4717A106k425P39J55r00J063J356k688o93K974K40j888N99L63j210J930L68k547
$$ 1106 -1319 -580 -425 -1325 -262 1094 -1594 -2287 687 927 -961 -362 1 -1209 721 1089 -1458
4734a458O07K917j205j416P82j59k59K126p20k904K288J786j980o70Q63o98Q00
$$ -1458 -851 2066 861 -555 227 68 -191 1935 1215 -1689 599 2385 405 -265 598 -100 700
4751G00J381k263j741K898R81j873j17K31j026J153J358k807q74K895l44j634
$$ 700 2081 -182 -1923 975 1956 83 -34 197 -829 324 1682 -1125 -1999 896 552 -1082
4767a082P75j89m65J801k66k831P16K369r74j284R34l38m20K106j181j793J788
$$ -1082 -307 -496 -961 840 574 -2257 -1541 828 -146 -1430 -496 -834 -1254 852 -329 -2122 -334
4784c34J389j731jJ033j186N51J897j845j163K603J07j822P33Q39j031J267M04
$$ -334 1055 -676 -677 356 -830 -279 1618 -227 -1390 1213 1320 -502 231 1070 39 1306 1710
4801A710k543K57L017p25j845Q62n06j44J681o79k390J157K432j970j239J281
$$ 1710 -833 -576 2441 1716 -129 733 227 83 1764 1085 -1305 -148 2284 314 -925 356
4817C56p24L12J205j198k027K135R38j888k87Q31r64R39J191k209j135K742J8
$$ 356 -368 -56 1149 -49 -2076 59 997 -891 -1178 -347 -1311 -372 819 -1390 -2525 217 235
4834B35j688P40P7p82J036J044k265M33K343j075j434J356J11n36J920o41k445
$$ 235 -1453 -713 -636 -1418 -382 662 -1603 -1170 1173 98 -1336 20 131 -405 1515 874 -1571
4851a571J989J723j569n94J109q76o7J919j468j206K320K36k108L43N26q66J224
$$ -1571 418 2141 572 -22 1087 211 144 2063 595 -611 1709 1945 -163 180 706 -160 1064
4868A064N45k228l95K560p43j853Q19N1m85J000p4k661J302K299j311j454Q92
$$ 1064 1609 -619 -1014 1546 803 -1050 -231 -180 -665 335 261 -2400 -1098 1201 -110 -1564 -672
4885f72l34n5J488q74j766J691J321j965l28J421r66J102J002j965o96K378L36
$$ -672 -1006 -1061 427 -447 -2213 -522 799 -1166 -1494 -73 -1039 63 1065 -900 -1596 782 1118
4902A118j473J85M40m29R70Q98k336j50K736p22j434Q38l38m43J707k36k142J126
$$ 1118 -355 -170 270 -159 811 1709 -627 -777 1959 1237 -197 641 303 -140 1567 1331 -811 315
4920C15J571j977n42J648q80j52J511k101j097K298J239k742L44N26j030P79J281
$$ 315 1886 -91 -633 1015 135 -17 1494 -607 -1704 594 1833 -909 -565 -39 -1069 -290 991
4937I91k181m80K611n03k171R66N13o50Q94K77k308R82K484j471j497J264RK4
$$ 991 -1190 -1670 941 438 -1733 -767 -254 -904 -10 267 -2041 -1059 1425 -46 -1543 -279 -270 -246
4955b46J461j411j776J935J950k051n76J218r42N70J693j849o51K100M1j941L47
$$ -246 1215 -196 -1972 -37 1913 -138 -714 504 -438 132 1825 -24 -675 1425 1466 -475 -128
4972a28J229o41P66K86k203k05K785n74j759O67n9q61J641p31j278Q91J814k040
$$ -128 1101 460 1226 1512 -691 -896 1889 1315 -444 223 164 -697 944 213 -1065 -174 1640 -400
4990d00q76J396l02q50J401r05j518K217P23k068j76J645j050L21N37j525m68
$$ -400 -1276 120 -182 -1032 369 -536 -2054 163 886 -1182 -1358 287 -763 -442 95 -1430 -1898
5007a898K888k94k079Q42P45o96N84L65j750Q32K139j292j618J420M15j90R17
$$ -1898 990 696 -1383 -541 204 -492 92 457 -1293 -461 1678 386 -1232 188 603 413 1330
5024A330q34j851J697J954j848p75R67j63J69J015j493j328K481Q70k371N4P90
$$ 1330 496 -1355 342 2296 448 -327 640 477 646 1661 168 -1160 1321 2191 -180 -126 664
5041F64o37L50J111k252o75K650o31j968P80N43q00J031L56k471O00K359j378
$$ 664 27 377 1488 -764 -1439 1211 580 -1388 -608 -65 -865 166 522 -1949 -1349 1010 -368
5058c68j218J474p16o32J520p88r00J862O46j795l69J598k45L6Q90j402m98K004
$$ -368 -1586 -112 -828 -1460 60 -728 -1628 234 880 -915 -1284 314 69 105 995 -407 -905 1099
5076A099J02j941Q93Q07o60N56L63j687M39K103q03k000J278M14p62J168n79j669
$$ 1099 1201 -740 153 960 300 856 1219 -468 -29 2074 1271 -729 549 963 201 1369 790 -879
5094h79J269J586j802j225J752j64n48J362j824j546K192J144k337J2P51o27M94
$$ -879 390 1976 174 -1051 701 537 -11 1351 -473 -2019 173 1317 -1020 -1008 -257 -884 -390
5111c90J045j817o62K512j54k104N67N77n81J300K38k096N07K198j156j053J232
$$ -390 655 -1162 -1824 688 534 -1570 -1003 -426 -1007 293 531 -1565 -1058 1140 -16 -1069 163
5128A63K2m96J012p6j958J683J609j896l67J245o81j25J233p50j180J909K83k471
$$ 163 185 -311 701 625 -1333 350 1959 63 -304 941 260 135 1368 618 -562 1347 1630 -841
5146h41R70R62p53L85O92j977k12K324p87j745J059P33j276N09r6j617J209J669
$$ -841 129 1091 338 723 1415 -562 -774 1550 763 -982 77 810 -466 43 -53 -1670 -461 1208
5164A208j546j324J328K09o21R66j117j036J746J233k080q22J601k53J97O15j273
$$ 1208 -338 -1662 -334 -125 -746 220 -897 -1933 -187 1046 -1034 -1856 -255 -508 -311 304 -969
5181i69q27K880j02j899M70Q23l81M43O93k067O36K166j220j322J095M04n32J069
$$ -969 -1796 1084 982 -917 -447 376 -5 438 1131 -936 -300 1866 646 -676 419 823 291 1360
5199A360o78j355J193J741j807j118J655j47o87J108r71j422K034N85k305j34
$$ 1360 682 -673 520 2261 454 -664 991 844 157 1265 294 -1128 906 1491 -814 -948
5215i48J289j87l69N80j574J71J665m41k246J250Q16n54M10j36j571O13K244j549
$$ -948 341 154 -215 365 -1209 -1038 627 186 -2060 -810 6 -548 -138 -274 -1845 -1232 1012 -537
5233e37j263J348K39m56P20k48j128J859J061k146o76K044m23L9R32j883RK094
$$ -537 -1800 -452 -213 -669 51 -197 -1325 534 1595 -551 -1227 817 394 433 1365 -518 -509 1585
5251A585L43k217L97J163n15m16P82j394K29K106j011j837J275P42j422O79j1
$$ 1585 1928 -289 108 1271 756 340 1122 -272 -43 2063 1052 -785 490 1232 -190 489 478
5268D78j521R51J687k011r18J574r2o23N63o87j292J625N82j645K2J818j187k90
$$ 478 -1043 -92 1595 -416 -1334 240 148 -475 88 -599 -1891 -266 316 -1329 -1307 511 -676 -966
5286i66O69r07l31K058k85j969R69J735j190M75J2j236N94J907j393j105J493
$$ -966 -297 -1204 -1535 523 238 -1731 -762 973 -217 258 270 -966 -372 1535 142 -963 530
5303E30J29n47N27j06j194J421J323k322n7J211K4p36P47q50p25J874M87k322
$$ 530 659 112 639 533 -661 760 2083 -239 -296 915 939 203 950 100 -625 1249 1736 -586
5321e86L7J451q09j33P26j464m46K116p02j475Q41N28r61N43L06j547J031J361
$$ -586 -549 902 93 -40 686 -778 -1224 892 190 -1285 -444 84 -877 -334 -28 -1575 -544 817
5339H17j456r32J282J28o37R69n69j386J562J036j908LJ681k83n83J009j068m80
$$ 817 -639 -1571 -289 -161 -798 171 -398 -1784 -222 814 -1094 -1091 590 307 -276 733 -335 -815
5357h15K051j28j880P83J057o71J29K67r66K43J712o00j897J231O64n73J47R5
$$ -815 1236 1108 -772 11 1068 397 526 793 -173 70 1782 1182 -715 516 1180 607 754 849
5375H49j523P68J808j851j028J445M1p08O53p96q43J790K24j999l26J678o08j17
$$ 849 -674 94 1902 51 -977 468 509 -199 454 -342 -1185 605 829 -1170 -1496 182 -426 -543
5393e43K82q58k42J759j50j869R21R66q37K24L24j352P21J910j165j644J706N17
$$ -543 -261 -1119 -1361 398 248 -1621 -700 266 -571 -347 -23 -1375 -654 1256 91 -1553 153 670
5411F70q50O69j31j034J408J035j945l76J621j69p15M59l08n95J701P2k152M15
$$ 670 -180 489 358 -676 732 1767 -178 -554 1067 898 183 642 334 -261 1440 1512 -640 -225
5429b25J788j065j64K41j299L81K110j259j630Q87J242j160r3n6r31P83J503j826
$$ -225 1563 498 334 575 -724 -343 1767 508 -1122 -235 1007 -153 -246 -302 -1233 -450 1053 -773
5447g73j193J765N75r43M83q08r04J720Q28j857m78J545k82m90J018p81n81K120
$$ -773 -1966 -201 374 -569 -86 -894 -1798 -78 750 -1107 -1585 -40 -322 -812 206 -575 -1156 964
5465I64l26j931J241J102j028J19P31j033K05J759j320j390J768K98j063N55K67
$$ 964 638 -1293 -52 1050 22 141 872 -161 44 1803 483 -907 861 1159 96 651 918
5482I18j042R21P23j662m68J678m72j099Q55m04l83J220m8k119N04J711r36n17
$$ 918 -124 797 1520 -142 -610 1068 596 -503 352 -52 -435 785 737 -1382 -878 833 -103 -620
5500f20L64l46k01J620o19j936R91J465j278k91M76p79P47J635j992r97K311j50
$$ -620 -256 -602 -803 817 198 -1738 -747 718 -560 -851 -375 -1154 -407 1228 -764 -1761 550 400
5518D00q96M11J82j014J210J034j833n11K095n96j98Q33j149r58J875K27j629
$$ 400 -496 -85 97 -917 293 1327 -506 -1017 1078 482 284 1117 -32 -990 885 1112 -517
5535e17M48R50q01k49J263j136j75J666q07j502R19N12q96P43J1r47K04J170r56
$$ -517 -69 881 80 -169 1094 -42 -217 1449 642 -860 59 571 -325 418 429 -518 -314 856 -100
5554a00r25J607n23r16R15l64p18R40M54j340N7J433n14r29O71l62m11J573r6
$$ -100 -1025 582 59 -857 58 -306 -1024 -84 370 -970 -913 520 6 -923 -252 -614 -1025 548 452
5573D52k096R60J646j143n8M47q87P6J922j274j345J748Q69j370P5L05r89J392
$$ 452 -1644 -684 962 -181 -239 208 -679 -603 1319 45 -1300 448 1317 -53 22 327 -662 730
5591G30Q45j571r18K207l00j002O39n24n55J596M11k410L07J565q10j6K54p42
$$ 730 1575 4 -914 1293 993 -9 630 106 -449 1147 1558 -852 -545 1020 210 194 448 -294
5609b94l44J511m13j629P50J107q65j60Q3q62M96J523j424j356J645M73r82L10
$$ -294 -638 873 460 -1169 -419 688 -177 -337 -254 -1116 -620 903 -521 -1877 -232 241 -741 -431
5627d31J70j125J063J129j692k13J727m88o46M35j99n09J666k98j800Q87J919
$$ -431 -261 -1386 -323 806 -886 -1099 628 140 -506 -71 -270 -779 887 589 -1211 -324 1595
5644A595j250p01R72p41L92J295q72j617J682O92j171j38K98j069J055J291j806
$$ 1595 345 -356 616 -125 267 1562 690 -927 755 1447 276 138 436 -633 422 1713 -93
5661i3n94J588K01j600N89j29m79J182J16j953l71K351q93o71M55n88k40J537
$$ -93 -687 901 1102 -498 91 -38 -517 665 781 -1172 -1543 808 -85 -756 -301 -889 -1129 408
5679D08m28j708J117J023q44j68N47p49O6J503j177p80J476K89j361Q92N0k39
$$ 408 -20 -1728 -611 412 -432 -600 -53 -802 -736 767 -410 -1190 286 575 -786 106 156 -83
5697h3L12R12j441m14K119n01j052P80L2r46J370L72j818P10J377j107j009R55
$$ -83 229 1141 -300 -714 1405 904 -148 632 664 -282 1088 1460 -358 352 1729 622 -387 568
5715E68m08M3J067q66j301J321Q37j602J80R24r91O0R32j176r86J521M04j621
$$ 568 160 203 1270 404 -897 424 1261 -341 -161 763 -228 -168 764 -412 -1398 123 527 -1094
5733a094N67J66m53O52N81j422m84J913q03q46J047j44o68J331kj794J065J264
$$ -1094 -527 -361 -814 -162 419 -1003 -1487 426 -377 -1223 -176 -320 -988 343 341 -1453 -388 876
5751H76q49k39P15p51l02J582n57q52J040O61j507N29O03j237O34J017j283m63
$$ 876 27 -212 503 -248 -550 1032 475 -377 663 1324 -183 346 949 -288 346 1363 80 -383
5769c83J502k04j235R30j87p41J003M26j980K24J360o55l86P47q26p45J503j87
$$ -383 1119 915 -320 610 423 -318 685 1111 -869 -645 715 60 -326 421 -405 -1150 353 166
5787A66j554P20J158j303l37Q17p03K82J303j173j302J585L24p76L06L20q68Q69
$$ 166 -1388 -668 490 -813 -1150 -333 -1036 -754 549 -624 -1926 -341 -17 -793 -487 -167 -1035 -166
5805a66J181j642m18J808m53n76P30N3r32J398N08j829M99J448q76o83Q09o38
$$ -166 1015 -627 -1045 763 310 -266 464 517 -415 983 1491 -338 161 1609 733 50 859 221
5823B21k12J574r75j158J111R01j459K9O09q42K42P93j147q79J682M73j941N09
$$ 221 9 1583 608 -550 561 1462 3 32 641 -201 41 834 -313 -1192 490 963 -978 -469
5841d69M80r29R46K65j680m42K267m56j022M54L6m27R94Nj831J100J666j481m61
$$ -469 11 -918 28 293 -1387 -1829 438 -18 -1040 -586 -550 -977 17 22 -1809 -709 957 -524 -985
5860i85O70qK05J099r31j308K043P21j737J7R81o88N59J069j760l11J503J85j167
$$ -985 -315 -323 -118 981 50 -1258 785 1506 -231 -214 767 79 638 1707 -53 -364 1139 1324 157
5879A57K66L33p72R49J40j382L02J534j262r02R24l04m55J248k65j680J043O80
$$ 157 423 756 -16 933 1073 -309 -7 1527 265 -637 287 -17 -472 776 511 -1169 -126 554
5897E54j473o4Q52l39n02R70p27q86J692J70j687O20Q54o19L00L39j051J43J908
$$ 554 -919 -983 -131 -470 -972 -2 -729 -1615 77 247 -1440 -820 34 -585 -285 54 -997 -854 1054
5916A054q59j237Q46L85m31R37j28j254J158J177j648k38J146m55j06Q42o05j121
$$ 1054 195 -1042 -196 189 -242 695 567 -687 471 1648 0 -238 908 453 347 1189 584 -537
5934e37J806K29j279j20P38r55M36Q40j246l74J194k13j146O19M42j053N89L48
$$ -537 1269 1498 219 99 837 -118 318 1158 -88 -462 732 519 -627 -8 434 -619 -30 318
5952C18j317j30J293j56j074R53n11o13J306K26j440N57J336j579j00J216j053
$$ 318 -999 -1129 164 8 -1066 -113 -624 -1237 69 295 -1145 -588 748 -831 -931 285 -768
5969g68k44J644n11j176J160O19j347M30O86r32M14O68q39m17J710j10j448J353
$$ -768 -1012 632 121 -1055 105 724 -623 -193 493 -439 -25 643 -196 -613 1097 987 -461 892
5987H92j55o45O97K22j400N25J412j078q44J132l35o47J370p18j429J043Q32q51
$$ 892 737 92 789 1011 -389 136 1548 470 -374 758 423 -224 1146 428 -1001 42 874 23
6005B3l67M88q26L14J032j206r98J791K54j269k65N83o17R68O42j689l72K116
$$ 23 -344 144 -682 -368 664 -542 -1540 251 505 -764 -1029 -446 -1063 -95 547 -1142 -1514 602
6023F02l83j259J221l72o77J212J37j422O49J345r45m55J241q22l5J277o96j186
$$ 602 219 -1040 181 -191 -868 344 481 -941 -292 1053 108 -347 894 72 37 1314 618 -568
6041e68J052J082j481n5Q03r09N87O60j044l22J325J50j695O04L98p92K19M92
$$ -568 484 1566 85 30 833 -76 511 1171 127 -195 1130 1280 -415 189 587 -205 14 506
6059E06j018K63J497j257j328J092N37q41R65l40j864J441J032j504m97J243l15
$$ 506 -512 -249 1248 -9 -1337 -245 292 -549 416 76 -1788 -347 685 -819 -1316 -73 -388
6076c88L0M49p95p57J952L22j601K30J113q30M14O07j560o5K041j61j590M82O37
$$ -388 -358 91 -704 -1461 491 813 -788 -558 555 -275 139 746 -814 -879 1162 1001 -589 -107 530
6095E30n95Q91N7j385N72J453j190n11J152o8j312J024k64j002J327J56j151N1
$$ 530 -65 826 883 -502 70 1523 333 -178 974 906 -406 618 354 -648 679 835 -316 -265
6113b65Q30p28k88P75n18o58J725o31j306O87O32o83l5N53j126N39J201q03j015
$$ -265 565 -163 -451 324 -194 -852 873 242 -1064 -377 255 -428 -463 90 -1036 -497 704 -99 -1114
6132a114J176L60j136L16M78j016O10J163j297n13J250P9p38P66m09p47J111M18
$$ -1114 62 422 -714 -398 80 -936 -326 837 -460 -973 277 356 -382 384 -25 -772 339 757
6150G57j474N39J235j201J91O67n27q50J736j76j349N19R52j271M58Q39j543M33
$$ 757 -717 -178 1057 -144 47 714 187 -663 1073 897 -452 67 1019 -252 206 1045 -498 -65
6168f5J326r10q35Q96m62l41Q66Q6j324M40J159j258j67J037j039j55J279n79
$$ -65 1261 351 -484 412 -50 -391 475 561 -763 -323 836 -422 -589 448 -591 -746 533 -46
6186d6j377J386N01j491N48P16j278N48J091j308m12J690n90q11J010M11j370
$$ -46 -1423 -37 464 -1027 -479 237 -1041 -493 598 -710 -1122 568 -22 -833 177 588 -782
6203g82R37K15j120L82J377o94m79R37m06m98J038l56j192R40J143j544k31J141
$$ -782 155 370 -750 -368 1009 315 -164 773 367 -131 907 551 -641 299 1442 -102 -333 808
6221H08m57j2Q71j024q97J619K45j825Q67L53q94P20J4j097L1J365o65j029O69
$$ 808 351 339 1210 186 -711 908 1153 -672 195 548 -346 374 388 -709 -678 687 22 -1007 -338
6240c38J51n05Q74j39j297P82J488j606n13J221n18m82J195o51o33J004Q44j563
$$ -338 -187 -692 182 43 -1254 -472 1016 -590 -1103 118 -400 -882 313 -338 -971 33 877 -686
6258f86k80J283l54l3M80q16m9J810o95j419O84Q64o32N84J21j027K01J376r72
$$ -686 -966 317 -37 -70 410 -406 -455 1355 660 -759 -75 789 157 741 862 -165 36 1412 440
6277D40q19J141k19q32R95l19j102J052O93j161m34J174o21r9M72j012j84J276
$$ 440 -379 762 543 -289 706 387 -715 337 1030 -131 -565 609 -12 -111 361 -651 -835 441
6295D41p3j641O29J045p65O5M81j099k09J619o02j467J080P14j049P37K54r37
$$ 441 368 -1273 -644 401 -364 -299 182 -917 -1126 493 -109 -1576 -496 218 -831 -94 160 -777
6313g77O89P96j137l54J399m12q57J306j97r15J090M96j437M15R28q36k70Q13
$$ -777 -88 708 -429 -783 616 204 -653 653 456 -459 631 1127 -310 105 1033 197 -73 740
6331G40n14k24J131l82j371J145P28j237o6O44q84K71J105j055o67Q81J52j055
$$ 740 226 2 1133 751 -620 525 1253 16 -50 594 -290 -19 1086 31 -636 245 397 -658
6349f58Q39j21r45N93O81j289n0J087n84n84R58n11n59Q37O42j407M24O43o39
$$ -658 181 60 -885 -292 389 -900 -950 137 -447 -1031 -73 -584 -1143 -306 336 -1071 -647 -4 -643
6368f43J84R46q38n41J253J26r86O00M34q78P83N21j131J99J127p04p15J052l61
$$ -643 -459 487 -351 -892 361 487 -499 101 535 -343 440 961 -170 29 1156 452 -263 789 428
6387D28l90M69K66p19K46R16j183O7J109r28m73R13l07q38R45J70j458M06M87
$$ 428 38 507 773 54 300 1216 33 100 1209 281 -192 721 414 -424 521 691 -767 -361 126
6406A26j033L02N27q55j44J418n77q08M41M81j036O99L08j209R11J197j060j010
$$ 126 -907 -605 -78 -933 -1077 341 -236 -1044 -603 -122 -1158 -459 -151 -1360 -449 748 -312 -1322
6424a322J227l5p7N59l02r22J306M50j166MJ047k32l70Q71j030l54J618j26j206
$$ -1322 -95 -130 -207 352 50 -872 434 884 -282 -278 769 537 167 1038 8 -346 1272 1146 -60
6443f0J64M56m53L20O13j335L41J068m54q55N13K34r21P13J30j183P45O43j427
$$ -60 104 560 107 427 1040 -295 46 1114 660 -195 318 552 -369 344 474 -709 36 679 -748
6462g48m03J357m58r45J426n36p39J085K90j510J42J257o57k72M97m66r5J576
$$ -748 -1151 206 -252 -1197 229 -307 -1046 39 329 -1181 -1039 218 -439 -711 -214 -680 -775 801
6480H01n46j434J216Q37q31l24L30n37O21J324j016j130J550K44q98N42o5q16
$$ 801 255 -1179 37 874 43 -281 49 -488 133 1457 441 -689 861 1105 207 749 684 -132
6498a32J164M39j583j80J303k81n15O49o32n73J017Mj320N12J073q50k36O0o49
$$ -132 1032 1471 -112 -292 1011 730 215 864 232 -341 676 680 -640 -128 945 95 -141 -81 -730
6517g30K18J266p86j237Q48L73r03M45L66q95O42N67j076j02J064l91n16M58M43
$$ -730 -512 754 -32 -1269 -421 -48 -951 -506 -140 -1035 -393 174 -902 -1004 60 -331 -847 -389 54
6536E4j000J282M32j442J87J492q60m39N31J7l29Q21k17o97N87N20p05m5N99p07
$$ 54 -946 336 768 -674 -487 1005 145 -294 237 254 -75 746 529 -168 419 939 234 189 788 81
6556H1M08Q91j083q15J393p0j236Q59j33p66O02P03j064o98J301m04l90O74k87
$$ 81 489 1380 297 -518 875 805 -431 428 295 -471 131 834 -230 -928 373 -31 -421 253 -34
6575c4p80O71N23j279L36Q23p46j13P29o00k54Q07j5r48O32N23p92J88M91p04
$$ -34 -814 -143 380 -899 -563 260 -486 -599 130 -470 -724 83 68 -880 -248 275 -517 -329 162 -542
6595e42n4R86n13k31P12J48r72J283k81q44N55Q89j235nJ154o00l38P36l70p41
$$ -542 -596 390 -123 -354 358 506 -466 817 536 -308 247 1136 -99 -104 1050 450 112 848 478 -263
6615b63J281j85j215O34M73o24l33P20q04J9Q31n59j044J156K74p93QK48j146
$$ -263 1018 833 -382 252 725 101 -232 488 -316 -297 534 -25 -1069 87 361 -432 -424 -176 -1322
6634a322J035P71j136n34J282l59l87P72k36p29O21O48j261L14R04n60J5Q00j144
$$ -1322 -287 484 -652 -1186 96 -263 -650 122 -114 -843 -222 426 -835 -521 383 -177 -162 638 -506
6653e06J21J113k62j018P76M77q14K60N44j110O18J238q74j078R15K61p93L39
$$ -506 -385 728 466 -552 224 701 -113 147 691 -419 199 1437 563 -515 400 661 -132 207
6671B07M23j353J150M96j295k67J248k5q19O23l15q13J110L34j416L32J059p20
$$ 207 630 -723 427 923 -372 -639 609 584 -235 388 73 -740 370 704 -712 -380 679 -41
6689d1o78Q25o61j57J207o01j306J079O28p74l5L49o06M52J090j216q61J423K71
$$ -41 -719 106 -555 -712 495 -106 -1412 -333 295 -479 -514 -165 -771 -319 771 -445 -1306 117 388
6708C88o87K92K20p60R82N75j246o5J108m29m72N66l05k98O63J68j130L70P74
$$ 388 -299 -7 213 -547 435 1010 -236 -301 807 378 -94 472 167 -131 532 700 -430 -60 714
6727G14q34K73P19o00k82Q63m65p74P95J13q90L71K39p99M98N51j092M2R34k32
$$ 714 -120 153 872 272 -10 853 388 -386 409 522 -368 3 242 -557 -59 492 -600 -558 376 144
6747A44p62P13p8p27O40N43j396O70N31n78k95P49n73m50Q23J97r19P27N01j034
$$ 144 -618 95 17 -710 -70 473 -923 -253 278 -300 -595 154 -419 -869 -46 151 -768 -41 460 -574
6767e74J05Q04n51k70J309q36n88J295j23p20N6O00p22M89P47j045l3Q90l64n73
$$ -574 -469 335 -216 -486 823 -13 -601 694 571 -149 -93 507 -215 274 1021 -24 -57 833 469 -104
6787a04N22n6q29J050K42j118Q7Q07q43K5P76q13l99J173k50q92L10N48q65P9
$$ -104 418 362 -467 583 825 -293 -206 601 -242 -217 559 -254 -653 520 270 -622 -312 236 -629 -550
6807e50N73q38L07R26p90o44J338o21l16M09J57o95O12O37j088O2P91l38m02N45
$$ -550 23 -815 -508 418 -372 -1016 322 -299 -615 -206 -49 -744 -132 505 -583 -521 270 -68 -470 75
6827G5o2j07R61j54j185O32J021q80j72N60m33j99J213q97p74J185p1n93M45l03
$$ 75 13 -94 867 713 -472 160 1181 301 129 689 256 57 1270 373 -401 784 713 120 565 262
6847B62n22L79J197j507n12J208k89l89pNn48J216j76q71j37J013o35j70J51j86
$$ 262 -260 119 1316 -191 -703 505 216 -173 -180 -175 -723 493 317 -554 -691 322 -313 -483 -332 -518
6867e18l33J380n32j186N95J037o76j87M68l55j35J023q52q18J252L95o95J42
$$ -518 -851 529 -3 -1189 -594 443 -233 -420 48 -307 -442 581 -271 -1089 163 558 -137 5
6885EJ22m99M65O82j081n0J262l09r24R49l66m41J122l86j118R27O77q67j75Q33
$$ 5 127 -372 93 775 -306 -356 906 597 -327 622 256 -185 937 551 -567 360 1037 170 -5 828
6905H28q67r4P48p29p94P88K27n53j41N68k06K81M04j303j86J120K26j131K68
$$ 828 -39 -133 615 -114 -908 -120 107 -446 -587 -19 -225 56 460 -843 -1029 91 317 -814 -546
6924e46M01m90Q22j73q06j00J100l71m08O69j8p16J130J0j233J063J6l83n9R03
$$ -546 -145 -635 187 14 -792 -892 208 -163 -571 98 80 -636 494 504 -729 334 350 -33 -92 811
6944H11j002N10M36m17n45J014rr77Q75K31j143J77R22q68K40L47k92p42O77p7
$$ 811 -191 319 755 338 -207 807 798 -179 696 927 -216 -39 883 15 255 602 310 -432 245 168
6964A68k70M33K00j114K90P36p76k99J018n82l88K90J19j016P30O00r77K69M03
$$ 168 -102 331 531 -583 -293 443 -333 -632 386 -196 -584 -294 -175 -1191 -461 139 -838 -569 -166
6983a66m76R6P51p14o09J353j26r10O29L10n53L28N15p05m20J309j45o22Q04k09
$$ -166 -642 -546 205 -509 -1118 235 109 -801 -172 138 -415 -87 428 -277 -697 612 467 -155 649 440
7003D40q09R56p0p53M13P05p81L35N3m34l7J143p56q42Q82M58r10l2O24j034K17
$$ 440 -369 587 517 -236 177 882 101 436 489 55 18 1161 405 -437 445 903 -7 -39 585 -449 -232
7024b32Q35n73p15O58J8m73M39K25p20M00K58j035j20J113k25o78P81n03k17Q26
$$ -232 603 30 -685 -27 -9 -482 -43 182 -538 -138 120 -915 -1035 78 -147 -825 -44 -547 -764 62
7044F2j01q26O87P62r07N54lj47J21P16n89q51R19L34r62K11L54m44O17O57j229
$$ 62 -39 -865 -178 584 -323 231 228 81 202 918 329 -522 397 731 -231 -20 334 -110 507 1164 -65
7065f5k78J307m39m65j22N31n48R71j74j113RJ063o92j79M72l88k12P58n81p62
$$ -65 -343 964 525 60 -62 469 -79 892 718 -395 -386 677 -15 -194 278 -110 -322 436 -145 -907
7085i07M53R30j076k06L65m55L50Q08p83n92J098Q0j013N88M96o43J98M11p02
$$ -907 -454 476 -600 -806 -441 -896 -546 262 -521 -1113 -15 65 -948 -360 136 -507 -309 102 -600
7104f00O3J093m17j020J160J22l14M45k39j071J200O05p96m40Q79j16m05P35m31
$$ -600 -537 556 139 -881 279 401 87 532 293 -778 422 1027 231 -209 670 554 149 884 453
7123D53o53J016J21j316N44K09m20j48O82r16l08J364l28j017M97M25o79O04k9
$$ 453 -200 816 937 -379 165 374 -46 -194 488 -428 -736 628 300 -717 -220 205 -474 130 101
7142A01j018K70P45n06k73L00p7l45O43R3r28Q89N04j059J13P05m12j21P59p13
$$ 101 -917 -647 98 -408 -681 -381 -458 -803 -160 -67 -995 -106 398 -661 -548 157 -255 -376 383 -330
7162c30l74O29L85p05L67M29n28M10P02p28l21R17m17o01P38K3o90O04L05q09
$$ -330 -704 -75 310 -395 -28 401 -127 283 985 257 -64 853 436 -165 573 596 -94 510 815 6
7182FK64P88r14n73J104l80n80N41j29p67Q42K37j069L57M25j38m9L40p18o15
$$ 6 270 1058 144 -429 675 295 -285 256 127 -640 202 439 -630 -273 152 14 -35 305 -413 -1028
7202a028J186j09q71P00K55q38M50M65j055K91Q34m48m52N46J22p05J024J42j179
$$ -1028 158 49 -822 -122 133 -705 -255 210 -845 -554 280 -168 -620 -74 48 -657 367 509 -670
7221f70M37J032p75j10O52m95k06O96J1r15N90M51p93K69L79n18L89O37j269j09
$$ -670 -233 799 24 -86 566 71 -135 561 572 -343 247 698 -95 174 553 35 424 1061 -208 -317
7241c17Q29j21p18M77m9k45K30J52q59J06J188j002l29L45K97o07P88k47j066
$$ -317 512 391 -327 150 101 -144 86 238 -621 -515 673 -329 -658 -313 -16 -623 165 -82 -1148
7260a148Q65O74q12n81Q95l44j05J012o95n84J001Q5j028M49L18l00M19M90p51
$$ -1148 -283 391 -421 -1002 -107 -451 -556 456 -239 -823 178 263 -765 -316 2 -298 121 611 -140
7279a40k88J241r7q80O82k25l20P15K36j516Q28J013j030j73K84k1j20N96o9j280
$$ -140 -428 813 716 -164 518 293 -27 688 924 -592 236 1249 219 46 330 309 189 785 716 -564
7299e64R52N96j352K25O27o16j19M61n42k70R37r7j163Q18K80m37o8L25j026N61
$$ -564 388 984 -368 -143 484 -132 -251 210 -332 -602 335 238 -925 -107 173 -264 -332 -7 -1033 -472
7319d72J052n56j114Q61L58r79R87m3j079P87Q85j165j99Q95J16m26M99n74l61
$$ -472 580 24 -1090 -229 129 -850 137 94 -985 -198 687 -478 -677 218 334 -92 407 -167 -528
7338e28J082J09p67mP45p08K21Q05r79j55J018l77j028J053J90p13J53P09j038
$$ -528 554 663 -104 -108 637 -71 150 955 -24 -179 839 462 -566 487 677 -36 117 826 -212
7357b12L52O86q09l13M95Pm83P69m01q75O10K60o33J65M71k08p93J144m88m53
$$ -212 140 826 17 -296 199 206 -277 492 91 -784 -174 86 -547 -382 89 -119 -912 232 -256 -709
7377g09N69K9p91N18P42r46m2R50m45j79N76q8r01Q11J54n79O65J98q52M74Q12
$$ -709 -140 -111 -902 -384 358 -588 -630 320 -125 -304 272 184 -717 94 248 -331 334 532 -320 154 966
7398I66p80m84Q21O5m62N52l2r12O80K29r22N7Q09n43j65Q73p52l84J044k44j115
$$ 966 186 -298 523 588 126 678 646 -266 414 643 -279 -222 587 44 -121 752 0 -384 660 416 -699
7419f99P00K90j048O85M31j122J28J112o09m37O57k71m92Q39o5j187O05P50r24
$$ -699 1 291 -757 -72 359 -763 -635 477 -132 -569 88 -183 -675 164 99 -1088 -483 267 -657
7438f57J56O49k70l84Q52l95o24Q83M35j178J19R16p96P8Q04o66j08J297m44j196
$$ -657 -501 148 -122 -506 346 -49 -673 210 645 -533 -414 502 -294 -216 588 -78 -186 1111 667 -529
7458e29J191m55J9J70M02j025J75Q30n73n52Q77l54m32P68R4j237N73Q64j426
$$ -529 662 207 226 396 798 -227 -52 778 205 -347 530 176 -256 512 606 -631 -58 806 -620
7477f20J42P73p96J98M50n53j91N82K62r24k23Q63n31N02K39j014K42J247n53
$$ -620 -478 295 -501 -303 147 -406 -597 -15 247 -677 -900 -37 -568 -66 173 -841 -599 648 95
7496I5j091J004j79j68M24K42q88M19Q44r43j85J040j86p37Q43k91n73R19L67
$$ 95 -996 8 -171 -339 85 327 -561 -142 702 -241 -426 614 428 -309 534 243 -330 589 956
7515I56j145J99R36l97n45M88m04j24O33j25q24M72M36o11J64K77p30K28N43o71
$$ 956 -189 10 946 549 4 492 88 -36 597 472 -352 120 556 -55 109 386 -344 -116 427 -244
7535b44n04N33L55p52M12K15n45O56M85j347K8Q40m06k51J30K00p76J144K70j298
$$ -244 -748 -215 140 -612 -200 15 -530 126 611 -736 -708 132 -274 -525 -395 -195 -971 173 443 -855
7555h55L17Q13m41j71O47n49L12N06J0j148P68L64p62N95j10n48M94P40j086j82
$$ -855 -538 275 -166 -337 310 -239 73 579 589 -559 209 573 -189 406 296 -252 242 982 -104 -286
7575b86R29j25q08R39l73l49O30K0p69J77N40n38j08O49p40m4Q35m67p85L93N70
$$ -286 643 518 -290 649 276 -73 557 577 -192 -15 525 -13 -121 528 -212 -256 579 112 -673 -280 290
7596B90j228N38M04m32j1O88o63l61O15L28r67O59J58p26O86M52r77j55Q88j80
$$ 290 -938 -400 4 -428 -439 249 -414 -775 -160 168 -799 -140 18 -708 -22 430 -547 -702 186 6
7616Fj19N98m58j25O56L7q95M03L02l17K39M78m94l73R99K3j093M96R1k90K88
$$ 6 -113 485 27 -98 558 595 -300 103 405 88 327 805 311 -62 937 960 -133 363 454 164 452
7637D52M1q39K24O93n45n47P29k65l24N31J11j025O17M72q69m09R32J5n73P77
$$ 452 493 -346 -122 571 26 -521 208 -57 -381 150 261 -764 -147 325 -544 -953 -21 -6 -579 198
7657A98o08n83R02L32j024L73L40k98L0N00m08l20J099l61p80R97j02p03O55M06
$$ 198 -410 -993 -91 241 -783 -410 -70 -368 -338 162 -246 -566 533 172 -608 389 287 -416 239 645
7677F45j163Q28M48n61o63J119k83m29N09k41m99Q56L28j196o0R26l08l68N92
$$ 645 -518 310 758 197 -466 653 370 -59 450 209 -290 566 894 -302 -362 564 256 -112 480
7696D80l88k61Q39m18q40L21Q65q57J16K82p67J57R72o39p68Q14J06k81j46N32
$$ 480 92 -169 670 252 -588 -267 598 -259 -143 139 -628 -471 501 -138 -906 -92 14 -267 -413 119
7716A19p91L77M90j040P1R76j39l30L35J66o59Q42K45j049J54J076p60j17N33
$$ 119 -672 -295 195 -845 -774 202 63 -267 68 234 -425 417 662 -387 -233 843 83 -34 499
7735D99m84J91M32j57q52M29O21m87M3K97n55J20Q76o78p42J251l40n04M8N86
$$ 499 15 206 638 481 -371 58 679 192 235 532 -23 97 973 295 -447 804 464 -40 8 594
7755E94p76M02J24j039J86P69l08n14O36l87j24L64K67q85K30N77o69j15J023
$$ 594 -182 220 344 -695 -509 260 -48 -562 74 -313 -437 -73 194 -691 -461 116 -553 -668 355
7774C55o87m19J102n15p60Q56K94q53N82L13m85J54M30n86k60J331o83j90N18
$$ 355 -332 -751 351 -164 -924 -68 226 -627 -45 268 -217 -63 367 -219 -479 852 169 -21 497
7793D97p8m32N64K9n86O8M97m35n8N67l65p66J036M5q63K85M46o50J83L54n89
$$ 497 419 -13 551 580 -6 62 559 124 66 633 268 -498 538 583 -280 5 451 -199 -16 338 -251
7814b51Q1O18n75p24Q15J63o11M77L98q22K03L30p04j58J140n76k38K68j9p60
$$ -251 -170 448 -127 -851 -36 127 -484 -7 391 -431 -228 102 -602 -760 380 -196 -434 -166 -185 -945
7834i45R44m3p53M12Q11o63P0M49p08R8Q46j47p63L55M06l83N7M91l47p6P14m75
$$ -945 -1 -44 -797 -385 426 -237 -167 282 -426 -328 518 371 -392 -37 369 -14 43 534 187 111 825 350
7856C50o76P37o0l88J15O05q49L04L98m22m44Q03m06j87M0Q9l10L99L7q32M34
$$ 350 -326 411 351 -37 78 683 -166 138 536 114 -330 473 67 -120 -80 9 -301 98 135 -697 -263
7877b63O25o80k01L64l35l26J062m19q83Q19L88q59J76O74p55L55M87p51r4P21
$$ -263 362 -318 -519 -155 -490 -816 246 -173 -1056 -237 151 -708 -532 142 -613 -258 229 -522 -616 105
7897A05l2m71M00J91n48O22L38r59K09Q37n27k44N12m3n08Q22m2o88K02O93r70
$$ 105 73 -398 2 193 -355 267 605 -354 -145 692 165 -79 433 390 -118 704 662 -26 176 869 -101
7918a01L08J58k36l3O64o63q03Q50J43q93L90L52o10M96L78q63k37J034n70l89
$$ -101 207 365 129 96 760 97 -706 144 287 -606 -216 136 -474 22 400 -463 -700 334 -236 -625
7938f25N42j06l55O93j91q94P01P16p73l32Q21k75l9K78k82p66Q91N47o86k8N09
$$ -625 -83 -189 -544 149 -42 -936 -235 481 -292 -624 197 -78 -117 161 -121 -887 4 551 -135 -163 346
7959C46k24j16O54m76j96N30J29q10M80p9l94M52N39j118J04R35o27l84N82n5
$$ 346 122 6 660 184 -12 518 647 -163 317 238 -156 296 835 -283 -179 756 129 -255 327 272
7979B72n62Q92m40p69P50L68p84j3O60o67J93K90m23k69K78J79o68K80M15m45
$$ 272 -290 602 162 -607 143 511 -273 -286 374 -293 -100 190 -233 -502 -224 -45 -713 -433 -18 -463
7999d63R7P1j46k79Q58k22l99N90J91o12L54M24j034N69O85n73r3J39j0N0L44
$$ -463 -366 -295 -441 -720 138 -84 -483 107 298 -314 40 464 -570 -1 684 111 18 157 147 197 541
8020E41j21n76P90Q9q87J87P28l77q1K97n53l94N61K22p98M14J39l37K91L97r29
$$ 541 420 -156 634 723 -164 23 751 374 293 590 37 -357 204 426 -372 42 181 -156 135 532 -397
8041c97K09N03j19p80O01j66k08J82O68j346M77O36o79j24N02k65m08R31l35m20
$$ -397 -188 315 196 -584 17 -149 -357 -175 493 -853 -376 260 -419 -543 -41 -306 -714 217 -118 -538
8061e38L78M43n41J89K86n89L94K77k14m47Q31J95q21L19N7p4J24M74p26l00R83
$$ -538 -160 283 -258 -69 217 -372 22 299 85 -362 469 664 -157 162 219 145 269 743 17 -283 700
8082G00n32o9L86P0o29P48n59o49J168q1o75j04N59l12k05L65j24n85M15M16p31
$$ 700 168 99 485 555 -74 674 115 -534 634 553 -122 -226 333 21 -184 181 57 -528 -113 303 -428
8103d28K10Q7j92J81K51m35o12R43L9o11J10L98l12J31L33q26L81P58l75k66N79
$$ -428 -218 -131 -323 -142 109 -326 -938 5 44 -567 -457 -59 -371 -240 93 -733 -352 406 31 -235 344
8124C44o31K25N21k57p02P43J56m16K15L6K7J5J30r9p20J049L1n82L6L57p52N07
$$ 344 -287 -62 459 202 -500 243 399 -17 198 234 261 276 406 307 -413 636 667 85 121 478 -274 233
8146B33M56o71o05J258m13n53M42Kp05P18K64j129P98K49r09k63P09k59j11M06
$$ 233 689 18 -587 671 258 -295 147 149 -556 162 426 -703 95 344 -565 -828 -119 -378 -489 -83
8166h3o0p87Q29J40q53L95M43l20K62K10m77k73J039j54n63K10L08l85J61N54
$$ -83 -143 -930 -101 39 -814 -419 24 -296 -34 176 -301 -574 465 311 -252 -42 266 -119 42 596
8186E96q33NR81l43o97
$$ 596 -237 -232 749 406 -291
8191b91
$$ Imaginary data points
##PAGE= N=2
##DATA TABLE= (X++(I..I)), XYDATA
0@%%%%%%pJ5qQj6J6k2L0l2M0m8N6p1P9r2J10j26J47j69J91k17K48k80L17l57L99
$$ 0 0 0 0 0 0 0 -7 8 0 8 -8 8 -14 16 -16 24 -24 32 -39 40 -52 58 -68 79 -90 101 -116 132 -148 169 -188 211
32B11m46N02n62O23o93P70q53R44j046J161j286J422j577J752j947K168k425K725
$$ 211 -235 267 -295 328 -365 405 -448 496 -550 611 -675 747 -830 922 -1025 1143 -1282 1443
50A443l079L506m032M700n580O793q584J1497j7024L1099j28145l20072K40235
$$ 1443 -1636 1870 -2162 2538 -3042 3751 -4833 6664 -10360 20739 -107406 -427478 -187243
63a87243L48765M2927k61014k11003O1965K32772L4748j77826o0182J51377Q5563
$$ -187243 161522 204449 -56565 -267568 -205603 27169 61917 -115909 -176091 -24714 60849
74F0849q8532j22990J0995J63044J24817j15081j74584M9025J76840M4131q4664
$$ 60849 -27683 -150673 -139678 23366 148183 33102 -141482 -92457 84383 128514 43850
85D3850q3222L430J01662P4347o8501q4063K1755L3513l173L2746K5972m6337
$$ 43850 -39372 -35942 65720 140067 71566 -12497 9258 42771 39598 72344 98316 51979
97E1979o7570m1575K2236J22645P8619j25938j74454Q478J35416R1057k2055j15604
$$ 51979 -15591 -57166 -34930 87715 166334 40396 -134058 -125580 9836 100893 78838 -36766
109c6766p4224O8125P2481m8894l9278O0911M6641l7981q2590n5747P5296J61561
$$ -36766 -110990 -42865 29616 -19278 -58556 2355 48996 11015 -71575 -127322 -52026 109535
121A09535R288j78024j00602R1963J35726L7000r6914j27362L0381J55842L7194
$$ 109535 118823 -59201 -159803 -67840 67886 104886 7972 -119390 -89009 66833 104027
132A04027j19015q1569L6171R5475O5716n8388j19954N984J07724L0116m5940
$$ 104027 -14988 -96557 -60386 35089 100805 42417 -77537 -71553 36171 66287 20347
143B0347k4279M31K1244K7676l6790n0381N2899Q0217j8952p0685m9524l789P7930
$$ 20347 -3932 -3501 17743 45419 8629 -41752 11147 91364 72412 1727 -47797 -51586 26344
156B6344Q9365l7946j11678l7548L3950N6405N2538k8573r4675j6783O3688K0319
$$ 26344 115709 77763 -33915 -71463 -37513 18892 71430 42857 -51818 -68601 -4913 15406
168A5406k6680j9926j0073K6953M2768l9007p6459K3288Q0684K1625k9771m7392
$$ 15406 -11274 -31200 -41273 -14320 28448 -10559 -87018 -63730 16954 38579 8808 -38584
180c8584l1868M7883P2897k1630n9739J2935L6034L340n744k0557j5941M2842
$$ -38584 -70452 -22569 50328 28698 -31041 -18106 17928 21268 15524 -5033 -20974 21868
192B1868L8644l7822l6346J0086J137O619L6542k185m3457j4799O19N428M1300
$$ 21868 60512 22690 -13656 -3570 -2433 4186 40728 38543 -4914 -19713 -19094 -13666 27634
205B7634J2147o1194k5451N2884K3210l5503l4547k080N7254O9082n1951j30194
$$ 27634 39781 -21413 -46864 6020 29230 -6273 -40820 -42900 14354 83436 31485 -98709
217i8709j072J32827P7108n2265j09966n0728Q8781J17233m1347j24260L170J00210
$$ -98709 -99781 33046 110154 57889 -52077 -102805 -14024 103209 61862 -62398 -59228 40982
229D0982L2111o7039q2176J2871J25340N8526j30171j25184O5034J37369K6646
$$ 40982 73093 6054 -76122 -63251 62089 120615 -9556 -134740 -69706 67663 94309
240I4309r2676j05229J5827J33171M7964j14482q0580O3224Q3572L967n6622n4565
$$ 94309 1633 -103596 -87769 45402 93366 -21116 -101696 -38472 45100 49067 -7555 -62120
252f2120K8094P9066n686o8511R991O0061n632m7712j8208K6730O3355K1161q1959
$$ -62120 -34026 45040 39354 -29157 -19166 40895 35263 -12449 -30657 -3927 59428 80589 -1370
265a370o5027N5888O8216j4872l5694j0084M054J0497j8420l4537M3559P7598
$$ -1370 -66397 -10509 57707 42835 7141 -2943 1111 11608 -6812 -41349 2210 79808
277G9808m0933j17129j9093R1351Q6272j1234j17238q2014Q8778J30027k7811
$$ 79808 38875 -78254 -97347 -5996 80276 69042 -48196 -130210 -41432 88595 60784
288F0784j17989l2706O9008P8391o493r8032m0083R9722P4929p1961q4820K4213
$$ 60784 -57205 -89911 -20903 57488 50995 -47037 -87120 12602 87531 15570 -69250 -45037
300d5037Q4456M3896n8458j05986J3077J38487M9028j08286r7674K2114R7968
$$ -45037 39419 83315 24857 -81129 -68052 70435 119463 11177 -86497 -64383 33585
311C3585P1593m8497j16877j5184R0145L9252l5050k5984p150N931J5532j6251
$$ 33585 105178 56681 -60196 -75380 14765 54017 18967 -7017 -14167 -8236 7296 -8955
323h955k1146L9065L4320m4056m4946J5591K9362K1507O231l6755k8917K6295
$$ -8955 -30101 8964 43284 -772 -45718 -30127 -765 20742 26973 -9782 -38699 -12404
335a2404J9689j0301J4061J1952l6119k2614K5817K8560J7364j0080n8378k4139
$$ -12404 7285 -3016 11045 22997 -13122 -35736 -9919 18641 36005 25925 -32453 -56592
347e6592O8956N3867l7552n5644j3773K6892N3998J0622o3382l2074M5574K6513
$$ -56592 12364 66231 28679 -26965 -40738 -13846 40152 50774 -12608 -44682 892 27405
359B7405k2612j3409J913R589J8938j8970m8316J7305O3809N196m5611l3424p930
$$ 27405 4793 -8616 -6703 2886 21824 2854 -45462 -28157 35652 40848 -4763 -38187 -46117
372d6117L6789N9832r929o9090k1821L0288L0152K6180q669n6769j7435M9865
$$ -46117 -9328 50504 40575 -28515 -50336 -20048 10104 36284 27615 -29154 -46589 3276
384C276K8922j5376j8477j8272M274M1710M707m9833p255M6358J5093k4797l0524
$$ 3276 32198 16822 -1655 -19927 -15653 26057 30764 -19069 -26324 20034 35127 10330 -20194
397b0194j5724M1842O0982l1467q8807m568P5392M6023k2415o9919m4387N7928
$$ -20194 -35918 5924 66906 35439 -53368 -57936 17456 63479 41064 -28855 -73242 -15314
409a5314Q5384k3224q2215j5115M2961L4975k84m2647k7597M5448L6602m6282
$$ -15314 70070 46846 -35369 -50484 -7523 27452 27168 -15479 -43076 2372 38974 -7308
421g308m0715L1896L9534J882k8184m1553M965O2433J7771n1351k3673K3274J2615
$$ -7308 -48023 -16127 23407 25289 -2895 -44448 -39483 22950 40721 -10630 -34303 -11029 1586
434A586K517K846r480K547J0020k5652j2400N1550L0835m7441m5548J2540M6131
$$ 1586 4103 6949 -2531 16 10036 -15616 -28016 23534 54369 6928 -38620 -26080 20051
447B0051L9048k3495p4709n825Q0784K9265o0464m3165K1643N0348K0093n7190
$$ 20051 59099 35604 -39105 -44930 35854 65119 4655 -38510 -16867 33481 53574 -3616
459c616o5470M7038R4383j8826j01031l5908O3209Q3571K641j05462p3875P8333
$$ -3616 -69086 -22048 72335 53509 -47522 -83430 -20221 63350 65991 -39471 -113346 -35013
471c5013J09259k1145r5708l7771M9592P5553M809q4367l8488P6649N7506m6815
$$ -35013 74246 53101 -42607 -80378 -30786 44767 49576 -34791 -73279 3370 60876 14061
483A4061n8517P750N5156M2522l3289p8226M602Q5876K8130n6213m3086P002L6378
$$ 14061 -44456 -36706 18450 60972 27683 -50543 -45941 39935 68065 11852 -31234 -24232 12146
496A2146L3077k1758m5939J1293L3355j7409k1815K1692J6105j1966k1330j8670
$$ 12146 45223 23465 -22474 -11181 22174 4765 -17050 4642 20747 8781 -12549 -31219
508c1219J7171N0730l645o4348j5656N1196K8849j7015l1235j5179L1943L9592
$$ -31219 -14048 36682 33037 -31311 -46967 4229 33078 16063 -15172 -30351 1592 41184
520D1184l2245n1785K8471N9811o744n3515l3682K3718P1644K2423q1924o6344
$$ 41184 8939 -42846 -14375 45436 38692 -14823 -48505 -24787 46857 69280 -12644 -78988
532g8988M9380P6340L143n4482n2006Q629O9991K5804o2038m0783L6321L5621
$$ -78988 -29608 46732 49875 -4607 -56613 -47984 22007 47811 -14227 -55010 -18689 16932
544A6932n688k4732k1410J7874M6777n366n3952n783M3355K4303m333k4922l0841
$$ 16932 11244 -13488 -34898 -17024 29753 24387 -29565 -35348 8007 32310 27977 3055 -27786
557b7786J5903N2805P186l6717j7074J249J0134L2183R245l8415k3329J2721J2526
$$ -27786 -11883 40922 48108 11391 -5683 -4434 5700 37883 47128 8713 -14616 -1895 10631
570A0631J2038N765k9621k4711K1366J5209j6578n022M253m667L132l398k4876
$$ 10631 22669 28434 -1187 -25898 -4532 10677 -5901 -10923 -6670 -11337 -8205 -11603 -36479
583c6479N747M1307R43l8206j5858J0044K5463K9170j3955m7643r43M2570J5732
$$ -36479 -30732 10575 11518 -26688 -42546 -32502 -7039 22131 8176 -39467 -40410 2160 17892
596A7892r229r494j6218K404L0906O477j7892Q17J839j1533J2528K2123j0903
$$ 17892 8663 -831 -17049 -14645 16261 22738 4846 5663 7502 -4031 8497 30620 19717
609A9717j7014Kj16R295J8637j4530k5375J5546J7526k0494j3745J3697J5389
$$ 19717 2703 2705 2589 11884 30521 15991 -9384 6162 23688 3194 -10551 3146 18535
622A8535R051j9583m8293K1O8493L0697n3648n7038n43N0276N0843k3002p7430
$$ 18535 27586 8003 -40290 -40269 28224 58921 5273 -51765 -52308 -2032 48811 25809 -51621
635e1621j1199O7724K9148m0349l9310L816M3022L1620m0233n9294K6848P0518
$$ -51621 -62820 4904 34052 -6297 -45607 -41791 1231 32851 -7382 -66676 -39828 30690
647C0690K003n3563k8984K2624N4760J8948n6977m4278M8290O0026j4021m5126
$$ 30690 32693 -20870 -49854 -27230 27530 46478 -10499 -54777 -6487 53539 39518 -5608
659e608j8272K1532M4958R295m4991j8837L5662J3209k7450o881J7717J2686l899
$$ -5608 -23880 -2348 42610 51905 6914 -11923 23739 36948 9498 2617 20334 33020 29121
672B9121l2233k7975L2211M4974k4249m8705q36K5761R162j2322k8098N5M3407
$$ 29121 -3112 -31087 1124 46098 21849 -26856 -27692 -1931 7231 -5091 -33189 -33134 10273
685A0273P014n8323k6595M7131M4371q734m5982l3221L4031O6426q375o8243p776
$$ 10273 17287 -41036 -67631 -20500 23871 15137 -30845 -64066 -30035 36391 28016 -40227 -48003
698d8003N9548L4092k5178n0081j2705O1582N7816m0801p4047P782O1627K7928
$$ -48003 11545 45637 20459 -29622 -42327 19255 77071 36270 -37777 -29995 31632 59560
710E9560k7287m8535q017N5246K9580n3842m6683L0622M6804K512l5681m1301
$$ 59560 32273 -16262 -24279 30967 60547 6705 -39978 -9356 37448 39960 4279 -37022
722c7022M584N2737J4686m4552k0918K4806J3202j0058j4464q541K0956L0588
$$ -37022 -32438 20299 34985 -9567 -30485 -5679 7523 -2535 -16999 -25540 -4584 26004
734B6004j8250m1742N709K9464P834o96m499j4963O02R109q103O331K8904n364
$$ 26004 7754 -33988 -28279 1185 9019 8323 3824 -11139 -10537 -1428 -9531 -3200 25704 20340
748B0340l7625r420K0179K0128J1578j7303l2377Q022L3517n195k4951L383J4210
$$ 20340 -17285 -26705 -6526 13602 25180 7877 -24500 -16478 17039 11844 -13107 -9724 4486
761D486O366j619k0245j4095K8433K4509k2591k2058J1568J3565M195o497k2029
$$ 4486 10852 9233 -11012 -25107 3326 27835 5244 -16814 -5246 8319 12514 6017 -16012
774a6012K43L8693J4082l6267k5960O020J9211K7734O341l5557k7867J2807J7050
$$ -16012 -15769 22924 37006 739 -25221 -19201 10 27744 34085 -1472 -29339 -16532 518
787E18J0270J1320j2961k7542N25J3816K46P724R732j2867j1124J477q057K932
$$ 518 10788 22108 9147 -18395 -17870 -4054 -3808 3916 13648 781 -10343 -8866 -16923 -13991
801a3991L1206Q356l0236k1115M930J8860K6934k440m2258j3362L8242K2266j8171
$$ -13991 17215 25571 -4665 -25780 -20850 -1990 24944 22504 -19754 -33116 5126 27392 9221
814I221k4207j0747J7489L7852j632m5738j3197K7836J5048l611l756p732J991
$$ 9221 -14986 -25733 -8244 29608 27976 -17762 -30959 -3123 11925 8314 4558 -3174 -1183
827a183P912j8429j4814L4298L3745k0768l9680j5466J7042M2879K1910l5906
$$ -1183 6729 -11700 -26514 7784 41529 20761 -18919 -34385 -17343 25536 47446 11540
839A1540l7535J1492K0293J737N177L150q940n455j0102j1523K3395L2437j9277
$$ 11540 -25995 -14503 5790 7527 12704 15854 6914 1459 -8643 -20166 3229 35666 16389
852A6389m0103l54K5012J5569m267k9426j5877L4871K8432l0398l5772J0890K8182
$$ 16389 -23714 -24068 944 16513 12246 -17180 -33057 1814 30246 -152 -35924 -25034 3148
865C148J2970j1075k7961O25L5661J206m0337l739M3587K5608k1247m7491k3487
$$ 3148 16118 5043 -22918 -22293 13368 14574 -25763 -29502 14085 39693 18446 -29045 -52532
878e2532M7913O8682j3316p1779k4997L7014M0189O473l1629k7345K3115K8996
$$ -52532 -4619 64063 50747 -21032 -46029 -9015 31174 37647 6018 -21327 1788 30784
890C0784k5772l0804K0671L3568O16k8084l3091M252M8857J7746m4033k8436K3035
$$ 30784 5012 -25792 -5121 28447 29063 979 -32112 -27860 20997 38743 -5290 -33726 -10691
903a0691K4824j940j9269k0445J3752L6439m770l8165m424K3491O593l824k915
$$ -10691 14133 12193 -7076 -27521 -13769 22670 17900 -20265 -24689 -1198 5395 1571 -1344
916a344l004Q732L350k5583r175L8798K5495k5112l3035q003K0721L4912J845
$$ -1344 -4348 4384 7734 -17849 -27024 11774 37269 12157 -20878 -28881 -8160 26752 28597
929B8597l8276j2489K8840P461k0699o029J2310J7052O238k9221l2098K3707M6099
$$ 28597 -9679 -22168 6672 14133 -6566 -12595 -285 16767 23005 -6216 -38314 -14607 31492
942C1492m302l5850j4702J1048K4642R619k8498k1970K9807K9398j8936k9293
$$ 31492 27190 -8660 -23362 -12314 12328 21947 -6551 -28521 1286 30684 11748 -17545
954a7545m740J6631K8590O578l3738k1477K1321J8126p008l685q93l210P004j904
$$ -17545 -22285 -5654 22936 29514 -4224 -25701 -4380 13746 6738 3053 2160 -1050 5954 4050
968D050j7557M912K3323j008j5181l861o192o05J8084O248j4383l372K97p905
$$ 4050 -13507 -8595 14728 13720 -1461 -5322 -11514 -12119 5965 12213 -2170 -5542 -5245 -13150
982a3150O800J3862q144r799Q759K122o431K180m738l590K0160J1756k2499j6300
$$ -13150 -6350 7512 -632 -10431 -1672 450 -5981 -3801 -8539 -12129 8031 19787 -2712 -19012
996a9012R045J1346J1221O505j8137j5144J3619R030o473N183O840q994m846P96
$$ -19012 -9967 1379 12600 19105 968 -14176 -557 8473 2000 7183 14023 5029 183 979
1010I79n825P141J7386p216j7922K922K892m198P999O409r824m149Q59q193N772
$$ 979 -4846 2295 19681 12465 -5457 -2535 357 -3841 4158 10567 743 -3406 -2547 -10740 -4968
1025d968J6178r835j8440Q074J3592m18o487j4460p090K7438K4160k4461l2089
$$ -4968 11210 1375 -17065 -8991 4601 4183 -2304 -16764 -23854 3584 27744 3283 -28806
1038b8806N492K3196J7051j389k6843j3310K6680J6562k2419j3022J7468J6971
$$ -28806 -23314 -118 16933 15544 -11299 -24609 2071 18633 -3786 -16808 660 17631
1050A7631j239k1116k5193J6554M7574K408m5557k1688K0260K8705J1519k2558
$$ 17631 16392 -4724 -29917 -13363 34211 36619 -8938 -30626 -10366 18339 29858 7300
1062G300l0916J2332L4976n935k8619p90J6450R776k927j9639j0106K4422J5845
$$ 7300 -23616 -11284 23692 17757 -10862 -11652 4798 14574 11647 -7992 -18098 6324 22169
1075B2169k5052j6854J8090J5857m308j5296j6760R200L2462l73l3623p604K0354
$$ 22169 -2883 -19737 -1647 14210 9902 -5394 -22154 -12954 19508 19135 -14488 -22092 -1738
1088a738O895m543o356k873J1851Q492k3935j7690K9315K9943j5224l1099j1173
$$ -1738 5157 614 -5742 -8615 3236 11728 -12207 -29897 -582 29361 14137 -16962 -28135
1101b8135J7961L5170M836m1623j9880L2572K4779j4305k1329m595J7747K3596
$$ -28135 -10174 24996 29832 -11791 -31671 901 25680 11375 -9954 -14549 3198 26794
1113B6794j3352l7174M911L9809O623k7917j9360N775K7039J7097k7693l4153
$$ 26794 13442 -23732 -18821 20988 27611 -306 -19666 -13891 13148 30245 2552 -31601
1125c1601J8820L7700k316k6871j6047N797K5953J4088k5578k1080J8281J6459
$$ -31601 -12781 24919 22603 -4268 -20315 -14518 11435 25523 -55 -21135 -2854 13605
1137A3605j0705q905K672N637R809o292k2966L185K8070K218k1113o581L610O310
$$ 13605 2900 -6005 -3333 2304 12113 5821 -17145 -13960 14110 16328 -4785 -11366 -7756 -1446
1151a446J0440o730j5612Q451J2389j2792r420J1447P174l123l920j0707P22K1557
$$ -1446 8994 2264 -13348 -4897 7492 -5300 -14720 -3273 3901 778 -3142 -13849 -13127 8430
1165H430L736k2485n368J6748O856j953n376j0976O573K1011m118j9064L501J2397
$$ 8430 12166 -10319 -15687 1061 7917 5964 588 -10388 -3815 17196 13078 -5986 -2485 9912
1179I912l64q73l270p572J0014J1510j3634j3757J0361Q113k565r87q497j0108
$$ 9912 9548 8675 5405 -2167 7847 19357 5723 -8034 2327 10440 7875 6888 -1609 -11717
1193a1717J0569J1135j0747o802L686n007n86J0088m108j0239N687K964n581M178
$$ -11717 -1148 9987 -760 -7562 -3876 -8883 -9469 619 -3489 -13728 -8041 -5077 -10658 -6480
1207f480J886r037N833J1285q684q483Q079N501J689M374r179r563J5442J5199
$$ -6480 -4594 -13631 -7798 3487 -5197 -13680 -5601 -100 1589 5963 -3216 -12779 2663 17862
1221A7862j2502j0340N235N063P043K870j5915o633J9587P537j5918n708N923
$$ 17862 5360 -4980 255 5318 12361 15231 -684 -7317 12270 19807 3889 -1819 4104
1234D104L570M642m642j6244M422K0945n295k0649K0R431M945J896j1629j3248
$$ 4104 7674 12316 7674 -8570 -4148 16797 11502 -9147 -9127 304 5249 7145 -4484 -17732
1248a7732J2854J5831j3657j3771R277P625j711l562r652J492K0135J426k4911
$$ -17732 -4878 10953 -2704 -16475 -7198 427 -1284 -4846 -14498 -13006 7129 8555 -16356
1261a6356l696K0519Q788o316j0832q213J2381K1545j0184k4109P814K2419j33
$$ -16356 -20052 467 9255 2939 -7893 -16106 -3725 17820 7636 -16473 -8659 13760 13627
1274A3627j2174r493J604K1322J0235k5917j8204K2740K1454q855j8695j0070
$$ 13627 1453 -8040 -6436 14886 25121 -796 -19000 3740 25194 16339 -2356 -12426
1286a2426J0175K5533p49l2740q848K6980J2379j4831j5389m396J5145J8778j4998
$$ -12426 -2251 23282 22533 -10207 -19055 7925 20304 5473 -9916 -14312 833 19611 4613
1299D613k9627Q910K8986k57k0428j1835M209K1209J2003k4092k1754J9678K2296
$$ 4613 -25014 -16104 12882 12625 -7803 -19638 -15429 5780 17783 -6309 -28063 -8385 13911
1312A3911p874j4794l837O863J6420O00k3213l134K5535O540j8591q326O064J1651
$$ 13911 6037 -8757 -12594 -5731 10689 11289 -11924 -15058 10477 17017 -1574 -9900 -3836 7815
1326G815R159j2169k0766J0608K4027o176j9461n97Q068P930J773j5528r047J9556
$$ 7815 16974 4805 -15961 -5353 18674 12498 -6963 -7560 508 8438 10211 -5317 -14364 5192
1340E192J1552j9454j2979J1798J1559K286q695j8073M116K6597K398k4691o425
$$ 5192 16744 -2710 -15689 -3891 7668 9954 1259 -16814 -12698 13899 16297 -8394 -14819
1353a4819J3085Q898K314r447j3586R828J9586q735j8796N194J2855K110k919
$$ -14819 -1734 7164 9478 31 -13555 -3727 15859 7124 -11672 -6478 6377 8487 5568
1366E568j1597p336J6571J4019j6439j4377Q214P489K236m11j0901o054J4576
$$ 5568 -6029 -13365 3206 17225 786 -13591 -5377 2112 4348 3937 -6964 -13018 1558
1379A558O327j2705k627O093k600J379M564n994k088R142k861p654P487M512n989
$$ 1558 7885 -4820 -7447 -1354 -3954 -2575 1989 -4005 -6093 3049 188 -7466 21 4533 -1456
1394a456K288L684p372J029Q253k566k457O126n834p335J0267O757p217k053p2
$$ -1456 832 4516 -2856 -1827 6426 3860 1403 7529 1695 -5640 4627 11384 4167 2114 2042
1409B042m610N736P602r670n908Q866L07o933K613N22m429N498R55j0190J912
$$ 2042 -2568 3168 10770 1100 -4808 4058 4365 -2568 45 567 -3862 1636 2591 -7599 -5687
1424e687R060o574n543P361O31l610K748m156n048J0996N703j2221k515R078m43
$$ -5687 3373 -3201 -8744 -1383 -752 -4362 -1614 -5770 -10818 178 5881 -6340 -8855 223 -220
1439b20k617J783l220L276J1493p065j6516P942J6852l12p562p626m349J3675
$$ -220 -2837 -1054 -4274 -998 10495 3430 -13086 -5144 11708 11396 3834 -3792 -8141 5534
1453E534J3846j4331j6605J2228J4440m298j0469p553K555J9232M951k4372j1911
$$ 5534 19380 5049 -11556 672 15112 10814 345 -7208 -4653 14579 19530 -4842 -16753
1466a6753J8097J1876o577r817p513O005J7026n512k4002K585K2274L553j2982
$$ -16753 1344 13220 6643 -3174 -10687 -4682 12344 6832 -17170 -14585 7689 11242 -1740
1479a740j1402l521J4469J7053j2818k0211Q686J5447l931q031j785L053J1933
$$ -1740 -13142 -16663 -2194 14859 2041 -18170 -9484 5963 2032 -5999 -7784 -4731 7202
1492G202K714k0137o295K1450R415j3077p983K126P001R546p059j8089Q109K2863
$$ 7202 9916 -10221 -16516 4934 14349 1272 -6711 -4585 2416 11962 4903 -13186 -5077 17786
1506A7786m282j9164m484Q069J1920O176j5045j5091J4530J5658j3066j3566P410
$$ 17786 13504 -5660 -10144 -2075 9845 16021 976 -14115 415 16073 3007 -10559 -3149
1519c149J1223M918q582k1306r8K9268J0665k2995j6604N761J3492J0048o940
$$ -3149 8074 12992 4410 -16896 -16994 12274 22939 -56 -16660 -10899 2593 12641 5701
1532E701j9764K984K1822j875j9777j420J1526P918N88j2789j2814J3748J7572
$$ 5701 -14063 -11079 10743 8868 -10909 -12329 -803 7115 7703 -5086 -17900 -4152 13420
1545A3420j0465j5247N598R676K803k777j3226l905J9720J0656j6284j0321N903
$$ 13420 2955 -12292 -6694 2982 5785 3008 -10218 -14123 5597 16253 -31 -10352 -4449
1558d449M021M119K856o784j627Q085n451j0942R848J3760l533q384o802m193
$$ -4449 -428 3691 6547 -237 -1864 6221 770 -10172 -324 13436 9903 1519 -5283 -9476
1572i476J2251J4406j0259j3188N035N396l563J433j07l111O760J070j3558j895
$$ -9476 2775 17181 6922 -6266 -1231 4165 602 2035 1928 -1183 5577 6647 -6911 -8806
1586h806J3122J412o905n58k748K28Q400l368j2411M595J2305k286o047k364o859
$$ -8806 4316 5728 -1177 -1735 -4483 -4255 4145 777 -11634 -7039 5266 2980 -3067 -5431 -12290
1601a2290L976J5131m12j0949j127n46k070R648P088p594l712K577m912P55J0826
$$ -12290 -8314 6817 6405 -4544 -5671 -6217 -8287 1361 8449 855 -2857 -280 -5192 -4437 6389
1616F389O97m874K174m430p955Q757J1265l447n012l010n341N160J2145n612j1721
$$ 6389 7086 2212 4386 -44 -7999 758 12023 8576 3564 554 -4787 373 12518 6906 -4815
1631d815M768O317l374r07l545n402Q908R249j0632q937N607J331j899L551j088
$$ -4815 -47 6270 2896 1989 -1556 -6958 1950 11199 567 -8370 -2763 -1432 -3331 220 -868
1646h68k222N912m025j4215M941J7741J627r963p727n367P486J6376k177j4725
$$ -868 -3090 2822 -1203 -15418 -10477 7264 8891 -1072 -8799 -14166 -6680 9696 7519 -7206
1660g206K261P082m482k072M254K488N570m8j5514n134J8624R644j1097q349J21
$$ -7206 -4945 2137 -2345 -4417 -163 2325 7895 7847 -7667 -12801 5823 15467 4370 -3979 -3858
1675c858N506R653l429j7537K115K0309J598j5552p559K365R697J0438q479j6343
$$ -3858 1648 11301 7872 -9665 -7550 12759 14357 -1195 -8754 -6389 3308 13746 5267 -11076
1689a1076P018J3470p713j0985M598Q993O523m444k0389o336K3929J5967j4230
$$ -11076 -4058 9412 1699 -9286 -4688 4305 10828 6384 -14005 -20341 3588 19555 5325
1702E325j5785q89P348J1266K33j4849j100J6639o83j6444j540J0566P875J563
$$ 5325 -10460 -11349 -4001 7265 7498 -7351 -8451 8188 7505 -8939 -10479 87 7962 9525
1716I525j1117j3765J0905J7566p798j5299M103R981L628m376j3409m322J9995
$$ 9525 -1592 -15357 -4452 13114 5316 -9983 -5880 4101 7729 3353 -10056 -14378 5617
1729E617J2151j5870j3207M606P660M383J0q868L40J2349l791j6470L137J6543
$$ 5617 17768 1898 -11309 -6703 957 5340 5350 -3518 -3178 9171 5380 -11090 -7953 8590
1743H590M910o312j1733q827J1853J8651o787j6698J959Q474K95j729m980l226
$$ 8590 13500 7188 -4545 -13372 -1519 17132 10345 -6353 -4394 4080 4375 2646 -2334 -5560
1757e560J1038N980j4825q840J0860O755l407l463n066P12J0249k116j4964K340
$$ -5560 5478 11458 -3367 -12207 -1347 5408 2001 -1462 -6528 -5816 4433 2317 -12647 -10307
1771a0307J5197J526q157o835m591P407J5031l147j3938J208O128j910R36L487
$$ -10307 4890 6416 -1741 -8576 -13167 -5760 9271 6124 -7814 -6606 -478 -2388 -1452 2035
1785B035j501L197K131j0996m032J3442P603o132m203l484k205R947N306q995
$$ 2035 534 3731 5862 -5134 -9166 4276 11879 5747 1544 -1940 -4145 5802 11108 2113
1799B113l354O345j514k584K982k846l283P075J242p959J09K747m373J561O076
$$ 2113 -1241 5104 3590 1006 3988 1142 -2141 4934 6176 -1783 -1674 1073 -3300 -1739 4337
1814D337m307m098L519l537m062O750L764m065L15k090q527M356J2012j037o156
$$ 4337 30 -4068 -549 -4086 -8148 -1398 2366 -1699 -1384 -3474 -12001 -7645 4367 3330 -2826
1829b826j182m614J329J1070J132q132O26L950m154J107M914j307J231L429p057
$$ -2826 -4008 -8622 -7293 3777 4909 -3223 -2597 1353 -2801 -1694 3220 1913 3144 6573 -484
1844d84m649J0354M382o946j375J745p87M655M78j0696m40J2764O90q885k869
$$ -484 -5133 5221 9603 2657 1282 3027 2240 6895 7373 -3323 -3763 9001 9691 806 -2063
1859b063J21J024O673j330r959K933Q048p216p783N272N962K343j357j2941o594
$$ -2063 -1942 -918 5755 4425 -5534 -2601 5447 -1769 -9552 -4280 1682 4025 2668 -10273 -16867
1874a6867J5851J2311j0284j0404Q51M356P666J142j1428k047J4937J693j2657
$$ -16867 -1016 11295 1011 -9393 -8542 -4186 3480 4622 -6806 -8853 6084 7777 -4880
1887d880k889P164O200L549p103j2113O518J6767m883j3651M26P931N140K57j1026
$$ -4880 -7769 -605 5595 9144 2041 -10072 -3554 13213 8330 -5321 -4895 3036 8176 8433 -2593
1902b593q663J2864J3017r988j1497K791N037L623p00q122j319J2544M31j5031
$$ -2593 -11256 1608 14625 4637 -6860 -4069 968 4591 3891 -4231 -5550 6994 7425 -7606
1916g606j749J1327N766j949p868r592O957J6041m242j4775J462R053J379k278
$$ -7606 -9355 1972 7738 5789 -2079 -11671 -4714 11327 7085 -7690 -6228 2825 4204 1926
1930A926n907l747J1483P637j3614j0234R282R277j521n532o992P69J3951J525
$$ 1926 -3981 -7728 3755 11392 -2222 -12456 -3174 6103 4582 -950 -7942 -7173 6778 8303
1944H303j6008m139J2842N943m280o356o324N576J3245k675j4351K093J0186R0
$$ 8303 -7705 -11844 998 6941 2661 -3695 -10019 -4443 8802 6127 -8224 -6131 4055 4145
1958D145l686k704j845P359P443j0373r481R056R058l185m540l590j139Q832L897
$$ 4145 459 -2245 -4090 3269 10712 339 -9142 -86 8972 5787 1247 -2343 -3482 5350 9247
1973I247j0632l493R239J184n784m37j117R94P032k464j0589K030R034k721m305
$$ 9247 -1385 -4878 4361 5545 -239 -676 -1793 -799 6233 3769 -6820 -4790 4244 1523 -2782
1988b782J239j925K103N015n844o874O790O216n292k654J002k091M593M193p182
$$ -2782 -1543 -3468 -1365 3650 -2194 -9068 -2278 3938 -1354 -4008 -3006 -5097 -504 3689 -3493
2003c493l876Q484J117m443M62O82j484N240K096q281j61P560J8k873J794k795
$$ -3493 -7369 1115 2232 -2211 -1749 -1067 -2551 2689 4785 -3496 -3657 3903 3921 1048 2842 47
2019D7j183P135J5p079J141M921k128J65J195n577M75P708j697p093J281J898
$$ 47 -1136 5999 6014 -1065 76 4997 2869 3034 4229 -1348 -873 6835 5138 -1955 -674 1224
2035A224j113L053r08p061K163O392l857n227L141L80j39K912m152o148O862O063
$$ 1224 111 3164 2256 -4805 -2642 3750 -107 -5334 -2193 -1813 -1952 960 -3192 -9340 -2478 3585
2051C585o585l158L012M78K016K649o458k277Q906K335p833P3M245P98K070r19
$$ 3585 -3000 -6158 -3146 -2668 -652 1997 -4461 -6738 2168 4503 -3330 -3257 988 1786 3856 2937
2067B937p269L482J0357m216r047K743N540J108J71n892n637Q844Q427q939q325
$$ 2937 -4332 -850 9507 5291 -3756 -1013 4527 5635 5806 -86 -5723 3121 11548 2609 -5716
2082e716N049M765N32j236p600j476J1580K170j2991l750Q696M141q29n562p863
$$ -5716 -667 4098 4630 3394 -4206 -5682 5898 8068 -4923 -8673 23 4164 3335 -2227 -10090
2097a0090M385J3490k573j3795J30Q407L114j039n830n686Q269R679q478r879
$$ -10090 -5705 7785 5212 -8583 -8453 -46 3068 2029 -3801 -9487 -1218 8461 -17 -9896
2111i896N894P659k99l009n959p83J1580L740j2507n269R739N305k443l971n615
$$ -9896 -4002 3657 3358 349 -5610 -6393 5187 8927 -3580 -8849 890 6195 3752 -219 -5834
2126e834L347J1158j849j2815J697R638L78m285l053j983P055P281r904j0112
$$ -5834 -2487 8671 6822 -5993 -4296 5342 5720 1435 -1618 -3601 3454 10735 831 -9281
2140i281Q102R958l227n892m077L03R610L636j2573n700J0566M899n425m222k334
$$ -9281 -1179 8779 5552 -340 -4417 -4114 5496 9132 -3441 -9141 1425 6324 899 -3323 -5657
2155e657L054Q830k626j2818J292J1746L23p012l166l31N934P035o990j0731O158
$$ -5657 -2603 6227 3601 -9217 -7925 3821 4144 -2868 -6034 -6365 -431 6604 -386 -11117 -4959
2170d959R833k051n196j354o49N769M902p786m986Q722M170o171j642J039J105
$$ -4959 4874 2823 -2373 -3727 -4376 1393 6295 -1491 -6477 2245 6415 244 -1398 -359 746
2185G46N350O2r564k6R115N10n243j12k55L67N038k405p117L021O639m131l940
$$ 746 6096 6158 -3406 -3432 5683 6193 950 838 583 950 5988 3583 -3534 -513 6126 1995 -1945
2202a945J451l75R39L585m820n076N944L755n949j812K177n10K837J912p160k463
$$ -1945 -494 -869 70 3655 -1165 -6241 -297 3458 -2491 -4303 -2126 -2636 201 2113 -5047 -7510
2218g510P430K053m279L06l99j543M891J472o585L39O999j424l496J302j370P70
$$ -7510 -80 1973 -2306 -2000 -2399 -3942 949 2421 -4164 -3825 3174 1750 -1746 -444 -1814 -1044
2234a044O414j220q198K066N641j485k26L10l684J654O323m000o329L991M264
$$ -1044 5370 4150 -4048 -1982 3659 2174 1948 2258 -1426 228 6551 2551 -3778 213 4477
2249D477j598k86k476m447N273N922n631n186M341R34j270J269l101k003O508
$$ 4477 2879 2593 117 -4330 943 6865 1234 -3952 389 1323 53 1322 -1779 -3782 2726
2264B726J620r116j177O575J009j328q67m532P58Q039j917q523K330O652r68k108
$$ 2726 4346 -4770 -5947 628 1637 309 -558 -5090 -4332 3707 1790 -6733 -4403 2249 1281 -827
2280h27k418k888N722P421o543p902N665N259k160j654j473q9P189J706j1162
$$ -827 -3245 -6133 -411 7010 467 -7435 -1770 3489 1329 -325 -1798 -1887 5302 7008 -4154
2295d154k913J0457N012l996m883m383K408J0048k59j1182qQ022J31l627k509
$$ -4154 -7067 3390 8402 4406 -477 -4860 -2452 7596 7337 -3845 -3853 4169 4300 673 -1836
2310a836j430N230O525p738r766O024Q752k281m308k982m46P511L315j0228n612
$$ -1836 -3266 1964 8489 751 -9015 -2991 5761 3480 -828 -3810 -4256 3255 6570 -3658 -9270
2325i270R790N814m516m705k913J842Q487J88r615o33Q515j089n778r0J775M453
$$ -9270 520 6334 1818 -2887 -5800 -3958 4529 4717 -4898 -5531 2984 1895 -3883 -3973 -2198 2255
2341B255L761p760r631P127J1544k399p098k650K37N741M890o868n129Q289M193
$$ 2255 6016 -1744 -11375 -4248 7296 4897 -2201 -4851 -4614 1127 6017 -851 -5980 2309 6502
2356F502o485l350K409K730N117j193r983l28J1131J075p731j893K141L430M195
$$ 6502 17 -3333 -924 1806 6923 5730 -4253 -4581 6550 7625 -106 -1999 142 3572 7767
2371G767m947j0074M357J0451j707o615j801j160K639M640m055n114N527K499
$$ 7767 2820 -7254 -2897 7554 5847 -768 -2569 -3729 -1090 3550 -505 -5619 -92 2407
2385B407p185k948M621K899K443j083r195k296J0193M539n539j747J46n37L942
$$ 2407 -4778 -7726 -3105 -206 2237 1154 -8041 -10337 -144 4395 -1144 -2891 -2745 -3282 660
2400F60J629n681J999O621k966n039K437J724J219K560k448n182M563M915n461
$$ 660 2289 -3392 -1393 5228 2262 -2777 -340 1384 2603 5163 2715 -2467 2096 7011 1550
2415A550l518L769J302J724R93p048m533P501N221m376k845k16l088K840L700
$$ 1550 -1968 1801 3103 4827 5820 -1228 -5761 1740 6961 2585 -260 -476 -3564 -724 2976
2430B976l679j122M754k439o150J517L345R56L407k765q411Q59Q140P48l224J94
$$ 2976 -703 -1825 2929 490 -5660 -4143 -798 158 3565 800 -7611 -6752 1388 2136 -1088 -894
2446h94k835K32N326j232n829L196N459k835j939J00k010K694N627l816m532M501
$$ -894 -3729 -3497 1829 597 -5232 -2036 3423 588 -1351 -1251 -3261 -567 5060 1244 -3288 1213
2462A213J721l883M15J937j36L997J80q553j784Q279L404k980j440l600j607O141
$$ 1213 2934 -949 -534 1403 1267 5264 5444 -3109 -4893 3386 6790 3810 2370 -1230 -2837 3304
2478C304J390n853J403M333l739m223J641O90K630L770o331p064M928O315l028
$$ 3304 4694 -1159 244 4577 838 -3385 -1744 -1054 1576 5346 -985 -8049 -3121 3194 166
2493A66k948Q5m12L952J990q324l049R543M368n089l572j119Q49O608J457p242
$$ 166 -2782 -2697 -3109 843 2833 -5491 -8540 1003 5371 282 -3290 -4409 -3560 3048 4505 -2737
2509b737j003P816j306n622K6K291M196L923o495j0166N054J0569l52n501k573
$$ -2737 -3740 4076 2770 -2852 -2826 -535 3661 7584 1089 -9077 -4023 6546 6194 693 -1880
2524a880j186L757M574n058n008O657M338n891l609J298J733M693R15q703j328
$$ -1880 -3066 691 5265 207 -4801 1856 6194 303 -3306 -2008 -275 4418 5333 -3370 -4698
2539d698Q026J154o095n91K747K072K486m364q470L905J0190j583o529j102j29
$$ -4698 3328 4482 -1613 -2204 543 2615 5101 737 -7733 -3828 6362 4779 -1750 -2852 -2981
2554b981J619L396k780m485O285L046q149l540M838M106K147k078r076j128J0286
$$ -2981 -1362 2034 -746 -5231 1054 4100 -4049 -7589 -2751 1355 3502 1424 -7652 -8780 1506
2569A506M151o698k910K480J283L210j321o488K407Q868j495o862J62K762J368
$$ 1506 5657 -1041 -3951 -1471 -188 3022 1701 -4787 -2380 6488 4993 -1869 -1707 1055 2423
2584B423K881k459o046M487O009n582n108L668K915J894J14p490m995Q212N711
$$ 2423 5304 2845 -3201 1286 7295 1713 -3395 273 3188 5082 5196 -2294 -7289 923 6634
2599F634m513l096j97j856J822K922l373n65M699k094o612J871M172Q27Q58j934
$$ 6634 2121 -975 -1172 -3028 -1206 1716 -1657 -2222 2477 383 -6229 -4358 -186 641 1499 -435
2615d35o437K783P181k487m572K511J080q22K072j557l908M782M428m764k271
$$ -435 -6872 -4089 3092 605 -3967 -1456 -376 -1198 874 -683 -4591 191 4619 -145 -2416
2630b416L280m20m73K340k249o86N478k71p370n5N329J351J277j872p358M53Q369
$$ -2416 864 444 -29 2311 62 -624 4854 4583 -2787 -2842 2487 3838 5115 3243 -4115 -3662 4707
2647D707J129m989o54J1j259L248M2m616K339N078m762m778K224J884J559J989
$$ 4707 5836 847 193 204 -1055 2193 2235 -2381 -42 5036 274 -4504 -2280 -396 1163 3152
2663C152m753n704N213N744m295l200J122j03K726K437n830l639P001K934l744
$$ 3152 -1601 -7305 -2092 3652 -643 -3843 -2721 -2824 -98 2339 -3491 -7130 -129 2805 -939
2678i39o70L29j386L136J892m608N11O184k198n276J943K222J364L177l323p175
$$ -939 -1609 -1280 -2666 470 2362 -2246 -1735 4449 2251 -3025 -1082 1140 2504 5681 2358 -4817
2694d817L318P217k245l173R34j136R58K520l480k740N945K418o663k218L175
$$ -4817 -1499 5718 3473 300 1234 98 1056 3576 96 -2644 3301 5719 -944 -3162 13
2709A3O62K504n84o341q24Q071m2o973j25K989J131J921k623o537K982Q062k455
$$ 13 675 3179 2595 -3746 -4570 3501 3459 -3514 -3639 -650 481 2402 -221 -6758 -3776 4286 1831
2726A831n848J226J426R78K400l858m049O489M902o390m634L328K832K434P26
$$ 1831 -4017 -2791 -1365 -387 2013 -1845 -5894 595 5497 -893 -5527 -2199 633 3067 3793
2741C793o950k650Q124L410o171j785L064N47J461o10n470J741Q094j759p357
$$ 3793 -3157 -5807 2317 5727 -444 -2229 835 1382 2843 2233 -3237 -1496 6598 4839 -2518
2756b518P37L273P03J766k482n248M290N455m662m917K910K682k11M62m239l408
$$ -2518 -1781 1492 2195 3961 1479 -3769 521 5976 1314 -3603 -693 1989 1778 2240 -1999 -5407
2772e407O550L566o119k671L553O76l86K35m331m0P481p55p543K59M593Q46K55
$$ -5407 1143 4709 -1410 -4081 -528 148 -238 -3 -4334 -4374 3107 2352 -5191 -4932 -339 507 762
2789G62j608m550K738O459l003n578L162L295p21N58k682k830N580M540n433l809
$$ 762 -846 -5396 -2658 3801 798 -4780 -1618 1677 956 1514 -1168 -3998 1582 6122 689 -3120
2805c120M424J198r8Q61l355j773O383R31p012j55M432jm57k21m414L07O630j698
$$ -3120 1304 2502 2404 3265 -90 -1863 4520 5451 -1561 -1716 2716 2715 2258 2037 -2377 -2070 4560 2862
2823B862o050J975K528j790P20r72l489L226M523m345m300L640J902j186J085
$$ 2862 -3188 -1213 1315 -475 245 -727 -4216 -990 3533 -812 -5112 -1472 430 -756 329
2838C29k546k992N499K771n502k076L944J141l56Q40l792j321O477J204n631K
$$ 329 -2217 -5209 290 3061 -2441 -4517 -573 568 212 1052 -2740 -4061 2416 3620 -2011 -2009
2854b009L374j022J351pm308J622N907k438n247K290K794o33J321j521m946L708
$$ -2009 1365 343 1694 1687 -2621 -999 4908 2470 -2777 -487 2307 1674 2995 1474 -3472 236
2870B36N625m278m049L227P33n45J745k763k992M937K100n617j021L964p53m77
$$ 236 5861 1583 -2466 761 1494 949 2694 -69 -3061 1876 3976 -1641 -2662 1302 549 72
2886G2J027m258l8N836l9o709P74L593r61J082r85m511K574N822l367m983L524
$$ 72 1099 -3159 -3197 2639 2600 -4109 -3335 258 -703 379 -606 -5117 -2543 3279 -88 -5071 -1547
2903a547K159j406J295k193k799N268L965n910l449M624K258K5n9m428r80P024
$$ -1547 612 -794 501 -1692 -4491 777 4742 -1168 -4617 7 2265 2290 2231 -2197 -3177 3847
2919C847J998o929j049M266R6N93o37m261R30P008k321o471J462L762l11L84k104
$$ 3847 5845 -1084 -2133 2133 2229 2822 2185 -2076 -1146 5862 3541 -2930 -1468 2294 1983 2367 263
2936B63m422L850N567m485m862K676K063m40J276k697l612M912K972n115j936
$$ 263 -4159 -309 5258 773 -4089 -1413 650 210 1486 -1211 -4823 89 3061 -2054 -3990
2951c990L946J22j064O35k727j90N974j007o512J325M475q31k37J54l678K187
$$ -3990 -44 78 -986 -351 -3078 -3268 2706 1699 -4813 -3488 987 156 -81 73 -3605 -1418
2967a418N571l491m761L783L152k379k24p00j338M436K975o165k942N446K354
$$ -1418 4153 662 -4099 -316 2836 457 233 -467 -1805 2631 5606 -559 -3501 1945 4299
2982D299k110q20k421j73O226P73p674j176N507O62j634q75l241J217N639k021
$$ 4299 2189 1369 -1052 -1225 5001 5774 -1900 -3076 2431 3093 1459 584 -2657 -1440 4199 2178
2998B178o505J398M574j368o74j529l230K995O118m841n207L479K285m99R72k003
$$ 2178 -4327 -2929 1645 277 -397 -1926 -5156 -2161 3957 -884 -6091 -2612 -327 -826 146 -1857
3014a857k963M259L509m814k153M404N86q12J077k359j028N075O51n319Q92L959
$$ -1857 -4820 -561 2948 -1866 -4019 385 971 159 1236 -1123 -2151 2924 3575 -1744 -852 3107
3030C107j589m61R55k393P50M420k615m439K857K778k399k02J06k013K188L090
$$ 3107 1518 1057 2012 -381 369 4789 2174 -2265 592 3370 971 769 875 -1138 1050 4140
3046D140n084l032N552J183k758n75j197r95N025Q28o374q96N797m85k393J9j969
$$ 4140 -944 -3976 1576 2759 1 -574 -1771 -2766 2259 3087 -3287 -4183 1614 1129 -1264 -1245 -3214
3063c214R95N365k054o992K257N425q39j057j010l285K723N828l297n275L027
$$ -3214 -2219 3146 1092 -5900 -3643 1782 943 -114 -1124 -4409 -1686 4142 845 -4430 -1403
3078a403K996j613O86j334k400M283M143n476l425M181J790o31O11k408k251N640
$$ -1403 1593 -20 666 -668 -3068 1215 5358 -118 -3543 638 2428 1797 2408 0 -2251 3389
3094C389J341n722k16L673n81l83N13l473l0M860q22m883K011K360k919k80O54
$$ 3389 4730 -992 -1208 2465 1884 1501 2014 -1459 -1489 3371 2549 -2334 -323 2037 -882 -1162 -508
3111e08j657J928L204m754l795M829K219j934lj166k096L309K407m923n15N070
$$ -508 -2165 -237 2967 -1787 -5582 -753 1466 -468 -471 -1637 -3733 -424 1983 -2940 -3455 1615
3127A615m42l325R46n53K21M935j399o685J884N845j496j557mk147K582N002m065
$$ 1615 1173 -2152 -1206 -1759 -1538 3397 1998 -4687 -2803 3042 1546 -11 -15 -2162 420 5422 1357
3144A357n644L659M211j291n11k183k040L403L968m601k840M813N67k703j14r32
$$ 1357 -4287 -628 3583 2292 1781 -402 -2442 961 4929 328 -2512 2301 2868 165 51 -881
3160h81k47N180N29p292j608N105J301q85j85l734n08N029p2m970J554K941k368
$$ -881 -1128 4052 4581 -2711 -4319 786 2087 1202 1017 -2717 -3225 1804 1732 -3238 -1684 1257 -1111
3177a111q87J001k147J765L864l468l961M199K163k716N8J6j225L815J973n696
$$ -1111 -1998 -997 -3144 -1379 2485 -983 -4944 -745 1418 -1298 -1240 -1224 -2449 1366 3339 -2357
3193b357j943N375J497k257P46r56j584L860N17m476J533N004k833l021P06Q2
$$ -2357 -4300 1075 2572 315 1061 105 -1479 2381 2898 -1578 -45 4959 2126 -895 -189 -107
3209a07K166M003l933o153L080M320j621p03n52k567J961L438m183l271M944J572
$$ -107 2059 6062 2129 -4024 -944 3376 1755 1052 500 -2067 -106 3332 -851 -4122 822 2394
3225B394l105n39n93j212M146J393n938n19N060n49k858M40m47O65M556j183p069
$$ 2394 -711 -1250 -1843 -3055 1091 2484 -3454 -3973 1087 538 -2320 -1880 -2327 -1662 2894 1711 -5358
3242e358J659M955n17l82M7k743N26M244k110l027L691K576l457j031P90o73L783
$$ -5358 -3699 1256 739 357 404 -2339 -1813 2431 321 -2706 985 3561 104 -927 -137 -810 2973
3259B973K127n696k569M759J348j607J53q68j310L558M23n662Q00M922j130k220
$$ 2973 5100 -596 -3165 1594 2942 1335 1488 620 -690 2868 3291 -2371 -1571 3351 2221 1
3275AK2j412m2L930j138m590K871L224l618j781J129m06K098K970n282m350N014
$$ 1 23 -1389 -1431 2499 1361 -3229 -358 2866 -752 -2533 -1404 -1810 288 3258 -2024 -6374 -1360
3292a360K779j870j31n32k308K841J934m243m21N695n01l429K24J28M80L950o53
$$ -1360 1419 -451 -582 -1114 -3422 -581 1353 -2890 -3311 2384 1883 -1546 -1322 -1194 -714 3236 2583
3309B583n601J733M618j751j950J028m93J077L520l965m265L643M032k064j199
$$ 2583 -3018 -1285 3333 1582 -368 660 167 1244 4764 799 -3466 177 4209 2145 946
3324I46k82j977J867K928l771j664M785J38m464j7O38K51L702l55o376q53N559
$$ 946 664 -1313 554 3482 -289 -1953 2832 2970 -1494 -1511 -873 -622 3080 2725 -3651 -4504 1055
3341A055J12j871M27j800l95L535o62m406J983M091k197j742R67j612J314L751
$$ 1055 1167 -704 -277 -2077 -2472 1063 401 -4005 -2022 2069 -128 -1870 -903 -2515 -1201 2550
3357B550k911l036L940J529l160l84J100j06K625J739n684j267M932J339k181
$$ 2550 -361 -3397 543 2072 -1088 -1472 -372 -478 2147 3886 -1798 -3065 1867 3206 1025
3372A025N47q03j961K845P90l336J877L627l014l469J642Q60M92K732k994m606
$$ 1025 1572 769 -1192 1653 2443 -893 984 4611 1597 -1872 -230 630 1122 3854 860 -3746
3388c746L205L619k896j012O54j191J196K274l988k473M692J718l268o59K15p10
$$ -3746 -541 3078 182 -830 -176 -1367 -171 2103 -1885 -4358 334 2052 -1216 -1875 -1660 -2370
3404b370K609J025m661K00N030o85l954K34Q44Q86M130j665o018J079N235k87
$$ -2370 239 1264 -3397 -3197 1833 1148 -2806 -2572 -1728 -842 3288 1623 -4395 -3316 1919 1632
3420A632p31p2j850L80L266j650k979L652K289l594j025J123o03K582K285m642
$$ 1632 901 829 -1021 -641 2625 975 -2004 1648 3937 343 -682 441 -162 2420 4705 63
3436F3k794M387J341k678L70L3j455K437O95m456J95L889j114k175J389r35j057
$$ 63 -2731 1656 2997 319 689 722 -733 1704 2399 -2057 -1862 2027 913 -1262 127 -808 -1865
3453a865K438j049k992L160L159m228k529K495O2J552K003l735l346M432K258
$$ -1865 573 -476 -3468 -308 2851 -1377 -3906 -1411 -1349 203 2206 -1529 -4875 -443 1815
3468A815l037nJ064j239J749P64l557N58N456o00m588r6J442R78K917j191n296
$$ 1815 -1222 -1227 -163 -1402 347 1111 -2446 -1888 3568 2968 -1620 -1716 -274 704 3621 2430 -2866
3485b866J576N275j345l333R49j94J268K517k550m558L440L497k301j521O08j435
$$ -2866 -1290 3985 2640 -693 256 62 1330 3847 1297 -3261 179 3676 1375 -146 462 -973
3501i73J374J974l227k179M492Q35l742m67N28l31K544J190m738j028M205r7k536
$$ -973 401 2375 -852 -3031 1461 2296 -1446 -1913 -1385 -1716 828 2018 -2720 -3748 457 360 -2176
3518b176J354n6j152K079m73l277K614L303k945j835K409k85k1K496k157k387
$$ -2176 -822 -878 -2030 49 -424 -3701 -1087 2216 -729 -2564 -155 -440 -461 2035 -122 -2509
3534b509L779J501l508l76K367m19J021R38l855l55M297L36l876P41J510j069
$$ -2509 1270 2771 -737 -1113 1254 835 1856 2794 -1061 -1416 2881 3217 -659 82 1592 523
3550E23J291j49l973J942M437k172m056J129P17Q71K257k478m338K870L752k929
$$ 523 1814 1665 -2308 -366 4071 1899 -2157 -1028 -311 560 2817 339 -3999 -1129 2623 -306
3566c06j802J187r1N91J853k886k718M226J792l317o25Q89p54K175J238l689m59
$$ -306 -2108 -921 -1012 -421 1432 -1454 -4172 54 1846 -1471 -2096 -1207 -1961 214 1452 -2237 -2696
3583b696L992l08k660J248J89l95K100K57m210J140L775j330j244J598p98p80
$$ -2696 1296 988 -1672 -424 -235 -630 1470 1727 -2483 -1343 2432 1102 -142 1456 658 -122
3599a22K713j473k388L235J309l444k05K109j217Q36J710l413j241L902O5l432
$$ -122 2591 1118 -1270 1965 3274 -170 -375 1734 517 1353 3063 -350 -1591 2311 2376 -1056
3615a056L24J551n52Q61l73l516L22M587j496l286J211O01m97K205j593l434K871
$$ -1056 -732 819 267 1128 755 -2761 -2439 2148 652 -2634 -1423 -822 -1319 886 -707 -4141 -1270
3632a270L654k937k678J722M70Q44K459l464k900M124K325k654q22R23l92J684
$$ -1270 2384 -553 -3231 -1509 -1039 -195 2264 -1200 -4100 24 2349 -305 -1127 -204 -596 1088
3648A088J511l537j141M593M00l429N12O55k54K187M1m224O19M438j360k567J148
$$ 1088 2599 -938 -2079 2514 2914 -515 -3 652 398 2585 2626 -1598 -979 3459 2099 -468 680
3665F80n56L83K286j935l308K734K514k754j627J741n51J76J277k431j475L726
$$ 680 124 507 2793 858 -2450 284 2798 44 -1583 158 -393 -217 1060 -1371 -2846 880
3681H80Q28m223K8J829j03J053J60l301j19M654q84l453J091J414q37J666r68
$$ 880 1708 -2515 -2487 -658 -761 292 452 -2849 -2968 1686 802 -2651 -1560 -146 -983 683 -285
3698b85k804K806L848l361k741K305J140J95J272k339k233L784K418m155q61J969
$$ -285 -3089 -283 3565 204 -2537 -232 908 1103 2375 36 -2197 1587 4005 -150 -1011 958
3714I58r5R31Q81l351j017M436J51l844M57J805q10R17k63l245Q86M036j962l419
$$ 958 863 1794 2675 -676 -1693 2743 2894 -950 -493 1312 502 1419 1156 -2089 -1203 2833 871 -2548
3732b548J488P91k35J588j583k756K023K601k596j090J727J29n92J275k089j200
$$ -2548 -1060 -269 -504 1084 -499 -3255 -1232 1369 -1227 -2317 -590 -461 -1053 222 -1867 -3067
3748c067L702J002l462j34K213n69N08J001l259L63M121n07l512J399J727j196
$$ -3067 635 1637 -1825 -1959 254 -315 193 1194 -2065 -1702 2419 1912 -1600 -201 1526 330
3764C30J259r1k667J193L232k485j970K430J86j041J441j328k148K912K376l636
$$ 330 1589 1498 -1169 24 3256 771 -1199 1231 1417 376 1817 489 -1659 1253 3629 -7
3780gj056J663k5m0J392k488j504L487J82l391N82J327p88N81M12k565K06L460
$$ -7 -1063 600 575 535 1927 -561 -2065 1422 1604 -1787 -1205 122 -666 -85 327 -2238 -2032 1428
3798A428j248k787J649Q94j176J243k59k694J705L229k912j416J923J94q3J805
$$ 1428 180 -2607 -958 -64 -1240 3 -256 -2950 -1245 1984 -928 -2344 -421 -227 -310 1495
3814A495j848k064L204K133l408m07J851j65QJ417k691r24M506j06l722P21J224
$$ 1495 -353 -2417 787 2920 -488 -895 956 791 799 2216 -475 -1399 3107 3001 -721 0 1224
3831A224m68J014o7l117Q00L844j572k859J132O99m70J301j185l245K497K868
$$ 1224 756 1770 1703 -1414 -614 3230 1658 -1201 -69 630 160 1461 276 -2969 -472 2396
3847B396k680j598J722m39j10J329k329j714L808R48l563k9J471nM26R45k897
$$ 2396 -284 -1882 -160 -599 -709 620 -1709 -3423 385 1333 -2230 -2259 -788 -793 -367 578 -2319
3864b319j75M209q42l250J499J539q99J064l70k514J856L473k662k505K750P98
$$ -2319 -2494 1715 873 -2377 -878 661 -238 826 456 -2058 -202 3271 609 -1896 854 1652
3880A652j015R90j559j222L520J541m429j002K899L03N6K11k628p09L781N2m001
$$ 1652 637 1627 68 -1154 2366 3907 -522 -1524 1375 1678 1734 1945 -683 -1392 2389 2441 -1560
3897a560N91K317n03o80M5k613J092M124k212l804J351K141j029J034j022k855
$$ -1560 -969 1348 845 165 210 -2403 -1311 2813 601 -3203 -1852 289 -740 294 -728 -3583
3913c583K396L103k720k361K231N11k37J345j407j799L063J387l230K4K251p13
$$ -3583 -1187 1916 -804 -3165 -934 -423 -660 685 -722 -2521 542 1929 -1301 -1277 974 261
3929B61l7R69k145J36L832p96l399J005J857p40O03Qk178Q11K588k402j440K637
$$ 261 224 1193 -952 -816 3016 2220 -1179 -174 1683 943 1546 1554 -624 187 2775 373 -1067 1570
3947A570M01j800M21k53j707K678J480l878j236L449m78j298Q55j629m54L094
$$ 1570 1971 171 592 339 -1368 1310 2790 -1088 -2324 1125 647 -651 204 -1425 -1879 1215
3963A215j24l862L08K986j148K44K71k442N58L616j771k991K388J439j165J74
$$ 1215 1091 -2771 -2463 523 -625 -381 -110 -2552 -1994 1622 -149 -3140 -752 687 -478 -304
3979c04l43j714K255L105k630k492J740P93kJ602j345k269K764J518k733m97K260
$$ -304 -647 -2361 -106 2999 369 -2123 -383 410 408 2010 665 -1604 1160 2678 -55 -552 1708
3996A708o98j94J291k006j310L232L08k601L32J464j668N47Q31k062k21L240j664
$$ 1708 1010 816 2107 101 -1209 2023 2331 -270 62 1526 -142 405 1236 -826 -1047 2193 529
4013E29k598J622O92j145J298J46k811J371J733k654l56K914o50j597O03p96p06
$$ 529 -2069 -447 245 -900 398 544 -2267 -896 837 -1817 -2173 741 91 -1506 -903 -1699 -2405
4030b405L295M35l622J45K384l00k1O98j718k58L604r32l123J415K144p41J13
$$ -2405 890 1325 -2297 -2152 232 -68 -89 609 -1109 -1367 2237 1305 -1818 -403 1741 1000 1113
4047A113p6k653J549L474k556k259K484Q08q19J87j016j744L173K088l847j496
$$ 1113 1037 -1616 -67 3407 851 -1408 1076 1884 1065 1252 236 -1508 1665 3753 -94 -1590
4063a590K013L11L75O51k163k128L415M21l247O32K043j063j76K64k056K61L746
$$ -1590 423 734 1109 1760 -403 -2531 884 1305 -1942 -1310 733 -330 -506 -242 -2298 -2037 1709
4080A709j539k916J303J449j195Q86J76k033J378K491k739j729K825O43j023Q59
$$ 1709 170 -2746 -1443 6 -1189 -303 -127 -2160 -782 1709 -1030 -2759 66 709 -314 545
4096E45p99j427K909Q62l033N20K941r76j388O22r46J79L477q34m223J151K453
$$ 545 -254 -1681 1228 2090 -943 -423 2518 1542 154 776 -170 9 3486 2652 -1571 -420 2033
4113B033r15k13L52k001R54K773k645k734K835J805j775l01p02j620K593K110
$$ 2033 1118 905 1257 -744 210 2983 338 -2396 439 2244 469 168 -534 -2154 439 2549
4129B549l741j610L205k03q90M17j234r36L618M78m047k54K800n39l9J130k325
$$ 2549 -1192 -2802 403 200 -690 -273 -1507 -2443 1175 1653 -2394 -2648 152 -387 -426 704 -1621
4146a621m13L092p53k747K649J537j962l1M85j243J575K397k258k388K332O51
$$ -1621 -2034 1058 305 -2442 207 1744 -218 -249 236 -1007 568 2965 707 -1681 651 1302
4162A302j044J215k36j598J426J395l356J67L170j006j564J163r61n27K366o56
$$ 1302 258 1473 1237 -361 1065 2460 -896 -729 2441 1435 -129 1034 73 -454 1912 1256
4178A256k930J256K424j532j192P16j306Q23K944k206l084J396J938j383N67N83
$$ 1256 -1674 -418 2006 474 -718 -2 -1308 -485 2459 253 -2831 -1435 503 -880 -313 270
4194B70k490J397J488k528q36L454k26j691N82p37j230L157J600m195l9K487k51
$$ 270 -2220 -823 665 -1863 -2699 755 529 -1162 -580 -1317 -2547 610 2210 -1985 -2024 463 212
4211B12n11J485j456r29K640j51k591J534J550j150N51M85k251P00K624j988j784
$$ 212 -299 1186 -270 -1199 1441 1290 -1301 233 1783 633 1184 1669 -582 118 2742 754 -1030
4228a030K317N62j673L97r0j672K232J929l378j252K347m79m29J087j138j299
$$ -1030 1287 1849 176 573 483 -1189 1043 2972 -406 -1658 689 210 -219 868 -270 -1569
4244a569J975J42k929L12L061j361r73O76j604O51L270j649k805J618J712j447
$$ -1569 406 548 -2381 -2069 992 -369 -1342 -666 -2270 -1619 1651 2 -2803 -1185 527 -920
4260i20L89rj149J351K681k516k166K764Q65j239Q93l65j688K627R06l075k60
$$ -920 -531 -540 -1689 -338 2343 -173 -2339 425 1290 51 944 579 -1109 1518 2424 -651 -911
4277i11L127k63j266M52j164l48L245m12l635J025J840j179L5N34j713L5K298
$$ -911 2216 1953 687 1139 -25 -373 2872 2460 -1175 -150 1690 511 546 1080 -633 -598 1700
4294A700k009k170K432J305k064K63j57j445J819J876l049j273L062J27j940J063
$$ 1700 -309 -2479 -47 1258 -806 -543 -700 -2145 -326 1550 -1499 -2772 290 417 -1523 -460
4310d60p86o15K606N83l648K4L109l78j254O99r72M01K783j411k657J977K547
$$ -460 -1246 -1861 745 1328 -2320 -2296 813 435 -819 -120 -1092 -691 2092 681 -1976 1 2548
4327B548j958n51K84j338K018K242k598k291K671J084j838O01p1j571K258R79
$$ 2548 590 39 323 -1015 1003 3245 647 -1644 1027 2111 273 874 803 -768 1490 2469
4343B469k995o47K672j50j464P49q87j114K632j03l098O22K728j769q77P24p47
$$ 2469 -526 -1173 1499 1349 -115 634 -253 -1367 1265 1162 -1936 -1314 1414 -355 -1232 -508 -1255
4360a255J04K205j504k534K215J393j635N3R15j464J203J183k322r05L146O58
$$ -1255 -1151 1054 -450 -2984 -769 624 -1011 -958 -43 -1507 -304 879 -1443 -2348 798 1456
$$ [...]
8191A71
##END NTUPLES=NMR FID
##END=
