##TITLE=1H_EC-3202(II-2)
 CDcl3, 8 sc, 
 21.8.2019
##JCAMPDX= 6.0         $$ Bruker NMR JCAMP-DX V2.0
##DATA TYPE= NMR FID
##DATA CLASS= NTUPLES
##ORIGIN= UXNMR, Bruker Analytische Messtechnik GmbH
##OWNER= root
$$ XWIN-NMR		Version 3.5
$$ Wed Aug 21 13:43:36 2019 Russian Standard Time (UT+4h)  she@DPX200
##.OBSERVE FREQUENCY= 200.13155
##.OBSERVE NUCLEUS= ^1H
##.DELAY= (6, 6)
##.ACQUISITION MODE= SIMULTANEOUS
##.ACQUISITION SCHEME= undefined
##.AVERAGES= 8
##.DIGITISER RES= 18
##SPECTROMETER/DATA SYSTEM= spect
##.PULSE SEQUENCE= zg30
##.SOLVENT NAME= CDCl3
##.SHIFT REFERENCE= (INTERNAL, CDCl3, 0, 15.7039)
##AUDIT TRAIL= $$ (NUMBER, WHEN, WHO, WHERE, WHAT)
$$ ##TITLE= Audit trail, XWIN-NMR		Version 3.5
$$ ##JCAMPDX= 5.01
$$ ##ORIGIN= Bruker BioSpin GmbH
$$ ##OWNER= she
$$ F:/spectra/data/she/nmr/H-F/1/audita.txt
$$ ##AUDIT TRAIL=  $$ (NUMBER, WHEN, WHO, WHERE, WHAT)
(   1,<2019-08-21 13:42:30.73 +0400>,<she>,<DPX200>,
      <created by zg, POWCHK disabled, PULCHK disabled
       configuration hash MD5:
       00 E9 B6 7A A2 85 ED C7 34 08 36 98 17 FE 4E 26
       data hash MD5: 16K
       87 49 F2 FE 4A 22 B0 64 74 F7 D0 C1 04 E0 B8 B6>)
$$ ##END=
$$ 
$$ hash MD5
$$ 5F C0 05 F9 1E 94 5E 8F 50 82 6C D9 B5 36 3A 93
##$RELAX= 
##$RELAX= 
##$RELAX= 
##$RELAX= 
##$RELAX= 
##$RELAX= 
$$ Bruker specific parameters
$$ --------------------------
##$DU= <F:/spectra>
##$EXPNO= 1
##$NAME= <H-F>
##$PROCNO= 1
##$TYPE= <nmr>
##$USER= <she>
##$AMP= (0..31)
100 100 100 100 100 100 100 100 100 100 100 100 100 100 100 100 100 100 
100 100 100 100 100 100 100 100 100 100 100 100 100 100 
##$AQSEQ= 0
##$AQ_mod= 1
##$AUNM= <au_zg>
##$AUTOPOS= <>
##$BF1= 200.13
##$BF2= 200.13
##$BF3= 200.13
##$BF4= 200.13
##$BF5= 200.13
##$BF6= 200.13
##$BF7= 200.13
##$BF8= 200.13
##$BYTORDA= 1
##$CFDGTYP= 0
##$CFRGTYP= 5
##$CHEMSTR= <none>
##$CNST= (0..31)
1 1 145 1 1 1 1 1 1 1 1 1 1 1 1 1 1 1 1 1 1 1 1 1 1 1 1 1 1 1 1 1 
##$CPDPRG= <>
##$CPDPRG1= <>
##$CPDPRG2= <>
##$CPDPRG3= <>
##$CPDPRG4= <mlev>
##$CPDPRG5= <mlev>
##$CPDPRG6= <mlev>
##$CPDPRG7= <mlev>
##$CPDPRG8= <mlev>
##$CPDPRGB= <>
##$CPDPRGT= <>
##$D= (0..31)
0 1.2 0 0 0 0 0 0 0 0 0 0.03 0 0 0 0 0 0 0 0 0 0 0 0 0 0 0 0 0 0 0 0 
##$DATE= 1566380550
##$DBL= (0..7)
120 120 120 120 120 120 120 120 
##$DBP= (0..7)
150 150 150 150 150 150 150 150 
##$DBP07= 0
##$DBPNAM0= <>
##$DBPNAM1= <>
##$DBPNAM2= <>
##$DBPNAM3= <>
##$DBPNAM4= <>
##$DBPNAM5= <>
##$DBPNAM6= <>
##$DBPNAM7= <>
##$DBPOAL= (0..7)
0.5 0.5 0.5 0.5 0.5 0.5 0.5 0.5 
##$DBPOFFS= (0..7)
0 0 0 0 0 0 0 0 
##$DE= 6
##$DECBNUC= <off>
##$DECIM= 24
##$DECNUC= <off>
##$DECSTAT= 4
##$DIGMOD= 1
##$DIGTYP= 9
##$DL= (0..7)
0 120 120 120 120 120 120 120 
##$DP= (0..7)
150 150 150 150 150 150 150 150 
##$DP07= 0
##$DPNAME0= <>
##$DPNAME1= <>
##$DPNAME2= <>
##$DPNAME3= <>
##$DPNAME4= <>
##$DPNAME5= <>
##$DPNAME6= <>
##$DPNAME7= <>
##$DPOAL= (0..7)
0.5 0.5 0.5 0.5 0.5 0.5 0.5 0.5 
##$DPOFFS= (0..7)
0 0 0 0 0 0 0 0 
##$DQDMODE= 0
##$DR= 18
##$DS= 0
##$DSLIST= <SSSSSSSSSSSSSSS>
$$ [...]
##$SUBNAM2= <"">
##$SUBNAM3= <"">
##$SUBNAM4= <"">
##$SUBNAM5= <"">
##$SUBNAM6= <"">
##$SUBNAM7= <"">
##$SUBNAM8= <"">
##$SUBNAM9= <"">
##$SW= 24.9336996594482
##$SWIBOX= (0..15)
0 0 2 0 0 0 0 0 0 0 0 0 0 0 0 0 
##$SW_h= 4990.01996007984
##$TD= 16384
##$TD0= 1
##$TE= 0
##$TE2= 300
##$TE3= 300
##$TEG= 300
##$TL= (0..7)
0 120 120 120 120 120 120 120 
##$TP= (0..7)
150 150 150 150 150 150 150 150 
##$TP07= 0
##$TPNAME0= <>
##$TPNAME1= <>
##$TPNAME2= <>
##$TPNAME3= <>
##$TPNAME4= <>
##$TPNAME5= <>
##$TPNAME6= <>
##$TPNAME7= <>
##$TPOAL= (0..7)
0.5 0.5 0.5 0.5 0.5 0.5 0.5 0.5 
##$TPOFFS= (0..7)
0 0 0 0 0 0 0 0 
##$TUNHIN= 0
##$TUNHOUT= 0
##$TUNXOUT= 0
##$USERA1= <user>
##$USERA2= <user>
##$USERA3= <user>
##$USERA4= <user>
##$USERA5= <user>
##$V9= 5
##$VALIST= <valist>
##$VCLIST= <CCCCCCCCCCCCCCC>
##$VD= 0
##$VDLIST= <DDDDDDDDDDDDDDD>
##$VPLIST= <PPPPPPPPPPPPPPP>
##$VTLIST= <TTTTTTTTTTTTTTT>
##$WBST= 1024
##$WBSW= 4
##$XGAIN= (0..3)
0 0 0 0 
##$XL= 0
##$YL= 0
##$YMAX_a= 197094
##$YMIN_a= -309761
##$ZGOPTNS= <>
##$ZL1= 120
##$ZL2= 120
##$ZL3= 120
##$ZL4= 120
##$ABSF1= 10
##$ABSF2= 0
##$ABSG= 5
##$ABSL= 3
##$ALPHA= 0
##$AQORDER= 0
##$ASSFAC= 0
##$ASSFACI= 0
##$ASSFACX= 0
##$ASSWID= 0
##$AUNMP= <proc_1d>
##$AZFE= 0.1
##$AZFW= 0.1
##$BCFW= 1
##$BC_mod= 2
##$BYTORDP= 1
##$COROFFS= 0
##$CY= 11.3945322036743
##$DATMOD= 1
##$DC= 2
##$DFILT= <>
##$DTYPP= 0
##$F1P= 20.1720416913024
##$F2P= 0.152960286110954
##$FCOR= 0.5
##$FTSIZE= 0
##$FT_mod= 4
##$GAMMA= 1
##$GB= 0.15
##$INTBC= 1
##$INTSCL= 1
##$ISEN= 128
##$LB= 0.24
##$LEV0= 0
##$LPBIN= 0
##$MAXI= 10000
##$MC2= 0
##$MEAN= 0
##$ME_mod= 0
##$MI= 1.114404
##$NCOEF= 0
##$NC_proc= 0
##$NLEV= 6
##$NOISF1= 3.799351
##$NOISF2= 2.8
##$NSP= 1
##$NTH_PI= 0
##$NZP= 0
##$OFFSET= 15.70392
##$PC= 1
##$PHC0= -9213.246
##$PHC1= 16.00096
##$PH_mod= 1
##$PKNL= yes
##$PPARMOD= 0
##$PSCAL= 0
##$PSIGN= 0
##$REVERSE= no
##$SF= 200.130013532006
##$SI= 16384
##$SIGF1= 3
##$SIGF2= 2
##$SINO= 400
##$SIOLD= 16384
##$SREGLST= <1H.CDCl3>
##$SSB= 0
##$STSI= 0
##$STSR= 0
##$SW_p= 3612.71676300578
##$SYMM= 0
##$S_DEV= 0
##$TDeff= 0
##$TDoff= 0
##$TI= <>
##$TILT= no
##$TM1= 0
##$TM2= 0
##$TOPLEV= 0
##$USERP1= <user>
##$USERP2= <user>
##$USERP3= <user>
##$USERP4= <user>
##$USERP5= <user>
##$WDW= 1
##$XDIM= 8192
##$YMAX_p= 0
##$YMIN_p= 0
$$ End of Bruker specific parameters
$$ ---------------------------------
##NTUPLES= NMR FID
##VAR_NAME=  TIME,          FID/REAL,        FID/IMAG
##SYMBOL=    X,             R,               I
##VAR_TYPE=  INDEPENDENT,   DEPENDENT,       DEPENDENT
##VAR_FORM=  AFFN,          ASDF,            ASDF
##VAR_DIM=   8192,          8192,            8192
##UNITS=     SECONDS,       ARBITRARY UNITS, ARBITRARY UNITS
##FACTOR=    0.0002004,     1,               1
##FIRST=     0,             0,               0
##LAST=      1.6414764,     0,               0
##MIN=       0,             -309761,         0
##MAX=       1.6414764,     197094,          0
$$ Real data points
##PAGE= N=1
##DATA TABLE= (X++(R..R)), XYDATA
$$ plain form
0 0 0 0 0 0 2 0 8 -8 8 -8 16 -22 24 -32 40 -48 56 -64 75 -89 104 -122 140 -162 186 -215 245 -277 315
29 315 -356 400 -453 506 -568 633 -706 784 -871 968 -1073 1186 -1312 1456 -1611 1784 -1979
46 -1979 2198 -2449 2735 -3067 3459 -3928 4504 -5226 6166 -7448 9309 -12260 17701 -31092
60 -31092 133605 96622 -205207 -90069 106103 197094 57061 -100549 -91603 84134 86336
71 86336 -71072 -122804 -2790 61498 13637 -100599 -144960 -36719 86282 3308 -129561
82 -129561 -96531 12937 30127 -14726 -76481 -84921 2286 61966 -2915 -44991 -3022 3482
94 3482 -23745 44 31705 41540 36309 -25349 -73861 20464 129728 74484 -38566 -56404
106 -56404 -5437 61553 82386 5295 -45909 22573 62094 -5115 -37808 8200 45333 47700
$$ packed form
0@%%%%KkQj6J6j6K4l8M6n6P2q8J04j20J39j64J93k26K62l02L48m01M60n22N92
29C15o71P56q53R59j074J201j339J490j655J839k041K259k498K768l067L395l763
46a979M177m647N184n802O526p387Q432r730J1392j3614J6757k1569K9961m8793
60c1092J64697l6983l01829J15138J96172R0991j40033j57610Q946J75737K202
71H6336j57408n1732J20014O4288m7861j14236m4361J08241J23001q2974j32869
82a29561L3030J09468J7190m4853o1755q440Q7207N9680o4881m2076M1969O504
94C482k7227K3789L1661R835n231o1658m8512R4325J09264n5244j13050j7838
106e6404N0967O6990K0833p7091n1204O8482L9521o7209l2693M6008L7133K367
$$ plain form
118 47700 -6493 -87359 -48325 83683 89951 -30566 -85989 -43555 24629 67971 15092 -82180
130 -82180 -60164 41058 49063 -10790 -41626 -46218 -8461 48103 15049 -61613 -42819 14253
142 14253 9568 -3493 -8106 -28348 -9102 27444 -9386 -50950 -8020 35774 31886 22239 -15003
155 -15003 -53337 -1770 71415 52841 5559 -11646 -25592 2921 66527 51579 -14458 -13802
167 -13802 15265 11624 9588 -2002 -27254 5305 48227 -370 -57443 -31008 5519 11848 9712
180 9712 -26536 -56070 -6031 33693 -12811 -40525 -7512 6594 3550 1513 -27558 -31162 19988
193 19988 27353 -12828 -5557 12160 -11799 -13670 11514 8008 8165 14059 -20896 -29227 28408 38488
207 38488 -16906 -25333 8289 19719 14704 -15732 -48254 6143 82710 32344 -67178 -59511 17040
$$ packed form
118D7700n4193q0866L9034J32008O268j20517n5423M2434O8184M3342n2879r7272
130h2180K2016J01222Q005n9853l0836m592L7757N6564l3054p6662J8794N7072
142A4253m685j3061m613k0242J9246L6546l6830m1564M2930M3794l888r647l7242
155a5003l8334N1567P3185j8574m7282j7205j3946K8513O3606j4948o6037O56
167a3802K9067l641k036j1590k5252L2559M2922m8597n7073K6435L6527O329k136
180I712l6248k9534N0039L9724m6504k7714L3013J4106l044k037k9071l604N1150
193A9988P365m0181P271J7717k3959j871K5184l506J57N894l4955q331N7635J0080
207C8488n5394q427L3622J1430n015l0436l2522N4397P6567n0366r9522P667P6551
$$ plain form
220 17040 63887 47831 -33249 -76813 10033 87467 22332 -57312 -27658 38263 58986 14720
232 14720 -61999 -48265 66393 92816 -16277 -74864 -18526 46203 57051 1439 -69899 -38330
244 -38330 56229 46211 -40166 -52875 -7212 16941 14600 -20674 -51542 -10977 28179 -15663
256 -15663 -44889 1250 24573 -2041 -22524 -33293 -15303 38315 36907 -27634 -31777 18212
268 18212 21391 -435 2255 5149 15283 24216 -15705 -40034 23575 68821 15083 -40247 -33545
281 -33545 4648 50080 45122 -33304 -61568 13192 56557 14403 -24610 -29349 -5526 36349
293 36349 24302 -40322 -35989 30551 35199 -11156 -28472 -19135 11525 43428 4971 -57379 -27260
306 -27260 41555 38334 -2657 -30073 -36112 5593 52357 18508 -35954 -22143 5276 4327 13066
$$ packed form
220A7040M6847j6056q1080m3564Q6846P7434o5135p9644K9654O5921K0723m4266
232A4720p6719J3734J14658K6423j09093n8587N6338O4729J0848n5612p1338L1569
244c8330R4559j0018q6377j2709M5663K4153k341l5274l0868M0565L9156m3842
256a5663k9226M6139K3323k6614k0483j0769J7990N3618j408o4541m143M9989
268A8212L179k1826K690K894J0134Q933l9921k4329O3609M5246n3738n5330O702
281c3545L8193M5432m958p8426k8264P4760M3365m2154l9013m739K3823M1875
293C6349j2047o4624M333O6540M648m6355j7316R337L0660L1903l8457o2350L0119
306b7260O8815l221m0991k7416o039M1705M6764l3849n4462J3811K7419r49Q739
$$ plain form
319 13066 11416 -13841 -7418 8868 -13366 -16957 15314 12111 -10204 -3201 -5711 -16430 5621
332 5621 17077 -6146 -6301 1405 -17494 -8276 27946 15201 -18110 -13198 -1479 7292 27492
345 27492 9290 -34490 -17043 29823 24580 713 -7230 -16642 -2916 27706 9795 -20639 -699
358 -699 14968 -6923 -7783 5371 -1070 4235 11028 -16580 -25103 7192 11078 -4746 3677 -1464
372 -1464 -24720 -10591 13037 6176 2147 -4509 -30474 -15426 35916 26549 -23787 -28390 -1915
385 -1915 19026 28703 -1680 -38878 -4483 47162 19015 -27464 -16596 15906 33900 22380
397 22380 -27918 -41155 28126 64875 5154 -43900 -20404 21559 43211 18510 -40126 -38711
409 -38711 30194 43115 -10225 -30114 -9405 8148 16396 -3323 -34722 -10700 29217 1850
$$ packed form
319A3066j650k5257O423J6286k2234l591L2271l203k2315P003k510j0719K2051
332E621J1456k3223j55P706j8899R218L6222j2745l3311M912J1719Q771K0200
345B7492j8202m3780J7447M6866n243k3867p943r412J3726L0622j7911l0434J9940
358f99J5667k1891q60J3154o441N305O793k7608q523L2295L886j5824Q423n141
372a464k3256J4129K3628o861m029o656k5965J5048N1342r367n0336m603K6475
385a915K0941R677l0383l7198L4395N1645k8147m6479J0868L2502J7994j1520
397B2380n0298j3237O9281L6749n9721m9054K3496M1963K1652k4701n8636J415
409c8711O8905J2921n3340j9889K0709J7553Q248j9719l1399K4022L9917k7367
$$ plain form
421 1850 -37910 -18803 8446 8736 872 -21401 -31575 2996 19801 -15316 -23345 7425 7675
434 7675 -11203 -11799 -9342 5689 26045 -1571 -39875 -8257 40759 25024 -11662 -21129 -7103
447 -7103 28400 42760 -5045 -35367 11124 46751 20296 -8853 -11855 5915 39573 32211 -26149
460 -26149 -32913 26644 45845 5941 -26696 -29817 70 41051 18804 -44970 -43115 9597 22214
473 22214 -1740 -23290 -34731 -10043 24172 -414 -41725 -20198 15538 7882 -8447 -17078
485 -17078 -18158 9903 28360 -6557 -29535 1349 20169 9272 5597 -1850 -9422 10706 19208
498 19208 -2918 453 19138 2288 -12826 5760 15293 9346 8174 -6829 -16686 12730 25756
511 25756 -6569 -19230 2685 9418 5348 1741 -14845 -10812 19616 11084 -25033 -17126 12450
$$ packed form
421A850l9760J9107K7249K90p864k2273j0174L4571J6805l5117q029L0770K50
434G675j8878n96K457J5031K0356k7616l8304L1618M9016j5735l6686r467J4026
447g103L5503J4360m7805l0322M6491L5627k6455k9149l002J7770L3658p362n8360
460b6149o764N9557J9201l9904l2637l121K9887M0981k2247o3774J855N2712J2617
473B2214k3954k1550j1441K4688L4215k4586m1311K1527L5736p656j6329q631
485a7078j080K8061J8457l4917k2978L0884J8820j0897l675p447p572K0128Q502
498A9208k2126L371J8685j6850j5114J8586R533n947j172j5003r857K9416J3026
511B5756l2325j2661K1915O733m070l607j6586M033L0428q532l6117P907K9576
$$ plain form
524 12450 13688 2694 -11935 -25989 -2716 30735 9527 -24995 -15839 2801 7148 11924 -930
537 -930 -22573 -6460 15383 -1023 -11649 -565 -4612 -7156 6892 -971 -16750 -1807 8933
550 8933 -1747 -1250 -1664 -13929 2683 28232 8368 -17470 -4649 13928 22078 23925 -1979
563 -1979 -23967 8866 41645 18941 -9077 -7044 2262 16572 21086 -7825 -20502 11126 19319
576 19319 -11711 -20281 -4970 2405 8256 -2230 -31652 -24528 12322 8815 -18359 -18155 -9653 -7740
590 -7740 2251 -3901 -20231 -6930 7708 -10760 -16491 5286 7488 -5465 -5885 -8316 -2727 19445
604 19445 13540 -18201 -11633 18739 18972 5563 -167 -5127 8237 28420 8672 -15319 6934
617 6934 28497 11895 -5348 -6342 1272 25138 27864 -14556 -32857 5336 30583 14545 -8401
$$ packed form
524A2450J238j0994j4629j4054K3273L3451k1208l4522R156J8640M347M776j2854
537i30k1643J6113K1843j6406j0626J1084m047k544J4048p863j5779J4943J0740
550H933j0680M97m14j2265J6612K5549j9864k5838J2821J8577Q150J847k5904
563a979k1988L2833L2779k2704k8018K033R306J4310M514k8911j2677L1628Q193
576A9319l1030q570J5311P375N851j0486k9422P124L6850l507k7174K04Q502J913
590g740R991o152j6330J3301J4638j8468n731K1777K202j2953m20k431N589K2172
604A9445n905l1741O568L0372K33j3409n730m960J3364K0183j9748k3991K2253
617F934K1563j6602j7243r94P614K3866K726m2420j8301L8193K5247j6038k2946
$$ plain form
630 -8401 -23270 -15089 19709 21949 -19306 -28127 3527 13418 -838 -13694 -23733 -8982 20534
643 20534 5766 -33661 -26351 5393 8745 -3722 -17393 -25711 -3401 20551 -3420 -29644 -9153
656 -9153 12665 7782 1699 -6087 -9441 12146 22738 -418 -4438 19466 18015 801 1858 8273
670 8273 15795 25970 8748 -17746 -414 25604 10909 -7962 -3176 2274 6091 5234 -16778
683 -16778 -21927 10946 20108 -13261 -27498 -12710 1103 8996 488 -24584 -18470 13400 7975
696 7975 -19885 -16143 2212 8081 8722 -6344 -23176 -2688 24274 9211 -11038 -4343 2446
709 2446 5931 13847 3071 -9486 7416 17509 1107 -2966 5099 743 3231 14498 2994
722 2994 -9065 1301 3488 -3015 5960 5839 -9598 -4830 6285 -3954 -7305 3878 1645 184
$$ packed form
630h401j4869Q181L4798K240m1255q821L1654R891j4256j2856j0039J4751K9516
643B0534j4768l9427P310L1744L352j2467j3671q318K2310K3952k3971k6224K0491
656i153K1818m883o083p786l354K1587J0592k3156m020K3904j451j7214J057O415
670H273P522J0175j7222k6494J7332K6018j4695j8871M786N450L817q57k2012
683a6778n149L2873R162l3369j4237J4788J3813P893q508k5072O114L1870n425
696G975k7860L742J8355N869O41j5066j6832K0488K6962j5063k0249O695O789
709B446L485P916j0776j2557J6902J0093j6402m073Q065m356K488J1267j1504
722B994j2059J0366K187o503Q975j21j5437M768J1115j0239l351J1183k233j461
$$ plain form
736 184 6128 -6643 -17890 4021 19512 4826 -5209 -6585 -9949 3906 17127 617 -10546
749 -10546 1392 454 -9103 -187 4839 -2884 -438 -2690 -16013 -7134 10748 -818 -11749 -1439
763 -1439 339 -4437 977 -2543 -8258 6217 11115 -6653 -6204 7749 2627 -3088 3685 3767 5132
778 5132 13445 -1205 -20329 -2562 21319 15809 2196 -8434 -16860 -211 22572 9962 -8769
791 -8769 -1541 3125 -2683 1638 2201 -1805 10815 12585 -13460 -19029 5635 15126 6807 -3168 -16492
806 -16492 -12658 14274 14767 -14146 -17655 324 5533 4833 -2129 -18049 -11826 11739 6820 -12116
820 -12116 -6655 921 -5350 -4290 -2499 -5417 6712 11988 -12965 -22401 1535 15486 9180 1777
834 1777 -11088 -13635 8460 17163 -52 -1655 10324 2510 -5472 2565 7701 12824 16865 -2846
$$ packed form
736A84N944j2771j1247K1911J5491j4686j0035j376l364J3855J3221j6510j1163
749a0546J1938r38r557Q916N026p723K446k252j3323Q879J7882j1566j0931J0310
763a439J778m776N414l520n715J4475M898j7768M49J3953n122n715O773Q2J365
778E132Q313j4650j9124J7767K3881n510j3613j0630q426J6649K2783j2610j8731
791h769P228M666n808M321N63m006J2620J770k6045n569K4664R491q319r975j3324
806a6492L834K6932M93k8913l509J7979N209p00o962j5920O223K3565m919j8936
820a2116N461P576o271J060J791k918J2129N276k4953r436K3936J3951o306p403
834A777j2865k547K2095Q703j7215j603J1979p814p982Q037N136N123M041j9711
$$ plain form
848 -2846 -19198 3864 24951 9657 -6517 -7686 -3312 9947 13156 -10635 -19145 6225 13592
861 13592 -5800 -13274 -8582 -3291 5768 903 -16624 -8415 12562 1343 -18521 -12217 1687
874 1687 10134 12981 -6695 -26170 -7269 17661 10678 -821 -2006 -7787 -4251 8212 3849 -1747
888 -1747 9535 7725 -8213 -4616 5184 3484 7329 9841 -3978 -6922 6752 4788 -2587 5181
902 5181 4599 -3888 2661 5151 -6058 -2892 6126 -369 -1068 6529 -3207 -11313 -127 3461 -914
917 -914 5132 1813 -12962 -8586 4523 1910 1100 4063 -8041 -11814 2215 3727 -4341 1008 2037
932 2037 -7611 -3561 1234 -6600 -1488 10218 205 -10040 -2409 386 207 7722 3282 -8770
946 -8770 244 10191 -239 -3238 4261 3064 4516 10278 -1389 -10227 5700 13846 4465 2493
$$ packed form
848b846j6352K3062K1087j5294j6174j169M374J3259L209k3791q510K5370P367
861A3592j9392p474M692N291R059m865j7527Q209K0977j1219j9864O304J3904
874A687Q447K847j9676j9475J8901K4930o983j1499j185n781L536J2463m363n596
888a747J1282j810j5938L597R800j700L845K512j3819k944J3674j964p375P768
902E181n82q487O549K490j1209L166R018o495o99P597r736q106J1186L588m375
917i14O046l319j4775M376J3109k613q10K963j2104l773J4029J512q068N349J029
932B037r648M050M795p834N112J1706j0013j0245P631K795j79P515m440j2052
946h770R014R947j0430k999P499j197J452N762j1667q838J5927Q146r381j972
$$ plain form
960 2493 1407 -6418 1891 12119 1783 -3646 4495 750 -4908 1613 -31 -5483 4533 6459
974 6459 -9474 -11168 -1317 -1688 412 3366 -9059 -13801 1613 3132 -9467 -6845 -386 -1482
988 -1482 2472 -813 -14736 -8165 11305 6996 -5340 -2560 -1638 -2986 5719 4892 -2823 5979 10287
1003 10287 -5190 -7211 8147 11049 6254 4918 -3376 -3919 11807 10589 -4594 89 10138 2419
1017 2419 -3244 -179 -1051 4718 11480 -4662 -15624 1879 11024 -2040 -8559 -7307 -3566 7645
1031 7645 5624 -16727 -18096 6616 11171 -2482 -8671 -10577 -6135 8012 5028 -11862 -5209 9130
1045 9130 392 -9912 -4838 -12 7030 11542 -4574 -17706 -305 14574 5242 -902 -1182 -4497
1059 -4497 3016 10904 283 -3857 8618 7304 -2975 1762 4898 568 5619 5452 -4796 -161
$$ packed form
960B493j086p825Q309J0228j0336n429Q141l745n658O521j644n452J0016J926
974F459j5933j694R851l71K100K954j2425m742J5414J519j2599K622O459j096
988a482L954l285j3923O571J9470m309j2336K780R22j348Q705q27p715Q802M308
1003A0287j5477k021J5358K902m795j336q294n43J5726j218j5183M683J0049p719
1017B419n663L065q72N769O762j6142j0962J7503R145j3064o519J252L741J1211
1031G645k021k2351j369K4712M555j3653o189j906M442J4147k984j6890O653J4339
1045I130q738j0304N074M826P042M512j6116j3132J7401J4879r332o144k80l315
1059d497P513P888j0621m140J2475j314j0279M737L136m330N051j67j0248M635
$$ plain form
1073 -161 10158 775 -7668 571 2154 -47 4601 -2058 -12223 -2675 6291 -3137 -4602 1192 -4504
1088 -4504 -6148 -126 -4884 -5124 6986 3443 -12315 -8600 2004 2734 4254 794 -12381 -6834
1102 -6834 10337 5628 -6402 -2698 979 85 5680 1581 -7573 1994 11626 -538 -5789 3427
1116 3427 5100 3879 6300 -1990 -6376 7872 11323 -2268 -3338 3696 1262 3281 6518 -3417
1130 -3417 -5487 5638 3195 -3933 3266 2993 -6323 -2104 3357 -1724 495 4181 -5693 -7474 3419
1145 3419 1013 -5827 1060 780 -7200 -3150 -1299 -6884 -873 4994 -6908 -11025 133 541 -3881
1160 -3881 506 -2142 -6189 2724 4579 -5776 -1569 7774 1891 -931 5832 3133 975 7441 3322
1175 3322 -1670 9221 11419 -1735 -1923 6730 4248 4049 5043 -2546 -1770 9020 2005 -9857 -723
$$ packed form
1073a61J0319r383q443Q239J583k201M648o659j0165R548Q966r428j465N794n696
1088d504j644O022m758k40J2110l543j5758L715J0604P30J520l460j3175N547
1102f834J7171m709j2030L704L677q94N595m099r154R567R632j2164n251R216
1116C427J673j221K421q290m386J4248L451j3591j070P034k434K019L237r935
1130c417k070J1125k443p128P199k73r316M219N461n081K219L686r874j781J0893
1145C419k406o840O887k80p980M050J851n585O011N867j1902m117J1158M08m422
1160c881M387k648m047Q913J855j0355M207R343n883k822O763k699k158O466m119
1175C322m992J0891K198j3154j88Q653k482j99R94p589P76J0790p015j1862R134
$$ plain form
1190 -723 7281 538 -3142 -5420 -8681 1873 8686 -6707 -15295 -1235 4007 -2950 -5507 -8521
1204 -8521 -8265 4699 5012 -11958 -10934 3437 2980 -3329 -3377 -5621 -1130 10340 3044 -11011 -1765
1219 -1765 9860 5042 1584 1690 -1465 4575 11752 704 -5592 6976 9996 160 113 1264 -1049
1234 -1049 5823 6917 -5384 -5098 8055 4046 -4754 -1290 -849 -1189 5135 594 -9932 -2276 7067
1249 7067 -2324 -6872 -1112 -1760 -879 2746 -6789 -11824 2508 6469 -5556 -7856 -2893 -2963 2597
1264 2597 3396 -8264 -7606 7326 5625 -5677 -3430 1283 2837 8001 3254 -8872 -269 13218
1278 13218 4925 -4837 -411 2897 5062 8113 -1745 -8924 3796 10735 -1274 -4202 1424 -51
1292 -51 1357 3325 -4775 -4836 7484 4389 -7591 -3376 3525 40 960 1167 -6378 -1430 6705 -2029
$$ packed form
1190g23Q004o743l680k278l261J0554O813j5393q588J4060N242o957k557l014
1204h521K56J2964L13j6970J024J4371m57o309m8k244M491J1470p296j4055R246
1219a765J1625m818l458J06l155O040P177j1048o296J2568L020r836m7J151k313
1234a049O872J094j2301K86J3153m009q800L464M41l40O324m541j0526P656R343
1249G067r391m548N760o48Q81L625r535n035J4332L961j2025k300M963p0N560
1264B597P99j1660O58J4932j701j1302K247M713J554N164m747j2126Q603J3487
1278A3218q293r762M426L308K165L051r858p179J2720O939j2009k928N626j475
1292e1J408J968q100o1J2320l095j1980M215O901l485R20K07p545M948Q135q734
$$ plain form
1308 -2029 -7642 2134 3170 -3444 -936 -765 -4349 2391 3290 -7411 -4450 6515 1365 -5240 -1089
1323 -1089 -1043 -1354 5319 705 -7453 758 6583 -2704 -4469 2986 -143 -241 3043 -3363 -4930 6047
1339 6047 4617 -5532 -1133 4650 130 1184 4028 -1753 86 7556 971 -2822 6546 6162 -2705
1354 -2705 194 4098 835 3820 4166 -5474 -2551 7486 1622 -6465 -477 1533 -1842 397 -3073
1369 -3073 -8262 820 5855 -6533 -9319 337 724 -1768 -668 -6544 -6783 5328 4291 -8580 -5982
1384 -5982 2678 1335 1090 1002 -5667 -2009 8072 1926 -6250 1766 6781 1379 1942 1099 -2561 5646
1400 5646 11193 -312 -4764 4950 6048 1968 3719 307 -2367 5864 5607 -5662 -3354 5799 1315
1415 1315 -2837 -682 -4301 -2588 4862 -1692 -10278 -1934 4038 -3059 -5285 -3436 -4674 849 4714
$$ packed form
1308b029n613R776J036o614K508J71l584O740Q99j0701K961J0965n150o605M151
1323a089M6l11O673m614q158Q211N825r287j765P455l129r8L284o406j567J0977
1339F047j430j0149M399N783m520J054K844n781J839P470o585l793R368l84q867
1354b705K899L904l263K985L46r640K923J0037n864q087N988K010l375K239l470
1369c073n189R082N035j2388k786R656L87k492J100n876k39J2111j037j2871K598
1384e982Q660j343k45q8o669L658J0081o146q176Q016N015n402N63q43l660Q207
1400E646N547j1505m452R714J098m080J751l412k674Q231k57j1269K308R153m484
1415A315m152K155l619J713P450o554q586Q344N972p097k226J849j238N523L865
$$ plain form
1430 4714 -6661 -10498 2375 4534 -3605 -2967 -2072 -2511 3988 3016 -7869 -3013 9507 4703 -4358
1445 -4358 -2248 119 3444 9471 2078 -8090 1892 10841 2582 -2871 1278 2427 5554 7265 -3686
1460 -3686 -7134 6141 8683 -2479 -3319 966 -42 2133 1047 -7178 -2593 8133 401 -9275
1474 -9275 -3374 1042 -367 1256 -2239 -8190 -540 4666 -4527 -6225 2654 1438 -3664 -1743 -3221
1489 -3221 -2970 5120 2616 -8080 -2871 5621 489 -2323 713 -1618 888 6130 -636 -6659 3154
1504 3154 6782 -588 110 2772 -815 1837 4627 -1721 -1265 7680 3417 -4144 -160 2603 587
1519 587 4289 3026 -5065 -1662 4715 -922 -1927 4569 221 -4996 -672 -535 -2456 2857 1854
1534 1854 -6750 -3242 3219 -1929 -4227 461 -1733 -2662 1633 -2681 -6969 1209 4146 -3718 -2974
$$ packed form
1430D714j1375l837J2873K159q139O38Q95m39O499r72j0885M856J2520m804r061
1445d358K110K367L325O027p393j0168R982Q949q259n453M149J149L127J711j0951
1460c686l448J3275K542j1162q40M285j008K175j086q225M585J0726p732r676
1474i275N901M416j409J623l495n951P650N206r193j698Q879j216n102J921j478
1489c221K51Q090k504j0696N209Q492n132k812L036k331K506N242o766o023R813
1504C154L628p370O98K662l587K652K790o348M56Q945m263p561L984K763k016
1519E87L702j263q091L403O377n637j005O496m348n217M324J37j921N313j003
1534A854q604L508O461n148k298M688k194r29M295m314m288Q178K937p864P44
$$ plain form
1549 -2974 1593 -1516 -1203 1578 -3557 -1975 7425 3995 -5758 -2200 2169 1691 5887 4475 -4528
1564 -4528 -1607 6336 1822 -393 5555 3835 -554 1858 687 -2422 5420 7569 -3031 -4242 2290
1579 2290 907 142 2547 -2710 -3937 3946 1258 -7078 -2689 2582 -1743 -1735 -733 -5701 -2811 2990
1595 2990 -3449 -7198 2150 3622 -3544 -4530 -3783 -2831 5759 6236 -6532 -7985 2495 4075 167
1610 167 1389 -677 -836 5046 1879 -6196 1535 10495 3550 -2960 -1640 -222 4865 9290 -245
1625 -245 -7104 3085 7556 137 -2185 -103 -314 3830 3935 -5661 -5309 4859 3248 -4508 -1606
1640 -1606 868 -1386 -115 -2923 -6789 1423 8319 -2249 -9109 -2933 894 1408 2930 -2694 -6497
1655 -6497 1311 3003 -5571 -3256 5042 2058 -1659 -2146 -5056 -412 8466 2541 -7094 -1525 4789
$$ packed form
1549b974M567l109L13K781n135J582R400l430r753L558M369m78M196j412r003
1564d528K921P943m514k215N948j720m389K412j171l109P842K149j0600j211O532
1579B290j383p65K405n257j227P883k688q336M389N271m325QJ002m968K890N801
1595B990o439l749R348J472p166r86P47R52Q590M77j2768j453J0480J580l908
1610A67J222k066j59N882l167q075P731Q960o945o510J320J418N087M425r535
1625b45o859J0189M471p419k322K082k11M144J05r596L52J0168j611p756K902
1640a606K474k254J271k808l866Q212O896j0568o860O176L827N14J522n624l803
1655f497P808J692q574K315Q298k984l717m87k910M644Q878n925r635N569O314
$$ plain form
1670 4789 1267 480 203 -2375 2678 7362 -1704 -5734 3106 4528 530 2360 894 -2218 2352
1685 2352 3272 -3419 -384 6947 1564 -4008 -989 -854 -99 5728 1943 -5653 -1945 2114 -2187 -458
1701 -458 4228 -903 -3328 -448 -2681 -3325 3576 1786 -5470 -2450 635 -3469 -1995 808 -3521
1716 -3521 -2280 2981 -2229 -6356 576 1976 -1383 1548 1730 -3464 83 3048 -1415 390 6338
1731 6338 2378 -2570 903 832 568 6546 5042 -2704 -730 3766 82 973 5191 1108 -1207 2007
1747 2007 -1042 -2351 4371 4115 -3092 -2102 1206 -1818 -478 1100 -3973 -3033 3189 -1363 -7308 -1952
1763 -1952 -134 -2474 -440 -1505 -6047 -2053 2177 -4040 -4826 2716 2445 -2593 -1722 -2785 -1675 6435
1779 6435 5920 -4302 -3840 4112 3487 2296 3192 -229 601 5768 1227 -4018 3512 8447 1597 -1355
$$ packed form
1670D789l522p87k77k578N053M684r066m030Q840J422l998J830j466l112M570
1685B352R20o691L035P331n383n572L019J35P55N827l785p596L708M059m301J729
1701d58M686n131k425K880k233o44O901j790p256L020L085m104J474K803m329
1716c521J241N261n210m127O932J400l359K931J82n194L547K965m463J805N948
1731F338l960m948L473p1k64N978j504p746J974M496l684Q91M218m083k315L214
1747B007l049j309O722k56p207R90L308l024J340J578n073R40O222m552n945N356
1763a952J818k340K034j065m542L994M230o217p86P542k71n038Q71j063J110Q110
1779F435n15j0222M62P952o25j191Q96l421Q30N167m541n245P530M935o850k952
$$ plain form
1795 -1355 -77 -898 4031 6268 -2428 -4972 4553 4763 -2590 -2578 -617 -438 3723 1243 -7421 -4427
1811 -4427 3928 -38 -5295 -1546 -616 -1413 -715 -4933 -7570 1748 5881 -3271 -7188 -1866 100 1819
1827 1819 3014 -2890 -4015 4058 3238 -3227 -176 4589 2201 872 474 -2812 1413 7566 1839
1842 1839 -4280 1205 3904 876 1355 299 -2494 2903 5430 -2443 -3610 2355 1695 -606 1580
1857 1580 -447 -2498 1900 407 -4738 -630 4236 -446 -3465 -1588 -3168 -1269 4237 -116 -5444
1872 -5444 -828 925 -2694 -212 1810 -2173 -1248 1571 -2273 -2382 3349 887 -2773 449 491 -2371
1888 -2371 1130 2480 -2311 -906 2874 -785 -1986 2164 -50 -1839 2889 2092 -2173 897 2102
1903 2102 -1611 995 4462 104 -779 2438 -191 -640 4011 2474 -2180 1023 1771 -2586 -139 2686
$$ packed form
1795a355J278q21M929K237q696k544R525K10p353J2J961J79M161k480q664K994
1811d427Q355l966n257L749R30p97O98m218k637R318M133r152l917N322J966J719
1827A819J195n904j125Q073q20o465L051M765k388j329l98l286M225O153n727
1842A839o119N485K699l028M79j056k793N397K527p873j167N965o60k301K186
1857A580k027k051M398j493n145M108M866m682l019J877j580J899N506m353n328
1872e444M616J753l619K482K022l983R25K819l844j09N731k462l660L222M2k862
1888b371L501J350m791J405L780l659j201M150k214j789M728p97m265L070J205
1903B102l713K606L467m358q83L217k629m49M651j537m654L203P48m357K447K825
$$ plain form
1919 2686 -1366 -916 1288 -2459 -3033 1886 550 -3575 -906 327 -2860 -279 755 -3955 -1653
1934 -1653 2653 -1782 -4141 925 194 -2430 423 -414 -3316 1404 2583 -3273 -2114 2838 1110
1949 1110 -896 753 -1221 -929 5022 2754 -3610 109 4069 1545 692 1569 -414 1883 5390 -390
1965 -390 -3700 3464 4619 42 -587 -675 -1470 2712 3351 -3770 -3864 3231 1697 -2967 -1930 -1356 -1030
1982 -1030 2357 -767 -6469 -1753 3429 -1386 -4280 -1323 -1405 -731 1024 -3837 -5099 2622 3646 -3197
1998 -3197 -3499 209 -142 1500 1910 -2830 -1328 5370 1916 -3497 667 3920 2087 2545 1238 -1942
2014 -1942 2251 6366 402 -2349 2728 2907 905 1569 -1117 -2291 3227 3986 -3122 -2764 1540 22
2030 22 -1307 100 -2939 -2477 2411 40 -4675 -1511 1337 -1661 -1495 -630 -3120 -900 2560 -1890
$$ packed form
1919B686m052M50K204l747n74M919j336m125K669J233l187K581J034m710K302
1934a653M306m435k359N066p31k624K853q37k902M720J179n856J159M952j728
1949A110k006J649j974K92N951k268o364L719L960k524q53Q77j983K297L507n780
1965c90l310P164J155m577o29q8p95M182O39p121r4P095j534m664J037N74L26
1982a030L387l124n702M716N182m815k894K957q2O74J755m861j262P721J024o843
1998c197l02L708l51J642M10m740J502O698l454n413M164L253j833M58j307l180
2014a942M193M115n964k751N077J79k002O64k686j174N518P59p108L58M304j518
2030B2j329J407l039M62M888k371m715L164K848k998J66Q65k490K220L460m450
$$ plain form
2046 -1890 -3987 494 845 -1736 342 168 -2414 565 2608 -2053 -1083 2992 509 -949 1865 461
2062 461 -637 3245 2214 -2024 822 3383 -93 -21 2259 -448 -13 3529 -127 -2417 1775 2717
2078 2717 -1196 327 1484 -1715 112 2031 -1658 -1572 2396 38 -2699 146 -8 -2516 888 1213
2094 1213 -3344 -1507 1430 -2234 -2066 1409 -1030 -2568 734 -94 -3075 233 741 -2767 -46 1808
2110 1808 -1850 -1617 1820 -96 -1035 2174 666 -1585 2682 1876 -1689 658 3320 845 421 2185
2126 2185 -517 -192 3930 1368 -1911 1730 2535 -456 620 1701 -1451 875 2966 -1809 -2453 2553
2142 2553 1039 -2416 -353 -545 -1837 1428 418 -4423 -1749 2341 -1229 -3219 -623 -1471 -1216 1367
2158 1367 -1885 -4526 619 2108 -2543 -2282 514 -141 611 1716 -2408 -2393 3902 2636 -2033 -92
$$ packed form
2046a890k097M481L51k581K078j74k582K979K043m661R70M075k483j458K814j404
2062D61j098L882j031m238K846K561l476P2K280k707M35L542l656k290M192R42
2078B717l913J523J157l199J827J919l689Q6L968k358k737K845j54k508L404L25
2094A213m557J837K937l664J68L475k439j538L302q28k981L308N08l508K721J854
2110A808l658K33L437j916r39L209j508k251M267q06l565K347K662k475m24J764
2126B185k702L25M122k562l279L641Q05k991J076J081l152K326K091m775o44N006
2142B553j514l455K063j92j292L265j010m841K674M090l570j990K596q48K55K583
2158A367l252k641N145J489m651K61K796o55P52J105m124J5O295j266m669J941
$$ plain form
2174 -92 1830 636 2022 1763 -1949 645 5137 525 -1942 1920 2362 638 2290 236 -2145 2116
2190 2116 3827 -1434 -1989 1990 750 -516 911 -1875 -2071 2205 1290 -3643 -1483 1009 -1396 -1111
2206 -1111 105 -2707 -1426 2157 -1611 -4246 -167 886 -1712 -636 -953 -2835 179 2370 -2385
2221 -2385 -2307 2259 497 -1211 1392 -36 -1135 2785 2255 -1999 233 3461 814 265 2106 -268
2237 -268 582 3718 1123 -2179 1878 2811 -77 291 855 -1388 836 3289 -1220 -2507 1266 636
2253 636 -1418 534 420 -2062 668 877 -3386 -1464 1677 -765 -2504 -385 -1730 -2560 1110 -440
2269 -440 -3564 -7 728 -2127 -1251 461 -1550 -717 2012 -746 -2379 1552 727 -1540 1200 1898
2285 1898 -663 467 2091 -1461 -162 3357 1175 -589 1851 499 -1440 2292 2921 -626 384
$$ packed form
2174i2J922j194J386k59l712K594M492m612k467L862M42j724J652k054k381M261
2190B116J711n261n55L979j240j266J427k786j96M276r15m933K160K492k405K85
2206a111J216k812J281L583l768k635M079J053k598J076l17j882L014K191m755
2221b385P8M566j762j708K603j428j099L920n30m254K232L228k647n49J841k374
2237b68Q50L136k595l302M057R33k888L68N64k243K224K453m509j287L773o30
2253F36k054J952j14k482K730K09m263J922L141k442j739K119j345q30L670j550
2269d40l124L557P35k855Q76J712k011Q33K729k758j633L931q25k267K740O98
2285A898k561J130J624l552J299L519k182j764K440j352j939L732O29l547J010
$$ plain form
2300 384 1971 -878 168 2928 1 -1052 2413 871 -1773 885 1320 -1441 311 968 -2903 -1343
2316 -1343 1929 -1645 -2956 -305 -924 -2278 142 -1802 -4570 -339 1742 -2389 -2536 -373 -2136
2331 -2136 -887 1265 -1188 -2114 1674 745 -2634 335 2418 892 1256 1463 -1504 448 4656 2044
2347 2044 -1088 1107 1617 430 2365 1894 -590 1956 3211 -1156 -1079 2224 1371 -195 884 -710
2363 -710 -1671 1876 961 -3520 -1493 1384 -680 -1254 -682 -3163 -1913 2128 -392 -3633 -1162 -133
2379 -133 -2340 -553 367 -1729 33 1419 -2621 -2983 1698 1681 -330 225 -720 -2249 1711 2726 -1045
2396 -1045 -518 2277 369 -276 1924 19 -462 3172 1539 -1597 715 2394 -207 1013 1977 -128
2412 -128 675 2692 -546 -2295 2242 2197 -645 166 -900 -2634 303 2105 -1493 -2242 351 -1439
$$ packed form
2300C84J587k849J046K760k927j053L465j542k644K658M35k761J752O57l871J560
2316a343L272l574j311K651o19j354K420j944k768M231K081m131j47K163j763
2331b136J249K152k453r26L788r29l379K969K083j526L64K07k967J952M208k612
2347B044l132K195N10j187J935m71k484K546J255m367P7L303q53j566J079j594
2363g10r61L547r15m481K027K877k064n74N72k481J250M041k520l241K471J029
2379a33k207J787R20k096J762J386m040l62M681j7k011N55r45j529L960J015l771
2396a045N27K795j908o45K200j905m81L634j633l136K312J679k601J220R64k105
2412a28Q03K017l238j749M537m5k842Q11j066j734K937J802l598p49K593j790
$$ plain form
2428 -1439 -2506 467 -942 -1652 1041 -643 -4485 -1141 1966 -683 -1224 -275 -1913 -1266 2235 57
2444 57 -2151 1078 1705 -1100 471 724 -1178 1180 3047 -315 -806 2213 929 -570 2122 1455
2460 1455 -279 2079 1599 -1621 49 3117 1123 86 1196 -1596 -1526 2755 1325 -1341 172 584
2476 584 -2140 -162 1214 -1370 -228 1542 -1443 -2551 575 414 -1116 317 -339 -2399 146 1417
2492 1417 -2582 -1916 1154 -274 -1361 -141 -1840 -2221 1910 1459 -2355 -737 283 -1283 -260 1475
2508 1475 -522 333 2454 -536 -2417 1664 3224 742 1241 293 -1246 2072 3813 240 -1122 2140
2524 2140 1369 -194 1090 228 -496 2156 1580 -2636 -1283 1734 -299 -929 308 -1579 -1125 1204
2540 1204 -931 -3859 -344 1360 -1201 -1045 -993 -2998 -749 1851 -733 -2253 579 -571 -2483 114
$$ packed form
2428a439j067K973j409p10K693j684l842L344L107k649n41R49j638O47L501k178
2444E7k208L229O27k805J571K53j902K358J867l362m91L019j284j499K692o67
2460A455j734K358m80l220J670L068j994j037J110k792P0M281j430k666J513M12
2476E84k724J978J376k584J142J770k985j108L126j61j530J433o56k060K545J271
2492A417l999O66L070j428j087J220j699l81M131m51l814J618J020j566J023J735
2508A475j997Q55K121k990j881M081J560k482M99r48j539L318J741l573j362L262
2524B140p71j563J284q62p24K652n76m216J353L017k033o30J237j887M54K329
2540A204k135k928L515J704k561J56N2k005K249K600k584j520K832j150j912K597
$$ plain form
2556 114 727 -507 1362 892 -2617 -575 2934 1092 -253 1032 -399 -851 2629 1788 -1036 1177
2572 1177 2892 -109 370 1584 -345 744 2854 -123 -1539 1427 1288 -1233 310 1161 -951 937
2588 937 1543 -2390 -2183 1506 754 -945 -288 -1647 -2662 884 1035 -2154 -1334 360 -2026 -1812 343
2605 343 -1147 -1232 1433 -1033 -3426 187 1325 -713 -126 151 -1743 123 2510 -510 -1028 1920
2621 1920 1333 -167 1746 790 -787 1884 2582 -699 81 2155 53 -567 1749 706 -34 2097
2637 2097 567 -2499 111 2363 -198 -156 63 -2423 -1046 2054 -490 -2280 396 248 -1998 -563
2653 -563 -188 -2133 203 1090 -2799 -2646 888 78 -948 199 -1230 -1718 1530 990 -2407 -820 2098
2670 2098 298 -16 494 -1550 -315 2841 1017 -1575 1140 1634 -560 24 1471 -198 1685 2603
$$ packed form
2556A14O13j234J869m70l509K042L509j842j345J285j431m52L480q41k824K213
2572A177J715l001M79J214j929J089K110k977j416K966j39k521J543Q51k112J888
2588I37O06l933K07L689p52j699O57j359j015L546J51l189Q20J694k386K14K155
2605C43j490q5K665k466k393L613J138k038N87K77j894J866K387l020n18K948
2621A920n87j500J913r56j577K671O98l281P80K074k102o20K316j043p40K131
2637B097j530l066K610K252k561M2K19k486J377L100k544j790K676j48k246J435
2653e63L75j945K336Q87l889J53L534q10j026J147j429m88L248n40l397J587K918
2670B098j800l14N10k044J235L156j824k592K715M94k194N84J447j669J883R18
$$ plain form
2686 2603 -1148 -1373 1935 2233 258 894 -132 -1152 1678 1753 -1754 -350 2217 -203 -1114 656
2702 656 -632 -559 1786 -687 -3152 -302 1411 -1543 -1538 -361 -1677 -518 1035 -2333 -2841 821 1001
2719 1001 -1605 -692 -71 -1407 659 1506 -1817 -876 2333 -32 -1150 513 601 111 2017 1063 -1935
2736 -1935 831 3028 584 229 1414 -159 187 2387 332 -1149 2006 1914 -1169 157 1000 -590
2752 -590 438 1574 -1535 -1150 1303 -147 -2073 -179 120 -1703 278 -11 -2768 -1323 1156 -1070
2768 -1070 -1664 402 -1120 -1900 893 -368 -2205 513 786 -1798 -595 1270 -672 -300 1835 -492
2784 -492 -1312 1673 1004 -766 896 874 -929 893 1907 -769 -409 2147 365 -273 1633 133 -894
2801 -894 2073 1122 -1574 100 1798 -362 -23 762 -879 -268 1828 -408 -2762 548 927 -903
$$ packed form
2686B603l751k25L308K98j975O36j026j020K830P5l507J404K567k420r11J770
2702F56j288P3K345k473k465K850J713k954NJ177j316J159J553l368n08L662J80
2719A001k606R13O21j336K066Q47l323R41L209k365j118J663Q8m90J906r54k998
2736a935K766K197k444l55J185j573L46K200k055j481L155r2l083J326Q43j590
2752e90J028J136l109L85K453j450j926J894K99j823J981k89k757J445K479k226
2768a070n94K066j522p80K793j261j837K718K73k584J203J865j942L72K135k327
2784d92q20K985o69j770J662k2j803J822J014k676L60K556j782o38J906j500j027
2801h94K967r51k696J674J698k160L39P85j641O11K096k236k354L310L79j830
$$ plain form
2817 -903 -250 -381 -2193 -143 1529 -1859 -2310 532 -219 -1610 -174 -870 -1595 823 624 -2534 -1026
2834 -1026 1490 -108 -979 414 -621 -257 2151 237 -2226 1151 2239 -325 -20 957 -460 767
2850 767 2734 -396 -1021 2375 1665 -778 670 650 -89 2187 1609 -2085 -683 2293 551 -1206 163
2867 163 -756 -760 1367 -57 -2959 2 1570 -1666 -1551 -92 -1401 -342 1037 -1612 -2723 1046
2883 1046 1041 -1742 -1146 -127 -1319 426 812 -2068 -1457 1812 503 -1426 397 437 -451 1807 936
2900 936 -1688 750 2444 93 -468 1485 458 620 1813 -40 -1444 1639 1966 -615 122 1275
2916 1275 -339 260 1627 -1084 -1062 2060 637 -1811 -163 535 -1112 521 211 -2068 -925 1417
2932 1417 -944 -1898 -94 -878 -1508 461 -514 -2642 -645 572 -1731 -817 691 -1252 -291 1355
$$ packed form
2817i03O53j31j812K050J672l388m51K842p51j391J436o96p25K418j99l158J508
2834a026K516j598q71J393j035L64K408j914k463L377J088k564L05R77j417J227
2850G67J967l130o25L396p10k443J448k0p39K276n78l694J402K976j742j757J369
2867A63r19mK127j424k902K961J568l236J15J459j309J059J379k649j111L769
2883A046nk783N96J019j192J745L86k880O11L269j309j929J823M0q88K258q71
2900I36k624K438J694k351n61J953j027J62J193j853j404L083L27k581P37J153
2916A275j614N99J367k711K2L122j423k448J648O98j647J633l10k279J143K342
2932A417k361r54J804p84o30J969r75k128J997J217k303R14J508j943R61J646
$$ plain form
2948 1355 -495 -1553 1410 1221 -1197 348 1174 -436 1053 1840 -757 -412 2242 889 -131 1371
2964 1371 921 -362 1870 1623 -1138 530 1905 35 -357 1357 -522 -671 1283 -354 -2086 317
2980 317 958 -1422 -486 -70 -1140 -424 953 -1496 -2147 565 175 -1623 -286 -436 -1402 908 700
2997 700 -1967 -877 1496 -2 -831 376 -733 -694 1781 277 -1960 -89 1657 -361 168 878
3013 878 -470 750 2413 -143 -1177 1687 2089 -88 640 522 -355 1397 1864 -1532 -656 2022 776
3030 776 -917 463 -143 -29 1764 58 -2813 -355 1460 -549 -1496 -49 -1111 -364 1155 -1469
3046 -1469 -2646 692 1002 -1400 -1434 -440 -1044 168 743 -1724 -1612 1559 821 -1740 -366 112 -161
3063 -161 1447 622 -1948 -80 2496 594 -1052 940 194 191 1942 51 -1174 1517 2339 -474 -698
$$ packed form
2948A355j850j058K963j89k418J545Q26j610J489P87k597L45K654j353j020J502
2964A371m50j283K232k47k761J668J375j870l92J714j879j49J954j637j732K403
2980C17O41k380R36M16j070P16J377k449o51K712l90j798J337j50r66K310k08
2997G00k667J090K373j498q29J207j109L9K475j504k237J871J746k018N29P10
3013H78j348J220J663k556j034K864M02k177P28j18q77J752M67l396Q76K678j246
3030G76j693J380o06J14J793j706k871K458J815k009r47J447j062P47J519k624
3046a469j177L338L10k402l4R94o04J212N75k467J12L171p38k561J374M78k73
3063a61J608q25k570J868K576j902j646J992p46lJ751j891j225K691Q22k813k24
$$ plain form
3080 -698 1164 90 1124 1211 -968 -1019 1714 1162 -1678 -214 333 -545 607 490 -1921 -681 1693
3097 1693 -203 -1599 86 -537 -1201 128 -113 -1885 -154 910 -1756 -1449 -73 -347 -863 929
3113 929 -705 -1898 769 681 -1341 -81 1252 -545 -138 1281 -753 -247 2130 753 -910 872
3129 872 1124 8 1377 1430 -866 396 1871 80 -313 1027 325 -250 1649 -7 -1453 574 1111
3146 1111 -1071 -370 712 -1274 -315 803 -1335 -1563 670 127 -1876 -517 -502 -1765 496 591 -2176
3163 -2176 -1608 822 -66 -1105 33 -765 -978 1077 598 -1864 20 1442 -299 -401 820 -253
3179 -253 402 2058 -279 -1112 1559 1993 -517 7 957 -274 1076 1469 -1088 -962 1789 1164 -382
3196 -382 587 54 -662 876 556 -1551 364 1879 -734 -1775 -67 -504 -342 1284 -369 -2628 57
$$ packed form
3080f98J862j074J034Q7k179n1K733n52k840J464N47q78J152j17k411J240K374
3097A693j896j396J685o23o64J329k41j772J731J064k666L07J376k74n16J792
3113I29j634j193K667q8k022J260J333j797M07J419k034N06K377j377j663J782
3129H72K52j116J369N3k296J262J475j791l93J340p02n75J899j656j446K027N37
3146A111k182P01J082j986R59J118k138k28K233n43k003J359J5j263K261R5k767
3163b176N68K430q88j039J138p98k13K055m79k462J884J422j741j02J221j073
3179b53O55J656k337q33K671M34k510N24R50j231J350L93k557J26K751o25j546
3196c82R69n33p16J538l20k107J915J515k613j041J708m37J62J626j653k259K685
$$ plain form
3213 57 617 -1322 -1198 -311 -784 59 811 -1728 -1759 1232 681 -1263 -581 -94 -511 866 761 -1842 -106
3232 -106 2202 -10 -1245 424 185 424 2079 437 -1138 925 1840 74 311 1314 4 -73 1417
3249 1417 -368 -600 1791 1307 -1179 61 802 -474 569 987 -1577 -802 1303 -350 -1667 -97
3265 -97 -8 -778 332 -760 -1833 -334 1233 -1229 -1216 296 -465 -852 443 -840 -1463 1096 1113 -1681
3283 -1681 -779 972 -425 665 913 -993 -898 1678 885 -623 717 554 -377 637 1027 -636 499
3300 499 1685 596 -672 660 400 -446 1181 382 -1387 774 987 -614 -657 618 -584 -225 1146
3317 1146 -1094 -1652 600 372 -1286 45 20 -1637 -237 364 -1526 -956 1054 -627 -1552 -554 -265
3334 -265 -867 1017 199 -1977 -52 1488 -343 -386 848 -181 -152 1411 -230 -1093 1155 1220 -263
$$ packed form
3213E7N60j939J24Q87m73Q43P52k539l1K991n51j944O82M87m17J377j05k603J736
3232a06K308k212j235J669k39K39J655j642j575K063R15j766K37J003j310p7J490
3249A417j785k32K391m84k486J240P41j276J043M18k564P75K105j653j317J570
3265i7Q9p70J110j092j073J499J567k462J3J512p61l87J295j283o23K559J7k794
3283a681R02J751j397J090K48j906R5K576p93j508J340j63r31J014L90j663J135
3300D99J186j089j268J332k60q46J627p99j769K161K13j601m3J275j202L59J371
3317A146k240n58K252k28j658J331k5j657J400O01j890N70K010j681r25R98K89
3334b65o02J884q18k176J925J540j831m3J234j029K9J563j641q63K248O5j483
$$ plain form
3351 -263 229 835 -249 485 1600 -363 -563 1891 978 -850 51 569 78 1518 592 -1767 -450
3368 -450 1649 -114 -678 424 -320 -726 601 -590 -1856 670 1205 -1169 -1388 -124 -971 146 762
3385 762 -1327 -1789 543 528 -1213 -377 -230 -347 693 667 -1428 -758 1410 62 -768 675 440 -384
3403 -384 946 322 -1031 711 1949 -30 -629 873 347 438 1662 -357 -908 1124 1484 -403 418
3420 418 980 -322 80 687 -1307 -757 1634 137 -1764 -90 97 -526 314 -116 -1809 -429 1116
3437 1116 -814 -1744 70 -526 -604 443 -753 -1704 367 1015 -1171 -562 542 -378 -279 721 -542
3454 -542 -568 1767 815 -1272 388 795 -29 1133 1108 -466 196 1528 184 -279 1184 820 209 950
3472 950 313 -865 628 1639 -576 -365 535 -336 -142 946 -701 -966 651 474 -1336 -849 210
$$ packed form
3351b63M92O06j084P34J115j963k00K454r13j828R01N18m91J440r26k359J317
3368d50K099j763n64J102p44m06J327j191j266K526N35k374k19J264q47J117O16
3385G62k089m62K332j5j741Q36J47j17J040k6k095O70K168j348q30J443k35q24
3403c84J330o24j353J742J238j979n99J502n26R1J224k019n51K032L60j887Q21
3420D18N62j302M02O07j994N50K391j497j901J674J87o23Q40m30j693J380J545
3437A116j930r30J814n96p8J047j196r51K071O48k186O09J104r20R9J000j263
3454e42k6K335r52k087J660M07q24J162k5j574O62J332j344m63J463l64o11P41
3472I50o37j178J493J011k215K11R00q71J94J088j647k65J617j77j810M87J059
$$ plain form
3489 210 -1057 -150 325 -1520 -1165 501 -605 -1197 159 -111 -1125 118 -110 -1499 4 1407 -499
3506 -499 -1002 89 -134 -232 1230 82 -1181 800 1398 -370 79 973 186 593 1541 -644 -438 1414
3524 1414 1103 -523 451 399 -31 892 750 -871 -23 2091 232 -871 345 -188 -146 870 -306 -1755
3542 -1755 93 1098 -1155 -952 434 -668 -387 166 -1319 -1391 779 796 -1558 -773 114 -581 292 585
3560 585 -1331 -611 1585 251 -1239 253 565 -143 804 315 -1006 428 1883 153 -422 854 583
3577 583 494 1280 0 -590 1343 1492 -677 -421 810 -5 318 1068 -701 -1045 1112 270 -902 -161
3595 -161 288 -402 53 120 -1712 -558 965 -196 -1213 84 21 -383 178 -606 -1405 294 922 -1074
3613 -1074 -616 285 -201 -432 418 -461 -472 1363 579 -1118 410 1219 -74 488 588 -776 338 1854
$$ packed form
3489B10j267R07M75j845L55J666j106n92J356k70j014J243k28j389J503J403j906
3506d99n03J091k23r8J462j148j263J981N98j768M49Q94p87M07R48k185K06J852
3524A414l11j626R74n2m30R23j42j621Q48K114j859j103J216n33M2J016j176j449
3542a755J848J005k253K03J386j102K81N53j485p2K170J7k354P85Q87o95Q73K93
3560E85j916P20K196j334j490J492L12p08R47m89j321J434J455j730n75J276k71
3577E83q9P86j280n90J933J49k169K56J231q15L23P50j769l44K157q42j172P41
3595a61M49o90M55O7j832J154J523j161j017J297o3m04N61p84p99J699O28j996
3613a074M58R01m86k31Q50q79j1J835p84j697J528Q09j293N62J00j364J114J516
$$ plain form
3631 1854 438 -820 736 699 245 1188 455 -664 600 1235 -374 -318 803 88 -241 793 -359
3648 -359 -567 748 590 -1081 -618 76 -290 -280 311 -1272 -1221 725 -59 -1344 78 -240 -749 327
3666 327 167 -1302 -734 706 -730 -853 457 -148 -675 740 145 -975 723 1048 -378 -99 974
3683 974 170 102 1046 -265 -554 1372 889 -616 107 805 51 698 810 -1187 -124 1316 204 -815
3701 -815 358 236 -251 745 -73 -1866 29 1172 -368 -883 -198 -479 -327 670 -893 -1531 571 534
3719 534 -862 -580 -60 -450 86 221 -1431 -461 1192 490 -1247 -65 545 -145 546 538 -926 39 1699
3738 1699 163 -656 959 314 -14 898 -299 -832 1089 1658 -86 -132 1156 110 540 608 -209 -406
3756 -406 1220 381 -1103 -206 566 -212 235 22 -1431 -201 846 -501 -1428 401 260 -458 -97 -633
$$ packed form
3631A854j416j258J556l7m54R43p33j119J264O35j609N6J121p15l29J034j152
3648c59k08J315j58j671M63O94l66J0N91j583N1J946p84j285J422l18n09J076
3666C27j60j469N68J440j436j23J310o05n27J415n95j120J698L25j426K79J073
3683I74q04o8R44j311k89J926m83j505P23O98p54O47J12j997J063J440j112j019
3701h15J173j22m87R96q18j793J895J143j540n15O85k81J52R97j563o38K102l7
3719E34j396K82N20l90N36J35j652R70J653p02j737J182O10o90O91qj464R65J660
3738A699j536q19J615o45l28R12j197n33J921N69j744m6J288j046M30O8q17j97
3756d06J626q39j484Q97P72p78M47k13j453J230J047j347r27J829j41p18L61n36
$$ plain form
3774 -633 -1482 125 862 -791 -1116 377 117 -314 313 -626 -1074 654 537 -1205 -261 613 -15 506
3792 506 605 -624 127 1558 365 -750 777 673 153 893 691 -672 482 1535 -516 -582 904
3809 904 425 163 487 -104 -516 657 671 -974 -456 908 -665 -633 321 -549 -1096 398 -227 -1239 -183
3828 -183 -188 -929 -200 423 -1241 -527 199 -438 -961 33 157 -656 184 278 -1059 197 1024 -598 -268 959
3848 959 24 -108 963 -97 -182 1141 929 -410 242 576 -57 779 1061 -493 -140 1153 335 -674
3866 -674 767 366 -64 697 69 -1021 -17 956 -444 -606 214 -90 -403 361 -724 -1470 317 681
3884 681 -1187 -934 -217 -653 -191 291 -1027 -936 897 356 -663 -282 291 -136 460 121 -1009 -122 1422
3903 1422 -152 -850 709 636 103 547 333 -641 754 1199 -267 -328 1029 20 420 664 -329 -417 1187
$$ packed form
3774f33q49J607P37j653l25J493k60m31O27r39m48J728j17j742R44Q74o28N21
3792E06R9j229P51J431j193j115J527j04n20P40k02j363J154J053k051o6J486
3809I04m79k62L24n91m12J173J4j645N18J364j573L2R54q70n47J494o25j012J056
3828a83np41P29O23j664P14P26o37n23R94J24q13Q40R4j337J256Q27j622L30J227
3848I59r35j32J071j060q5J323k12j339O52L34o33Q36K82j554L53J293q18j009
3866f74J441m01m30P61o28j090J004R73j400j62Q20l04l13P64j085p46J787L64
3884F81j868K53P17m36M62M82j318R1J833n41j019L81N73m27N96l39j130Q87J544
3903A422j574o98J559p3n33M44k14r74J395M45j466o1J357j009M00K44r93q8J604
$$ plain form
3922 1187 569 -1088 -282 326 -546 273 252 -1103 -405 1164 -11 -1299 -145 -178 -374 124 -219 -1136
3940 -1136 -269 774 -1232 -1003 143 34 -442 29 -589 -875 432 398 -1116 -172 850 -23 -117 520
3958 520 -648 -408 1381 565 -631 836 883 367 591 404 -353 328 1390 -463 -551 1251 651 -108
3976 -108 428 -208 -794 485 1017 -900 -173 322 -134 -277 151 -175 -591 361 128 -1436 -168 200 -918
3995 -918 -364 85 -802 -487 267 -460 -1141 280 -124 -742 347 14 -767 18 919 -430 -220 293 -271
4014 -271 18 909 -137 -392 749 616 -624 468 974 -68 326 791 -294 -184 852 626 -405
4031 -405 391 501 -155 581 282 -415 -331 890 -552 -621 491 -249 -301 340 -443 -1233 -8 611 -957
4050 -957 -635 -98 -627 -467 155 -962 -854 756 324 -762 -395 -247 -508 473 99 -958 -319 1042
$$ packed form
3922A187o18j657Q06O08q72Q19k1j355O98J569j175j288J154l3j96M98l43r17
3940a136Q67J043k006K29J146j09m76M71o18k86J307l4j514R44J022q73r4O37
3958E20j168K40J789q16j196J467M7n16K24j87p57O81J062j853q8J802o00p59
3976a08N36o36n86J279N32j917P27M95m56j43M28l26m16R52k33j564J268L68j118
3995i18N54M49q87L15P54p27o81J421m04o18J089l33p81P85R01j349K10N13n64
4014b71K89Q91j046k55J141j33j240J092N06j042L94M65j085J10J036k26j031
4031d05P96J10o56P36k99o97Q4J221j442o9J112p40n2O41p83p90J225O19j568
4050i57L22N37n29J60O22j117J08J610m32j086L67J48k61R81l74j057O39J361
$$ plain form
4068 1042 217 -779 307 545 -129 744 72 -907 818 1154 -278 -396 906 71 206 373 -226 -499
4086 -499 1058 930 -664 32 397 40 180 417 -606 -584 961 -275 -911 -118 19 -429 -213 -205 -1102
4105 -1102 30 880 -811 -906 -86 -258 -382 417 -400 -861 519 165 -918 -352 640 -5 -163 230 -478
4124 -478 -353 996 171 -1031 361 995 -108 176 358 -375 326 990 -10 -750 481 16 -187 280
4142 280 255 -266 513 444 -730 -351 788 41 -303 259 -390 -641 434 338 -1010 10 -185 -465 -176
4161 -176 277 -826 -517 276 -619 -1153 135 44 -875 427 -43 -842 -104 427 -761 -579 687 -7 -433
4180 -433 15 163 -390 781 923 -464 295 666 38 78 1047 53 -166 824 33 -507 624 634 -307 467
4200 467 549 -645 116 849 -30 -516 452 -167 -426 473 -186 -1217 322 503 -715 -525 -44 -482 9
$$ packed form
4068A042q25r96J086K38o74Q73o72r79J725L36j432j18J302q35J35J67n99k73
4086d99J557j28j594O96L65l57J40K37j023K2J545j236o36P93J37m48K16Qq97
4105a102J132Q50j691r5Q20j72j24P99q17m61J380l54j083N66R92o45j58L93p08
4124d78J25J349q25j202J392O34j103K84J82p33P01O64j000p40J231m65k03M67
4142B80k5n21P79o9j174L79J139p47l44N62o49k51J075r6j348J020j95k80K89
4161a76M53j103L09P93q95n34J288r1r19J302m70p99P38N31j188J82J266o94m26
4180d33M48J48n53J171J42j387P59L71o28M0R69r94k19R90p91n40J131J0r41P74
4200D67Q2j194P61P33q79m86R68o19k59Q99o59j031J539J81j218J90M81m38M91
$$ plain form
4219 9 405 -563 -765 109 86 -1043 -110 197 -544 372 316 -1036 -513 865 463 -469 265 116 -185 712
4239 712 422 -669 636 1091 -150 -345 598 304 -31 613 -55 -417 1091 692 -484 -121 748 20
4257 20 15 411 -526 -450 738 107 -805 170 116 -522 171 -176 -859 -3 381 -627 -1048 238 -9 -356 70
4278 70 -641 -1078 -32 649 -663 -462 412 -128 -212 470 -353 -68 621 443 -808 180 125 -13 359 708
4298 708 -510 -95 1414 220 -521 744 470 -241 556 315 -567 760 816 -187 -231 468 -4 -93 285
4317 285 11 -476 722 291 -1145 -93 536 -487 -270 178 -909 -717 569 -81 -1069 81 180 -735
4335 -735 -211 -138 -616 66 472 -709 -552 367 27 -179 202 -116 -265 877 671 -318 -42 809 -78 211
4355 211 796 -7 -435 1000 359 -341 256 463 -364 367 631 -218 -435 1016 -4 -589 130 93 -145
$$ packed form
4219IL96r68k02Q74k3j129R33L07p41R16n6j352N23J378m02r32P34j49l01Q97
4239G12k90j091J305M55j241j95R43k94l35O44o68l62J508l99j176L63Q69p28
4257B0nL96r37P6J188o31r12R75n4o38O93l47o83Q56L84j008m21J286k47l47M26
4278G0p11m37J046O81j312K01Q74n40q4O82q23K85O89j78j251R88n5j38L72L49
4298G08j218M15J509j194p41J265k74p11P97k41q82J327N6j003m4O99m72q9L78
4317B85k74m87J198m31j436J052O29j023K17M48j087J92J286o50r88J150R9r15
4335g35N24P3m78O82M06j181J57R19l40k06L81l18j49J142k06r89K76Q51q87K89
4355B11N85q03m28J435o41p00N97K07q27P31K64q49k17J451j020n85P19l7k38
$$ plain form
4374 -145 428 -77 -725 -121 373 -652 -206 209 -446 -677 247 -490 -1175 502 52 -830 -218 194 -845
4393 -845 -289 384 -708 -474 282 -233 -645 224 303 -494 242 193 -704 83 1138 -106 -333 725 358
4412 358 14 526 320 -246 462 571 -415 -168 513 -77 117 543 -232 -109 810 134 -482 34 344 -120
4432 -120 -103 213 -644 -200 842 -351 -913 57 -56 -691 9 -236 -887 232 393 -930 -627 247 -208
4451 -208 14 143 -592 -717 350 165 -667 -172 680 148 16 576 -280 24 1158 -12 -622 678 804
4470 804 -153 438 368 -282 343 907 -178 -371 452 326 -25 274 -132 -145 544 680 -698 -395 623 -522
4490 -522 -412 367 -448 -386 498 -74 -963 75 329 -634 -198 85 -803 -174 748 -670 -478 37 -305 -487
4510 -487 236 282 -621 391 387 -626 -209 519 12 -261 891 206 -70 779 486 -532 80 582 -219 32
$$ packed form
4374a45N73n05o48O04M94j025M46M15o55k31R24p37o85J677m50q82O12M12j039
4393h45N56O73j092K34P56n15m12Q69P9p97P36m9q97P87J055j244k27J058l67
4412C58l44N12k06n66P08J09r86K47O81n90J94M26p75J23R19o76o16N16L10m64
4432a20J7L16q57M44J042j193n62R70j13o35P00k45o51J119J61j323L03Q74m55
4451b08K22J29p35j25J067j85q32M95Q52n32j32N60q56L04J134j170o10J300J26
4470H04r57N91p0o50O25N64j085j93Q23j26l51K99m06j3O89J36j378L03J018j145
4490e22J10P79q15O2Q84n72q89J038K54r63M36K83q88O29R22j418J92N15l42j82
4510d87P23M6r03J012mj013M17P28n07k73J152o85k76Q49k93j018O12N02q01K51
$$ plain form
4530 32 783 -239 294 1037 171 -285 562 256 -242 361 156 -737 50 524 -554 -670 232 -112 -362 73
4550 73 -186 -808 -45 113 -881 -305 254 -474 -342 158 -432 -440 524 -34 -575 -22 136 -201 322 423 -391
4571 -391 -203 727 -36 -364 628 240 -324 745 239 -262 595 863 -485 -6 830 287 289 686 15 -402
4591 -402 869 165 -566 264 412 -407 146 388 -630 -251 1017 -361 -840 436 75 -369 145 -78
4609 -78 -812 104 357 -768 -564 285 -607 -274 215 -68 -779 344 394 -611 -447 528 -615 -67 379
4628 379 -296 -8 937 -141 -537 713 451 96 431 395 -291 337 797 65 -291 561 599 -108 557 -22
4648 -22 -306 362 608 -638 -268 326 -113 -230 431 -585 -647 598 -90 -972 229 205 -578 -336 -74 -553
4668 -553 -159 352 -260 -678 313 127 -311 72 197 -593 0 373 -493 -347 325 32 -207 553 -108 -10
$$ packed form
4530C2P51j022N33P43q66m56Q47l06m98O03k05q93P87M74j078j16R02l44k50M35
4550G3k59o22P63J58r94N76N59p28J32N00n90qR64n58n41N53J58l37N23J01q14
4571c91J88R30p63l28R92l88n64J069n06n01Q57K68j348M79Q36n43KL97o71m17
4591d02J271p04p31Q30J48q19N53K42j018L79J268j378m79J276l61m44N14k23
4609g8p34R16K53j125K04Q49q92L33M89k83p11J123N0j005J64R75j143N48M46
4628C79o75K88R45j078l96J250k62l55L35l6o86O28M60p32l56Q52L8p07O65n79
4648b2k84O68K46j246L70N94m39j17O61j016o2J245o88q82J201k4p83K42K62m79
4668e53L94N11o12m18R91j86m38L83J25p90N93L73q66J46O72k93k39P60o61R8
$$ plain form
4688 -10 676 652 -385 401 577 -160 212 570 -73 -160 904 -16 -291 838 340 -602 561 69 -358 -40
4708 -40 444 -435 -402 7 -323 -397 396 -204 -951 71 48 -654 -503 14 -377 -354 330 -551 -163 137 -8
4729 -8 -417 -66 590 -626 233 417 -596 -26 411 79 -414 390 239 -256 256 391 -110 350 804 -195
4749 -195 39 556 192 -20 673 -55 -330 821 640 -408 307 461 -68 285 374 -394 -397 429 -99 -663
4769 -663 84 190 -385 106 151 -477 217 212 -621 -846 95 -75 -371 376 -115 -684 194 382 -442 -103 301
4790 301 -79 259 120 -312 -182 511 247 -173 88 548 38 540 309 -479 125 1144 199 -318 504 211
4810 211 -224 217 131 -470 602 438 -424 -315 341 -519 -343 317 -172 -609 263 146 -638 -68 496 -562
4830 -562 -334 131 -470 -407 452 -195 -783 157 13 -601 163 192 -302 -194 767 -447 -251 363 -192 -354
$$ packed form
4688a0O86k4j037P86J76p37L72L58o43q7J064r20k75J129m98r42J163m92m27L18
4708d0M84q79L3M09l30p4P93o00p47J022k3p02J51N17l91K3O84q81L88L00j45
4729hm09L51O56j216Q59J84j013N70M37l32m93Q04j51m95N12J35n01M60M54r99
4749a95K34N17l64k12O93p28k75J151j81j048P15J54n29L53Q9p68lQ26n28n64
4769f63P47J06n75M91M5o28O94nq33k25R41j70k96P47m91n69Q78J88q24L39M04
4790C01l80L38j39m32J30O93k64m20K61M60n10N02k31p88O04J019r45n17Q22k93
4810B11m35M41q6o01J072j64q62J09O56q60J76O60m89m37Q72j17p84N70N64j058
4830e62K28M65o01O3Q59o47n88R40j44o14P64K9m94J08R61j214J96O14n55j62
$$ plain form
4850 -354 395 -182 -489 309 422 -352 50 409 177 153 540 -76 31 860 45 -146 468 375 -339 399 383
4871 383 75 -98 435 -537 -101 281 -89 -230 448 -401 -823 -104 631 -739 -226 -208 -495 -266 335 -346
4891 -346 -636 180 -374 -754 -166 189 -650 -366 169 -547 52 277 -249 -195 260 296 -122 365 438 -299 198
4912 198 304 -17 -64 630 -4 28 582 -142 7 532 760 -278 -254 84 36 -2 166 199 -335 315 -255 -403
4934 -403 170 109 -320 -91 145 -653 -176 229 -297 -628 11 -144 -430 40 -320 -818 198 70 -381 -387 453
4955 453 -192 -49 272 -114 -400 292 135 -461 415 254 -135 123 414 -14 345 566 189 -298 375 484
4975 484 -242 473 183 -137 -33 625 -532 -107 570 -117 104 338 -294 -85 316 -92 -603 -545 163 -412
4995 -412 -210 -96 -397 -255 344 -295 -795 222 -128 -565 250 55 -517 -42 293 -430 -250 231 -269 -350
$$ packed form
4850c54P49n77l07P98J13p74M02L59k32k4L87o16J07Q29q15j91O14r3p14P38j6
4871C83l08j73N33r72M36L82l70j41O78q49m22P19P35j370N13J8k87K29O01o81
4891c46k90Q16n54l80N88L55q39K84N35p16N99K25n26N4M55L6m18M87P3p37M97
4912A98J06l21m7O94o34L2N54p24J49N25K28j038K4L38m8l8J68L3n34O50n70j48
4934d03N73o1m29K29K36p98M77M05n26l31O39j55k86M70l60m98J016j28m51oQ40
4955D53o45J43L21l86k86O92j57n96Q76j61l89K58K91m28L59K21l77m87O73J09
4975D84p26P15k90l20J04O58j157M25O77o87K21K34o32K09M01m08n11N8P08n75
4995d12K02J14l01J42N99o39n00J017l50m37Q15j95n72M75L35p23J80M81n00q1
$$ plain form
5015 -350 322 32 -42 769 164 -458 -149 388 19 39 303 40 -146 456 279 -35 -3 456 -142 238 314
5036 314 -468 -34 157 -304 102 532 75 -597 477 417 -174 27 69 -278 -227 359 -54 -221 -8 -57 -684
5057 -684 38 -133 -722 -223 218 -641 -131 92 -192 -456 399 122 -262 292 166 -405 423 441 -216 274
5077 274 97 -17 -90 563 -55 -67 370 37 69 537 719 -161 446 457 -51 -68 734 -25 -103 495 48 19
5099 19 201 525 -319 79 17 -464 -547 -18 -400 -343 -34 175 -536 70 -160 -782 174 -75 -538 -495 112 19
5121 19 -103 -224 -200 -304 482 127 -342 42 340 -196 -76 333 -295 17 645 183 -278 303 170 286 376
5142 376 113 -95 317 458 50 71 170 199 -53 338 295 -346 535 82 -440 179 179 -217 -354 194 -423 -373
5164 -373 -103 -51 -430 197 -261 -548 -48 64 -329 163 241 -175 -32 178 -75 -295 278 272 -465 156 277
$$ packed form
5015c50O72k90p4Q11o05o22L09N37l69K0K64k63j86O02j77l14L2M59n98L80P6
5036C14p82M34J91m61M06M30m57o72J074o0n91K01M2l47N1N86m13j67K13m9o27
5057f84P22j71n89M99M41q59N10K23k84k64Q55k77l84N54j26n71Q28J8o57M90
5077B74j77j14p3O53o18j2M37l33L2M68J82q80O07J1n08j7Q02p59p8N98m47k9
5099A9J82L24q44L98o2m81q3N29l82N7L09K09p11O06k30o22R56k49m63M3O07r3
5121A9j22j21K4j04P86l55m69L84K98n36J20M09o28L12O28m62m61N81j33J16R0
5142C76k63k08M12J41m08K1R9K9k52L91m3o41Q81m53n22O19%l96j37N48o17N0
5164c73K70N2l79O27m58k87N00J12l93M92P8m16J43K10k53k20N73op37O21J21
$$ plain form
5185 277 -109 166 436 -19 -235 139 67 57 268 339 7 266 274 -193 -36 553 137 -83 351 -102 -170 359
5207 359 151 -456 507 356 -120 -517 365 -362 -358 362 -181 -246 195 33 -357 142 -44 -624 -71 213 -421
5228 -421 34 320 -404 -327 422 -3 -276 94 251 -224 173 229 -271 -214 278 -215 -124 467 -16 -243 532
5249 532 314 -83 522 457 -96 130 317 -5 -27 224 103 -264 569 222 -638 122 342 -314 61 322 -178
5270 -178 -344 686 -173 -387 172 -152 -625 38 -33 -362 120 118 -574 -470 152 -347 -63 282 218 -719 482
5291 482 87 -523 45 227 -91 -299 370 -209 92 400 104 -598 404 304 -12 385 222 -515 225 533
5311 533 -25 -451 502 202 46 -19 -347 -364 -22 129 -360 -276 255 -18 -134 -134 -293 -306 309 -235 -493 215
5333 215 -310 -757 -117 21 -382 -353 351 -208 -565 91 98 -459 391 134 -107 412 18 -387 -166 482 34
$$ packed form
5185B77l86K75K70m55k16L74p2j0K11P1l32K59Qm67J57N89m16k20M34m53o8N29
5207C59k08o07R63j51m76l97Q82p27MP20n43o5M41j62l90M99j86n80N53K84o34
5228d21M55K86p24P7P49m25k73L70J57m75L97N6n00N7M92m93R1N91m83k27P75
5249E32k18l97O05o5n53K26J87l22k2K51j21l67Q33l47q60P60K20o56L75K61n00
5270a78j66J030q59k14N59l24m73O63p1l29M82ko92J04O22m99K84L45o4r37J201
5291D82l95o10N68J82l18k08O69n79L01L08k96p02J002j00l16L97j63p37P40L08
5311E33n58m26R53l00j56o5l28j7L42J51m89Q4N31k73j16%j59j3O15n44k58P08
5333B15n25m47O40J38m03K9P04n59l57O56Pn57Q50k57k41N19l94m05K21O48m48
$$ plain form
5354 34 -112 386 245 -406 369 156 83 113 520 -210 -222 577 -10 -35 411 502 -205 232 168 -86 -19 159 -102
5377 -102 -44 231 -3 -124 246 -55 -399 305 -161 -580 -19 132 -437 193 176 -421 -370 -30 -233 -265 395
5398 395 62 -439 128 99 -544 218 168 -155 -259 399 -180 -31 393 -21 -60 359 262 -57 71 283 62
5419 62 7 434 274 -396 343 57 -315 420 6 -169 65 294 -259 34 343 -338 -302 364 -194 -192 201 -31
5441 -31 -200 268 174 -239 166 348 -239 -234 168 -56 -424 317 119 -211 186 343 -399 -85 17 -232 -110
5462 -110 -107 -205 -32 436 136 -156 223 135 -55 292 184 -138 101 521 -313 -44 221 214 117 179 430 -47 8
5485 8 430 -186 62 439 -130 -167 190 -157 -117 460 227 -425 -174 -32 -494 -168 311 -42 -341 19 -75 -424
5507 -424 276 -34 -365 266 211 92 -47 -147 -475 -559 596 -303 104 287 -175 -73 234 218 -365 218 353
$$ packed form
5354C4j46M98j41o51P75k13p3L0M07p30j2P99n87k5M46R1p07M37o4k54O7J78k61
5377a02N8K75k34j21L70l01l44P04m66m19N61J51n69O30j7n97N1L40k03l2O60
5398C95l33n01N67k9o43P62n0l23j04O58n79J49M24m14l9M19r7l19J28K12k21
5419F2n5M27j60o70P39k86l72P35m14j75K34K29n53K93L09o81L6O66n58KL93k32
5441c1j69M68r4m13M05J82n87NM02k24l68P41j98l30L97J57p42L14J02k49J22
5462a10Lr8J73M68l00k92L79q8j90L47j08l22K39M20q34K69K65pr7O2K51m77N5
5485HM22o16K48L77n69l7L57l47M0N77k33o52K51J42m62L26M79l53k99L60r4l49
5507d24P00l10l31O31n5j19j39j00l28q4J155q99M07J83m62J02L07j6n83N83J35
$$ plain form
5528 353 244 65 526 232 -163 234 373 41 472 274 67 49 208 89 47 424 46 -240 250 274 64
5549 64 301 18 -151 238 511 -238 -83 429 27 -12 140 -193 -402 62 -367 -340 65 -238 -309 106 95 -438
5571 -438 101 18 -15 -64 170 22 -306 86 331 -140 244 171 -321 -40 409 -36 -15 304 354 14 507 335
5593 335 103 270 203 -149 5 113 -63 174 259 256 -488 277 14 -120 -119 161 -247 -161 212 -381 -351 -63 -268
5616 -268 -290 256 179 -441 58 -2 -303 -77 -117 -316 -251 388 204 -61 124 240 -429 117 192 -268 97 225
5638 225 -292 220 8 30 573 144 422 -169 258 -160 -138 218 267 -178 57 319 -218 -255 434 -23 -57 61
5660 61 217 -92 -173 -37 -255 173 -109 -180 -367 178 -177 -517 176 -276 -656 -32 -194 -626 -162 229 -264
5681 -264 -56 5 143 -84 156 -42 -78 266 38 -251 -23 341 30 121 352 224 -157 467 -50 -152 187
$$ packed form
5528C53j09j79M61k94l95L97J39l32M31j98k07j8J59j19m2L77l78k86M90K4k10
5549F4K37k83j69L89K73p49J55N12m02l9J52l33k09M64m29K7M05l03p1M15j1n33
5571d38N39q3l3m9K34j48l28L92K45m71L84p3m92K81M49m45K1L19N0l40M93j72
5593C35k32J67o7l52J54J08j76K37Q5lp44P65k63j34JK80m08Q6L73n93L0K88k05
5616b68k2N46p7o20M99o0l01K26m0j99O5O39j84k65J85J16o69N46P5m60L65J28
5638B25n17N12k12K2N43m29K78n91M27m18K2L56M9m45K35K62n37l7O89m57l4J18
5660F1J56l09q1J36k18M28k82p1j87N45l55l40O93m52l80O24j62m32M64L91m93
5681b64K08O1J38k27K40j98l6L44k28k89K28L64l11R1K31j28l81O24n17j02L39
$$ plain form
5702 187 305 -56 16 636 95 -33 366 -30 98 584 1 -538 315 23 -226 -68 -93 6 -151 110 -63
5723 -63 -254 -81 -318 -407 141 -141 -274 -271 -253 -428 -34 52 -466 -122 226 -211 -5 51 170 -460 302 419
5745 419 -155 130 140 22 145 615 -72 -91 234 68 -154 100 40 -233 87 517 -278 -4 218 -105 -78
5766 -78 197 166 -305 195 95 -133 -25 153 -53 -144 25 -171 -291 74 -169 -175 333 -183 -324 84 131 -116
5788 -116 115 501 -276 -118 63 272 -294 107 -99 -115 340 492 -112 11 338 -243 12 556 13 9 431
5809 431 125 131 302 303 -240 79 232 76 -65 271 -39 -215 177 199 -397 332 221 -214 202 -70 -390 40
5831 40 -8 -255 32 158 -80 -510 152 -138 -195 -64 -58 -170 -156 605 -263 -332 256 147 -367 184 212 -340 207
5854 207 -56 -310 288 555 -291 50 430 45 64 257 73 -128 290 582 -334 -150 313 -196 161 325
$$ packed form
5702A87J18l61P2O20n41j28L99l96J28M86n83n39Q53k92k49J58k5R9j57K61j73
5723f3j91J73k37q9N48k82j33LJ8j75L94Q6n18L44L48m37K06N6J19o30P62J17
5745D19n74K85J0j18J23M70o87j9L25j66k22K54o0k73L20M30p95K74K22l23K7
5766g8K75l1m71N00j00k28J08J78k06r1J69j96j20L65k43oN08n16j41M08M7k47
5788a16K31L86p77J58J81K09n66M01k06j6M55J52o04J23L27n81K55N44n43mM22
5809D31l06OJ71Jn43L19J53j56j41L36l10j76L92K2n96P29j11m35M16k72l20M30
5831D0m8k47K87J26k38m30O62k90n7J31Oj12J4P61q68o9N88j09n14N51K8n52N47
5854B07k63k54N98K67q46L41L80l85J9J93j84k01M18K92r16J84M63n09L57J64
$$ plain form
5874 325 -153 -117 142 -340 -255 150 -162 -334 -165 82 -203 58 153 -136 -114 209 -79 -197 94 -108 -253
5895 -253 207 222 -160 55 130 -293 -489 282 -170 -21 -46 53 -262 194 550 -238 114 219 -50 -128 256 -54
5917 -54 -313 245 2 -230 53 275 -161 -25 500 -70 62 59 33 -368 266 177 -192 159 146 -374 -34 218
5939 218 -300 -367 144 -178 -44 93 -79 -20 35 -123 -373 26 99 -352 -260 -167 -322 -51 296 31 -310 97
5961 97 -137 -95 183 358 -465 -22 16 24 31 162 183 -94 373 297 -139 311 192 226 -28 336 -23 -22 386 -67
5985 -67 178 217 -112 -314 323 -9 -140 288 153 -302 30 255 -207 -176 99 -67 -359 188 -41 -484 16
6006 16 -59 -509 -174 -8 -331 -214 31 -81 -214 145 187 25 384 230 145 28 83 43 -80 171 20 57
6028 57 105 -187 -185 87 62 5 256 459 148 349 302 -345 -454 285 251 -436 21 245 -246 14 194 -189 -249
$$ packed form
5874C25m78L6K59m82Q5M05l12j72J69K47k85K61R5k89K2L23k88j18K91k02j45
5895b53M60J5l82K15P5m23j96P71m52J49k5R9l15M56L56p88L52J05k69p8L84l10
5917e4k59N58k43k32K83K22m36J36N25n70J32lk6m01O34q9l69L51j3n20L40K52
5939B18n18o7N11l22J34J37j72N9N5j58k50L99P3m51R2R3j55K71L47k65l41M07
5961I7k34M2K78J75q23M43L8QPJ31K1k77M67p6m36M50j19L4k54L64l59JM08m53
5985f7K45L9l29k02O37l32j31M28j35m55L32K25m62L1K75j66k92N47k29m43N00
6006A6p5m50L35J66l23J17K45j12j33L59M2j62L59j54q5j17N5m0j23K51j51L7
6028E7M8k92KK72k5n7K51K03l11K01m7o47j09P39l4o87M57K24m91K60J80l83o0
$$ plain form
6051 -249 336 -210 -98 154 -106 -279 -81 -51 -457 95 233 -270 191 75 -236 -285 139 -76 70 -96 -8
6072 -8 22 -88 26 -26 -20 -110 -154 -28 214 71 -155 320 234 -3 234 258 -110 -77 302 94 22 344 -105 -126
6096 -126 325 264 -20 388 336 -349 15 275 -245 -205 177 -50 -167 306 -15 -468 192 132 -393 -305 -125 -425
6118 -425 -72 -177 -185 -92 286 95 -92 191 -33 -135 71 264 -239 281 100 -64 78 373 -42 -33 144 72
6140 72 -126 192 332 -107 142 361 -171 -350 504 324 -27 160 72 9 365 101 -13 -254 -45 -226 28
6161 28 127 -126 68 74 -100 -300 -57 46 -446 -232 106 -271 5 85 -68 -237 274 70 -273 44 247 -258
6183 -258 -76 360 0 176 168 22 -226 76 139 -27 62 133 177 143 131 -81 66 279 -71 -108 331 -72 -308
6206 -308 14 157 -112 321 111 -278 179 281 -463 231 291 -38 -299 129 130 -282 -136 49 -246 65 415
$$ packed form
6051b49N85n46J12K52k60j73J98L0m06N52J38n03M61j16l11m9M24k15J46j66Q8
6072hL0j10J14n2Or0m4J26K42j43k26M75q6k37K37K4l68L3L79k08p2L22m49k1
6096a26M51o1k84M08n2o85L64K60n20M0L82k27j17M73l21m53O60o0n25Q8J80l00
6118d25L53j05qR3L78j91j87K83k24j02K06J93n03N20j81j64J42K95m15RJ77p2
6140G2j98L18J40m39K49K19n32j79Q54j80l51J87q8o3L56k64j14k41K09j81K54
6161B8R9k53J94Oj74k00K43J03m92K14L38l77K76Q0j53j69N11k04l43L17K03n05
6183b58J82M36l60J76qj46k48L02O3j66Q9P1M4l4j2k12J47K13l50l7M39m03k36
6206c08L22J43k69M33k10l89M57J02p44O94O0l29k61M28Jm12J46J85k95L11L50
$$ plain form
6227 415 -178 -272 396 -252 -260 30 -21 -165 87 80 -244 116 93 -200 -29 200 262 -88 274 70 -483 37 211
6250 211 70 213 378 -133 -166 -35 -218 -92 36 233 108 276 54 -346 338 555 -215 -98 297 -149
6270 -149 148 49 100 -161 122 144 -258 -172 63 -337 -313 405 -369 -55 199 -352 -212 -38 81 -352 -238 131
6292 131 -309 7 -88 -498 -27 362 -356 -65 377 217 -125 101 70 127 -83 202 141 -23 306 79 -18 -25
6314 -25 292 259 324 202 -281 86 -97 200 -37 333 -167 -385 259 44 81 122 -163 -88 106 -209 -348 65
6336 65 344 130 -235 327 -182 27 330 -98 -403 32 205 327 -193 -93 -190 87 1 11 -101 3 161
6357 161 -255 -318 85 -140 182 16 -169 -164 389 -75 -64 129 2 -12 -112 -39 -266 153 99 14 51 -62 296
6380 296 -176 321 -53 -301 200 237 65 127 -106 -92 110 46 -169 -306 -74 59 -221 37 -216 -421 84
$$ packed form
6227D15n93r4O68o48qK90n1j44K52pl24L60k3k93J71K29O2l50L62k04n53N20J74
6250B11j41J43J65n11l3J31j83J26J28J97j25J68k22m00O84K17p70J17L95m46
6270a49K97r9N1k61K83K2m02Q6K35m00K4P18p74L14K54n51J40J74J19m33J14L69
6292A31m40L16r5m10M71L89p18K91M42j60l42K26l1N7k10K85o1j64L29k27r7p
6314b5L17l3O5j22m83L67j83K97k37L70n00k18O44k15L7M1k85P5J94l15j39M13
6336F5K79k14l65N62n09K09L03m28l05M35J73J22n20J00r7K77q6J0j12J04J58
6357A61m16o3M03k25L22j66j85NN53m64J1J93j27j4j00P3k27M19n4q5L7j13L58
6380B96m72M97l74k48N01L7j72O2k33J4K02o4k15j37K32J33k80K58k53k05N05
$$ plain form
6401 84 -36 -324 83 347 -209 -100 59 -32 -181 104 128 -329 4 -135 -63 320 360 -254 -254 402 -148 58
6423 58 359 -205 7 112 308 -58 155 -6 -125 356 175 50 145 19 -172 -63 106 -54 -176 -22 -9
6444 -9 -97 -82 -19 -190 86 130 -152 -184 218 164 -235 153 160 -89 106 151 135 -283 -97 168 -138 297 54 -16
6468 -16 11 -58 -111 -34 157 -59 -30 56 97 -23 216 86 -51 416 36 -268 27 142 -108 190 92 -119 -134
6491 -134 79 -166 160 436 83 -152 -220 -147 -104 217 146 -147 -310 -4 222 -94 143 37 -360 130 -22
6512 -22 -60 -8 -22 -98 117 -6 -172 -218 37 221 39 73 176 13 306 149 24 -247 560 55 -299 285
6534 285 15 34 525 -74 54 239 199 -308 19 198 -218 -42 431 84 -195 257 260 -36 -89 34 -52 -21
6556 -21 127 -284 -124 397 8 -11 -284 -29 -245 255 -70 -81 -281 251 -291 -156 326 -190 -255 102 -79
$$ packed form
6401H4j20k88M07K64n56J09J59r1j49K85K4m57L33j39P2L83M0o14%O56n50K06
6423E8L01n64K12J05J96l66K13j61j19M81j81j25R5j26j91J09J69j60j22J54J3
6444iq8J5O3j71K76M4k82l2M02n4l99L88Pk49J95M5j6m18J86K65l06M35k43p0
6468a6K7o9n3P7J91k16K9Q6M1j20K39j30j37M67l80l04K95J15k50K98r8k11j5
6491a34K13k45L26K76l53k35o8P3M3L21p1k93j63L06K26l16K37j06l97M90j52
6512b2l8N2j4p6K15j23j66m6K55J84j82L4J03j63K93j57j25k71Q07n05l54N84
6534B85k70J9M91n99J28J85m0n07L27J79m16J76M73l47k79M52Lk96n3J23q6L1
6556b1J48m11J60N21l89j9k73K55k16N00l25j1k00N32n42J35M82n16o5L57j81
$$ plain form
6577 -79 -265 -136 -37 -114 -123 169 -220 -139 279 -301 -274 45 150 -269 108 118 -152 399 174 -121 -74 102 -31
6600 -31 -141 438 245 -5 -26 121 -340 -169 285 -384 108 17 -370 131 -7 -69 -33 399 -225 -282 182 -291
6622 -291 -248 -11 7 76 -325 -13 -90 83 -396 -203 84 14 80 1 -66 141 46 -93 289 213 -271 118 300
6645 300 -89 -37 57 19 -20 82 10 14 367 -89 187 378 -40 36 -65 139 -14 177 -114 -41 -142 445 204
6668 204 -329 82 178 -285 -228 194 -130 93 -32 -9 -400 -181 -263 -434 14 -73 -306 176 50 -344 -33 156
6690 156 -371 -9 -40 -260 352 465 -28 124 -35 176 -243 458 191 22 422 228 -4 109 102 180 -23
6711 -23 367 59 -52 115 341 19 -4 -304 41 -61 -169 -146 -150 204 -186 -469 7 -38 -215 -180 -26 -126
6733 -126 -83 121 -116 -204 184 -240 -17 -128 -47 -25 -4 41 -112 -249 53 -38 -228 61 139 206 385 145 -162
$$ packed form
6577g9j86J29R9p7rK92l89Q1M18n80K7L19J05m19L77J0k70N51k25k95M7J76j33
6600c1j10N79j93k50k1J47m61J71M54o69M92r1l87N01j38o2L6M32o24n7M64m73
6622b91M3K37J8O9m01L12p7J73m79J93K87p0O6p9o7K07r5j39L82p6m84L89J82
6645C00l89N2R4l8l9J02p2ML53m56K76J91m18P6j01K04j53J91k91P3j01N87k41
6668B04n33M11R6m63N7M22l24K23j25K3l91K19q2j71M48q7k33M82j26l94L11J89
6690A56n27L62l1k20O12J13m93J52j59K11m19P01k67j69M00j94k32J13pP8k03
6711b3L90l08j11J67K26l22k3l00L45j02j08K3mL54l90k83M76m5j77L5J54j00
6733a26M3K04k37q8L88m24K23j11Q1K2K1M5j53j37L02r1j90K89P8O7J79k40l07
$$ plain form
6756 -162 20 111 -120 149 61 -8 -18 54 202 115 319 -38 -21 288 -215 62 318 162 17 -171 119 -293
6778 -293 -118 -161 23 -146 -89 110 -88 -9 93 -181 -402 2 -54 -397 29 -145 -208 -60 -82 -462 191 161
6800 161 -15 -56 87 -170 11 237 56 -145 151 53 -122 161 356 -180 211 90 -134 73 101 40 88 364
6822 364 448 -237 126 34 83 -85 -62 402 -226 231 38 -36 73 -45 -451 183 -128 -107 -57 -90 -430 -315 -266
6845 -266 -81 -346 122 -89 -160 95 -99 -103 65 47 50 -36 -189 51 7 274 3 -460 208 58 3 307 231
6868 231 23 68 225 -31 264 -49 445 -108 272 89 40 333 426 129 87 50 68 14 51 24 -185 125 64
6891 64 -198 -332 209 -343 16 159 -356 40 333 357 19 169 -542 -356 31 275 -77 116 143 37 56
6912 56 97 83 -170 622 16 -468 47 353 -139 -42 68 -3 -69 236 -121 82 384 119 -244 267 225 74
$$ packed form
6756a62J82R1k31K69q8o9j0P2J48q7K04l57J7L09n03K77K56j56j45j88K90m12
6778b93J75m3J84j69N7J99j98P9J02k74k21M04n6l43M26j74o3J48k2l80O53l0
6800A61j76m1J43k57J81K26j81k01K96r8j75K83J95n36L91j21k24K07K8o1M8K76
6822C64Q4o85L63r2M9j68K3M64o28M57j93p4J09j18m06O34l11K1N0l3l40J15M9
6845b66J85k65M68k11p1K55j94mJ68j8Lq6j53K40m4K67k71m63O68j50n5L04p6
6868B31k08M5J57k56K95l13M94n53L80j83m9K93R3k97m2l7J8n4L7k7k09L10o1
6891F4k62j34N41n52L59J43n15L96K93K4l38J50p11J86L87K44l52J93K7j06J9
6912E6M1j4k53P92o06m84N15L06m92R7J10p1o6L05l57K03L02k65l63N11m2j51
$$ plain form
6934 74 47 190 -74 -140 335 208 -216 223 25 41 61 -89 75 108 363 -279 32 191 -296 -7 132 -123
6956 -123 24 -143 -49 -216 24 -98 -50 414 65 -36 -37 168 26 45 63 -46 -37 53 -18 -129 130 466 55
6979 55 12 165 64 186 37 -9 -242 142 261 31 223 293 119 195 181 23 190 -72 167 -49 12 154
7001 154 -279 128 -107 -197 -51 -74 -336 -237 24 -100 -330 22 -159 -140 -132 53 -74 -101 178 -149 -95 153 187
7024 187 -297 151 -4 -148 100 151 190 333 127 -27 -122 131 143 -19 0 -40 -58 112 153 -393 38 290 2
7047 2 -198 102 -89 -325 187 139 -222 131 -211 -225 -57 24 -183 -75 -275 -277 -188 158 202 -93 65 -294 -23
7070 -23 -155 103 -196 20 45 -120 -34 228 -239 -97 346 24 -120 237 -28 2 130 179 -377 42 344 4
7092 4 122 171 405 73 292 341 -38 146 -5 -228 294 492 143 -104 -36 132 -147 126 73 95 -56 298
$$ packed form
6934G4k7J43k64o6M75j27m24M39j98J6K0j50J64L3K55o42L11J59m87K89J39k55
6956a23J47j67R4j67K40j22M8M64l49j01jK05j42J9J8j09RR0p1j11K59L36m11
6979E5m3J53j01J22j49m6k33L84J19k30J92P0j74P6j4j58J67k62K39k16O1J42
7001A54m33M07k35r0J46k3k62R9K61j24k30L52j81J9QJ85j27k7K79l27N4K48L4
7024A87m84M48j55j44K48N1L9J43k06j54r5K53J2j62J9m0j8J70M1n46M31K52k88
7047Bk00L00j91k36N12m8l61L53l42j4J68Q1k07J08k00kQ9L46M4k95J58l59K71
7070b3j32K58k99K16K5j65Q6K62m67J42M43l22j44L57k65L0J28M9n56M19L02l40
7092DJ18M9K34l32K19M9l79J84j51k23N22J98l49k47O8J68k79K73n3K2j51L54
$$ plain form
7114 298 -327 -125 326 -91 -99 176 -59 186 -234 131 -412 -248 -33 -310 46 -16 -334 -46 311 -46 -131
7135 -131 239 260 -290 -193 -66 -183 85 318 -21 -113 440 -22 133 79 -369 -134 276 272 98 -74 287 -14
7157 -14 -189 223 -176 -196 180 196 -240 20 117 87 372 166 -323 163 534 -238 28 -246 207 -84 -367 -78
7179 -78 -199 243 212 -224 158 -64 -174 -6 121 159 -338 249 91 -72 65 93 -15 -95 9 -216 16 21
7201 21 48 22 62 235 125 323 236 -24 50 262 -30 -151 197 -24 -108 14 108 -251 -10 -55 24 -142 -24
7224 -24 200 -94 22 -180 -301 132 224 -178 -41 262 -151 -70 224 -103 -14 -18 -131 -150 22 -7 118 237 212
7247 212 -317 -261 -11 -108 -108 160 19 -161 -25 379 -269 121 -57 42 285 -37 -85 362 578 -61 -143 -30
7269 -30 206 24 31 -203 113 41 252 -337 -54 108 -236 -50 -69 -146 194 300 -251 -233 -146 249 200 176 -100
$$ packed form
7114B98o25K02M51m17qK75k35K45m20L65n43J64K15k77L56o2l18K88L57l57q5
7135a31L70K1n50R7J27j17K68K33l39r2N53m62J55n4m48K35M10mj74j72L61l01
7157a4j75M12l99k0L76J6m36K60R7l0K85k06m89M86L71p72K66k74M53k91k83K89
7179g8j21M42l1m36L82k22j10J68J27L8m97N87j58j63J37K8j08q0J04k25K32N
7201B1K7k6M0J73j10J98q7k60P4K12k92j21L48k21q4J22R4l59K41m5P9j66J18
7224b4K24k94J16k02j21M33R2m02J37L03m13Q1K94l27Q9mj13j9J72k9J25J19k5
7247B12n29N6K50r7%K68j41j80J36M04o48L90j78R9K43l22m8M47K16o39q2J13
7269c0K36j82Pk34L16p2K11n89K83J62l44J86j9p7L40J06n51J8Q7L95m9k4k76
$$ plain form
7292 -100 -326 173 -249 -99 -130 402 19 -423 -45 -89 -112 23 63 -404 -91 369 245 -239 141 -33 -117 352
7314 352 344 -98 131 174 127 59 77 55 55 272 15 -149 150 281 -167 30 -249 -243 82 217 -186 -82 353 -146
7338 -146 -28 -92 -167 -171 102 -455 -44 -301 155 -144 6 83 -147 -44 -44 -149 -185 -45 107 -200 -144 -105 -3
7361 -3 -85 163 -352 133 155 -90 -73 -98 232 -397 19 75 -178 245 327 -62 79 91 191 -131 62 158 -169
7384 -169 -212 149 -160 -77 239 50 -152 184 46 -49 136 66 -326 -178 7 9 -90 95 -256 -67 197 -20
7406 -20 4 120 -217 -130 73 12 -279 367 -148 -382 15 446 -93 -73 78 -46 -140 64 25 -108 -58 94 -331
7429 -331 1 124 -182 181 188 126 92 -158 205 107 92 372 15 416 299 -127 -267 244 4 -13 366 68
7451 68 -245 -15 -167 -37 15 109 -479 -38 46 127 -427 430 75 -316 185 -37 -173 -167 96 -255 3 111
$$ packed form
7292a00k26M99m22J50l1N32l83m42L78m4k3J35M0m67L13M60j24m84L80j74q4M69
7314C52qm42K29M3m7o8J8k2%K17k57j64K99J31m48J97k79OL25J35m03J04M35m99
7338a46J18o4p5mK73n57M11k57M56k99J50P7k30J03%j05l6J40J52l07N6L9J02
7361cq2K48n15M85K2k45J7k5L30o29M16N6k53M23Q2l89J41J2J00l22J93R6l27
7384a69m3L61l09Q3L16j89k02L36j38r5J85p0l92J48J85Kr9J85l51J89K64k17
7406b0K4J16l37Q7K03o1k91O46n15k34L97M31n39K0J51j24r4K04l9j33N0J52m25
7429c31L32J23l06L63Po2l4k50L63r8j5K80l57M01j17m26j40N11k40j7L79k98
7451F8l13K30j52J30N2R4n88M41Q4Q1n54Q57l55l91N01k22j36OK63l51K58J08
$$ plain form
7473 111 -88 -115 141 89 -43 -8 -50 20 -191 137 254 73 249 -443 99 490 184 -148 -36 390 0 161
7495 161 176 -13 207 255 -47 -173 -11 -38 -25 -12 -30 -93 67 -70 52 -133 97 -442 -224 0 -20 -185 33
7518 33 -97 -90 157 -48 -265 -49 309 -140 83 185 3 -144 155 -53 52 -39 145 216 -30 327 -228 50
7540 50 133 194 -338 281 348 229 118 -58 -216 74 -166 -59 292 312 109 -234 -20 90 -104 299 -109 -118
7562 -118 -72 -85 -147 -236 151 -82 -210 -45 -50 -45 204 58 -77 96 -8 -125 -151 27 102 -194 387 -76 -124 154
7586 154 198 -290 -99 -45 4 -43 167 -82 302 32 -149 -20 362 -82 -183 105 200 166 87 -86 -125 111 -137
7609 -137 133 -242 2 1 151 72 262 1 58 121 -124 -224 -42 13 -127 -139 -36 -61 235 185 237 221 43 -376
7633 -376 12 90 -373 -13 483 -72 3 118 -26 -198 266 227 42 84 -40 -171 74 212 -74 -114 116 -248
$$ packed form
7473A11j99k7K56n2j32L5m2P0k11L28J17j81J76o92N42L91l06l32J12M26l90J61
7495A61J5j89K20M8l02j26J62k7J3J3j8o3J60j37J22j85K30n39K18K24k0j65K18
7518C3j30PK47k05k17K16L58m49K23J02j82j47K99k08J05r1J84P1k46L57n55K78
7540E0Q3O1n32O19O7j19j11j76j58K90k40J07L51K0k03l43K14J10j94M03m08r
7562a18M6j3o2q9L87k33j28J65nNK49j46j35J73j04j17k6J78P5k96N81m63m8K78
7586A54M4m88J91N4M9m7K10k49L84k70j81J29L82m44j01K88R5l4p9j73l9K36k48
7609a37K70l75K44jJ50p9J90k61N7O3k45j00J82N5j40j2J03k5K96n0N2j6j78m19
7633c76L88P8m63L60M96n55P5J15j44j72M64l9j85M2j24j31K45J38k86m0K30l64
$$ plain form
7655 -248 92 -34 -92 -54 -58 188 71 24 138 99 181 241 -140 -368 268 179 -103 32 332 -299 -82 300 -52
7678 -52 -18 145 -102 -72 -138 -288 -26 -63 129 -451 32 249 -366 -113 184 -64 -142 137 -17 -140 -33 60
7700 60 -127 -114 84 -347 -45 260 -187 10 -111 -128 -279 433 54 -184 308 728 156 -256 320 -227 -117
7721 -117 108 -21 -50 338 86 -56 235 185 19 100 116 -17 -125 303 -112 -214 35 98 35 -181 -12 -34
7743 -34 -165 -92 -267 -323 1 -86 -89 176 -123 -167 152 208 30 27 151 -15 -107 -72 -76 87 22 106 221 79 90 -167
7769 -167 92 -8 171 -302 175 -74 -391 61 120 167 17 -32 -224 -175 108 -141 -145 2 -104 -41 225 -64
7791 -64 -209 -129 22 -243 -15 25 -312 -104 -230 -11 -148 226 -55 -118 41 -84 129 -142 -36 -98 -53 415
7813 415 30 -109 242 -83 29 200 473 164 275 -87 -7 70 -190 61 146 135 134 23 140 -217 -272 167
$$ packed form
7655b48L40j26n8L8mK46j17m7J14l9Q2O0l81k28O36q9k82J35L00o31K17L82l52
7678e2L4J63k47L0o6j50K62l7J92n80M83K17o15K53K97k48p8K79j54j23J07R3
7700F0j87J3J98m31L02L05m47J97j21j7j51P12l79k38M92M20n72m12N76n47J10
7721a17K25j29k9L88k52j42K91n0j66Q1J6j33j08M28m15j02K49O3o3k16J69k2
7743c4j31P3j75n6L24q7lK65k99m4L19N6j78lJ24j66r2L5mJ63o5Q4J15j42J1k57
7769a67K59j00J79m73M77k49l17M52N9M7j50m9j92M9K83k49mJ47j06O3K66k89
7791f4j45Q0J51k65K28M0l37K08j26K19j37L74k81o3J59j25K13k71J06o2M5M68
7813D15l85j39L51l25J12J71K73l09J11l62Q0P7k60K51Q5j1jj11J17l57n5M39
$$ plain form
7835 167 11 115 -16 -137 -233 91 163 103 -245 -221 -13 -320 -159 173 -253 149 74 -282 -117 278 217 -204
7857 -204 210 202 -197 349 -27 -98 0 -36 -62 246 -35 -42 -190 157 190 -21 175 75 -238 25 0 194 152 160
7881 160 81 -16 252 -171 219 262 -59 -330 -145 -44 -209 -69 26 -83 35 251 -194 97 180 -2 164 -205
7903 -205 -199 -111 87 47 52 -128 176 -278 -266 3 -226 -159 300 -119 -131 184 63 -84 -77 22 -135 -265 149 348
7927 348 259 433 33 -223 31 42 -133 -28 231 -88 -66 23 -124 -113 230 165 150 73 337 62 56 9 -221 47
7951 47 57 -211 -114 -103 185 -304 -75 -99 -343 -89 -291 -143 24 251 27 65 -92 -92 106 -111 20 -221 34
7974 34 -193 -1 52 41 -108 -375 -21 65 -288 221 173 -237 1 256 46 -59 182 -29 182 249 120 81
7996 81 138 -9 -111 139 334 -53 -27 80 -284 106 -32 24 45 -17 1 -141 202 -62 -526 -185 358 101
$$ packed form
7835A67j56J04j31j21r6L24P2o0l48K4K08l07J61L32m26M02p5l56J65L95o1m21
7857b04M14ql99N46l76p1R8l6k6L08k81pj48L47L3k11J96j00l13K63k5J94m2Q
7881A60p9r7K68m23L90M3l21k71J85J01j65J40R5j09J18K16m45K91Q3j82J66l69
7903b05OQ8J98m0Nj80L04m54J2K69k29O7M59m19j2L15j21j47PR9j57j30M14J99
7927C48q9J74m00k56K54J1j75J05K59l19K2Q9j47J1L43o5j5p7K64k75om7k30K68
7951D7J0k68R7J1K88m89K29k4k44K54k02J48J67K27k24L8j57%J98k17J31k41K55
7974C4k27J92N3j1j49k67L54Q6l53N09m8m10K38K55k10j05K41k11K11O7j29l9
7996H1N7j47j02K50J95l87K6J07l64L90j38N6K1o2J8j42L43k64m64L41N43k57
$$ plain form
8018 101 -170 -62 -285 -59 219 -47 -231 -112 123 199 -13 -34 -7 -66 -197 169 -129 121 291 -141 -119 353
8040 353 71 164 320 -271 -146 398 -90 -108 329 27 -117 109 -151 -327 66 165 -126 -93 79 -259 -1
8061 -1 89 316 -28 132 -72 -260 44 -34 -381 193 -24 214 -221 205 -316 -184 172 -316 -46 70 92 -14
8083 -14 -15 -40 -83 -20 32 -257 -238 236 112 -273 310 10 17 133 25 56 115 146 -37 57 5 -26 -143 -241 -121 -136
8109 -136 -35 -80 254 3 17 -16 229 166 -207 -21 -89 173 13 197 -94 -288 -284 -16 -283 -302 47 -156 24
8132 24 343 3 -17 -48 -10 -97 105 74 -150 -36 410 -150 -216 -87 -335 82 -127 -25 -73 210 309 -241 10
8155 10 137 387 68 260 -8 36 -22 208 -2 258 3 -293 49 352 154 -44 -179 95 -252 113 -313
8176 -313 -46 55 -33 -81 197 -66 -216 -112 -168 -192 -43 23 -99 -327 -98
$$ packed form
8018A01k71J08k23K26K78k66j84J19K35P6k12k1K7n9j31L66k98K50J70m32K2M72
8040C53k82R3J56n91J25N44m88j8M37l02j44K26k60j76L93R9k91L3J72l38K58
8061aR0K27l44J60k04j88L04p8l47N74k17K38m35M26n21J32L56m88K70J16K2j06
8083a4jk5m3O3N2k89J9M74j24l85N83l00PJ16j08L1N9L1j83R4n2l1j17r8J20j5
8109a36J01m5L34k51J4l3K45o3l73J86o8K62j60J84k91j94MK68k67j9L49k03J80
8132B4L19l40k0l1L8q7K02l1k24J14M46n60o6J29k48M17k09J02m8K83R9n50K51
8155A0J27K50l19J92k68M4n8K30k10K60k55k96L42L03j98j98j35K74l47L65m26
8176c13K67J01q8m8K78k63j50J04n6k4J49O6j22k28K29
8191i8
$$ Imaginary data points
##PAGE= N=2
##DATA TABLE= (X++(I..I)), XYDATA
$$ plain form
0 0 0 0 0 0 0 0 0 0 0 8 -8 8 -8 13 -16 16 -21 24 -29 32 -40 46 -52 61 -70 78 -87 102 -114 128 -145 161 -180
33 -180 202 -226 251 -280 310 -344 379 -421 466 -516 570 -634 704 -782 873 -981 1102 -1249
51 -1249 1428 -1651 1939 -2322 2863 -3688 5086 -7894 15757 -81816 -309761 -119637 118561
64 118561 124305 -59514 -190744 -129150 46857 45241 -119001 -146018 1427 59093 -23302
75 -23302 -111386 -102879 16753 112167 16856 -113265 -51230 79266 73618 -908 -39583 -18677
87 -18677 62028 103251 23682 -33150 19333 44813 12053 25912 55614 41093 16802 -20282
99 -20282 -40707 42868 122760 37787 -84526 -67197 18281 64658 50116 -27291 -71183 106
111 106 46222 -23380 -57843 1166 33081 6420 -41117 -81381 -29581 83012 64535 -71183
$$ packed form
0@%%%%%%%%%Qj6J6j6K1k9L2l7M5n3O1p2Q6r8J13j31J48j65J89k16K42k73L06l41
33a80L82m28M77n31N90o54P23q00Q87r82J086j204J338j486J655j854K083k351
51a249K677l079L590m261N185o551Q774j2980K3651r7573k27945J90124K38198
64A18561N744j83819j31230O1594J76007j616j64242k7017J47445N7666q2395
75b3302q8084Q507J19632R5414r5311j30121O2035J30496n648p4526l8675K0906
87a8677Q0705M1223p9569n6832N2483K5480l2760J3859K9702j4521k4291l7084
99b0282k0425Q3575P9892q4973j22313J7329Q5478M6377j4542p7407m3892P1289
111A06M6116o9602l4463N9009L1915k6661m7537m0264N1800J12593j8477j35718
$$ plain form
123 -71183 -104302 -16998 50640 53588 -8910 -84619 -45662 59899 53948 -30090 -50896 -21630
135 -21630 14736 49141 13748 -57099 -29752 42649 32714 -2916 -1913 -6728 4786 36024 8947
148 8947 -29647 15505 60769 32940 1855 -16670 -31496 18210 78454 38140 -30859 -33622
160 -33622 -16957 7778 49671 24624 -48391 -44336 3551 -25 -14756 -16986 -29407 -7500 26647
173 26647 -17008 -68943 -26539 24480 15494 -3319 -24669 -38967 7719 46720 -2122 -35700
185 -35700 6472 27709 8903 1961 -10798 -11392 31258 38307 -11007 -13288 16310 -801 -9463
198 -9463 18322 16383 442 4801 -12750 -20760 28486 38003 -21750 -31006 14446 22794 2950
211 2950 -16260 -28600 15547 70261 12737 -80067 -47397 46968 67492 18613 -49002 -64662
$$ packed form
123g1183l3119Q7304O7638K948o2498p5709L8957J05561n951q4038k0806K9266
135b1630L6366L4405l5393p0847K7347P2401r935l5630J003m815J1514L1238k7077
148H947l8594M5152M5264k7829l1085j8525j4826M9706O0244m0314o8999k763
160c3622J6665K4735M1893k5047p3015M055M7887l576j4731k230j2421K1907L4147
173B6647m3655n1935M2404N1019q986j8813k1350j4298M6686L9001m8842l3578
185c5700M2172K1237j8806o942j2759n94M2650P049m9314k281K9598j7111q662
198i463K7785j939j5941M359j7551q010M9246R517n9753r256M5452Q348j9844
211B950j9210j2340M4147N4714n7524r2804L2670R4365K0524m8879o7615j5660
$$ plain form
223 -64662 22623 86919 8410 -73758 -24825 48756 41896 -14805 -63997 -34522 65272 70121
235 70121 -49236 -94346 -8776 55157 32026 -30440 -75038 -30904 57039 36802 -57757 -59188
247 -59188 9786 29959 7358 -21321 -36781 2591 41607 947 -33009 14708 41125 2360
259 2360 -18947 -7889 12755 46973 36883 -26202 -29285 30194 34343 -2170 -2299 7852 8025
272 8025 10905 -13742 -30195 23814 58233 -6477 -60485 -27353 22375 42773 19608 -46342
284 -46342 -59560 21583 60172 -1307 -45038 -25794 6211 30797 14113 -41067 -33232 35651
296 35651 35404 -23568 -33811 -4954 19522 31947 -4051 -53316 -16862 52779 34487 -24254
308 -24254 -36891 -18659 18448 47658 7562 -48105 -24075 19808 13707 5469 4162 -16247 -13435
$$ packed form
223f4662Q7285O4296p8509q2168M8933P3581o860n6701m9192K9475R9794M849
235G0121j19357m5110Q5570O3933k3131o2466m4598M4134Q7943k0237r4559j431
247e9188O8974K0173k2601k8679j5460L9372L9016m0660l3956M7717K6417l8765
259B360k1307J1058K0644L4218j0090o3085l083N9479M149l6513j29J0151J73
272H025K880k4647j6453N4009L4419o4710n4008L3132M9728K0398k3165o5950
284d6342j3218Q1143L8589o1479m3731J9244L2005K4586j6684n5180P835O8883
296C5651k47n8972j0243K8857K4476J2425l5998m9265L6454O9641j8292n8741
308b4254j2637J8232L7107K9210m0096n5667K4030M3883o101q238j307k0409K812
$$ plain form
321 -13435 9620 -4123 -12776 16111 15153 -14169 -8707 2138 -6749 7574 20115 -4784 -11954
334 -11954 4837 -3709 -2214 27451 14697 -23142 -12988 10923 12797 16737 1758 -32266 -13095
347 -13095 35353 22622 -15862 -17967 -11092 615 22585 6070 -26867 -8520 15199 -5903
359 -5903 -13671 5061 906 -3812 3406 -13925 -21507 11619 19264 -6644 -4913 55 -16158 -4118
373 -4118 22560 10895 -4820 -4259 -14721 -2035 39197 25148 -28636 -25340 15682 28248 19867
386 19867 -6580 -31916 1301 47721 14968 -36243 -15764 24008 25827 2746 -32377 -33297 28956
399 28956 54460 -14661 -60136 -16492 30922 29420 -5288 -48509 -35707 31681 38494 -25545
411 -25545 -43873 -5999 13450 7905 -9703 -30006 -8178 28998 2811 -37658 -12034 23368
$$ packed form
321a3435K3055j3743q653K8887r58k9322N462J0845q887J4323J2541k4899p170
334a1954J6791q546J495K9665j2754l7839J0154K3911J874L940j4979l4024J9171
347a3095M8448j2731l8484k105O875J1707K1970j6515l2937J8347K3719k1102
359e903p768J8732m155m718P218j7331p582L3126P645k5908J731M968j6213J2040
373d118K6678j1665j5715N61j0462J2686M1232j4049n3784L296M1022J2566q381
386A9867k6447k5336L3217M6420l2753n1211K0479L9772J819k3081l5123r20O2253
399B8956K5504o9121m5475M3644M7414j502l4708m3221J2802O7388O813o4039
411b5545j8328L7874J9449n545j7608k0303K1828L7176k6187m0469K5624L5402
$$ plain form
423 23368 13607 -3989 -14980 -16343 13906 30404 -4847 -17753 16044 19922 -5081 -3621 8391
436 8391 15313 24211 2678 -27637 4255 49830 23830 -21573 -18157 8055 30492 31013 -12830
449 -12830 -37814 10671 44073 4813 -29366 -17811 4692 22614 9093 -39780 -40065 20855
461 20855 33259 -19830 -47044 -27985 4908 28570 1492 -54062 -41116 21775 28591 -10218
473 -10218 -27260 -20536 4081 30383 6472 -32498 -7823 33535 19121 -7538 -7285 990 20264
486 20264 30943 -2364 -24493 10086 31962 9774 -2689 -1860 -5212 9161 18325 -4203 -8458
499 -8458 11647 696 -17016 2303 14740 258 -6088 -11108 -15875 7778 19808 -13314 -26271
512 -26271 2133 11395 -1828 -6445 -13173 -9827 15177 9326 -24924 -15999 18870 14606 -6659
$$ packed form
423B3368r761j7596j0991j363L0249J6498l5251j2906L3797L878k5003J460J2012
436H391O922Q898k1533l0315L1892M5575k6000m5403L416K6212K2437N21m3843
449a2830k4984M8485L3402l9260l4179J1555K2503J7922j3521m8873k85O0920
461B0855J2404n3089k7214J9059L2893K3662k7078n5554J2946O2891O816l8809
473a0218j7042O724K4617K6302k3911l8970K4675M1358j4414k6659K53Q275J9274
486B0264J0679l3307k2129L4579K1876k2188j2463Q29l352J4373R164k2528m255
499h458K0105j0951j7712J9319J2437j4482o346n020m767K3653J2030l3122j2957
512b6271K8404R262j3223m617o728L346K5004n851l4250Q925L4869m264k1265
$$ plain form
525 -6659 -14063 -15986 4484 30075 6166 -30101 -13928 14516 12069 5750 -3775 -18556 -3538
538 -3538 19980 3254 -13465 1360 4630 -2148 8291 6041 -9685 3254 17694 3937 -1122
551 -1122 5306 -744 8495 28113 7867 -19622 -1891 21257 17558 7711 -11385 -25004 6005
564 6005 34226 3295 -30466 -18378 207 5699 3528 -19300 -29402 1553 12337 -19924 -27795
577 -27795 -3084 5293 455 -7935 -25938 -15398 20252 15944 -17095 -14814 4290 6039 8245
590 8245 5477 -8359 1536 19069 3361 -7010 14767 18503 -39 -112 6059 8976 21380 15274
604 15274 -13254 -6574 26105 21679 -1940 -5236 -2151 7315 19957 2437 -21460 -1048 21788
617 21788 -187 -20125 -12038 -21 12022 8060 -26679 -37937 4958 27722 -1163 -26600
$$ packed form
525f659p404j923K0470K5591k3909l6267J6173K8444k447o319r525j4781J5018
538c538K3518j6726j6719J4825L270o778J0439k250j5726J2939J4440j3757n059
551a122O428o050R239J9618k0246k7489J7731K3148l699r847j9096j3619L1009
564F005K8221l0931l3761J2088J8585N492k171k2828j0102L0955J0784l2261p871
577b7795K4711Q377m838q390j8003J0540L5650m308l3039K281J9104J749K206
590H245k768j3836R895J7533j5708j0371K1777L736j8542p3O171K917J2404o106
604A5274k8528O680L2679m426k3619l296L085R466J2642j7520k3897K0412K2836
617B1788k1975j9938Q087J2017J2043l962l4739j1258M2895K2764k8885k5437
$$ plain form
629 -26600 -26667 -10396 16721 14107 -25826 -31629 6675 16702 -7035 -18190 -15513 -633 20691
642 20691 5743 -30442 -18235 20390 18872 -3150 -10708 -8549 11083 29123 6042 -19918 4271
655 4271 29881 16777 2662 946 1553 17214 24372 682 -8179 15176 14535 -7850 -6173 5342
669 5342 6896 7249 -7283 -27590 -10222 16918 116 -23881 -14202 -2394 -3649 -6321 -18203
682 -18203 -19842 9002 16580 -17700 -29449 -2969 12654 10353 -285 -17638 -9659 21119 15300
695 15300 -14698 -8992 15140 16359 7056 -3584 -12481 6151 29931 10968 -14100 -3559 10250
708 10250 8282 9442 1762 -10234 3316 14981 -3087 -10905 1927 1107 -1778 6216 -1964 -14976
722 -14976 -3547 4323 -4419 -651 2327 -10650 -8096 6702 -786 -7683 4609 4519 -2768 1271
$$ packed form
629b6600o7J6271K7117k614l9933n803L8304J0027k3737j1155K677J4880K1324
642B0691j4948l6185J2207L8625j518k2022p558K159J9632J8040k3081k5960K4189
655D271K5610j3104j4115j716O07J5661P158k3690q861K3355o41k2385J677J1515
669E342J554L53j4532k0307J7368K7140j6802k3997R679J1808j255k672j1882
682a8203j639K8844P578l4280j1749K6480J5623k301j0638j7353P979L0778n819
695A5300k9998N706K4132J219r303j0640q897J8632K3780j8963k5068J0541J3809
708A0250j968J160p680j1996J3550J1665j8068p818J2832q20k885P994q180j3012
722a4976J1429P870q742L768K978j2977K554J4798p488o897J2292r0p287M039
$$ plain form
736 1271 -4073 -12471 6703 20745 649 -13709 -6566 -3360 5145 14207 -2143 -16451 -2256
749 -2256 3676 -7154 -1088 6806 -2860 -4224 -1297 -8728 -1932 14678 4541 -10072 1209 7946
763 7946 405 3410 4871 -1558 7790 13082 -3735 -6381 10101 6826 -3296 3604 5907 1487
777 1487 5580 -3230 -17634 713 23555 10131 -10983 -14423 -11323 3836 21296 5942 -17055
790 -17055 -8168 3877 -2872 -1607 2285 -2543 2035 4397 -15910 -18802 8630 16352 -1698 -12357
804 -12357 -14959 -7997 13579 12443 -16531 -18894 5985 10705 963 -4369 -12667 -5595 16136 10775
818 10775 -11842 -6270 7057 1070 -927 4085 2282 6898 10133 -8497 -15531 11300 24193 7725
832 7725 -4355 -8262 -6258 13249 20420 -529 -7393 6854 2785 -7077 2218 8638 5696 3847
$$ packed form
736A271n344q398J9174J4042k0096j4358P143L206Q505R062j6350j4308J4195
749b256N932j0830O066P894r666j364K927p431O796J6610j0137j4613J1281O737
763G946p541L005J461o429R348N292j6817k646J6482l275j0122O900K303m420
777A487M093q810j4404J8347K2842j3424k1114l440L100J5159J7460j5354k2997
790a7055Q887J2045o749J265L892m828M578K362k0307k892K7432P722j8050j0659
804a2357k602O962K1576j136k8974k363K4879M720r742n332q298P072K1731n361
818A0775k2617N572J3327n987j997N012j803M616L235j8630p034K6831J2893j6468
832G725j2080l907K004J9507P171k0949o864J4247m069r862R295O420k942j849
$$ plain form
846 3847 -10221 -21025 1801 21109 479 -20056 -13023 -2499 4579 4685 -14807 -20844 4805
859 4805 13306 -9792 -17214 -3952 2548 5941 2206 -11772 -5479 14855 5000 -15398 -4712 13321
873 13321 13993 7779 -7222 -18978 2178 26818 13344 -6793 -5275 -2831 342 11082 7294
886 7294 -2606 4573 5543 -9717 -5743 8414 5268 1880 4293 -6812 -10134 4958 5707 -5410
900 -5410 -269 2465 -6603 -2925 2880 -6405 -5810 5417 -260 -5364 1592 -3427 -11435 667 7266
915 7266 -987 -280 -256 -11356 -6955 9099 5698 -2357 447 -5369 -9334 5357 8935 -2056 -114
930 -114 3971 -4520 -2455 5793 225 492 10855 2320 -9394 121 7752 3920 6479 4112 -7013
945 -7013 -6 11850 1796 -5018 4452 4961 979 4503 -3222 -10554 3879 12904 -1392 -7272
$$ packed form
846C847j4068j0804K2826J9308k0630k0535P033J0524P078J06j9492o037K5649
859D805Q501k3098p422J3262O500L393l735j3978O293K0334r855k0398J0686J8033
873A3321O72o214j5001j1756K1156K4640j3474k0137J518K444L173J0740l788
886G294r900P179R70j5260L974J4157l146l388K413j1105l322J5092P49j1117
900e410N141K734r068L678N805r285N95J1227n677n104O956n019q008J2102O599
915G266q253P07K4j1100M401J6054l401q055K804n816l965J4691L578j0991J942
930a14M085q491K065Q248n568K67J0363q535j1714R515P631l832K559k367j1125
945g013P007J1856j0054o814R470N09l982L524p725p332J4433R025j4296n880
$$ plain form
959 -7272 -3369 -6903 -1752 8378 -1920 -11067 -1670 -1315 -8287 -2561 123 -6386 -188 3376 -10650
974 -10650 -12583 2255 3487 -752 1613 -6252 -10594 5664 9090 -5039 -3917 6662 4126 2705
988 2705 2439 -6685 -661 17195 11562 -5609 -1950 4209 2880 7204 8249 -1228 3144 8707 -3877
1003 -3877 -7399 9508 11125 -459 -2621 -5232 -5492 7407 7528 -9221 -7176 5701 -1787 -9659
1017 -9659 -3827 -1566 -364 3373 -7946 -17224 434 10786 -4899 -12747 -4515 929 5199 3045
1031 3045 -14396 -13163 12111 15646 -4431 -10476 -3622 1791 11464 8118 -8430 -3939 12555 4685
1045 4685 -8149 -120 7842 8473 8331 -4362 -13738 4286 19604 5281 -6135 -1824 -1228 3311
1059 3311 9587 211 -6964 5004 5953 -6318 -3450 3568 -1794 -1353 1154 -7075 -5523 5489 -2322
$$ packed form
959g272L903l534N151J0130j0298r147R397L55o972N726K684o509O198L564j4026
974a0650j933J4838J232m239K365p865m342J6258L426j4129J122J0579k536j421
988B705k66r124O024J7856n633j7171L659O159j329M324J045r477M372N563j2584
1003c877l522J6907J617j1584k162k611k60J2899J21j6749K045J2877p488p872
1017i659N832K261J202L737j1319r278J7658J0352j5685p848Q232N444M270k154
1031C045j7441J233K5274L535k0077o045O854N413R673l346j6548M491J6494p870
1045D685j2834Q029P962O31j42j2693r376J8024J5318j4323j1416M311N96M539
1059C311O276r376p175J1968R49j2271K868P018n362M41K507q229J552J1012p811
$$ plain form
1074 -2322 -11973 -2452 2627 -2860 -1431 -3300 -11865 -1945 8221 -1611 -6641 744 -1443 -5075 2384
1089 2384 1106 -2117 6725 4804 -10144 -5622 9079 7760 2393 694 -7142 -2803 13343 8543
1103 8543 -6972 -2433 5647 3116 4346 2666 -4991 1844 11706 49 -7911 3482 7233 881
1117 881 1119 -3072 -6802 4820 9107 -5850 -8484 2154 1093 -1231 1409 -5142 -8192 3079
1131 3079 2923 -6265 -2115 1757 -7057 -4711 3838 -1620 -3119 1145 -5026 -7795 3654 3239 -5922
1146 -5922 -1202 2405 -5536 -3328 3014 -1753 495 6551 -2672 -7452 5199 7940 118 2661 3922
1161 3922 -468 5709 9432 -1025 447 10796 5275 -1604 5016 4533 -393 4466 2349 -3753 3621
1176 3621 6859 -6661 -8084 3100 1185 -3476 -1615 -6112 -6759 2981 -1296 -12780 -4471 6146
$$ packed form
1074b322r651R521N079n487J429j869q565R920J0166r832n030P385k187l632P459
1089B384j278l223Q842j921j4948M522J4701j319n367j699p836M339J6146m800
1103H543j5515M539Q080k531J230j680p657O835R862j1657p960J1393L751o352
1117H81K38m191l730J1622M287j4957k634J0638j061k324K640o551l050J1271
1131C079j56r188M150L872q814K346Q549n458j499M264o171k769J1449m15r161
1146e922M720L607p941K208O342m767K248O056r223m780J2651K741p822K543J261
1161C922m390O177L723j0457J472J0349n521o879O620m83m926M859k117o102P374
1176C621L238j3520j423J1184j915m661J861m497o47R740m277j1484Q309J0617
$$ plain form
1190 6146 -2533 -8637 -6348 -6106 1194 7355 -6103 -14301 1419 8832 -1571 -5146 -2842 -1393
1204 -1393 7743 8228 -7198 -6445 10522 9779 -1047 -295 2466 4652 11859 5722 -7937 596 14051
1219 14051 6585 -1915 633 237 2339 8141 -790 -8594 3114 8044 -4115 -6193 -516 -2015
1233 -2015 616 2540 -8013 -8304 5026 2248 -8971 -4684 169 -2229 1047 -614 -10088 -3268
1247 -3268 7108 -1722 -8746 -218 1553 -1311 1329 -3377 -7767 4976 9655 -3720 -7034 2482
1261 2482 4006 4397 5372 -3457 -3731 10523 9120 -4814 -2073 5981 5026 5445 1963 -7254 -748 12480
1277 12480 3257 -9218 -2099 3727 2122 2207 -3991 -10210 1909 9545 -3619 -9258 76 1227
1291 1227 -905 500 -4221 -5220 5452 3661 -9251 -4894 5260 599 -1948 -479 -4836 -2463
$$ packed form
1190F146q679o104K289K42P300O161j3458q198J5720P413j0403l575K304J449
1204a393R136M85j5426P53J6967p43j0826P52K761K186P207o137j3659Q533J3455
1219A4051p466q500K548l96K102N802q931p804J1708M930j2159k078N677j499
1233b015K631J924j0553k91J3330k778j1219M287M853k398L276j661r474O820
1247c268J0376q830p024Q528J771k864K640m706m390J2743M679j3375l314R516
1261B482J524L91R75q829k74J4254j403j3934K741Q054r55M19l482r217O506J3228
1277A2480r223j2475P119N826j605Q5o198o219J2119P636j3164n639R334J151
1291A227k132J405m721r99J0672j791j2912M357J0154m661k547J469m357K373
$$ plain form
1305 -2463 5868 -1126 -8077 1788 4926 -3494 -2441 1298 -2261 1768 3887 -5016 -3883 7665 3352
1320 3352 -5912 -946 2765 138 4026 2121 -6163 19 8095 -1341 -5035 3698 2823 -973 2666
1335 2666 -605 -3418 6133 5785 -4782 -1948 6882 2087 -1018 3175 -564 -1481 5390 920 -5166
1350 -5166 3068 4367 -5269 -3922 2436 -1189 -1689 -116 -6824 -5751 4772 -372 -9633 -2807 2161
1365 2161 -2958 -2440 -2006 -6005 994 6552 -4285 -8282 3211 5312 -812 -92 -1717 -2201 7533
1380 7533 7124 -5636 -3553 8235 5725 1079 2561 -1250 499 9446 4095 -5379 2176 8737 1374
1395 1374 -927 1191 -1494 3380 8326 -3034 -8434 2497 4780 -2735 -2412 -2250 -5160 721 2169
1410 2169 -8574 -6820 3833 -165 -7002 -3775 -2831 -3373 2577 -1135 -9658 -1294 6878 -1714 -5623
$$ packed form
1305b463Q331o994o951R865L138q420J053L739l559M029K119q903J133J1548m313
1320C352r264M966L711k627L888j905q284O182Q076r436l694Q733q75l796L639
1335B666l271k813R551l48j0567K834Q830m795l105M193l739r17O871m470o086
1350e166Q234J299r636J347O358l625n00J573o708J073J0523n144r261O826M968
1365B161n119N18M34l999O999N558j0837l997J1493K101o124P20j625m84R734
1380G533m09j2760K083J1788k510m646J482l811J749Q947n351r474P555O561p363
1395A374k301K118k685M874M946j1360n400J0931K283p515L23J62k910N881J448
1410B169j0743J754J0653l998o837L227R44n42N950l712q523Q364Q172q592l909
$$ plain form
1425 -5623 -146 33 2275 5806 -3638 -6967 6007 9262 -1238 -2213 2629 1671 4866 4643 -4333
1440 -4333 -1254 10985 5654 -5786 -1763 4070 4609 6787 387 -8310 809 10510 539 -6894 -151
1455 -151 2069 1493 1412 -5987 -8697 4052 6965 -6348 -7717 5 -769 -1590 -839 -6161 -3724 6363
1471 6363 453 -10266 -3348 4625 840 -658 -1232 -5355 370 6777 -1767 -5252 4445 4209 -3026
1486 -3026 -997 927 471 5586 3940 -5910 -1907 8154 3105 -2708 1445 1949 1166 5071 114
1501 114 -5837 3002 7671 -1101 -2598 2235 -63 -275 3391 -2079 -3219 4684 1947 -7167 -2917
1516 -2917 3053 -338 253 428 -6171 -4017 4013 -565 -4289 1483 -185 -6443 -1867 1082 -2137
1531 -2137 911 1239 -6412 -3803 4318 257 -4386 1311 1476 -1663 2032 9 -4580 2734 7044
$$ packed form
1425e623N477J79K242L531r444l329J2974L255j0500r75M842r58L195k23q976
1440d333L079J2239n331j1440M023N833N39K178o400q697R119R701r971p433O743
1455a51K220n76q1p399k710J2749K913j3313j369P722p74q21P51n322K437J0087
1471F363n910j0719O918P973l785j498n74m123N725O407q544l485R697k36p235
1486c026K029J924m56N115j646r850M003J0061n049n813M153N04p83L905m957
1501A14n951Q839M669q772j497M833k298k12L666n470j140P903k737r114M250
1516b917N970l391N91J75o599K154Q030m578l724N772j668o258M576K949l219
1531b137L048L28p651K609Q121m061m643N697J65l139L695k023m589P314M310
$$ plain form
1546 7044 -1512 -2587 4383 1669 -187 3407 525 -186 7522 4684 -5497 -1785 5788 3638 3198
1561 3198 2795 -4817 -2901 6113 2263 -3100 2413 2126 -3856 -1509 -193 -2838 1341 4165 -5839
1576 -5839 -7659 1228 987 -2646 -774 -2958 -5494 1766 1174 -7277 -3469 3941 -441 -2950 20
1591 20 -2546 -1478 4369 -87 -4869 3778 6301 -2517 -3724 1163 2491 6698 6302 -5162 -5951 6344
1607 6344 7919 707 598 1001 -401 4025 2743 -4398 939 9317 1287 -6575 -2507 1686 3367
1622 3367 5011 -3114 -9182 620 6845 -2503 -6076 -653 -311 261 772 -6845 -6846 4144 3020 -5748
1638 -5748 -3600 1760 -1217 -1294 -1336 -3926 2108 7636 -2633 -9925 -144 5478 2648 1942 -1699 -4884
1654 -4884 2282 5655 -2570 -2001 6401 3423 -2673 -1334 -569 2160 8296 2732 -7241 -1403 6796
$$ packed form
1546G044q556j075O970k714j856L594k882p11P708k838j0181L712P573k150m40
1561C198m03p612J916R014l850n363N513k87n982K347J316k645M179K824j0004
1576e839j820Q887k41l633J872k184k536P260n92q451L808P410m382k509K970
1591B0k566J068N847m456m782Q647K523q818j207M887J328M207l96j1464p89J2295
1607F344J575p212j09M03j402M426j282p141N337Q378q030p862M068M193J681
1622C367J644q125o068R802O225r348l573N423L42N72N11p617jJ0990j124q768
1638e748K148N360k977p7m2k590O034N528j0269p292R781N622k830p06l641l185
1654d884P166L373q225N69Q402k978o096J339P65K729O136n564r973N838Q199
$$ plain form
1669 6796 2584 -1089 564 -639 2053 5285 -1657 -6723 2352 5927 -1199 -1603 37 -2634 -223
1684 -223 2483 -3577 -2407 4646 312 -6787 -2387 1092 -238 2995 266 -6986 -3432 2994 -1037
1699 -1037 -2017 2466 -1231 -4886 -734 -643 -2018 2994 2116 -5165 -2611 3088 -478 -1174 2912 -31
1715 -31 -582 3859 753 -3523 2729 5579 217 1680 3214 -1126 850 4994 777 -144 5870 2088
1731 2088 -4039 -289 2424 561 3365 2366 -5359 -3385 3282 -73 -2019 1951 -1272 -4811 -1049
1746 -1049 -1589 -3868 1436 2091 -5822 -5538 615 -1427 -2475 -2 -3098 -3745 2350 -467 -6486 -1270
1762 -1270 3700 -331 -250 909 -2338 217 4979 235 -2182 5092 5337 -1010 -290 1988 2313 7088
1778 7088 5584 -4288 -3505 5936 5224 478 1348 -132 -1160 3272 925 -4856 1457 6183 -1562 -5899
$$ packed form
1669F796m212l673J653j203K692L232o942n066R075L575p126m04J640k671K411
1684b23K706o060J170P053m334p099M400L479j330L233k729p252L554O426m031
1699a037r80M483l697l655M152R1j375N012q78p281K554N699l566o96M086k943
1715c1n51M441l106m276O252K850n362J463J534m340J976M144m217r21O014l782
1731B088o127L750K713j863K804r99p725J974O667l355j946L970l223l539L762
1746a049n40k279N304O55p913K84O153k042j048K473l096o47O095k817o019N216
1762a270M970m031Q1J159l247K555M762m744k417P274K45o347P20K278L25M775
1778G088j504r872P83R441p12m746Q70j480j028M432k347n781O313M726p745m337
$$ [...]
8191A87
##END NTUPLES=NMR FID
##END=
