##TITLE=1H_EC-3202(II-1)
 CDCl3, 8 sc, 
 21.8.2019
##JCAMPDX= 6.0         $$ Bruker NMR JCAMP-DX V2.0
##DATA TYPE= NMR FID
##DATA CLASS= NTUPLES
##ORIGIN= UXNMR, Bruker Analytische Messtechnik GmbH
##OWNER= root
$$ XWIN-NMR		Version 3.5
$$ Wed Aug 21 14:40:42 2019 Russian Standard Time (UT+4h)  she@DPX200
##.OBSERVE FREQUENCY= 200.13155
##.OBSERVE NUCLEUS= ^1H
##.DELAY= (6, 6)
##.ACQUISITION MODE= SIMULTANEOUS
##.ACQUISITION SCHEME= undefined
##.AVERAGES= 8
##.DIGITISER RES= 18
##SPECTROMETER/DATA SYSTEM= spect
##.PULSE SEQUENCE= zg30
##.SOLVENT NAME= CDCl3
##.SHIFT REFERENCE= (INTERNAL, CDCl3, 0, 15.7039)
##AUDIT TRAIL= $$ (NUMBER, WHEN, WHO, WHERE, WHAT)
$$ ##TITLE= Audit trail, XWIN-NMR		Version 3.5
$$ ##JCAMPDX= 5.01
$$ ##ORIGIN= Bruker BioSpin GmbH
$$ ##OWNER= she
$$ F:/spectra/data/she/nmr/H-F/1/audita.txt
$$ ##AUDIT TRAIL=  $$ (NUMBER, WHEN, WHO, WHERE, WHAT)
(   1,<2019-08-21 14:39:38.17 +0400>,<she>,<DPX200>,
      <created by zg, POWCHK disabled, PULCHK disabled
       configuration hash MD5:
       00 E9 B6 7A A2 85 ED C7 34 08 36 98 17 FE 4E 26
       data hash MD5: 16K
       44 46 DD 56 E9 7E 0B 5A 21 01 58 7C DA E8 DA 59>)
$$ ##END=
$$ 
$$ hash MD5
$$ 20 18 5A 12 CA 94 CA 86 62 69 9F 25 C8 E2 51 FA
##$RELAX= 
##$RELAX= 
##$RELAX= 
##$RELAX= 
##$RELAX= 
##$RELAX= 
$$ Bruker specific parameters
$$ --------------------------
##$DU= <F:/spectra>
##$EXPNO= 1
##$NAME= <H-F>
##$PROCNO= 1
##$TYPE= <nmr>
##$USER= <she>
##$AMP= (0..31)
100 100 100 100 100 100 100 100 100 100 100 100 100 100 100 100 100 100 
100 100 100 100 100 100 100 100 100 100 100 100 100 100 
##$AQSEQ= 0
##$AQ_mod= 1
##$AUNM= <au_zg>
##$AUTOPOS= <>
##$BF1= 200.13
##$BF2= 200.13
##$BF3= 200.13
##$BF4= 200.13
##$BF5= 200.13
##$BF6= 200.13
##$BF7= 200.13
##$BF8= 200.13
##$BYTORDA= 1
##$CFDGTYP= 0
##$CFRGTYP= 5
##$CHEMSTR= <none>
##$CNST= (0..31)
1 1 145 1 1 1 1 1 1 1 1 1 1 1 1 1 1 1 1 1 1 1 1 1 1 1 1 1 1 1 1 1 
##$CPDPRG= <>
##$CPDPRG1= <>
##$CPDPRG2= <>
##$CPDPRG3= <>
##$CPDPRG4= <mlev>
##$CPDPRG5= <mlev>
##$CPDPRG6= <mlev>
##$CPDPRG7= <mlev>
##$CPDPRG8= <mlev>
##$CPDPRGB= <>
##$CPDPRGT= <>
##$D= (0..31)
0 1.2 0 0 0 0 0 0 0 0 0 0.03 0 0 0 0 0 0 0 0 0 0 0 0 0 0 0 0 0 0 0 0 
##$DATE= 1566383977
##$DBL= (0..7)
120 120 120 120 120 120 120 120 
##$DBP= (0..7)
150 150 150 150 150 150 150 150 
##$DBP07= 0
##$DBPNAM0= <>
##$DBPNAM1= <>
##$DBPNAM2= <>
##$DBPNAM3= <>
##$DBPNAM4= <>
##$DBPNAM5= <>
##$DBPNAM6= <>
##$DBPNAM7= <>
##$DBPOAL= (0..7)
0.5 0.5 0.5 0.5 0.5 0.5 0.5 0.5 
##$DBPOFFS= (0..7)
0 0 0 0 0 0 0 0 
##$DE= 6
##$DECBNUC= <off>
##$DECIM= 24
##$DECNUC= <off>
##$DECSTAT= 4
##$DIGMOD= 1
##$DIGTYP= 9
##$DL= (0..7)
0 120 120 120 120 120 120 120 
##$DP= (0..7)
150 150 150 150 150 150 150 150 
##$DP07= 0
##$DPNAME0= <>
##$DPNAME1= <>
##$DPNAME2= <>
##$DPNAME3= <>
##$DPNAME4= <>
##$DPNAME5= <>
##$DPNAME6= <>
##$DPNAME7= <>
##$DPOAL= (0..7)
0.5 0.5 0.5 0.5 0.5 0.5 0.5 0.5 
##$DPOFFS= (0..7)
0 0 0 0 0 0 0 0 
##$DQDMODE= 0
##$DR= 18
##$DS= 0
##$DSLIST= <SSSSSSSSSSSSSSS>
$$ [...]
##$SUBNAM2= <"">
##$SUBNAM3= <"">
##$SUBNAM4= <"">
##$SUBNAM5= <"">
##$SUBNAM6= <"">
##$SUBNAM7= <"">
##$SUBNAM8= <"">
##$SUBNAM9= <"">
##$SW= 24.9336996594482
##$SWIBOX= (0..15)
0 0 2 0 0 0 0 0 0 0 0 0 0 0 0 0 
##$SW_h= 4990.01996007984
##$TD= 16384
##$TD0= 1
##$TE= 0
##$TE2= 300
##$TE3= 300
##$TEG= 300
##$TL= (0..7)
0 120 120 120 120 120 120 120 
##$TP= (0..7)
150 150 150 150 150 150 150 150 
##$TP07= 0
##$TPNAME0= <>
##$TPNAME1= <>
##$TPNAME2= <>
##$TPNAME3= <>
##$TPNAME4= <>
##$TPNAME5= <>
##$TPNAME6= <>
##$TPNAME7= <>
##$TPOAL= (0..7)
0.5 0.5 0.5 0.5 0.5 0.5 0.5 0.5 
##$TPOFFS= (0..7)
0 0 0 0 0 0 0 0 
##$TUNHIN= 0
##$TUNHOUT= 0
##$TUNXOUT= 0
##$USERA1= <user>
##$USERA2= <user>
##$USERA3= <user>
##$USERA4= <user>
##$USERA5= <user>
##$V9= 5
##$VALIST= <valist>
##$VCLIST= <CCCCCCCCCCCCCCC>
##$VD= 0
##$VDLIST= <DDDDDDDDDDDDDDD>
##$VPLIST= <PPPPPPPPPPPPPPP>
##$VTLIST= <TTTTTTTTTTTTTTT>
##$WBST= 1024
##$WBSW= 4
##$XGAIN= (0..3)
0 0 0 0 
##$XL= 0
##$YL= 0
##$YMAX_a= 571575
##$YMIN_a= -953176
##$ZGOPTNS= <>
##$ZL1= 120
##$ZL2= 120
##$ZL3= 120
##$ZL4= 120
##$ABSF1= 10
##$ABSF2= 0
##$ABSG= 5
##$ABSL= 3
##$ALPHA= 0
##$AQORDER= 0
##$ASSFAC= 0
##$ASSFACI= 0
##$ASSFACX= 0
##$ASSWID= 0
##$AUNMP= <proc_1d>
##$AZFE= 0.1
##$AZFW= 0.1
##$BCFW= 1
##$BC_mod= 2
##$BYTORDP= 1
##$COROFFS= 0
##$CY= 11.3945322036743
##$DATMOD= 1
##$DC= 2
##$DFILT= <>
##$DTYPP= 0
##$F1P= 20.1720416913024
##$F2P= 0.152960286110954
##$FCOR= 0.5
##$FTSIZE= 0
##$FT_mod= 4
##$GAMMA= 1
##$GB= 0.15
##$INTBC= 1
##$INTSCL= 1
##$ISEN= 128
##$LB= 0.24
##$LEV0= 0
##$LPBIN= 0
##$MAXI= 10000
##$MC2= 0
##$MEAN= 0
##$ME_mod= 0
##$MI= 1.114404
##$NCOEF= 0
##$NC_proc= 0
##$NLEV= 6
##$NOISF1= 3.799351
##$NOISF2= 2.8
##$NSP= 1
##$NTH_PI= 0
##$NZP= 0
##$OFFSET= 15.70392
##$PC= 1
##$PHC0= -9216.449
##$PHC1= 20.80096
##$PH_mod= 1
##$PKNL= yes
##$PPARMOD= 0
##$PSCAL= 0
##$PSIGN= 0
##$REVERSE= no
##$SF= 200.130013532006
##$SI= 16384
##$SIGF1= 3
##$SIGF2= 2
##$SINO= 400
##$SIOLD= 16384
##$SREGLST= <1H.CDCl3>
##$SSB= 0
##$STSI= 0
##$STSR= 0
##$SW_p= 3612.71676300578
##$SYMM= 0
##$S_DEV= 0
##$TDeff= 0
##$TDoff= 0
##$TI= <>
##$TILT= no
##$TM1= 0
##$TM2= 0
##$TOPLEV= 0
##$USERP1= <user>
##$USERP2= <user>
##$USERP3= <user>
##$USERP4= <user>
##$USERP5= <user>
##$WDW= 1
##$XDIM= 8192
##$YMAX_p= 0
##$YMIN_p= 0
$$ End of Bruker specific parameters
$$ ---------------------------------
##NTUPLES= NMR FID
##VAR_NAME=  TIME,          FID/REAL,        FID/IMAG
##SYMBOL=    X,             R,               I
##VAR_TYPE=  INDEPENDENT,   DEPENDENT,       DEPENDENT
##VAR_FORM=  AFFN,          ASDF,            ASDF
##VAR_DIM=   8192,          8192,            8192
##UNITS=     SECONDS,       ARBITRARY UNITS, ARBITRARY UNITS
##FACTOR=    0.0002004,     1,               1
##FIRST=     0,             0,               0
##LAST=      1.6414764,     0,               0
##MIN=       0,             -953176,         0
##MAX=       1.6414764,     571575,          0
$$ Real data points
##PAGE= N=1
##DATA TABLE= (X++(R..R)), XYDATA
$$ [...]
2300e01J049J372o51k663p04K618J300j869j397L93J291P32j057k431J278L309
2316B069j081k532k92J072J498M69j844k018J904K691j283k461K50J331J305j14
2332I64k298r69K540J621j279j190N20M32N62R5j371J18K218J47k709J4J516P35
2350A666Mj075j549P69J641n09r17L73K16l70O8j054n42J733R03k422j024J601
2368d88M66l1o57o16K99J316j94k186K02J065J074nr92j302R64J948k15j608Q31
2387a29M39n33M11j43l96Q66J478j528r99P59M32R18N5j382r93J043J452j192
2405E58l27J48J98K10k88j060j03J428J19r97J97o81n15J313K00j374J75J468
2423F69p63j424N55P46R2L34q95q68N87J140m5m73M2l61K96L62n33l95J955J74
$$ plain form
2300 -501 548 1920 1269 -1394 -2098 520 1820 -49 -1446 -1053 238 970 -87 -2518 -1240 2069
2316 2069 988 -1544 -1836 -764 734 1203 -641 -2659 -755 1936 653 -1808 -1558 -227 1078 964
2332 964 -1334 -2303 237 1858 579 -611 -91 341 903 998 -373 -255 1963 2110 -599 -585 931 1666
2350 1666 1670 595 -954 -185 1456 947 30 403 619 249 317 -737 -1279 454 1357 -1065 -2089 -488
2368 -488 -22 -53 -710 -1326 -1027 289 95 -2091 -1889 -824 250 245 -747 -2049 -1085 863 648 -960 -129
2387 -129 310 -223 188 45 -351 515 1993 465 -534 225 657 1575 1630 248 -745 298 1750 558
2405 558 231 379 577 787 499 -561 -664 764 883 -114 83 -598 -1113 200 400 -974 -799 669
2423 669 -94 -1518 -963 -217 -125 209 -686 -1554 -967 173 128 -345 -303 -664 -368 -6 -539 -934 1021 1195
2443A195k360j04J831m4J88L37j192k95J604j19j267j99J108O81K65j358j464
2460a193R87K228n26j193q25K98Q65O37j435j162J737O76j331j268L85J103Q08
2477G91k57j929r12K091R90j074n73K53L40L02j33j333Q95J968j064q82k87Q1
2495g33J109M64p34j208J506Q29j410r52J397Q49j30p78r38j13J541Q15j210m37
2513a33oR28K19j306m57J464J579k006k116J255J237M28j13j330j081J379J530
2530A471q47k057J059J053k36m49j277J75J300P43j352j148Q59L45L73j99r93
2547a180N05J651j263j080p0J634N68n48k58j252N28J535K20j200M15J68K0k36
2565A57j00M53Q64j78j415j55J057L89j08p8r20l13J554l66j747N51J328m73q09
$$ plain form
2443 1195 -1165 -1269 562 518 706 1043 -149 -444 1160 1041 -226 -425 683 1364 1629 271 -1193
2460 -1193 -206 2022 1496 303 -522 -224 641 1278 -157 -1319 418 1094 -237 -1505 -1120 -17 791
2477 791 534 -1395 -2307 -216 774 -300 -873 -620 -280 22 -111 -1444 -549 1419 355 -527 -814 -733
2495 -733 376 840 106 -1102 404 1233 -177 -1129 268 1117 987 209 -729 -842 699 1514 304 -133
2513 -133 -139 789 1008 -298 -755 709 2288 282 -1834 -579 658 1086 973 -357 -1438 -59 1471
2530 1471 624 -1433 -374 679 443 -6 -1283 -1108 192 935 -417 -1565 -706 -361 12 -187 -1180
2547 -1180 -675 976 -287 -1367 -1437 197 765 217 -41 -1293 -765 770 990 -210 205 373 393 157
2565 157 57 510 1374 1196 -219 -374 683 1072 964 886 -34 -347 1207 841 -906 -355 973 500 -309
2584c09k22r1L77R52m92j083m5J108k5p53l76K5J495N3j822n28J448L46P14n41
2604B31j031o39J583P58j078n04O79L04j33j13m88N58R74r9j323K8O44L58L40
2623A049l42q94K66J053m72j008O01O48n85M64m23j109M00J142o91k52M0l24l2
2642d69K3J21N6K42l7p60k5O15M17k05j43q22K83R72m17q69Q52N79n55j77j14
2663d33J1P06R79j382r01L61J319R8n19n62P6J065M32j545j80Q51J97J83o00p18
2683e62J0J621J38j845LJ076M04p46k07l37K70R01k64j101k62P95O38l73n41n55
2703i37N85O99p39l46J92M42O3J21p10l43J359r8p07k34O49K20l64L4k23M77L19
2724D59n93k40N23M61l53j11l27j01R67N03j036o76J036K13m81l96J63L29L34
$$ plain form
2584 -309 -531 -622 -245 707 215 -868 -913 195 170 -583 -959 -934 561 614 -1208 -1736 -288 58 772 231
2604 231 -800 -1439 144 902 -176 -680 -1 303 170 57 -431 127 1101 1002 -321 -293 351 709 1049
2623 1049 707 -187 79 1132 660 -348 253 901 316 780 357 -752 -352 790 99 -153 -113 -437 -469
2642 -469 -446 -325 -269 -27 -64 -824 -849 -234 183 -22 -165 -987 -704 268 -149 -1018 -166 413 -142 -319 -433
2663 -433 -422 284 1263 -119 -1020 -659 660 758 239 -323 -247 818 1250 -295 -475 376 573 756 156 -562
2683 -562 -552 1069 1207 -638 -635 441 845 99 -108 -445 -175 726 462 -639 -901 -106 532 159 -382 -937
2703 -937 -352 347 -392 -738 -546 -104 -41 80 -630 -973 386 288 -419 -653 -4 216 -148 -114 -337 140 459
2724 459 -134 -374 149 610 257 146 -181 -282 685 1188 152 -524 512 725 244 -152 11 340 674
2743F74m1r57m06J070Q49r06q27j71L75Q73l20j189K05Q68J85j43m67p61O84J212
2763H07p95p77J54J300r50K86k88k09L42N62o21n70O30M85q1k70l34j4Q87j42
2783D02o79K32M61J49k46j17KK01K63l21q11P37M17o58l3L31l23K11L29n91n84
2804f28P68M68p46n24J1L16L65J08p20j7O03J01o86N37l80Q7L80k37n15J28O87
2825A06K7l56j14K17J11L92l03o25L43M42O2o3r9m57O84P8n73k25N62P7j22l96
2847b32K34J95J37J90o26j29K53J50n3L0q3P2M48l99n28L30M19n66n1J93m06L09
2869a13L53n89l23O14K35n31N6J56l52O65K02r26K19O82P9m62m87M19K50J61k21
2890H7l70QO11m2J07j69l91O81K97m06n45J28Q31n53j69k51l8L67K78k72j94O7
$$ plain form
2743 674 633 -324 -730 340 1189 283 -544 -715 -340 533 213 -976 -771 97 282 139 -328 -1089 -405 807
2763 807 12 -765 -611 689 -261 25 -263 -472 -130 432 -189 -759 -129 356 275 5 -329 -343 544 402
2783 402 -277 -45 416 565 319 202 204 405 668 347 -464 273 690 32 -1 330 7 218 547 -44 -628
2804 -628 140 608 -138 -662 -651 -335 30 138 -582 -599 4 105 -581 -44 -424 -337 43 -194 -709 -581 106
2825 106 133 -223 -337 -120 -9 383 80 -545 -202 240 302 239 140 -317 367 445 -128 -353 209 286 164 -232
2847 -232 2 197 334 524 -102 -231 22 172 119 149 66 138 586 187 -341 -11 408 -158 -209 -16 -422 -113
2869 -113 240 -349 -672 -58 177 -354 -298 -142 -494 171 373 -553 -334 348 427 -35 -522 -103 147 308 87
2890 87 -283 -275 336 294 401 232 -159 522 819 413 -132 -4 827 274 105 -146 -184 183 461 189 -5 62
2912F2P5p1J98l49j30Q55l62r52L24M43l75J08N7j08k60R19o68j78M77l3l7m21
2934d26OQ7K78L7m25LP65Rm05l78M47J84K14k26n13J14N14K23m94k38j07N69J7
2957B55Om37J18N72km22O3j39N15k33l24k25K94J82Q7o88L68M2j00L7m3k18J26
2980a66N18p08L5J45p2J05K89p25K77O8K31k00J52O0l67K74J04k24J57L19j51
3001A21m44M85p2L88l95m15L66l1N06l67j82k71O19q6J08l19k67M88K43p11m1
3022b77K02L09N1k50m26K46O71l32j67l09J68K42j2l65m7N3K09K79l70j85K71
3043c9J50j80j95k5R7J86j56rj74L21J59k2k16J34j40K21L31n20K74l78J74K68
3065B61l59K96O2k02k55L30L29k55m9j58Q8M3K94l64R4N8l5r4J49j94l65O36m95
$$ plain form
2912 62 137 66 264 -85 -215 640 278 -674 -350 93 -282 -174 -117 -225 -485 434 -234 -412 65 32 -5 -426
2934 -426 -420 -333 -55 -18 -443 -440 325 334 -71 -449 -2 182 396 170 -343 -229 285 508 14 -224 -331 238 255
2957 255 261 -176 -58 514 512 90 153 14 529 296 -28 -253 41 223 310 -378 -10 32 -68 -31 -74 -292 -166
2980 -166 352 -356 -321 -176 -248 -143 146 -579 -302 -234 -3 -203 -51 9 -358 -84 20 -204 -47 272 121
3001 121 -323 162 90 478 83 -332 34 3 509 142 -40 -311 308 222 330 11 -256 232 475 -236 -277
3022 -277 -75 234 285 35 -391 -145 526 194 27 -282 -114 128 116 -249 -296 -243 -34 245 -125 -310 -39
3043 -39 111 -69 -264 -289 -192 -6 -162 -171 -345 -24 135 113 -103 31 -109 112 443 -77 197 -181 -7 261
3065 261 -98 198 260 58 -197 133 462 207 158 0 88 131 425 61 155 213 178 84 233 39 -326 310 -185
3088a85j8N4O7J46K39l64m64M02N04l19k98Lm4J95k9J24k30K01K95j87k29p2J86
3111b3L8K06r0o0j52J68N3j29lJ58j52Q1j59L4Q0Q8N9pk27r9L36n8q7O2J85m69
3137a67M8k76N93r3k44J44j5k21L15j37m28Q80k03l04L5R5j02K58r4l56l0L70
3159F8l4J8k84K30L7N7J63o00J71J15J74M4j81k02J15K5K33k02j62M36j74L18
3181C65n97K50q6J3K15k37Q9l0L17o8m87K73J06j81L7j85M11k42l1J25m24M56
3203H9K09p8l62k6L66o05M34j11M57J58m19l26J34J81J4o1j73j35J76J77o8l4
3225cMP5j47L30k67M7j31L79J33n79L30j29L7R2k1k43N6Q8N8k60R2O4K33l37j38
3250b37M09m02K09K12j11j96K1J65j67J48k03o5J87J18k07K09J5l8l10K12k08
$$ plain form
3088 -185 -203 -149 -82 64 303 -61 -525 -123 381 62 -236 -233 -277 -82 -111 13 -217 -16 279 92 -137 -209 -23
3111 -23 15 221 131 71 -81 87 140 11 8 166 14 95 -64 -30 50 138 197 190 -37 -136 200 142 55 117 302 -167
3137 -167 -119 -395 198 105 -139 5 -10 -231 84 -53 -481 399 196 -108 -73 22 -80 178 84 -272 -302 68
3159 68 34 52 -232 -2 35 92 255 -345 -174 -59 115 159 -22 -224 -109 -84 149 -53 -215 221 47 365
3181 365 -232 18 -68 -55 160 -77 12 -18 299 231 -256 17 123 -58 -21 -206 205 -37 -68 57 -367 89
3203 89 298 220 -142 -168 198 -407 27 -84 373 531 112 -214 -80 101 115 54 -119 -254 -78 99 31 -3
3225 -3 1 76 -71 259 -8 39 -92 287 420 -159 171 42 79 171 150 -93 -37 51 109 -151 -59 5 238 -99 -237
3250 -237 172 -230 -21 191 80 -116 -95 70 -97 51 -152 -217 -30 88 -119 90 105 67 -243 -31 -239
3271b39K55k5O6o1L5l3k42O3J04mK73n2m02j4K24k21J39o9M66k63j46J65J8J28
3295A65K95l72j81J52k0K49j77r3j3j19J2L91n7k43J38J57q7j62r2R6RL33m36
3318e5n9o6L59O2k29j30J80p0J2P1n7k42M04j86p4Q5M1k23K80o2l06J03J74N4
3342F6j12J9r4OJ38J18k66N5J06r6l4K7n6Q3K7J03j88J94J61j66l20L06J60k23
3366A4k1R2k11K66m2q4J31pR0k63L9k69K70L54k14j96K42M2k64j3j08J64K23j46
3390H9n6oQ7k62l5J76O9k44J50jk01J60J74r4j91J83l27L85j77L90j77Np7J45
3414A65k58J76l43K55P2Q7o6J70r9j47L06l35P5J36j50K17q7k61r8J66O9K59m29
3437a20J40P0m39K57J52j25m33P4N82k72J04l77K94J32k3k31K00j85o4M8N6K43
$$ plain form
3271 -239 16 -9 57 -4 31 -2 -244 -181 -77 -81 192 140 -262 -276 -52 -273 -134 -203 263 0 -146 19 37 165
3295 165 460 88 -93 59 39 288 111 18 5 -114 -102 289 232 -11 127 284 197 35 -57 39 48 381 -55
3318 -55 -114 -180 179 241 12 -118 62 -8 4 75 18 -224 180 -6 -80 5 46 -177 103 41 -265 -162 12 66
3342 66 -46 -27 -121 -115 23 141 -125 -70 36 -60 -94 -67 -123 -40 -13 90 -98 96 257 91 -229 77 237 14
3366 14 -7 85 -126 140 98 14 145 138 228 -35 4 -265 5 359 145 -51 191 233 -31 -44 -152 12 235 89
3390 89 33 27 114 -148 -183 -7 62 -182 -32 -33 -234 -74 100 6 -185 -2 -329 56 -121 269 92 97 20 165
3414 165 -93 83 -260 -5 67 154 88 258 159 12 318 -17 58 194 44 261 174 -87 -185 -19 50 309 -120
3437 -120 20 90 -349 -92 60 -65 -498 -424 158 -114 -10 -387 -93 39 16 -215 -15 -200 -264 -216 -160 83
3459H3j26J27Q5l57J13J87k47K43L5m63L15J02O6k14K06q3J70k84J57J2j6O7k24
3482d6J49J56mm55J69j22j8L60Q5m08J83j44p1M05j53l19J41M05m14M5J28k37
3504a65KM01k34j42M15j41j35L1kj52K29j33Q9m3l57K68Q5o8L9j51K17O0P4k92
3528a05O1m5m4L52m14RM17o6j9m44K05J11K07n3K0k67l9K09n44O37k04J1L6J3
3552D4p6%K54m89k99P62Q0l40J31qJ9m70P42o26o4M55p5k65K13M2l81L81j27k68
3576c65M23k18J90Jj01M0j36N08k82j43K70K94l56k19K19m41M01J03j30k24L21
3597A55n8n1M17k73k87J36M02m23p5J72k33M0K43j60k18K32kl53m7L69k32M36
3619A90j32J13n36N83k72l77N18l81J09L24q5j37O3J18j04j3j23L59j22K1j62
$$ plain form
3459 83 -43 84 169 -188 -75 112 -135 108 143 -320 -5 97 163 -51 155 72 242 -42 115 127 111 178 -46
3482 -46 103 259 255 -200 -31 -153 -171 189 274 -134 49 -95 -166 239 86 -233 -92 313 -101 -56 72 -165
3504 -165 -163 238 4 -138 277 136 1 32 30 -122 107 -26 63 20 -337 -69 16 -52 -13 -164 53 113 187 -105
3528 -105 -44 -89 -133 219 -195 -186 231 165 146 -298 -93 18 225 172 192 -75 -114 95 -449 188 -16 -5 31 44
3552 44 -32 -32 222 -267 -566 196 276 -64 67 59 78 -392 350 -276 -340 115 40 -225 -12 30 -351 30 -97 -365
3576 -365 58 -160 30 31 -70 -30 -166 342 60 -83 187 481 125 -94 125 -316 85 188 58 -166 155
3597 155 97 46 463 190 -97 39 441 18 -57 115 -118 -78 165 5 -213 19 17 -336 -383 -14 -246 190
3619 190 58 171 -365 218 -54 -431 87 -294 -185 139 54 -83 -20 98 -6 -19 -142 217 95 116 -46
3640d6j12K20Q8m23L79L11l56K27k32J1k68J19K67l70qN87l30K57M8n07j57M49
3662A54l13j77L37K38R9m35J83l79J93M90k64j70N6J22n45L21l06K51J63K86m17
3683a13OK28j45m1J43k73q9L06J0nR4Nq5j73K16K9k50L37j42j51K05j57Q0J78
3707B13q9j88K52j13n6k3J93r6j30K29k63j67O31l48k47L42op5k86K31k75J80
3729i1J90k85Q5L4O7m6N4O5n62K74L87k31m13O16j30J04j30j28j31L89R5j40j05
3752c2J54J05l87R8L7r1K44N4l08J37J46j8J22j58k76K81J06k0l26J62M8k04J4
3775a12K16l50L8M81l81l5L99m19J9J62j57Lp3J9J18j55L56m01K81J74k83n4K52
3798I8l17j9M3O67m15j69K29j59l03P10k29k12K05J96j06R3n50J0N53K35q19J81
$$ plain form
3640 -46 -158 62 150 -273 106 417 61 288 56 67 -201 -82 185 -185 -193 394 64 321 369 -138 -295 154
3662 154 -159 -336 1 239 338 -97 86 -293 -100 390 126 -44 12 134 -411 -90 -396 -145 18 304 -113
3683 -113 -107 121 -24 -65 78 -195 -284 22 32 27 121 126 41 -132 84 113 -137 200 58 -93 112 -45 35 213
3707 213 124 -64 188 75 19 -4 189 93 -37 192 -71 -238 393 45 -202 140 134 59 -227 4 -271 -91
3729 -91 99 -186 -101 -67 0 -46 8 73 -489 -215 172 -59 -472 144 14 118 -12 -140 -271 118 213 73 -32
3752 -32 122 227 -160 -62 -25 -116 128 182 -126 11 157 139 261 103 -173 108 214 194 -132 30 78 -126 -112
3775 -112 104 -246 -208 273 -108 -143 256 -163 -144 18 -139 -136 -209 -190 -72 -227 129 -272 9 183 -100 -154 98
3798 98 -219 -238 -195 472 57 -112 117 -42 -345 365 136 -76 129 325 219 312 -238 -228 325 560 -259 -78
3820g8L58k44j87M48n06L09N24m33m36J11O8P7K28k32l37J86L61k46m31K33L21
3841I4k17r2J5J7J72J59j030O98M08o2j70j18KR2M70n28l95N80Q0l4J71j23j06
3864H3J84L6k14OJ40J47l71R8J12R6o9K10m41k98M11K63l57J99k82k2J47L7j23
3887hm9K49m18Q6J65k7qj31N9J16k53R3m1j62M29m24J18K76l62R9K73n52J18M72
3911A18K9m6j04J25N7k28L81k45j60M08k13l70O34J3n29P0P9k75Q5P3JL49J58
3934D10j13o49N78q7p0J04l61o6K75J68m74n7K45K79n04J88o9j30L51kl24NL25
3957B2k71K21K40l71l46O11J0l48L19J77j46k04q1M14n40N40k4n26M89q4p9QK92
3980C23k00J4L35k78q4L20m16K00j41P7l31L26Mm42N6O06n19j13L75l68J57P32
$$ plain form
3820 -78 280 36 -151 297 -209 100 624 191 -245 -134 -66 11 239 7 -330 -144 217 -29 -460 -227 94
3841 94 -123 -215 -200 -183 -11 148 -882 -184 224 162 -8 -126 -124 -32 438 -90 -485 95 175 141 312 189 83
3864 83 267 303 89 95 235 382 11 109 221 317 248 458 17 -281 130 393 36 235 -47 -69 78 115 -8
3887 -8 -57 192 -226 -140 25 -2 -10 -141 -82 34 -219 -126 -167 -329 100 -324 -206 70 -292 -193 80 -472 -354 118
3911 118 147 101 -3 122 179 -49 332 87 -73 335 122 -248 386 399 -130 -60 19 -256 -171 -98 -97 252 410
3934 410 297 -352 226 139 69 173 -188 -254 21 189 -285 -342 -97 182 -322 -134 -203 -333 18 16 -308 -303 22
3957 22 -249 -28 212 -159 -505 106 116 -232 87 264 118 -86 -167 247 -293 247 223 -303 186 102 23 31 323
3980 323 123 137 472 194 110 430 14 214 73 150 -181 145 149 -293 -237 369 -150 -263 112 -256 -99 633
4002F33q32j9K46q5j45K29M8j57J41o4q6m23K84L80j78l8j07p6M82k56q1k89N26
4025A33L16n53R6j60L1R15n43l20Q3L27o3j56K10k64J66L45m31n52L17J2J11L67
4047C87J56o12M9K11l23k9M22l7l28K17k06k86M55N5l41K07r4j29j59L84j70J97
4069B6M08q45k87P70N84m17m42J12J55J13Ol43L29J63q2O4k67J60j50M61k04k60
4091E4j47N49l47l25L34l6M3M12k84q11L35N95O3l27K38l05k04O05j33q47M46
4112i2L55o15M30N8m39M00m0m22P4P0p5J24J91j64j04K33J08n70L46Q2L6m28O04
4135A62k45r9M90m02j76P63l04j36n7Q6J77P7J13l94l06M91j6j81J22k87J80J27
4157A85M0l38k07P21o4r96N82K29k21M09j96r03O24O4Jk20Q0j7P3J02l13ql4L61
$$ plain form
4002 633 -199 -218 28 -57 -202 27 75 -82 59 -5 -91 -514 -230 150 -28 -66 -173 -249 233 -23 -104 -393 133
4025 133 449 -104 -8 -168 -137 778 235 -85 -2 325 262 106 316 52 218 563 132 -420 -103 -91 20 387
4047 387 543 -69 -20 191 -132 -161 261 224 -104 113 -93 -379 76 131 -210 -3 -97 -226 -385 -1 -171 26
4069 26 434 -411 -698 72 656 239 -203 -91 64 177 183 -160 169 332 250 314 47 207 57 518 314 54
4091 54 -93 456 109 -216 118 82 125 537 253 -558 -223 372 435 108 346 41 -163 442 309 -538 -92
4112 -92 263 -352 78 136 -303 97 57 -365 -291 -221 -296 -172 19 -145 -249 -16 92 -478 -132 -50 -14 -442 162
4135 162 -83 -182 308 -94 -270 493 189 53 -4 82 259 336 449 55 -251 240 224 43 165 -122 58 185
4157 185 225 -113 -320 401 337 -659 -77 152 -69 340 144 -759 -135 -71 -70 -290 -210 -227 -154 -52 -365 -373 -407 -46
4181d6K4j48J04m14N53J19l92NJ91l8RK00J77n25M59P1n49R4O89m05LJr0l12M04
4206A84k32j08M34K10o23J32L63n96K17K44o3l77K04K07l31J23k4j90O48n40k38
4227c56J35N21j72k28j88J5J60J38j20m19N10M94o29j18K59P3k00O34o10m52K30
4248c23O55k81L06j2l01j3K58k97j19N97j48l88K95j7m9M72k36k80J04n7j15q6
4270c5K90r0k54K56k61j37M95p5k27j47jJ95O6o7m89K44O24j81q84K60N81k82
4292a19m4K06l33j62R34k99l76K26k2K02J30Mp72L56O08o64P4L18m27K12N89o34
4314Gk73P09R3m90O3O2k66N23J61p36o9M57m6J1k95j44l90P85L3n79j23P21k47
4337c3l23N18Nm59J05J16l54N00j49j67m77O50J62k47K1l2q1N34Nr67L17K9L81
$$ plain form
4181 -46 -22 -170 -66 -480 73 192 -200 -195 -4 -42 -33 167 344 -181 278 349 -200 -106 583 178 181 182 92 -220 184
4206 184 -48 -156 278 488 -135 -3 360 -236 -19 225 162 -215 -11 196 -135 -12 -36 -226 422 -118 -356
4227 -356 -221 300 128 -100 -288 -273 -113 25 -95 -514 -4 490 -139 -257 2 75 -125 509 -101 -553 -323
4248 -323 332 51 357 345 44 31 289 -8 -127 470 322 -66 229 212 163 635 399 119 223 166 51 -35
4270 -35 255 165 -89 167 -94 -231 264 189 -38 -185 -186 9 75 8 -481 -237 387 206 -678 -418 163 -119
4292 -119 -163 43 -290 -452 482 183 -193 33 11 213 343 347 -425 -69 539 -125 -51 267 -160 52 641 7
4314 7 -266 443 536 46 109 171 -95 428 589 -147 -216 241 195 206 -89 -233 -623 162 195 -384 -507 214 -33
4337 -33 -356 162 167 -292 -187 -71 -425 75 -74 -241 -718 -68 94 -153 -132 -164 -245 289 294 -673 -356 -327 54
4360E4J8J79o14O92o2j44j77K86k38K6L10J63o79L83L57n23M8J26K8j66L07j24
4382B50m26L44J79k76l16J94m3M48j03n42n79R46J2m69L32l47J58L9L29o12k67
4403g49P10j02k70O8j19K95K41k60j77M39P3m86L82K48m55K33L88n62l13O64r7
4424A51j92M50N5j97j44M45p56L09N53l73m33M4Q3r9N94l61n82L13O40m33o03
4445e36M08P9J71K25p35m66Q66k5l4n09M57o2j4J70l26J51L25k11k14K03j76o6
4467c19L85q0k49K03N66k49o68N62j94p3Q23l36n51R4R32p54k8L54j30k72K18
4488B34P0k58M62l21l20J83M63o29K96m3k20K4K31q4q03O84j02P3J2k19j96M16
4510d7N7l15l75P78Q6k62k0k14j5O17N9n78k63O57l79K59K01n52K6O83M36j049
$$ plain form
4360 54 72 251 -363 329 267 123 -54 232 -6 20 330 493 -186 197 554 31 79 205 233 67 374 250
4382 250 -176 168 347 71 -245 -51 -94 354 251 -291 -870 76 88 -381 -49 -396 -238 -199 130 -482 -749
4403 -749 -39 -141 -411 -343 -462 -167 74 -186 -363 76 149 -337 45 293 -162 71 459 -103 -416 248 151
4424 151 -41 409 464 267 123 568 -188 121 674 301 -132 -88 -5 -104 490 129 -453 -140 500 67 -536
4445 -536 -128 -49 122 347 -388 -854 12 -13 -47 -556 -99 -161 -175 -5 -331 -180 145 -66 -280 -77 -253 -319
4467 -319 66 -14 -263 -60 506 257 -411 151 -43 -116 707 371 -180 -86 846 92 64 418 288 16 234
4488 234 304 46 508 187 -133 50 513 -116 180 137 -83 -59 172 88 -715 -31 -133 -60 -48 -267 -463 -47
4510 -47 10 -305 -680 98 184 -78 -98 -312 -327 290 349 -229 -492 165 -214 45 246 -306 -280 403 839 -210
4532b10M1R42r39K36J73o84N45L86k85m01M88k36J53J86j44n73O17J35o13p7N81
4553C21k4m01N03l13n13M08Q0l12Q9K40l21J3K40n66K59O82m80m81L08J50j14
4574b32J31J32n98O81J42l83k97P23Qo39M83k22m72Q20M22o02k84N32j33o9L72
4595E15m16KL85k9l43J72J47l04L17J69q72j00Q26p3p14N63l58k8K61j48m17L42
4617a03Q4j98m8L79o9k37K50l15j74O64J6p16M58j53k29K80M07n25k86J004l49
4638A40o52P46P5k64K49l3n30N78M74o36p3J78N9j57M66o00o3P17Qp66l86Q63
4660C93j42j2j17l81J16J37L12p08q1N59k82P0j41m05L22N37l31k72L5M10m71
4681d52O27k30n26M20N10q10j9P03j69j74N51k90n47R73j72q07K06N55l13m03
$$ plain form
4532 -210 -169 773 -166 70 243 -441 104 490 205 -196 292 56 209 395 251 -322 295 430 -183 -260 321
4553 321 297 -104 399 86 -427 -19 61 -251 -162 78 -243 -230 10 -556 -297 385 -95 -576 -268 -118 -232
4574 -232 -101 31 -567 114 256 -127 -424 299 307 -332 151 -71 -543 277 699 97 -187 345 212 143 515
4595 515 99 101 486 457 114 286 433 129 446 615 -257 -357 469 396 -318 245 -113 -141 120 -28 -445 -103
4617 -103 -19 -217 -265 114 45 -192 58 -257 -431 233 249 -467 -9 -162 -391 -111 296 -229 -515 489 140
4638 140 -512 234 309 45 294 261 -269 309 783 147 74 252 311 154 620 20 -43 674 682 -84 -470 393
4660 393 251 239 122 -259 -143 -6 306 -402 -483 76 -206 -136 -277 -682 -360 177 -154 -426 -391 19 -452
4681 -452 175 -55 -581 -161 349 -461 -480 223 54 -120 431 141 -406 567 395 -412 -206 349 36 -367
4701c67K70j36N93M81m84o72P97j71m77K60J36k78Q5M20o57l79R13J07n08j79
4721b46K8J29M03m13l90K83L87l22M3K10q80K99R87n08q48N17K98l66J16K00j96
4742b69RM19K70r47N34j8P0j22J99m29O60K03p40R0M62j60l56P13n40J31M87k37
4764D29o03K81M91m04l24J03P6J06J01q6l59J92L38n33r5l26K87N57r4o82K00
4785c45M03J56n51K06l5n20R27N3j215L91R84l68n75M71l17l3Q10j78m05p8K88
4806F9K09k38L43m78K21N29m86l35O26L52o86j92N78n10k57R98k92o25O7O57p76
4827b26K21L3j85L57P2m28J90Ok71l6J54k44l8N85m29o66R59j16n03K40K74k74
4849c25q4M74l44j87M72J44o38L51K38M6J90j67l97N1R05m75l08N89m28j74Q40
$$ plain form
4701 -367 -97 -233 360 841 357 -315 482 311 -166 94 230 -48 37 457 -200 -579 334 441 -67 -246
4721 -246 -218 -89 314 -99 -489 -206 181 -141 -98 112 -768 -469 518 10 -838 -321 -23 -389 -273 -73 -269
4742 -269 -260 159 429 -518 16 -2 68 -54 145 -284 376 579 -161 -71 391 231 -125 588 48 179 666 429
4764 429 -174 107 598 194 -130 -27 49 155 256 170 -189 3 341 -192 -287 -613 -326 231 137 -545 -345
4785 -345 58 214 -337 -131 -166 -686 241 294 -921 -530 454 86 -489 -18 -335 -368 442 264 -141 -219 69
4806 69 278 40 383 -95 126 655 169 -166 460 812 126 -66 512 2 -255 743 451 -174 -107 550 -226
4827 -226 -5 28 -157 200 272 -156 34 40 -231 -267 -113 -357 -395 190 -239 -905 54 -62 -565 -325 -51 -325
4849 -325 -409 65 -279 -466 6 150 -488 -137 101 147 337 170 -227 -176 729 254 -54 535 107 -67 773
4870G73j61j092L64P44m41n5K61l59l2M13j64m19K28o9J32jo11rR54j65m63l85
4892e57R20m47k76L21k08k24O08k39m95KN03p6j70OM65l31J67l74K38K80J91l57
4914e3k77M86j55K84K08o46j56R71M3q43j2M13r3M09J56o82k31Q72k93l88n8K5
4936b0J45K81l75p12O34M93l21M0J1o82N23O52o18q08P31L74p16j0R3K36J15K66
4958C32p07n3K86K17l47O36k28o24P53p9n25K63N85q16L28L62l4k88N64l71o58
4979d04N66O61q27j59O56k1l9j60l66J66O67l81n43ON17l09L43J80q78K32Q07
5000G14o92k79K36j41o7K12K59r53M09N11n00k06O00o39N34K0n31j83P61J31o79
5021d83M32K38m99M74M58p66k30P80l09p57Q59J25m13K89J48k57J33Qj08q4M6
$$ plain form
4870 773 612 -480 -116 628 187 132 393 34 2 415 251 -168 60 -9 123 122 -489 -498 456 291 -172 -557
4892 -557 363 -84 -360 -39 -247 -471 137 -102 -597 -595 -92 -168 -338 -332 133 -198 -31 -405 -167 113 304 -53
4914 -53 -330 156 1 285 493 -153 -309 662 705 -138 -150 263 170 579 735 53 -178 694 401 13 -45 -20
4936 -20 125 406 31 -681 -47 446 125 165 176 -506 17 669 51 -757 -26 348 -368 -378 -285 -49 66 332
4958 332 -375 -428 -142 75 -272 364 136 -488 265 186 -339 -76 509 -307 21 383 349 61 625 254 -404
4979 -404 162 823 -4 -163 493 472 433 273 -93 73 740 359 -184 -178 339 30 373 553 -325 -93 714
5000 714 22 -257 -21 -162 -229 -17 242 -711 -302 209 -291 -497 103 -536 -2 18 -513 -696 65 196 -483
5021 -483 -51 187 -312 162 620 -146 -376 404 95 -662 197 322 -91 198 346 89 222 230 122 38 84
5042H4K94k56K52r9o19N20K31q63L82L69m61O0L45o93J87M84l07m97K64L32j73
5063a64L09k45o40R7P05m67j09L63k32J98K15j51r43O54Q75m05n71O44o1K8K55
5084C55k00m80oR07m42q6J13j71P24k82o90K02R39m58o43O70j8p86M02L84o34
5105b00M8M25k70l37O06l83j88Q9N20q35L33K54m21J16P9j54K64J06o90J82N49
5126I3j65m61J28N90n01M7L95o77J67O26j19n80L33N62k33Rj34k76K36P82o23
5147A99k22J69J0N9M31l63l13M45M71r75n9M87K0K8J16m21l94M88L25o15J17j21
5169a18k88M31j42k67L37M37o33k63M52m49m9N06K8p86P08J04m50J34K32J27o0
5190ij66r6J90N34P6r38L34L20n5L30l71l15N59K21o36m67J005l1j63r3Q0m09
$$ plain form
5042 84 378 122 374 275 -344 176 407 -456 -74 295 -166 -106 239 -454 -267 217 -90 -587 -323 9 -164
5063 -164 145 -100 -740 -643 62 -405 -514 -151 -383 -185 30 -121 -1064 -410 465 60 -511 133 72 100 355
5084 355 155 -325 -331 576 134 48 161 -10 714 432 -258 -56 883 425 -218 452 434 -352 50 434 -200
5105 -200 -152 273 3 -334 272 -111 -299 -210 310 -525 -192 62 -359 -243 -164 -318 -54 52 -638 -456 93
5126 93 -72 -533 -405 185 -316 -269 126 -551 -384 242 123 -457 -124 438 205 214 80 -196 40 822 199
5147 199 -23 146 156 215 646 283 -30 415 886 -89 -148 339 359 387 503 82 -312 176 501 -114 3 -118
5169 -118 -406 25 -117 -384 -47 390 -243 -506 -54 -503 -552 -46 -18 -804 -96 8 -442 -308 -76 51 -9
5190 -9 -175 -271 -81 453 529 -409 -75 245 190 520 149 -166 393 614 -22 -489 516 485 322 229 309 -100
5212a00K77M65l62q27P44L30k87O2j90n31N36M91m73l81K9Oj78L68m51j15P36
5233A49k78p21P50l9m35M49Q9m60J46N22mp95N56M4M0K39j43m63M43K45l39q1
5255h6M78l43n8N81n08q9P13j46q19M78O28o57k85N84k69k82P33l74m26K67J82
5276C02q5l86R0kpL69n84l80O40R0j93K6M5p46Q04N07j122%O70Mp6k50j77k03
5300f64P57J06l65J90j60J50p8J83p02Q10L29m54l86O22k29P6O9j12l78L30N67
5321F61l99j56K25l2m91P97n06k30L18k8l60N33l95k89K30J25m38J98L78j29q56
5342h44Q13p7q02L16M88l46K02M54l70m76N39K50k48o4n04M17J85J51l65N4M16
5363A89J52r0p3l48K1J032K2j251N66Q13j002J23N84n45j40L68K66p95Q3J97j95
$$ plain form
5212 -100 177 642 280 -547 197 527 240 302 112 -419 117 608 135 -246 -217 -211 -389 -21 -472 -587 149
5233 149 -129 -850 -100 -139 -574 -125 -36 -496 -350 172 168 -627 -71 -27 13 252 109 -354 89 334 -5 -86
5255 -86 392 49 -9 572 64 -25 688 542 -277 201 829 172 -113 471 202 -80 653 279 -147 120 302
5276 302 217 -169 -79 -81 -88 281 -303 -683 -43 47 -146 -120 -75 -821 -17 490 -632 -632 38 42 -34 -284 -461 -664
5300 -664 93 199 -166 24 -136 14 -64 119 -583 227 556 102 -284 338 109 185 254 142 -236 94 661
5321 661 262 106 331 299 -192 605 99 -131 187 159 -201 332 -63 -352 -122 3 -435 -237 141 12 -844
5342 -844 -31 -108 -910 -594 -106 -452 -250 204 -166 -642 -103 147 -101 -165 -669 -252 -67 84 -281 -227 189
5363 189 341 251 178 -170 -149 883 905 -346 220 1033 31 154 738 193 53 421 687 -108 -25 172 -23
5384b3P0K7j15j08M54o87j34P69j91n45P06m05l43K18L09q18L63P17k56m48L34
5405a06p2j01L26k35m34L75N19k09q4Q2k39K77N45r76P3Q32kq29M91K28n94M78
5427C45K66n00k60P44P7n55O9k43K31L64m63k42K47K74m39K27q7k01k51J004n41
5448F6p27M90K29m78o0O90q63N23Q1l43M2N14k93k03J06K94k54J06q3m67L99L50
5470A19m75L63M38l56kM69k88o88N85M81p80K0L00K3j11L11k57j18J42R1j42j4
5492A11J49k89M71j84p08J27P07k52k83M14m21l54N17M9q35K98P06l63j92l5m4
5513d11J45K90l85k57N02M4j99L82lo00K28P20n32J37K83o25L8L58J4l25M63J16
5535C83j20j13L71m12P9J79l89K45J03j34n97P82J06k49j19N75p84J86L47o14
$$ plain form
5384 -23 47 74 -41 -149 305 -382 -516 253 62 -483 223 -182 -525 -307 2 -816 -453 264 8 -440 -106
5405 -106 -178 -279 47 -188 -622 -247 272 63 -21 61 -178 99 644 -332 -259 573 571 -258 233 461 -133 345
5427 345 611 111 -149 595 672 117 186 -57 174 538 75 -167 80 354 -85 142 55 -146 -397 607 66
5448 66 -661 -171 58 -420 -480 210 -653 -130 -49 -392 -350 164 -129 -332 -226 68 -186 -80 -163 -630 -231 119
5470 119 -356 7 445 89 87 556 268 -420 165 646 -134 -114 186 209 98 409 152 34 176 267 125 111
5492 111 260 -29 442 258 -450 -323 384 132 -151 263 -158 -512 5 54 -781 -483 223 -140 -332 -367 -411
5513 -411 -266 24 -361 -618 -116 -72 -271 111 108 -492 -264 456 -76 61 344 -281 -243 115 129 -196 267 383
5535 383 263 150 521 109 188 367 -22 223 326 192 -405 377 483 234 115 690 -94 92 439 -175
5555a75j76O62j67n22K03K06j8K7R6k94m24M56P1k70K46l85k5M46J66o84K88M26
5577A53m0l9J23o81K04O17l69l39K48N37m45L37o9n95N56N48m54l17M91l4n77
5598a45O73l15k31L14K90r21O52J74n41j31N29m97J9N53l81m77M35K85l80r4K6
5619a63L2k26L90m83J71J51J18o83N58R5k80J63J80p30j20J024j41n53L96K15
5639A14n26R62j09p64J00N57r5j11K45m05J3O51r4r96Q29N4n40N45p7j64L05J84
5661F78l02q47O08Q7l93K66k1l59O13k38k26L10N0n93J6L97m21k53P34m19j43
5682d56N30l2m73L39P7k65o1L31R5o26J139l77o94L77K72o7L4Jk78J93L68j26
5704C01n52N57o8m0L59j33p08M22L10R3m87K4j49J73L88n61j36J82K70m58P3j3
$$ plain form
5555 -175 -351 311 144 -378 -175 31 13 40 136 -158 -582 -126 -55 -325 -79 -464 -489 -43 123 -561 -273 153
5577 153 113 74 197 -484 -280 337 -32 -371 -123 414 -31 306 237 -358 198 746 292 -25 466 432 -145
5598 -145 528 213 -18 296 586 -335 317 491 -50 -181 348 -149 -130 423 42 -435 0 285 -95 -189 -163
5619 -163 -131 -357 33 -450 -279 -128 -10 -693 -135 -40 -320 -157 23 -707 -827 197 56 -497 -101 114
5639 114 -412 550 441 -323 -223 334 239 128 373 -32 -19 632 538 -458 371 425 -115 430 353 189 494 678
5661 678 376 -471 137 224 -169 97 76 -283 330 92 -134 176 226 -367 -351 46 -375 -628 106 -313 -456
5682 -456 74 42 -431 -92 -15 -280 -341 -10 85 -541 598 221 -473 -96 176 109 143 144 -134 59 427 301
5704 301 -251 306 238 198 557 424 -284 138 448 541 54 78 -71 102 490 -71 -207 -25 245 -213 -140 -153
5726a53j00R3O06p07k94P37q8o18N74Mr20R56l8o10J6N91k74rM93m59k0J69K93
5749B42l96J63K13k91L02Q8j8o8L67p37j16R37p4m93O4M50m46J0L23l16j51Q26
5771H79p56k48N03l29MK18L0q66M97L81p14J15P9M8K1O04r46p04J203O04j082
5792d59l0M76l77l24Q46n15l03R20n0l11j61j3J8O42o9o02K05M25j80j61N72m50
5814I9n2M88k29m68J76Q92j090K6O61m10N2L25k29k05J63K59o1l25J71k04l33
5835b94J27j80L28L24o60l90N23k3j50K63j06m20L92O24n29o81P13j40K9J74p8
5856a54l86M18L96n74L0M51m2N7K57o26PM86J88l42j20M80o80M72M78p71j4P76
5878G87n40m56N75j0n17K42M15o83K23L11j67m36N13l96j85M26l78j74M29j37
$$ plain form
5726 -153 -253 -160 446 -261 -555 182 94 -524 50 54 -866 90 52 -558 -542 49 -225 -234 259 -200 -220 -51 242
5749 242 -154 9 222 -69 233 321 303 235 602 -135 -251 686 612 119 183 633 187 197 520 204 53 879
5771 879 123 -125 378 49 53 271 301 -565 -68 313 -401 -286 -207 -159 -138 466 -480 -1184 19 623 -459
5792 -459 -489 -13 -390 -714 132 -383 -686 234 184 -127 -288 -301 -283 359 290 -312 -107 318 138 -23 549 99
5814 99 47 535 306 -162 14 906 -184 -158 503 93 145 470 241 36 199 458 397 72 243 39 -294
5835 -294 -167 -347 -19 305 -355 -745 -222 -245 -395 -132 -238 -658 -266 358 -171 -852 -139 -279 -250 -76 -154
5856 -154 -540 -122 274 -300 -270 181 139 196 453 -173 -166 320 508 166 46 526 -154 318 796 25 11 787
5878 787 247 -209 366 356 -161 81 496 -187 36 347 180 -256 257 -139 -324 102 -276 -450 -21 -158
5898a58m93M90R0k39l61M62k2j06K30r5q5M94L8o74N12l4o77O35K93n41o3O41
5920C37j94k43O82k55m45J05R05p24n0M63k00l11N09j06o12M81K1k10q4J26k29
5941c4J85K97o96J7N09p6q01O07J05o44M57P8n43K00J29L08o79L69k94K67M67
5962B28n43q0K80M4o03K82P47m47J96L49n58rM95l00k77N79l4J48k32L44p26J03
5984a4O82l28j6l5k89L3M69m06j06J04L77l00l85N14k96l18L14m30j76O25o9k94
6006c44J83K4j90r2M13l82R9M77k22m60M49j73n85J037r5o69O55P3k57p0K68k64
6028a25j61P19l51j03L22P4k62j61N19k36k16N11k79l70O44m37k94K56J61L5m1
6049B05o8l96J83N83r24N7Q16k15m67Np1l04M72L58n41j04L14k62j42N75l98l58
$$ plain form
5898 -158 -651 -161 -71 -310 -671 -209 -231 -337 -107 -202 -287 207 245 -429 83 49 -628 7 300 -241 -304 337
5920 337 143 -100 582 327 -118 -13 892 168 118 581 381 70 579 473 -139 342 363 153 69 195 -34
5941 -34 151 448 -248 -231 278 202 -599 8 113 -531 -74 4 -539 -339 -210 98 -581 -212 -506 -239 228
5962 228 -315 -395 -115 -71 -674 -392 355 -92 104 453 -105 -114 381 81 -196 383 349 497 265 609 -117 -14
5984 -14 668 340 324 289 0 33 502 96 -10 94 471 171 -214 300 4 -314 0 -430 -606 19 -50 -344
6006 -344 -161 -137 -327 -419 -6 -388 -289 188 -34 -494 -45 -218 -803 234 139 -530 125 198 -59 -129 139 -125
6028 -125 -286 433 82 -21 301 375 113 -48 471 235 19 530 251 -119 525 88 -206 50 211 246 205
6049 205 137 -259 -76 507 -417 -360 456 241 -226 -221 -292 -596 -124 234 -307 -411 -97 -359 -501 74 -324 -682
6071f82P18L8l61L2J16j99K49M81o30j50O93j50j57l2J68l30L43M50n93j34L17
6092A87J5N7j25l7k95O24r2k02M5l0k25M98J08n06k7K46j10k39O33m14m18M08
6114A01J40m29J94k1j94j86P21o82p5L47j52j50J30k85j19P33L84p25o7K95%l67
6136d07N03r1l33N99k14m92J35M19o3n3J38j25k90M31J80m01L88qk99N31Q5j041
6158d08L98O93m06l81P1Q8l79N54J31o09L43k5o30O72J59o19Q4N82o41nJ83Q7
6180e8n43P19R3m30JK13n62j11Q88m94J0L94k05K59l05QJ9J68M42o08k74J055
6202F79m48m04M29l18L4N80J02r29J58O05l42M55k79k94m7O55k21m01r7L10k51
6223b4N21n79k49Q0P77m52p4K19l77rK08j3n40K83L17k34Q4J51l60q6L66k10j24
$$ plain form
6071 -682 36 74 -287 -255 -139 -338 -89 392 -238 -388 305 155 -2 -34 134 -196 147 597 4 -130 187
6092 187 202 259 134 97 -198 426 334 132 177 147 -78 420 528 22 -5 241 131 -108 525 111 -307 101
6114 101 241 -188 6 -15 -209 -395 326 -356 -431 -84 -236 -386 -256 -541 -660 73 457 -268 -335 -40 -40 -407
6136 -407 96 5 -328 271 57 -435 -300 119 56 3 141 16 -274 157 337 -64 324 316 17 548 633 -408
6158 -408 -10 683 277 -104 -33 55 -324 230 361 -248 95 70 -560 112 271 -348 -264 318 -323 -328 -145 -58
6180 -58 -601 118 211 -219 -218 -5 -567 -678 210 -284 -274 120 -85 174 -131 -123 -104 64 506 -102 -376 679
6202 679 231 -173 256 -62 -28 552 654 -275 -117 488 146 601 322 28 -19 636 415 14 -83 227 -24
6223 -24 497 -82 -331 -251 526 74 0 219 -158 -167 41 28 -512 -229 88 -146 -62 89 -271 -357 9 -201 -325
6246c25M32k24k35P1L32l47M70j61k72M6L50m2l30P58p4j45J05j95j78K3M13k17
6268B55l7L56l71l29N16p2j57J18k19l83j18R48l75j87L60o01j91N09k36n84N41
6289b57J09j29m7M51q41M31N22l78l71L74M5k20M79q8n90L60J46j75j10N83j90
6310A04n72P71j49l24M46O7k80L14J23o72J58N20j93j93M88l19l52L73J29o13
6330a74J49L86k47Q3J70o92j46O65J3m24K55R7n16O2Q2k44j85M65j29K32j52J14
6352a36l59O67j16o44K09L78k91K12K70p98L59R23o53k15K08j03K25M8J39l75
6372e2J72O39o39j12M67Q4k98M94n81m18M77K80q83O11M4k91K91N6p30k2M69j23
6394f5l44K70K37m14j4K05j68k01N23m84K79M02l61k91N08r9m01L86O6l44j78
$$ plain form
6246 -325 107 -117 -352 -281 51 -296 174 13 -259 -213 137 95 -235 523 449 304 409 214 36 59 472 255
6268 255 218 574 203 -126 390 318 161 279 60 -323 -441 507 132 -55 305 -296 -487 22 -214 -798 -257
6289 -257 -148 -277 -324 127 -714 -283 239 -139 -510 -136 -91 -311 168 80 -510 -150 -4 -179 -289 294 104
6310 104 -468 303 154 -170 276 343 63 377 500 -172 -14 506 313 120 608 289 -63 310 439 -174
6330 -174 -25 361 114 197 367 -325 -471 194 207 -217 38 135 -381 -319 -237 -481 -666 -201 -330 -98 -250 -136
6352 -136 -495 172 56 -588 -379 -1 -292 -80 190 -608 -249 674 21 -194 14 -89 136 184 323 -52
6372 -52 120 759 120 8 475 559 261 755 174 -244 233 513 -370 241 285 -6 285 341 -389 -411 58 -65
6394 -65 -409 -139 98 -316 -330 -125 -293 -494 29 -455 -176 226 -135 -426 82 -17 -418 -32 34 -310 -488
6415d88O23l08j71N02k55nN2J44l98O49O4l18J60N1j4q5M00m43l46Q42l35m12
6437i1O96n92l65P15J46o96J97K09k08k01N40l34l69J50J06J82k31J80l09k06
6457d81M21k37K72J27l80j09J44m8m45P80K95j100P16j1r5m9N07l88OK4L51k45
6479E5j8K93o06N00K32j80J71j34j29j2K57Q4m77K24O4J58l61j14j64K20K84l18
6501B9l38M0M54n49M56j43k03J99lk83M0K07j24L0N03q46q6M62J80l63K70L25
6523B57n13MO27j84l96K45Q1m45M50Nl36K73M64m86K7N10l26j32L92j75m90K68
6545A20K85m06K42Q8n39N0M66P6k58K2j86o3K85j58n5j95J59nl14L89l45J96J16
6568c0j84l93N02K41k64K71l31l42K84M89k99n42R28k05k48J27n9j7J16N51p62
$$ plain form
6415 -488 135 -173 -344 158 -97 -102 -50 94 -304 345 409 91 251 302 288 203 603 160 -186 656 321 -91
6437 -91 605 13 -352 363 509 -187 10 219 11 -190 350 16 -353 -203 -97 85 -146 34 -275 -481
6457 -481 -60 -297 -25 102 -278 -387 -243 -291 -736 44 339 -761 -45 -56 -151 -200 307 -81 -75 -51 300 55
6479 55 37 330 -276 224 456 276 447 313 184 172 429 513 36 260 324 482 121 7 -157 63 347 29
6501 29 -309 -269 185 -364 92 -51 -254 -55 -58 -341 -301 -94 -218 -188 315 -531 -617 -155 25 -338 -68 257
6523 257 -256 -252 375 191 -205 40 121 -324 126 131 -205 68 532 46 73 583 257 125 517 342 -148 120
6545 120 405 -1 241 329 -210 -160 306 382 124 146 -40 -103 182 24 -31 -226 -67 -72 -386 3 -342 -146 -30
6568 -30 -214 -607 -105 136 -128 143 -188 -530 -246 243 -56 -598 330 125 -123 4 -55 -72 44 595 -167
6589a67j75O72j10l19N03j77m05O53j12l68o0P41p50M04R6m80J21L17l22j32M94
6610D24l31l63K68J37m44M45m1m53J92M09n45k58O08k93j10N68l19m38K89N16
6630B61l27k51M32m47J07L00k58j76O44j40k72j22L29k63M24J83q30L54K75j7
6650B06J1L10l66j26M28Q2o93J69M93n89J76K58M2k60J08M9l61L84k3o32M27K4
6672A17j10R7j49k78K14J69k92l25M19k9m38K22K35r5n2K61q5m48M09k5k21Q18
6694D14k78j64QL39l11K33lJ36l01M41m49k97M57N48p45jM5j42L80J09j00l40
6716b1K39k7q1N8k7m58L60K71n19M1O66m39k75L22l24o3M95j02n63O61l91O0k23
6739c40L69m78O3N66j2l78K77k6k1r9J43j68J90J09m62K25N08j13k69O8o2j8J83
$$ plain form
6589 -167 -342 330 220 -99 404 227 -178 475 363 -5 -65 676 -74 330 426 -54 67 384 62 -70 424
6610 424 93 -270 -2 135 -309 136 95 -358 -166 243 -302 -560 48 -245 -355 213 -106 -544 -255 261
6630 261 -66 -317 115 -332 -225 75 -183 -359 285 145 -127 -249 80 -183 241 424 -406 -52 223 206
6650 206 217 527 161 35 463 545 -148 21 514 -75 101 359 401 141 249 298 -63 321 298 -334 93 117
6672 117 7 104 -45 -323 -109 60 -232 -557 -138 -167 -605 -383 -148 -243 -295 -34 -119 -567 -158 -183 -404 414
6694 414 136 -28 -20 319 8 241 238 374 73 514 65 -232 225 773 28 27 72 -70 310 419 319 -21
6716 -21 218 191 110 168 141 -317 43 314 -205 -164 502 63 -212 110 -214 -277 218 116 -447 214 -177 -117 -340
6739 -340 29 -449 -386 180 168 -210 67 41 20 -79 64 -104 86 195 -267 -42 466 353 84 152 90 72 255
6762B55K54l33j5N27m94j45M62m52L11Mk09l61J55L91k87J81k85l2K89J10m62
6783a36k48K58L32p2n25Q5O9P5p8K3j69L61J89m63l2K53l92L51L04m00J84J75
6805A44o38N37J93l06P7R8j56k4J29L07n12K48K26k23j1K44p2l21N76j15k54J92
6827C39k82M4J03k61l3K16J0K52m88RK2p1K37l74k32O47J54n95n1K58m9K20jn83
6851e09N18mO2m25J53K1j85L29j23j50J21K87J13n68L61K00k21K64K5l32K29o5
6873A01J72j69K6J00k37J95L40l94K93l87J74Ll14K61m48L19l1m8L55q7p70N92
6895D6J38l89O9K26k82p4L21k51O0k55p7P6L06J58o07O61J12n83K4N06k85J19
6917A9J83j74n37R34l79j79k2L89k79J68KN3k68O38j79M9o2k3m49O83l13k88L55
$$ plain form
6762 255 509 176 161 688 194 49 511 59 370 374 165 -196 -41 350 63 244 -41 -73 216 326 -136
6783 -136 -384 -126 206 134 -391 -306 -237 -162 -240 -217 -386 -25 164 -299 -331 -78 -470 -119 185 -215 -31 144
6805 144 -494 43 236 -70 7 105 -51 -75 54 361 -151 97 323 100 89 333 261 -60 516 401 147 339
6827 339 57 101 204 -57 -90 126 136 388 -100 -91 -69 -140 97 -277 -509 138 292 -303 -354 -96 -145 75 74 -509
6851 -509 9 5 67 -358 -205 -184 -369 -40 -163 -313 -192 95 208 -360 1 201 -20 244 269 -63 166 101
6873 101 273 104 130 230 -7 188 528 134 427 40 214 217 -97 164 -284 35 4 -44 311 224 -546 46
6895 46 184 -205 -136 90 -192 -266 55 -196 -136 -391 -468 -392 -86 72 -535 126 238 -345 -321 185 -100 19
6917 19 202 28 -509 425 46 -133 -155 234 -45 123 125 178 -90 548 369 418 356 333 -116 567 254 -34 321
6940C21j87l05qN8j09l7N41m78j13L69l34oq9K55j18k2M0k1j68K69N6j55K30k80
6964b91j14J36M45m03j3M15m47k6K62J09j93q3L47m89M71M14o74Q7M01k6k27J50
6986B51j60n3L66P3n83J88j94J84K24K56q12J13K81N6m18J61J39o5K71l03n47
7007e72K68K17k09k04L85n03O30J48l79k61N53J55m01K09k29MJ07K72j66o8K74
7028B30k11j13J84j61J01j14j62J68J10K75m50J81M93k10J14l58K43q7J77R0n90
7049i0j66O40j25l87J67l24J58L27j57n09K38M35k39n2m3j03j71N57k90k41K61
7070a14j76L03k42L8j16P8L27n58L92l9J79k79M57k27k8J5L11l31L3J23l58j36
7092c48P21m22J20J55j63r6J64K64n76K62J36J18k46J07k77k70K65K96m81J77
$$ plain form
6940 321 134 -171 -179 -121 -230 -267 274 -204 -317 52 -282 -288 -377 -122 -240 -262 -222 -243 -411 -142 -86 -241 -11 -291
6964 -291 -405 -269 176 -227 -240 175 -272 -298 -36 73 -120 -203 144 -345 126 540 -134 -47 354 328 101 251
6986 251 91 38 404 477 -106 82 -112 72 296 552 -260 -147 134 190 -228 -67 72 7 278 -25 -572
7007 -572 -304 -87 -296 -500 -115 -618 12 160 -219 -480 73 228 -173 36 -193 -189 -82 190 24 -44 230
7028 230 19 -94 90 -71 30 -84 -246 -78 32 307 -143 38 531 321 435 77 320 233 410 500 -90
7049 -90 -256 384 259 -128 39 -285 -127 200 43 -466 -228 207 -32 -84 -127 -230 -401 156 -134 -375 -114
7070 -114 -290 13 -229 -191 -307 -229 98 -460 -68 -107 72 -207 250 23 -5 10 321 -10 23 146 -212 -348
7092 -348 373 -49 71 226 63 -33 131 395 -181 81 217 335 89 196 -81 -351 -86 210 -271 -94
7112i4l9k13M37o5m36J07O67j60o50P56m64j76K04J36p40N91K72l61J99r3j77
7133b99M4N49l59n16R63l83m8K82J50o91K04M60k39l18L52o0K32R2l53p8K91L88
7155F63o09K48l26J51L8o5k19mL88M3k99l0K2k72N58k80m8j57M01j30m48N73m11
7178b13J33J43J9k15o2K1j54q7N32m21L22qj19q4J73K04o12K53M78n73M38J45
7200C13m63J61O00o52k71M0N11k32L56r8n83M18P6j07k8K24l00K30nq1l44M81
7222B46j35k97m5N51j53l94L24j13j40K00o3m09J66L36l23M6J91k99r2M05q7k63
7244c48L58M6j66j3J44j58L50j74q4rK47r0j75L38l57k45Q05k31k63J44K50K2
7266C91l71K61k23K61p0q6l40N52p8j12l01J13q9M9K73o44J63N17l60q8K44ql21
$$ plain form
7112 -94 -133 -346 91 26 -410 -303 364 204 -446 310 -154 -330 -126 10 -730 -139 133 -228 -29 -122 -299
7133 -299 -255 294 -65 -581 382 -1 -49 233 383 -308 -104 356 117 -201 151 91 323 415 62 -16 275 663
7155 663 54 302 -24 127 165 100 -119 -123 265 308 9 -21 1 -271 287 7 -41 -198 203 73 -375 198 -213
7178 -213 -80 63 82 -133 -195 -174 -328 -415 117 -304 18 10 -109 -193 -20 184 -428 -175 303 -270 168 313
7200 313 -150 11 611 -41 -312 -272 239 7 363 265 -318 100 176 69 41 265 -35 195 190 109 -235 246
7222 246 111 -186 -231 320 167 -227 97 -16 -156 44 -19 -428 -262 74 -249 -203 -12 -311 -403 2 -85 -348
7244 -348 10 56 -110 -123 21 -137 213 39 -45 -54 193 103 -72 266 -91 -336 469 238 -25 119 369 391
7266 391 20 281 58 319 249 163 -177 375 297 185 -116 -3 -92 -43 230 -414 -251 266 -94 -182 62 54 -267
7289b67P7L67p65M05J49j13j50O86r07M16N6q5k50J78L89o94N56m7J84l11J86
7310F0l9J04J82k79K1j21M34l20q2M65l80l5M93k84n1l6k83K31L36j20n48O32
7332C80J81n17j5M0L0N0K95n15k80L49j06K52m18K92k14K81k00r9j66K63J87l54
7354b84M50n69J19M96p7l31j36K53K40l37N80m40p1L44K0m09q5M79l51M64j67
7375A88k6m9j72J88J09j33M20o19M59k24j52j10N45m08K0K66j24m27M63l22k52
7396c60O14l43k5J77j49L6J39M2n42N7N75n22j48M55J18k75j32Q4j7k4O70r56
7418e26K89M05l0k73N8J81j04K28j84K39j42L71k11Lj39K5j62L66L3p39N01L00
7440D89m33j4O1j17J19L95l00o97K44K97k77J01l3J15k76K88n18M24L17l28LO0
$$ plain form
7289 -267 -190 177 -588 -183 -34 -147 -297 389 -518 -102 -46 -131 -381 -203 186 -508 48 1 185 -126 60
7310 60 21 125 307 28 49 -72 362 42 -40 425 45 10 503 219 168 132 -151 80 416 296 -252 380
7332 380 561 44 29 69 99 149 444 -71 -351 -2 -108 144 -274 18 -196 85 -115 -214 -380 -117 70 -284
7354 -284 166 -403 -284 212 135 -196 -332 -79 161 -176 404 -36 -107 237 257 -152 -237 242 -109 355 188
7375 188 162 113 -59 129 238 105 525 -94 365 141 -11 -121 424 16 36 302 178 -249 214 -108 -360
7396 -360 254 -89 -114 63 -86 -50 89 131 -411 -354 221 -301 -449 6 124 -151 -283 -199 -216 -240 430 -526
7418 -526 -237 168 138 -135 -77 104 0 228 44 283 141 512 301 304 165 190 28 394 427 -312 189 489
7440 489 56 42 103 -14 105 500 200 -497 -253 44 -233 -132 -165 -50 -326 -38 -556 -132 185 -143 -140 -80
7462h0j33j86O80Q8p20J24K41j80L3M51n50M91J5k48k67J77L99n03J42K59m85
7483b52K54K60J3j76j57L26k90K3M73o16M34p3k44l54Q38m97K73K4j65n6M8n5
7505C1k41Q1L99m80qQ6K39n2j20r4j7J87K42o29L34j80r3J81J20r4j65M87n55
7528c41M66K2O0j29j03P5j69n6L38l07K30K08K7j59j66N64n60K51R5m67K44K84
7550D07n55L41L81n37l48O90j39m18J26J41m21N12k4j30m00M42j34j18j07oj20
7571d17N61j4m30r0K67j79rL00k95p1O50p4o25K60K54r9L13k39n0j80K95j24q0
7594g6L48j4l7j81j10j44N33P6m17M77k46n5K8k81J17M3J0j24l66M79k04M9Q5
7617a0n5N0R%O3k00M47k83m88O01l04L8m5L23l25j27K14l05K74J51Ql9K63l79
$$ plain form
7462 -80 -213 -399 281 369 -351 -227 14 -166 -133 318 -232 259 274 26 -241 -64 335 -168 -26 233 -252
7483 -252 2 262 275 99 -58 268 -22 1 474 -142 292 219 -25 -379 459 -38 235 259 94 38 86 31
7505 31 -210 -129 270 -210 -218 -132 107 55 -65 -159 -176 11 253 -376 -42 -222 -315 -134 -14 -108 -273 214 -341
7528 -341 125 147 207 78 -25 50 -119 -175 163 -144 86 294 321 162 -4 560 0 251 346 -121 123 407
7550 407 -148 193 574 37 -311 379 240 -178 -52 89 -332 180 156 26 -374 68 -66 -184 -291 -297 -417
7571 -417 144 130 -300 -390 -123 -302 -311 -11 -306 -377 273 199 -426 -166 88 -11 302 63 13 -167 128 4 -76
7594 -76 272 258 221 40 -70 -214 319 395 -22 455 209 154 182 -99 18 61 71 -53 -419 60 -144 -95 -10
7617 -10 -65 -15 -6 -6 57 -143 304 21 -467 134 -170 -132 -177 146 -179 -306 -92 -397 -123 28 36 -3 260 -119
7641a19j35J68K28j03j46J38j31r4L58j31j01J92r6j73N41l64K8J57p4k95o4L53
7663A37l1j9J36j28l34M31q9r7P1P9j75j59J07J95nk27m0l1K36j14j90o7K97j70
7687a87n5j89N11j76q7J29m38O89p5k19J56r9Q7l1J09J51m37L89j37j8J43p6p0
7710G0L46l02k70L44n0P6l11K77j12l1nJ04o86O67k67K98k95J98j99k25N62l01
7732a12k1Q5J41l85L7K30K12k45j52j23j30R97j061M44P2o0J04j31m7q4L42J88
7754C01k18K10j72m73O90j26J46o02M91K61m26J14J7j5k13K76k82k81N61kk44
7775A3Q0R6m05J25O30l68k50nK32k88N1o0K0L40l49j82L01l7j6k52J61K3J80k05
7799a65R7p9R7J35l49Q2L6j27L75K1n10J75L40j11J24j41J77K0j29M18m47j13
$$ plain form
7641 -119 -254 -86 142 39 -107 31 -100 -194 164 33 -68 124 28 -145 396 32 60 217 143 -152 -216 137
7663 137 106 87 223 95 -239 192 103 6 77 156 -19 -178 -71 124 119 -108 -148 -179 57 -57 -247 -314 -17 -187
7687 -187 -242 -431 80 -96 -183 -54 -492 197 122 -97 59 -40 47 16 125 276 -161 228 91 73 216 140 70
7710 70 416 114 -156 188 138 214 -97 180 68 37 32 136 -550 117 -150 148 -147 51 -148 -373 189 -112
7732 -112 -133 -48 93 -292 -255 -25 187 -58 -210 -333 -463 534 -527 -83 -11 -71 33 -98 -145 -229 113 301
7754 301 83 293 121 -352 338 212 358 -244 247 508 82 196 213 198 -15 261 -21 -302 259 257 13
7775 13 93 189 -216 -91 539 171 -79 -84 148 -140 -89 -149 -129 211 -138 -320 -19 -56 -72 -324 -163 -140 40 -165
7799 -165 -68 -147 -50 85 -264 -182 -146 -273 102 123 -387 -212 128 17 141 0 177 197 68 486 39 -74
7821g4j3M88m45K67l09j39M68m4m82L82M8m9l5P2J23k76J17L0Jk47J31l4J06l2
7845E4l38J06K25j53l6J46O0j62J76o3m04M37k83K76O5J71l70M45k54q5r6L95
7867C12k62o8j8K41j92O9j2O1J73j16k39L53j81j24j8l2K85k07J23o8j29K61l8
7890A74k24O9K5j54K8L5J43k80L5Mk86N2N0Q0J99L24l35j97O9R3O2P2O2l63N25
7915B62j51q9K1k59K22L4N5J16l05J27L85m26L14j52o7m2l9JL86O0l33j39j37
7938a56J98j11J69n1lk08K97j45o4J23K58o21L45p2j48J87Lr5j18K73m69K11J33
7961f4o9r9M71k31m71J5R40o73m3J98n4O9K78k15j58K88j66O8J25O4l29K80j2
7984B12l36J04L2R7K7K34k36k22J96k26K54l98O05m06j69L80k63n2M09k86j25
$$ plain form
7821 -74 -87 401 -44 223 -86 -225 243 199 -283 99 147 98 63 135 258 -18 99 129 130 -117 14 -20 86 54
7845 54 -284 -178 47 -106 -142 4 64 -98 78 15 -389 48 -235 41 106 277 -93 352 98 13 -83 312
7867 312 50 -18 -36 205 13 82 70 131 304 188 -51 302 121 -3 -21 -53 232 25 148 80 -49 212 174
7890 174 -50 19 44 -110 -82 -47 96 -184 -149 -145 -431 -379 -329 -249 -50 274 -61 -258 -189 -96 -34 38 100 -263 262
7915 262 111 22 43 -216 6 40 95 211 -94 33 418 -8 306 154 87 45 6 7 393 453 120 -19 -156
7938 -156 42 -69 100 49 46 -162 135 -10 -74 49 307 -314 31 -41 -189 -2 1 -94 -212 61 -408 -197 -64
7961 -64 -133 -232 239 8 -463 -448 492 -181 -224 -26 -80 -11 267 52 -106 182 16 84 209 273 -56 224 212
7984 212 -124 -20 12 109 136 370 134 -88 108 -118 136 -262 343 -63 -232 148 -115 -167 242 -44 -169
8005a69L7J25J80j41K64l82K2L8k27l1M13j77j44L43M1k02l92M40k68M49j1l32
8027a24J79K7j54MJ05J66j65J4J86j33k01L20l51o3L50l8j43J72J71l95K12l26
8049a87J61J08K89m68j3M00k45j63L50k59k82L60j26j60o1L24r1J11n4M0l12L88
8071A10J3k04m3Mr1K2J04j13P2k33M02l24O42l0m28j02R6N4K35j30p7j72O54o46
8095a85J85M8J43j87J47j36j47M9K04J85j97j2n4l05K45K43l46N5K15r6j31Q6
8117Ik04K08O3l61J58k6J24k78J04K72j20L12l27l43L19J95k22k03M64j71k97
8138c24N57j85j87K69K1k57J53j10r4J22L96m20j2J87l9l4p0L03n62L60K15k73
8160A6Q2J08j48j34M17k51l11M49l88Q5L8J09l67J74O8K78m00K92l3r6R0O9q25
$$ plain form
8005 -169 -132 -7 173 32 296 -86 -64 -26 -253 -284 129 -48 -192 151 192 -10 -402 38 -230 219 208 -124
8027 -124 55 82 -72 -68 37 203 38 52 238 105 -96 224 -127 -190 160 122 -21 151 322 -73 139 -187
8049 -187 -26 82 371 -97 -110 290 45 -118 232 -27 -309 51 -75 -235 -296 28 -63 48 -6 34 -278 110
8071 110 123 -81 -124 -120 -211 -189 -85 -198 -126 -359 43 -281 361 331 -97 -199 -103 -49 186 56 -21 -193 461 -185
8095 -185 0 48 191 4 151 15 -132 -83 121 306 109 97 43 -262 -17 226 -120 -65 150 54 -77 9
8117 9 -195 13 76 -285 -127 -153 -29 -307 -203 69 -51 261 -66 -409 -90 105 -117 -320 144 -27 -324
8138 -324 233 48 -139 130 151 -106 47 -63 -157 -35 361 -59 -71 116 77 43 -27 276 -286 74 289 16
8160 16 98 206 58 -76 341 90 -221 228 -160 -75 -37 72 -295 -121 -53 225 -175 117 84 -12 78 147 -678
8183f78O17j62j9L97o9l70J18K45
$$ plain form
8183 -678 -61 -223 -242 155 86 -284 -166 79
8191G9
$$ Imaginary data points
##PAGE= N=2
##DATA TABLE= (X++(I..I)), XYDATA
0@%%%Qj6QqJ8k6L2l2M0n6P2q0R0j14J41j65J89k23K62k98L42l97M53n12N82o60
29c50P43q36R39j049J173j308J454j617J794j989K205k441K702k992L311l668
45a929M073m530N052n657O363p199Q215r477J1083j3210J6176k0596K7838m1692
59b5490P7097l19083o85700R37420N87331o10711l55558L87332k3908k74965K56784
70d9451K50022l85048j77505M51859J58040m85879j41063M92326K11094l90444
80f6049k04002K66144J79522j11807o1988K6035k7398K2617J12786N73j17989
91A8444m5298O2901O0194M409l2545j4827k0391p9332j8083J59668J15330j50455
103F0015k20699l869J88491J52936q2452k24881j1114J94976j0439j64181Q2508
$$ plain form
0 0 0 0 0 8 -8 0 -8 10 -16 16 -16 24 -32 40 -40 50 -64 77 -88 101 -122 140 -158 184 -213 240 -272 310 -350
29 -350 393 -443 496 -553 620 -688 766 -851 943 -1046 1159 -1282 1420 -1572 1739 -1929
45 -1929 2144 -2386 2666 -2991 3372 -3827 4388 -5089 5994 -7216 8960 -11636 16202 -25490
59 -25490 51607 -267476 -953176 -15756 571575 -39136 -394694 -7362 -31270 -306235 -49451
70 -49451 200571 -184477 -361982 89877 247917 -237962 -379025 113301 324395 -66049
80 -66049 -270051 -3907 175615 63808 1820 27855 457 23074 135860 136433 18444
91 18444 -26854 36047 96241 100650 68105 53278 32887 -46445 -64528 95140 210470 60015
103 60015 -160684 -164553 23938 176874 94422 -130459 -141573 53403 42964 -121217 -38709
114c8709J42765j28021p6092J34009p5350j61602K58280K48370l60153l32486
124c88989L50138L49960k63701k68800J84695J32592j41151K3637J51473j57594
134b7740j95370K50599K56766k65550k67603K33620K13703j88870j10367J68611
144F7799L0075j40115J5799R1927m2799m3413P5511N0851p9401j16198J8135J63208
156I1379O2475j44374r6116O8236K1038k9694Q3399L6149j56759p7035J47652
167F350Q4721j10262q2579O1856P8701j6108p8845k7538N6973M6840p650j2577
179a18k2539l9301K5011Q3164N803q0558k3345P3451M2000p0104n8204P8605P7499
192I1364q2687p0746R0244K9472j15536J3837J40436l6268j35637L1562P7804
$$ plain form
114 -38709 104056 -23965 -100057 33952 -41398 -203000 55280 303650 -56503 -388989
124 -388989 -38851 311109 47408 -221392 -36697 95895 -45256 -21619 129854 -27740
134 -27740 -223110 27489 284255 18705 -248898 -15278 198425 9555 -100812 67799
144 67799 97874 -42241 -26442 65485 22686 -20727 54784 105635 26234 -89964 -71829 91379
156 91379 153854 9480 -86636 -18400 2638 -27056 56343 92492 -64267 -141302 6350
167 6350 91071 -19191 -101770 -39914 38787 22679 -56166 -83704 -26731 20109 12459 -118
179 -118 -22657 -61958 -36947 46217 52020 -28538 -51883 21568 63568 -6536 -64740 13865 91364
192 91364 8677 -62069 28175 57647 -57889 -44052 96384 60116 -75521 -43959 33845
203C3845m1280r203O4282l2498q8353L3677R9684j0428j10492k8621J31416R3385
215A35414j30191j52656Q5486J62380j0268r1918l2949j4085K1727R3312K1570
226H7822j21770o3970J17562R6178j15499j44515R7149J91518n8119k09090m108
237a26842J52787L6821m9720k4313n6232k4080J18850P6283j29767j06722J06253
248b6682J23006n2855j17862M894J10874L3019r3354l8440Q8501M2245o5011l7084
260b8749K0674K2941M4246K1347q5584p6110P0484R9954k2025q6136k2983N5268
272A3327L4620o1820n1239Q4888Q2587r3592j25130M0979J20334L5676n8460q9653
284f7483l4622P9878J00781k0477j14690n1442R0804J14202n1551j49437K2708
$$ plain form
203 33845 -7435 -16638 47644 15146 -73207 -39530 60154 49726 -60766 -89387 42029 135414
215 135414 5223 -147433 -61947 100433 90165 -1753 -34702 -48787 -27060 66252 87822
226 87822 -33948 -97918 19644 115822 323 -144192 -47043 144475 86356 -122734 -126842
237 -126842 25945 62766 13046 -11267 -67499 -91579 27271 103554 -26213 -132935 -26682
248 -26682 96324 43469 -74393 -69499 41375 74394 -18960 -57400 31101 73346 8335 -28749
260 -28749 -8075 14866 59112 80459 -5125 -81235 -10751 89203 67178 -18958 -41941 13327
272 13327 47947 -13873 -65112 19776 102363 8771 -116359 -75380 44954 80630 22170 -67483
284 -67483 -102105 -22227 78554 58077 -56613 -108055 -17251 96951 45400 -104037 -81329
295h1329J64369K401j48779j8143J07546L4820l5911l5588m3880J3465J07621
306F6592M2143j19073j09377O9528J50883J2508j40919p1591R2228O9698n0850
317A1770k6647L6000j3916l3392K4975J1631k3866K4377L5245m5959n9023K6687
329c2118P0696J9535n6480n5001L2404N5378k5835l2659M1825J3357o1706j1737
341d2341N8991J9568k7295j9407j5720n48L6268K9539j9597n0176k6247M8658
353h307P0540l1855q8828J8065P7316j8516n3186K6637L2856k3858j5724O349
365h511n831Q299L1648N375l8781m1165J6768P5516K3988p6390m7390N0002L2454
378B5982j8614J2008Q847n0683j8395N9564L1602m0233l6321J1637L5011O932
$$ plain form
295 -81329 83040 85441 -63338 -81481 26065 60885 24974 -10614 -54494 -41029 66592
306 66592 108735 -10338 -119715 -50187 100696 113204 -27715 -99306 -7078 62620 11770
317 11770 -14877 21123 7207 -26185 -1210 10421 -13445 10932 46177 218 -58805 -32118
329 -32118 38578 58113 1633 -53368 -20964 34414 8579 -24080 17745 31102 -30604 -42341
341 -42341 16650 36218 8923 -10484 -26204 -26752 9516 39055 19458 -30718 -56965 -8307
353 -8307 62233 30378 -58450 -40385 36931 18415 -34771 -8134 24722 864 -14860 -8511
365 -8511 -14342 -6043 25605 30980 -7801 -48966 -32198 43318 67306 -9084 -56474 -6472 25982
378 25982 7368 19376 28223 -22460 -40855 18709 50311 10078 -26243 -14606 20405 27337
390B7337l5995j4129L4960J1191k6898k491N22k0915L0635N3719m9367q7421L5755
403d3097J01104M325q3670m9990L8811P1007P983n7474l1619J7913K5692K4989
415B5974l353n7399j4577P6120K5931q2505l2968P3771M2537m4063m8399M186
427c4745M4977K8578k6322l3970P473J5926N181J3774p994k9641J4272L0587k7385
440G11k4852M6286K9213n1744m4640L2777N9535L590o5609l8846N5921N3249l9196
453A6395m9477J2713K4153J3349N302m3453m5396N8476Q1095n1227j11145R671
465g9544J13776M7383q5507r4861L5246J05668J5935p0532m1336J1217M2757N3352
477E3554k0827r4180k27J15261K6885j05573m7371P6605O6758k7366o9634j9335
$$ plain form
390 27337 -8658 -22787 12173 23364 -3534 -6025 -5503 -26418 4217 57936 8569 -78852 -43097
403 -43097 58007 62332 -21338 -71328 -32517 38490 46473 -11001 -42620 -24707 985 25974
415 25974 22621 -34778 -49355 26765 52696 -29809 -62777 10994 53531 9468 -38931 -34745
427 -34745 10232 38810 12488 -21482 -14009 1917 7098 20872 12878 -16763 -2491 28096 711
440 711 -24141 22145 51358 -386 -45026 -12249 47286 50876 -14733 -53579 2342 55591 16395
453 16395 -33082 -20369 3784 17133 22435 -21018 -66414 -7938 73157 21930 -89215 -79544
465 -79544 34232 81615 -3892 -98753 -63507 42161 58096 -12436 -53772 -42555 202 53554
477 53554 32727 -61453 -61680 53581 80466 -25107 -72478 4127 70885 43519 -26115 -45450
489d5450N3200M7457j9271m5082j8670J4445M2055J7640m9039l6868M2392L2082
501C4891l9003k2769L3577J8447k3526k8223j061L8920K8644m0858m5607L1978
513a4590M4506j5685k6884p42O253J5860J1602k9068k5774L5474M2314k4040o2382
526d3156j2087O9129O0333n6193r4228K3109R0317O810n0757j8362m436Q770M8875
539B8124J2649o7705k9447O7540M3591n0903n0137L4664O0828j1726n6658j839
551b1019M0921N790o630J3083k5759m1229M3499O4352l9834o4912J9082L7880
563B5224p136m918M453k0793k1705J2001K7202N710k8335k7494J6742K4876j5579
576i752j5753J5526K894j3407N758o19j4521J9016K9293j9990l2922O248K4799
$$ plain form
489 -45450 7750 55207 35936 -9146 -27816 -13371 28684 46324 -2715 -39583 2809 34891
501 34891 -4112 -26881 6696 25143 1617 -26606 -27667 11253 39897 -961 -46568 -14590
513 -14590 29916 14231 -12653 -13395 -7142 8718 20320 -8748 -34522 952 43266 19226 -43156
526 -43156 -55243 13886 74219 18026 -76202 -53093 37224 44034 -6723 -25085 -29521 -20751 28124
539 28124 40773 -26932 -56379 11161 54752 3849 -46288 -11624 49204 37478 -19180 -21019
551 -21019 19902 25692 19062 32145 6386 -34843 8656 73008 33174 -31738 -12656 25224
563 25224 18088 13170 17623 -3170 -24875 -12874 14328 20038 -8297 -35791 -19049 5827 -9752
576 -9752 -25505 -9979 -7085 -20492 -14734 -15353 -29874 -10858 18435 -1555 -34477 -28229 -3430
589c430K1654P658l2489l3051L0746M7162r860l2014j214J1777N021N238L689
602B0887m453j3908o566K1393J5969k5853j6322K6695o96l2211K1037L3968m1882
615a942l4970M8769K2207n4828j4648N2660J2613m5006k7080J8559K9193J0568
627A6095j2563k6751k7856Q814O3360K8536p7418o2956O8149P3642m5668o0511
639e5127K3386L8812K586q014j9043j7244K9944M6811j3763n8023j0046O0772
651B1051M4094m3354n9618K6709O2349m344m2935j1276J0175K1054K3085k2444
663B4546m4107J4024L8761j5638k8582J3220J1589j1784r835j2472m148L0253
675E827J5976m2691l3015L2356L4989j8276l6286M502M0989J0815m3203k3559
$$ plain form
589 -3430 18224 25882 -6607 -39658 -8912 38250 28390 -3624 -4838 6939 11960 17198 20887
602 20887 16434 2526 -4040 17353 33322 7469 -8853 17842 17146 -15065 5972 39940 -1942
615 -1942 -36912 11857 34064 -20764 -35412 17248 29861 -15145 -42225 -23666 5527 16095
627 16095 3532 -23219 -51075 -42261 21099 49635 -27783 -90739 -22590 51052 5384 -55127
639 -55127 -31741 7071 9657 1643 -17400 -34644 -4700 42111 28348 -29675 -39721 21051
651 21051 65145 21791 -37827 -11118 51231 46887 3952 -7324 2851 23905 46990 24546
663 24546 -19561 -5537 33224 17586 -10996 2224 13813 2029 -7806 -20278 -24426 5827
675 5827 21803 -20888 -53903 -21547 13442 -4834 -41120 -36618 4371 15186 -28017 -51576
687e1576L6962L4417o952j8335k1257o905M8156M4292m8365o0984M2513P1536
699F3502k2657o7711o68N9353K9587l5438m3389J854K6964K3536R047l6124n1740
712d3884K9878P4903k6422q5450J7254P5195j0623n3885j618J7380M008J3288
724A0024Q48k7855r841K7144J3865j9978j9309J7847L1926j1289m1760J426L8943
737A1991O446j8596n88J20j0175M547J0224j054P895L919k5115j7463K0800K5883
751A8834K558j5757k4277l407K9449J4980k0286j3727Q898J1056K989j3337j5878
764a7905K1459K8542k4773l0409K4232K0045k0775k779J4262j7467l663L6232
776B7001l813n2111k533N0173J3951l1747j5851Q630j819p100J9938K5165k4307
$$ plain form
687 -51576 -14614 19803 12851 -5484 -26741 -33646 14510 58802 10437 -50547 -8034 63502
699 63502 40845 -26866 -27534 31819 61406 25968 -17421 -15567 11397 34933 43980 7856 -43884
712 -43884 -14006 60897 34475 -50975 -33721 41474 30851 -23034 -24652 -7272 -3264 10024
724 10024 10872 -16983 -26824 320 14185 -5793 -25102 -7255 24671 13382 -28378 -26952 11991
737 11991 18437 -159 -747 -627 -10802 -6255 3969 2915 10810 14729 -10386 -27849 -7049 18834
751 18834 21392 5635 -18642 -22049 7400 22380 2094 -11633 -2735 8321 11310 -2027 -17905
764 -17905 3554 32096 7323 -23086 1146 21191 416 -2363 11899 -5568 -9231 27001
776 27001 23188 -28923 -31456 18717 32668 921 -14930 -6300 -8119 -15219 4719 29884 5577
789E577m1377J3244L3670j0479j0113K4816q051m1122R616L8384p248j7851J5669
802D735L029k7874o443K8166K2117j1862l0969n034K6752J2698j3375o142k517
815f719m424J9758J9213l0687k9296K9794K8909j6838j3892O411m27k95K432q082
829d143O437K6691o043m2226j1900L4926L0873n335l0966k2985Q565K2944J1425
842A8263o197j8976r464J6943N537k8304K060M5990l275n6609m919M4280P564
855A2893j8851j992n394n613K2234J3518k8255j9439K7075L0935j2187l4922r79
868b0977L6124R113l2488m944L4101N891k6648j1408L386J3730L0768K292n1464
881a2524k8437M0097M1498j2358l5018j2882J8885K0510j5596k3940J4230K6726
$$ plain form
789 5577 -35800 -22556 11114 635 -9478 15338 7287 -33835 -24219 14165 6917 -10934 4735
802 4735 7764 -20110 -26553 1613 23730 11868 -19101 -24135 2617 15315 1940 -4202 -6719
815 -6719 -11143 8615 27828 -2859 -32155 -2361 26548 9710 -4182 2229 1802 1507 3939 -4143
829 -4143 2294 28985 22942 -19284 -31184 3742 34615 29280 -1686 -24671 -16106 6838 18263
842 18263 12066 -6910 -16374 569 6106 -22198 -20138 25852 22577 -34032 -38951 5329 12893
855 12893 -5958 -7950 -13344 -18957 3277 16795 -11460 -30899 -3824 27111 14924 -19998 -20977
868 -20977 15147 24260 -8228 -13172 20929 26820 172 -11236 -7850 5880 36648 38940 -12524
881 -12524 -40961 -864 40634 28276 -6742 -19624 -739 19771 4175 -19765 -5535 21191
893B1191q503k6920j2347J2492K9099R939l2371k6457K0839K6805l999j8857j2507
906b1596J0310L0395j047m1869q662M2393J4097k6197q841R594q5L47M282n479
920b358J746J3762k822k1106r179J8586K8524l766l7505j0650L3435J1664k4804
933d473l070J8678j769j0203j394o027L478K3418K336k8710j1512J8161J6461
946A5374k618j7835r111K0234J6246k2433k3581J4791K2985K308j1344j6813q482
959b0279J6973J7790p552j2658k504P71N593M027j1223n62J9622k831k4521K336
973a5018J8554k292n120R614l478j4282K653J2096M192k873o424q11P766n6n503
988i82M567P85o914J1304J4109k2346k2175K1604K4879p930j4983o160l527R037
$$ plain form
893 21191 12688 -14232 -26579 -14087 15012 24951 -7420 -33877 -13038 13767 9768 -9089 -21596
906 -21596 -11286 19109 18062 -23807 -32469 9924 24021 -2176 -11017 -1423 -1508 -1161 3121 -2358
920 -2358 -612 13150 10328 -10778 -19957 -1371 27153 23387 -14118 -24768 8667 20331 -4473
933 -4473 -7543 11135 9366 -837 -2231 -8258 -4780 18638 20974 -7736 -19248 -1087 15374
946 15374 12756 -5079 -14190 6044 22290 -143 -23724 -8933 14052 16360 5016 -11797 -20279
959 -20279 -3306 14484 6932 -5726 -8230 -7459 -1866 2161 -9062 -9624 9998 7167 -17354 -15018
973 -15018 3536 1244 -3876 5738 2260 -12022 -9369 2727 6919 4046 -2378 -3189 4577 4521 -982
988 -982 3585 4370 -2544 8760 22869 523 -21652 -48 24831 16901 1918 -4242 -7769 1268
1002A268J2292m828r602J154j12l079P66j803K831J2273n985k3292m3K0088M865
1017F793p091m507n213k05P631J55j938O243m257j0565R042J1494r268o527N979
1032b234j630K903J5145o404k6277K738K9014J0512j8289j9961K104K1979Q862
1045A8462j7813q422J2402N628n596n518r295M647K9151M200m1963j9875L3754
1058b38L0561j1298k8103j3646J4485K4757k073k4218n838J5173Q738l617j2897
1071h214r541J4974J8729j5010k1911J0864J9007m481j3249n296O672J6227k8
1084H743k1770m354J9826N414j0009k29J578k342M451N2q186Q444J6426j0439
1098G605k3265J469K3998J5788j3596k7937q82K9933J0559k2007j1079P950P365
$$ plain form
1002 1268 13560 8732 -870 284 172 -2907 -2141 -3944 -1113 11160 5175 -18117 -18160 1928 6793
1017 6793 -298 -4805 -10018 -10223 -2592 -2437 -4375 1868 -2389 -12954 -3912 7582 -1686 -8213 -2234
1032 -2234 -3864 -961 14184 7780 -18497 -15759 13255 23767 5478 -14483 -12379 9600 18462
1045 18462 649 -7773 4629 10257 4661 -857 -10152 -5505 23646 27846 -14117 -33992 -238
1058 -238 30323 19025 -9078 -22724 -8239 16518 14445 -9773 -15611 -438 8300 4683 -8214
1071 -8214 -17755 -2781 15948 938 -20973 -10109 8898 4417 -8832 -14128 -7456 8771 8743
1084 8743 -13027 -17381 2445 7859 -2150 -2379 -801 -3143 1308 1360 -6826 1618 18044 7605
1098 7605 -15660 -14191 9807 25595 11999 -15938 -16820 13113 23672 1665 -9414 -1464 5901
1111E901N906m549j9603m72K8735P111k9962j5712J9321K0848l014k2157j3251
1124b0898J8129K0761j0306j9079p44Q489R824N673j4358j7700J3299K0476r968
1137C598j5846O725Q779k660m796l483L840J0020k480j2126P85Q593R22l43j29
1152A399m983J876P686m228n641Q948O061p910n614J309N854J0116l528j7229
1166e884J945J8597j525j3875J649M040j323M630o64j2723O0J3037j402j0300
1180c738k060K305L992J962r189o525J1016M759j1460j287P733m384l388Q349
1194a915J153q201P35N587r0M63K405l82j746j746L242Q826j350j2706M676J5150
1210A4101n572j2822P065Q394m434m20j12q317L596J2825m827j3161J080O883
$$ plain form
1111 5901 11807 7258 -12345 -12817 15918 23029 -6933 -22645 -3324 17524 14510 -7647 -20898
1124 -20898 -2769 17992 7686 -11393 -12137 -3648 6176 11849 -2509 -20209 -6910 13566 3598
1137 3598 -12248 -5523 3256 596 -4200 -7683 -3843 6177 3697 -8429 -7644 949 1871 1528 1399
1152 1399 -3584 -1708 5978 1750 -3891 5057 11118 3208 -2406 -1097 4757 14873 11345 -5884
1166 -5884 -3939 14658 13133 -742 907 4947 3624 8254 7590 -5133 -5073 7964 6562 -3738
1180 -3738 -5798 -3493 499 2461 -6728 -13253 -2237 2522 -8938 -10225 -2492 -6876 -10264 -1915
1194 -1915 -762 -8963 -8228 -2641 -2731 -2268 137 -245 -1991 -3737 -495 8331 6981 -5725 -1049 14101
1210 14101 8529 -4293 2772 11166 6732 6312 6200 -2117 1479 14304 9477 -3684 -2604 4279
1224D279K418l56r521o436J1908P778j3729q481J0238M156n548k248k533J37Q702
1239G64J19j1976j843J0739M161m369o342l147R471R406r233j0813Q236J1416
1253F589l743p668j825O244J0283l187j4220R00J4411K956n938m626n614N648
1267B10J6837n201k2903M821K2306l545j7391L98Q280L218J33p739q058P526J1913
1282A0805n647j2310k480P875R855k564j7172k877J8221N406j5618o040Q923O572
1296B949q69p039n844P038J1155l843j0659j362P416R420L08j5253o651J8157
1310D923J1536j5471r792Q943N946Mk033p962q54J4418J664j5344l083J0236M241
1325G372j490n385q109M736J4425l508j6125J786J1978J84n497k916k71N705K966
$$ plain form
1224 4279 6697 6341 -3180 -9616 2292 10070 -3659 -12140 -1902 2254 -3294 -5542 -8075 -7938 764
1239 764 883 -11093 -12936 -2197 1964 -2405 -8747 -11894 -2423 6983 -2250 -13063 -4827 6589
1253 6589 2846 -4822 -6647 -403 9880 6693 -7527 -6627 7784 10740 4802 176 -5438 210
1267 210 17047 11846 -11057 -6236 16070 12525 -4866 -4468 3812 7030 7163 -576 -8634 -1108 10805
1282 10805 5158 -7152 -9632 -1757 8098 5534 -11638 -14515 3706 9112 -6506 -12546 -3623 2949
1296 2949 2080 -4959 -10803 -3765 7390 3547 -7112 -8474 -1058 8362 8670 -6583 -13234 4923
1310 4923 16459 988 -8804 139 6085 6089 4056 -3906 -4760 9658 11322 -4022 -7105 3131 7372
1325 7372 5882 497 -7612 -2876 11549 8041 -8084 -6298 5680 5864 367 -2549 -2820 2885 5851
1340E851p038l227N776K491k413j893l427Q25R584r88j2667j05J1201O47o948
1355b331j671J074L395J862o190l021P964K054p074m26J940k042N461N347j1648
1370e306p102J4177P046j1098l722O625J263k42R50k806m39L978J94j378J178
1385C318j915n91N027j347n847M032M337o082k103N560j687m826L417J695l016
1400b8j241j632o14O130P22r083k193N766J122J81K7o893j072R672J407r682n06
1417g917O547J728l34k805o064N230J1097m821j0254M421P044k368q36Q34l228
1432a726L272O322m164p018L790O381J84m282m628K567P368k988q886M785P702
1447H679o343n640L304K29N42M514m846r064N578R776n114r367L43P154N761n349
$$ plain form
1340 5851 -1187 -4414 1362 3853 1440 -453 -3880 -3055 6529 5541 -7126 -7231 3970 4617 -2331
1355 -2331 -4002 -2928 467 2329 -3861 -6882 1082 3136 -3938 -4364 -2424 -4466 995 6342 -5306
1370 -5306 -12408 1769 8815 -2283 -6005 620 1883 1641 2591 -215 -654 3324 3518 2140 3318
1385 3318 1403 812 5839 4492 -1355 2677 7014 932 -1171 4389 2702 -2124 1293 2988 -28
1400 -28 -1269 -2901 -3515 2615 3337 -5746 -7939 -2173 -1051 -870 -843 -7736 -8808 864 2271 -7411 -7917
1417 -7917 -1370 358 24 -2781 -8845 -3615 7482 2661 -7593 -3172 3872 1504 668 1502 -1726
1432 -1726 1546 7868 3704 -3314 476 6857 7041 2759 -1869 698 8066 5078 -3808 977 8679
1447 8679 2336 -3304 0 229 771 5285 439 -8625 -3047 6729 1615 -7752 -7409 -255 5506 157
1463A57j2349J845J5264J355j0716m057K715M483O423l151j2211L235J5302j670
1477F625j4231j350R796P904n32j1058q266J0598J3415n731j0680J53N533M316
1491F492k69q382j758R711M066r054n052L811M105L384m571q343M274J0340n806
1506B948j0721M783P949k121l092k559l383N032O677n276o317L706L739k112l850
1521d597j572N475Q538n857j4809L200J4229J706o459l782k769K738R719j870
1535C890j0068J382R445m5n599l674K215P890K719q999n125Q063M395l899k120
1550D70j81j93N607J572r363k614P839K936k039j772m199j749O437J560l788J231
1566A754J099o846j266O435J395k453j33k738l445L785K981j581k80J61l342N26
$$ plain form
1463 157 -12192 -10347 4917 6272 -4444 -8501 -5786 -1303 5120 1969 -10242 -7007 8295 6625
1477 6625 -7606 -8956 840 8744 8212 -2846 -11112 -514 12901 7170 -3510 -3357 2176 6492
1491 6492 6223 -2159 -3917 5794 9860 806 -4246 -435 3670 7054 2483 -5860 -1586 8754 2948
1506 2948 -7773 -2990 4959 2838 -254 -2813 -6196 -1164 5513 237 -6080 -2374 1365 -747 -4597
1521 -4597 -6169 -694 7844 1987 -12822 -9622 4607 6313 -146 -3928 -6697 -3959 5760 3890
1535 3890 -6178 -4796 4649 4604 -995 -4669 -2454 5436 8155 -844 -5969 2094 6489 2590 470
1550 470 289 96 5703 7275 -2088 -4702 3137 6073 4034 2262 -1937 -3686 2751 4311 523 1754
1566 1754 2853 -3993 -5259 1176 2571 118 -15 -2753 -6198 -2413 568 -1013 -1293 -1132 -4474 -3948
1582c948K704j831J817M190n074n316O427L878m445n87L198j237O60K359l138
1597c43j934L170K158L44O27l270l228M219L266j990J851P5p292j482Q124K621
1613F916m268j161j558j450K714N72k684J831K945m975l986J784J459L101L025
1628D265o974q023O741Q242l989n835K88K971M452k79q198k149R286M257m201
1643H54l234j982N52O996J316p301L34P828j744p924J092O139L420m2o851n901
1659f448N641P421k033l299r34o62J222K156m189j249P859J55r554k082O964L060
1675D028j600m060l818M337O620n230q333L579P501J130l363o169l880Q748Q624
1690H114o917q455L438N811o44l883k594L657Q194k623j1215j349R352N265j178
$$ plain form
1582 -3948 -1244 -3075 -1258 2932 -2142 -7458 -1031 2847 -1598 -2185 1013 -224 436 2795 -343
1597 -343 -2277 893 3051 3395 4022 752 -2476 1743 5009 3019 4870 4945 -2347 -3829 4295 6916
1613 6916 2648 1487 -71 -1521 1193 1765 -919 912 3857 -1118 -5104 -3320 -1861 1240 4265
1628 4265 -2709 -10732 -3991 4251 262 -5573 -5285 -2314 2138 1859 -6339 -8488 798 5055 854
1643 854 -2380 -4362 -3810 3186 4502 -2799 -2465 5363 3619 -4305 -3213 2926 6346 6304 -547 -6448
1659 -6448 -807 6614 4581 1282 348 -314 908 3064 -1125 -2374 5485 5640 -3914 -5996 968 4028
1675 4028 2428 -1632 -5450 -1113 5507 277 -8056 -4477 3024 4154 791 -5378 -9258 -510 8114
1690 8114 1197 -7258 -3820 1991 1347 -2536 -5130 -1473 6721 4098 -7117 -8466 886 6151 4973
1705D973n245p293L102J0971m37r876L69P491M78m710k342N72N376L163n712m401
1721c521L858K831j234l94j732J67N361q58r178j45R343K081n684k657q91Q83
1737a770M524n42m435J466L175m359l102K338L020K128n64o699l808P126N225
1752C723k878l801o87Q54L700O4m460L52O221j032m019J444P82q83L094J542m038
1769b2K5M032j385l415J955L004L72j052l669j983L735K594j212M92r33n924J269
1786b117N823j268k989K526j710n000K156M329j511k095N02j271j205J738P93
1801a299K63L96k427q09L103N59l191J311K228j314P80J100l590m39N856O14l640
1818d99J42J112j133J749J119k138J854L301m352m562L025M532J346j623n483
$$ plain form
1705 4973 -272 -7565 -4463 6508 6071 -3805 -3436 4055 4533 -177 -2519 -1947 3429 6592 880 -3521
1721 -3521 337 3168 1934 1540 -192 -25 5336 4478 -4700 -4845 4498 6579 895 -1762 -2653 -1770
1737 -1770 2754 2212 -2223 -757 2418 -1941 -5043 -2705 315 2443 1879 -4820 -8628 -1502 3723
1752 3723 845 -2956 -3643 -2789 911 975 -3485 -3133 3088 2056 -1963 -519 263 -620 2474 4016 -22
1769 -22 3 4035 2650 -765 1190 4194 4566 3514 -155 -2138 1597 4191 2979 3471 2538 -3386 -2117
1786 -2117 3706 2438 -551 1975 265 -4735 -2579 1750 239 -1856 -1354 -2625 -3830 -2092 -1299
1801 -1299 -1036 -640 -3067 -3876 -773 -214 -3405 -2094 134 -1180 -400 700 -2890 -3329 2527 3141 -499
1818 -499 -357 755 -378 1371 2490 352 2206 5507 1155 -3407 -382 4150 5496 3873 -1610
1833a610k990O154M763m446l262O65M20J533O14n146j174P517P60p423l157N383
1849a399K797j104k268k899J484M030k57l980q26K725K995O52n059l345O408M696
1865D650n239k707M207M92k461R96K69L47L475o09o313o67O662K462k663m074
1881a173j740L970M423l807n658M002M829k891l323j259J037N069K237p501m869
1896f654O233N460k914m814j161L149M984j192p629j090P211K639k786m043k305
1911d912M255M946l271n414K430M092j702j879l54o91L127L995n404n798N661
1926i19N207l500k641R59P65R04L82j967j33L022M0k261l71L73J483K783k560
1943A566m157L129M692l836l771K883K398p03k36k379j702L004K656k502l030
$$ plain form
1833 -1610 -4600 1554 6317 1871 -1391 -726 -306 1227 1841 -3305 -4479 3038 3798 -3625 -6782 -1399
1849 -1399 1398 294 -1974 -4873 -3389 641 384 -3596 -4422 -1697 1298 1950 -3109 -6454 -46 4650
1865 4650 -589 -3296 911 1403 -1058 -62 207 554 4029 3420 -2893 -3560 3102 5564 2901 -1173
1881 -1173 -2913 1057 5480 1673 -3985 17 4846 1955 -1368 -2627 -1590 3479 5716 -1785 -6654
1896 -6654 -421 5039 2125 -2689 -3850 -701 4283 3091 -4538 -5628 1583 4222 1436 -2607 -4912
1911 -4912 -657 4289 1018 -4396 -1966 2126 424 -1455 -1809 -2500 627 4622 -782 -6580 -919
1926 -919 4288 788 -1853 -894 -129 775 1157 -810 -943 2079 2119 -142 -513 -140 1343 4126 1566
1943 1566 -2591 538 5230 1394 -2377 506 2904 2201 1965 -414 -2116 888 3544 1042 -1988
1958a988N11J224J971r18m162O00N051j370m212P35J516l36K146q4m759p4M926
1975G77J03l054M29Q13k57K138k55l087P81L048J23j355o64k51J500J924j403
1992A310j370J288M07j280J999l00k410J365K241k432j230K089j19j987J330M09
2008A310j859J80J404r33p44P14j015M4N95j464K62K036j915k633L077K015l029
2025a955o68J628r12K62K638j520l274K358L468j028k896q52J966L094j86l636
2041a513p5K945J166p87j162k003J459M440q46n478L07M677N71k227j512j680
2057a718K560L356k025m645P27L488Lj525j945n13K871J783l526k370K667J771
2073I59j313j061j061J50L593q3m220k39M756l03k884l27J377J027O04j624k143
$$ plain form
1958 -1988 -1477 -253 1718 800 -3362 -2762 2289 919 -3293 -2558 -1042 -1378 768 684 -4075 -4149 777
1975 777 880 -2174 -1745 -932 -1189 949 694 -2393 -1612 1436 1559 204 -460 -711 789 2713 1310
1992 1310 -60 1228 1635 355 2354 2054 -356 1009 3250 818 -412 1677 1558 -429 901 1310
2008 1310 -549 -369 1035 102 -642 72 -943 -899 -304 -1768 -1506 530 -1385 -4018 -941 1074 -1955
2025 -1955 -2623 -995 -1907 -1645 993 -527 -3801 -1443 2025 997 -1899 -2751 -785 2309 2123 -1513
2041 -1513 -1588 1357 2523 1736 574 -1429 30 4470 3624 -1854 -1547 3130 3701 1474 -38 -1718
2057 -1718 842 4198 2173 -2472 -1745 1743 1746 221 -1724 -2237 634 2417 -1109 -3479 -812 959
2073 959 -354 -1415 -2476 -2326 1267 1184 -3036 -3275 1481 1178 -1706 -2033 -656 371 975 -649 -2792
2090b792K369K533q69k984o68K504L207k86n367n20N427J432l891j594J135J355
2106I91J939n10m486m29N822J247n060j997K585K619M33l375k650K171L737j505
2122A532k538q70R98K005J337l262l380L666L014k591k459J169Q45O90K5k517
2138b336L4L253m4k609n47J462J039M51j293j932J851K040j284j137Q82P74M13
2155A017j88j222n81K913J220m125n62K999J135j211l45j376l3K620P22l417j178
2172a612K187J077j3j671k199J997K420j369k244Q23K56R0J65l60k249J377K959
2189A634j485k424J99J445N95J80j042j281J391J490p62k20O4p33J008J269j486
2206a58j028J921M91j221K06N06o14L43J239j376m75J750l70j353R21J08l38P53
$$ plain form
2090 -2792 -423 2110 1241 -1743 -2411 93 3300 3014 -2353 -2873 2554 3986 95 -1499 -364 991
2106 991 2930 2420 -2066 -2495 3327 4574 -486 -2483 102 2721 3154 -221 -2871 -700 3037 1532
2122 1532 -1006 -1876 -878 1127 2464 -798 -4178 -512 2502 -89 -2548 -1379 -534 156 181 -2336
2138 -2336 -2302 951 907 -1702 -2249 -787 252 703 -590 -2522 -671 1369 85 -1052 -170 604 1017
2155 1017 829 -393 -974 1939 3159 -966 -1528 1471 2606 1395 1050 -326 -359 2261 2983 -434 -1612
2172 -1612 575 1652 1639 -32 -2231 -234 2186 817 -1427 -604 -348 -258 -93 -453 -2702 -1325 1634
2189 1634 149 -2275 -2076 -631 -36 144 -898 -2179 -788 702 -60 -280 -216 -949 59 1328 -158
2206 -158 -1186 735 1226 5 211 717 103 446 1685 309 -166 1584 1214 -139 782 890 552 1305
2224A305l48j555J039Q78p57r49K59J39J11P19j953m46K188P51k185o19M94L66
2242e63O82M52k370k65K493M06j994q61J188J251L85j343k098J391K684m86j782
2259h30p08N72J406J861k290k472K647K485j796k069O37P87J912q5k317j307K677
2276A110J332j693j255M92P25J127q32k555N98K738o7k292n47Q47L51O77r38j348
2294a530J468J214j999j350J126J461N27r38k260r2K977J094k448j564J450J055
2310A91N02q53j938J338K674j077k716L59J875J066k65j610j654J887K859j449
2326A189k822J106K046L50q79j758l62K427J585k497r13M43Q87K38k3j493J22
2343c54J910k20k816N71J751N51o96j247q28K04K035n45k014P58O34l52J94o53
$$ plain form
2224 1305 957 -598 441 1319 562 -387 -128 11 122 841 -1112 -1558 630 1381 -804 -1423 -929 -563
2242 -563 119 571 -1799 -2064 429 835 -1159 -2020 -832 419 804 -539 -2637 -1246 1438 952 -830
2259 -830 -1538 -966 440 2301 11 -2461 186 2671 875 -1194 -557 230 2142 2057 -260 -1567 1110
2276 1110 2442 749 -506 -14 711 1838 1006 -1549 -951 1787 1720 -572 -1119 -272 79 756 -182 -1530
2294 -1530 -62 1152 -847 -2197 -1071 390 917 -21 -2281 -2373 604 1698 -750 -2314 -864 191
2310 191 693 -160 -2098 -760 1914 837 -1879 -1520 355 1421 1156 -454 -2108 -221 2638 1189
2326 1189 -1633 -527 1519 1869 990 -768 -1130 1297 2882 385 -528 -85 802 1040 1017 -476 -354
2343 -354 1556 1336 -1480 -909 842 1393 697 -550 -1378 -1174 861 316 -1698 -940 -306 -658 -464 -1117
2361a117q6J473K04j912r11J804Q90n88j60o00L70J421j26j661K26J552O08n42
2379H45n89j020P70K330o32j674K57P59m56J49q9n39R45O86j689j357J303J172
2397A171m51k21j000o85R97J218r03j440R21L24l12j0p36k22J603lj189k08N02
2416f44l19O12L58q39j39J681j285n78J013R40l47l59j82p95P75J259m68p00J43
2435A26J01O6L90n04l91J497M99k668J09J897n9k8m47o56l74J501%j511l10J505
2455G43L87q48q27r54J236J508o85j814j74O97P21L52r31q44J694M59j563j295
2473b138J643R48N39q92j536j83J735J622k163m34O39K25N41j58j035M93J694
2490A540n37j575L61J065j59K85n16j236J136J055j367j008J389J165j054p63
$$ plain form
2361 -1117 -1203 270 474 -1438 -2349 -545 345 -243 -403 -1003 -633 788 662 -999 -773 779 1387 845
2379 845 256 -764 6 2336 1704 30 287 1046 590 739 650 111 1056 1742 53 -1304 -1 1171
2397 1171 720 499 -501 -1186 -189 1029 126 -1314 -393 -69 -381 -391 -1127 -1349 254 251 -938 -1146 -644
2416 -644 -963 -351 7 -832 -971 710 -575 -1153 -140 800 453 94 -88 -883 -108 1151 683 -17 126
2435 126 227 293 683 179 -212 1285 1784 -884 -775 1122 1063 1035 588 -68 -442 1059 1059 -452 -762 743
2455 743 1130 282 -545 -1499 -263 1245 560 -1254 -1428 -731 -10 342 -589 -1433 261 720 -843 -2138
2473 -2138 -495 453 992 100 -1436 -1619 116 1738 -425 -859 -220 5 546 388 -647 -154 1540
2490 1540 1003 -572 -211 854 695 980 464 -772 364 1419 52 -956 433 1598 544 -219
2506b19m61O7J614M52j461p64O17R16l75p85l72J044J203j844j515J119J679J6
2524I31q83j191n15J251K069j591k001J017J560l82j084p39P95J252N55j424j152
2541a532J349R88k47l70j062Q24J266m77j749K99J789L00p72q49m54Q77J825q06
2559A199j133K9P51n23k6Q8j01O47k81j477J20J082M46q26m92n14l7J492l32j390
2579a278K62J508k67j579K67Q41k77Q60J0j639M78J348l66n14j4K98Q21l64j008
2598f13p40J572J341q96p48l10p4J165Q74j241o46L90P98o19j35J00L43M32j57
2617H36j250q6R71j02K54l57n89l33J258o21n59K76L36m15M23J18j206N06J173
2636F33n52j008K32M06m46O05L7m0l6r6j34K03O06j1m43n82j62Q15N19j61p64
$$ plain form
2506 -219 -680 -613 1001 1453 -8 -772 -155 761 386 -399 -771 273 1476 -368 -1883 -764 915 931
2524 931 48 -1143 -1658 -407 1662 71 -1930 -913 647 265 -819 -1558 -763 489 1044 -380 -1532
2541 -1532 -183 805 558 188 -874 -50 1216 739 -1010 -711 1078 1378 606 -243 -697 180 2005 1199
2559 1199 66 95 846 323 297 385 284 931 650 -827 -707 375 821 -5 -497 -1011 -1048 444 112 -1278
2579 -1278 -1016 492 225 -1354 -1087 -246 -523 337 347 -1292 -814 534 168 -346 -360 -62 759 395 -613
2598 -613 -1353 219 1560 664 -84 -394 -468 697 1571 330 -316 74 872 253 118 218 561 993 836
2617 836 -414 -500 471 369 623 266 -323 -656 602 -19 -578 -302 34 -381 42 160 -1046 -540 633
2636 633 81 -927 -695 -289 -735 -130 -93 -133 -169 -265 -399 -196 410 399 -44 -626 -788 27 546 385 -379
2657c79P38M47n10n33L33J74K94L27p43q32P59R37l78q02m72P91N37J15j234l18
2677g49J092N76q59m54l86m2J468K28j607l99J076L40o47j11J19pO35l67j016
2696a110K85J151j60p8o66q2N57M89m05o19N96O0J39k29k88j83J063J98r77j65
2716d24J112Mn18M7N6J84J22m69m85M46J126m79q49j31O4O07K52j012m83J339
2736E09L01j154k63L48M55K80k09j104o73J415O36q43o67L15M55P66n50r32M25
2755d90Q40k53j61m34j78O42Q82p93q34M01J058m58m20N22k62L72K28p73k21Q38
2775E06J02l66n2r3R4K17L37o03R9N74o16l12K49Lj35K76m08m70O72R4p6o57K74
2798b91J60K24l31j27o22J142L7p67j67L10J85J44L87r64n0R68P3o59M23K0L0
$$ plain form
2657 -379 359 806 296 -237 96 270 564 891 148 -684 75 1012 634 -168 -640 151 688 803 -431 -749
2677 -749 343 919 60 -394 -780 -822 646 874 -733 -1132 -56 284 -363 -474 -355 -362 273 -94 -1110
2696 -1110 -825 326 166 88 -578 -660 -103 386 -19 -638 -42 18 157 -72 -360 -543 520 718 -259 -424
2716 -424 688 692 174 221 277 461 583 114 -371 75 1201 722 -127 -258 -194 413 665 -347 -830 509
2736 509 810 -344 -607 -259 196 476 267 -837 -1510 -95 541 -302 -969 -654 -199 567 17 -915 -490
2755 -490 350 97 -64 -498 -676 -34 848 55 -779 -378 680 222 -198 324 62 434 662 -111 -332 506
2775 506 608 242 190 97 191 408 745 142 241 815 199 -113 136 139 4 280 -128 -598 74 168 92 -565 -291
2798 -291 -131 93 -238 -365 -987 155 192 -575 -742 -432 -247 -103 284 -680 -730 238 311 -348 75 95 125
2819A25J61j22n32K83N34J03n56j09K30j45P31l02q59N22K18J22m57k2K94o3L61
2840E17l91n93Q88K97q79J1N9j03K30j69j2m18O80J02n34k9n2K27K22mn85K71
2862b65O88o66m61L72K38J03J95p12oO79J89m35j61R1J20K73K54p33J6M88K59
2883E26o91J04P3K27K23j9o55L84O23q4p26j68O07m47N17k61m96k7N54j63p01
2904f00L39L58j15K8m54l72R17ol94P7J21m5J41n9k83k27M86J24j00m05K55J70
2926d4j69L0m1J86L56Mm55kM66K48l76m48N0K58L79n03k16M14J28M44m11l62j47
2949b11N76jm56P4J2K36kr5o91L16Q29p14k25%L16L20O9o50o9M5K95N1q5j47o8
2974b75K56k97J48m27O64J16m14P8M74l19q3M2l03K42J88M5n31K71N12l43K89
$$ plain form
2819 125 286 164 -368 -85 449 552 -4 -113 117 -28 703 401 -458 64 282 404 -53 -75 219 156 517
2840 517 126 -467 421 718 -161 -150 -91 -194 36 -133 -145 -563 117 219 -315 -344 -396 -169 53 49 -536 -265
2862 -265 423 -243 -704 -332 -94 9 204 -508 -514 165 354 -81 -242 -151 -31 242 496 -237 -221 267 526
2883 526 -165 -61 12 239 462 443 -212 172 795 711 -15 -183 424 -23 494 233 -263 -290 264 101 -600
2904 -600 -261 97 -18 10 -444 -816 101 95 -299 -222 -101 -146 -5 -64 -347 -574 -88 36 -64 -469 -214 -44
2926 -44 -213 -183 -224 -38 318 322 -133 -135 331 579 203 -245 -195 63 442 -61 -277 137 265 709 298 -64 -211
2949 -211 365 364 -92 -18 -6 230 228 133 -558 -242 587 -127 -352 -352 -36 284 353 -297 -366 -321 -26 25 -60 -207 -275
2974 -275 -19 -316 -168 -595 69 185 -229 -151 323 4 -79 -37 -340 -98 90 135 -396 -125 387 44 333
2995C33j09k16J58J87j90oJ87J03k33m08P8qM16k51nm9R0K85j58m1m94j37M29
3018c9Q6j82j61K54K74j9l81l80O27k2j93k00J03j41N22o6K1n55qN99K54o52J4
3041b45L94K60m52p4k7j4N36n00J07M6j13P1Qj21j4M58j60j26J39k42j8k4L24
3064B13l73M55l73rJ57M50l37k53k04J74J56oR2l93pJ10J18j20o0P5k43M97N7
3087A76m07J2NN70l13Q6m29J77k6m4K78j39J34M46k27m99k96L24N40m8j42j57
3109B1o7L82pj87l18J88j15J46j44Q0K59j38K52m83n1L65j85j7K5M0P9j88J51
3132H8l28j48M30L18k99j06j5j5K6k9J95j72K26ok95N15o74M15l7l42RQ6M12n51
3156b97K06J9J09R7j28p2q8N83l20o4m1O8J16k08L5j91J35M05k31Mn32M52K2k1
$$ plain form
2995 333 224 8 166 353 163 157 344 447 214 -194 -116 -124 292 41 36 -13 77 362 204 163 -331 -468 -39
3018 -39 47 -135 -296 -42 232 213 -168 -548 79 57 -136 -336 -233 -374 148 82 103 -452 -460 139 393 -259 -245
3041 -245 149 409 -43 -117 -144 -158 378 -122 -15 31 -82 -11 -3 -124 -138 320 160 34 173 -69 -87 -111 213
3064 213 -160 295 -78 -87 70 520 183 -70 -274 -100 56 50 142 -251 -258 -148 -30 -150 -210 -135 -378 119 176
3087 176 -231 -219 -214 356 43 129 -300 -123 -149 -193 85 -54 80 526 299 -200 -496 -172 368 320 178 21
3109 21 -46 336 329 142 -176 12 -103 43 -101 -21 238 100 352 -131 -182 183 -2 -19 6 46 125 -63 88
3132 88 -240 -388 42 360 61 -45 -60 -75 -49 -78 117 -55 171 165 -130 385 -289 126 89 -253 -244 -158 254 -297
3156 -297 -91 -72 37 134 6 -66 -154 429 109 45 4 72 188 -20 15 -176 -41 364 133 137 -395 57 79 58
3180E8p7k28M46J38k33ml36K66K58k95j9j58j04K13L86m02N2K7L29k86m74L13
3202a30L53l80J04j22J99k10J2K55m56M77j75J22m56J89K47j14K17q7j87J59J18
3223A35p0q6J0K12J91m97K56O0J43j54q0l71L69J0K55n04J46p3K53k87J06K00
3245B24l88J45k15R7OJ23L30l73k02M47j72K53q9j67n4j62J48J21k64J30l16N70
3267A92n33J11l5K55L51l78J63k54L51l37J51L4K75j13J52p01J71J74J1L5k71
3288a96M59m38J00l09L48K4p4N17n70r2l6K77j27m6J48jj21J13l90L89j73K57
3310E9L5k91K0P3J5j78J64J45J07j29O4j22k69N37m94L49m07K8J37L37r4m09M6
3333b77L69j5j53K44j69p2L35j57m91L34J31q1q2J46k05K09o8Q2n29M30L27k97
$$ plain form
3180 58 -19 -247 199 337 104 100 -236 30 288 -7 -26 -184 -288 -75 311 -91 -39 -12 317 31 -443 -130
3202 -130 223 -157 -53 -175 24 -186 -174 81 -375 102 -73 49 -407 -218 29 -85 132 45 -142 17 135
3223 135 65 -21 -11 201 392 -105 151 211 354 200 120 -251 118 128 383 -121 25 -48 205 -82 24 224
3245 224 -164 -19 -234 -137 -131 -8 322 -51 -253 194 22 275 186 19 -35 -197 -49 72 -192 -62 -378 192
3267 192 -341 -230 -265 -10 341 -37 126 -128 223 -114 37 71 346 233 385 -316 -145 29 40 75 -196
3288 -196 263 -175 -75 -384 -36 -12 -86 431 -139 -231 -267 10 -117 -163 -15 -16 -137 -24 -414 -25 -198 59
3310 59 94 -197 -177 -104 -89 -267 -103 42 149 20 84 -38 -307 230 -264 85 -322 -294 -157 180 86 -323 -277
3333 -277 92 77 -76 168 -1 -73 262 105 -386 -52 79 -2 -84 62 -143 66 -2 80 -449 -19 308 11
3355A1N2j29K50k64J85k52J99l91L60M3j76K93k99L4J22k72L97j57j81M7J21R5
3377H8k49L83l72K37j22K21m34J02K70k43K16r9j71K08K73n09J90L1K54m75K41
3398D0j09j69n5K37Q9lK6j2J1l12J02L91n5j99j73M1J62J32M2j91O5k13K65o8
3422D4J21J44k59m70M83m0l29J22M55l70j18K27K72k91p0K89n03J71J24J16j73
3443e5j92J32J0J01j86l00N64J72J26l77j75j20K59K12K83n52R3K04k67K18J16
3464B66l03J63q0k56J85O4O8o8J42p8J62k09R8m43L57k8k09K96M9p5j49J7k9N9
3488aK15n1k13j17J2P6J13j85n3K37j39K25l23o6O7K15j3J39n6j26j09nK57J7
3512A16k7J38k49J83l89M5M60j61l34M37l18M15n7l95pJ18o5m4K26O8n05M66J96
$$ plain form
3355 11 63 -66 184 -80 105 -147 52 -339 21 64 -112 181 -118 -84 38 -234 163 6 -175 -128 -7 88
3377 88 -161 222 -150 87 -35 186 -248 -146 124 -119 97 -2 -173 35 308 -201 -11 20 274 -201 40
3398 40 -69 -238 -293 -56 33 30 56 44 55 -257 -155 236 181 -18 -191 -150 12 144 186 -5 60 -153 112 44
3422 44 165 309 50 -420 63 23 -306 -184 271 -99 -217 10 282 -9 -79 210 -293 -122 2 118 -55
3443 -55 -247 -115 -105 -4 -190 -490 74 246 372 -5 -180 -300 -41 171 454 -98 -5 199 -68 150 266
3464 266 -37 126 46 -210 -25 39 107 39 181 103 265 56 154 -289 68 40 -169 127 176 101 -48 -31 -60 -1
3488 -1 214 163 -50 -167 -155 -79 34 -151 -204 33 -106 119 -204 -270 -203 12 -1 138 82 -44 -153 -158 99 116
3512 116 89 227 -22 161 -228 -183 277 116 -218 219 -99 316 259 -136 -143 -25 -90 -134 92 160 -345 121 317
3535C17o51N6J92M5K74j21Q6k83l9L58n14J24K09j91q4J27p4j10N03l08j9N6J29
3558H2j90k32K63m7K02J09l66o6M85k89j03K29l17j12P62k37k17n8M72M1k84M1
3580A68J17n82N70J14k85J90O9J1o05K92j68LL10j51j89J96k19K75k13o1j7q1
3602b56M21l3o00K66J49k14K27J61m17L19K02n02m3L69k52L18m3l29K85J26J54
3623C08l36L3N7p7M43l72r5kM98l34q3j32M23m77L25N9j87M0N5k91j50L61j4l2
3647B0Q3j71Q5n1j44r8J80N17n20R3j07O3J69j76J63o61M55L51m48J55j50n6J57
3670i1K09r5j70k61M01l27N22k96K33L3o7m54M20J54n9j06R8l46J89M00p1l47
3692c1p1M31j90j94R7m3J78k88M84l99J85j63j85K92J74m10L03j29l25J32J19
$$ plain form
3535 317 -334 -278 -86 -41 233 112 198 -85 -124 234 -280 -156 53 -138 -222 -95 -169 -279 224 -84 -103 -47 82
3558 82 -108 -340 -77 -124 78 187 -179 -245 240 -49 -152 77 -240 -352 410 173 -44 -102 370 411 127 168
3580 168 285 -297 273 387 102 292 361 372 -233 59 -109 -106 204 53 -136 60 -159 116 -97 -158 -175 -256
3602 -256 165 132 -468 -202 -53 -267 -40 121 -296 23 225 -277 -320 49 -203 115 72 -257 28 154 308
3623 308 -28 5 62 -15 428 56 -39 -41 457 123 40 -92 331 -146 179 238 51 91 146 -145 -295 66 52 20
3647 20 103 -68 17 -34 -178 -276 -96 421 -99 -6 -113 -50 119 -57 106 -555 -100 251 -197 -42 -192 -248 -91
3670 -91 118 23 -147 -408 -7 -334 188 -108 125 158 91 -363 57 211 152 46 144 -202 -13 387 316 -31
3692 -31 -102 329 139 -55 42 -1 177 -111 373 -26 159 -4 -189 103 277 -133 170 41 -284 -152 -33
3713c3j81J7n5N4L34m15J60N3L6L48p50J19J12K32P1l5l00j69J55M3K95l0J32
3736A93l34J41O4k8j49K23J52l03O5K27m14L85j0j39j11Q6l0j44K03j22j21O35
3758D69k02m76J29N9j87K21p5j29J15L15k11m99L85j20J37J1J54j04j72j7L72
3779A75m99K66m6j82K19K76o8k79L42l50M9M77k26j97j4R9q4Q3l7Q7j03K22o4
3802A46l22K65J09J67j69R8k67J71m9J74m54J39j69M68q6j53l11M10k83J3r8j44
3824c45N1M0M35o57L64j98J60p0K85k25o3J20j01j4L5M22m36L82l0m70J38J72
3846eL4k55N03n8k26K21k81J12N6j9K6J63K5j77o1j08L2J60L5k55k2R0L9p2j51
3871a94M38l38K36J72m12l06L71M89q26L60j54k97K67K50k89l26N72m41N10k36
$$ plain form
3713 -33 -214 -197 -252 -198 136 -279 -119 -66 -30 318 -432 -313 -201 31 102 67 -233 -402 -247 -204 91 61 193
3736 193 -141 0 64 36 -113 110 262 -41 24 251 -163 222 212 73 -38 48 18 -126 77 -45 -166 469
3758 469 267 -209 -80 -21 -208 13 -62 -191 -76 239 28 -471 -86 -206 -69 -58 96 -8 -180 -197 175
3779 175 -324 -58 -104 -286 -67 209 141 -138 204 -146 -97 380 154 -43 -57 42 -42 41 4 91 -12 210 146
3802 146 -176 89 198 365 196 294 27 198 149 323 -131 8 -161 307 221 68 -243 167 -116 -103 -201 -345
3824 -345 -294 -254 181 -476 -112 -310 -150 -220 65 -160 -223 -103 -204 -218 -183 239 -197 185 155 -315 -177 -5
3846 -5 29 -226 277 219 -7 214 -67 45 101 82 108 271 296 119 58 -50 -18 142 177 -78 -100 -10 29 -43 -194
3871 -194 244 -94 142 314 -98 -404 -33 456 -370 -10 -164 -461 -194 56 -233 -559 13 -428 82 -154
3891a54O4n2J90k06k02p9M85O4J31o5j30j96M82j87k70J49k9J70J8Lj79J50K98
3914D55l41J1J30O0m00K53J69l88K28j75k55L71J68k14rJ46k23k50J08J88n09
3935d77N89N8k41l49L92n3o3K45n15j32P52j85L3k74J41m38L45J94j89m4N50K8
3957C67n47L79k33j86O09k07j14J29R7j04J5K37l03k96N45k9p04M63L36m75j72
3978a93O38n32R1J13k8n0k14K46j00j21k9J76J78m9k81m8J9m6j62N90M5n17K72
4001bM8n75K15L94l94j28O20N6l21L40j66l25L39K74m41J99N7rj14L34o36J06
4023a29Q09k04jm84J26N0K9K7k27j06O60o88J67J30j41l2L53k96m99O83k87j84
4045b44K37J77l35M4P3m76K44L70l4m01J69O8o3k16L87l61M83Nl63n7L37K9l8
$$ plain form
3891 -154 -90 -142 48 -158 -360 -439 46 110 241 176 46 -150 332 145 -125 24 -5 165 183 186 7 157 455
3914 455 114 125 255 315 -85 168 337 -51 177 2 -253 118 286 72 63 209 -14 -264 -156 32 -477
3935 -477 112 170 -71 -420 -28 -81 -144 101 -414 -546 206 21 54 -220 -79 -517 -172 22 -167 -211 339 367
3957 367 -180 199 -34 -220 389 182 68 197 294 190 205 442 139 -157 388 359 -345 118 454 -21 -193
3978 -193 445 -87 4 117 89 39 -175 71 -29 -150 -179 -3 175 126 -155 -203 -184 -230 -392 198 243 -274 -2
4001 -2 46 -529 -314 80 -314 -442 178 234 -87 253 87 -238 101 375 -66 133 190 181 67 401 -235 -129
4023 -129 680 476 475 -9 117 167 196 223 -4 -110 550 -138 29 159 18 -14 339 43 -456 227 -60 -244
4045 -244 -7 170 -165 -121 -48 -524 -280 90 56 -345 -176 -108 -171 -387 0 -361 122 127 -236 -293 44 73 35
4068C5J54o89L15K19M52n71k59N83m34M58K44p01K74M28R5p03M8K51n9n4J87l80
4090a07l8M74j60o58K78J29O6Nj04r8J18L18l19k74M19j21k05L96j1l32J40p7
4112a61j09N5K31l80J64L48l08l7K74k26J36lRk82J79M55n57M19M39n65l53N59
4134B87O1l14K88Nm68L94j78q6K0M01k00K9J90l80k10J06M68l93k44M36N2l1P1
4157C04p63K34J15M2n71O89l23j76O58k85m17J44P78o67k23L47q0j15N15r8m04
4178b96K81O4K13k35J45l65J12M80k01j87M51J98p36K64J14j24R7J27p55K54N76
4199D77k70j22j82J53r9N45k44m66L84o6l55M06m6j31k18M96p64J40M24j39k21
4220b98J68M05l91J2Qj09l04R42l18m21M9J49ML77M2o18K44O20o40M6P2J2L47
$$ plain form
4068 35 189 -500 -185 34 486 -85 -344 239 -195 263 507 -194 80 508 603 -100 -52 199 140 86 273 -107
4090 -107 -145 329 169 -489 -211 -82 -16 -11 -115 -213 -95 223 -96 -370 49 -72 -277 119 108 -224 -84 -161
4112 -161 -270 -215 16 -364 -200 148 -160 -197 77 -149 -13 -16 -7 -289 -110 345 -212 207 646 81 -272 287
4134 287 348 34 322 327 -141 253 75 -11 9 410 210 239 429 49 -161 -55 413 20 -224 212 264 233 304
4157 304 -459 -225 -110 -68 -639 50 -273 -449 209 -76 -493 -349 429 -238 -461 -114 -194 -309 206 108 -296
4178 -296 -15 49 262 27 172 -193 -81 399 198 11 462 660 -76 188 302 178 275 402 -353 -99 477
4199 477 207 85 -97 56 -43 502 258 -208 176 110 -245 161 115 -16 -234 262 -502 -362 62 -77 -298
4220 -298 -130 275 -116 -104 -96 -205 -509 433 115 -306 -257 -108 -104 273 315 -303 -59 561 -79 -33 39 51 398
4243C98P1K48q33J73P04o32J20j73o5O0L11m14j58O28l1n08L65o7m61J40K94n40
4265c70j60P05n25j43L11K56l10J40J47l39J09K30m86kL54L2N8K35l78j06J78
4286f4J71m59N4N42q6M2O7j87n31Q36J49p07N3K63p9O18n32j98M35J42k10o90
4308c71O52j88J72P2j62n31M89J84n05k76M30j89pM84n27R7J3M96o05M3Q9l12
4330d52K85M32n90J97J44l86j93K32J09k09L33K62n35N97J16o16L8L21J74j40
4350A19L0p4j00L53kn13J48K70J7k33L15l31L34J10j82o93O94J46n23k34L04l49
4372c94K20N16j16q05O63J99m33M70k85n85M92N94o65k38L76j82Q7O9m40j22N82
4393Cj95m63M12Q3K49N5L22p07k7R32n86K9P5j05K05m5N4l16K44K93m85k07M96
$$ plain form
4243 398 469 717 -116 57 761 129 249 76 11 71 382 -32 -190 438 407 -101 264 197 -264 -124 170 -370
4265 -370 -530 175 -350 -493 -182 74 -236 -96 51 -288 -179 51 -435 -437 -83 -51 7 242 -136 -242 -64
4286 -64 107 -352 -298 244 158 200 267 80 -451 385 534 -173 -120 143 64 682 150 -48 387 529 319 -371
4308 -371 281 93 265 337 175 -356 133 317 -188 -464 -34 -223 -230 254 -273 -176 -163 333 -272 -229 -140 -452
4330 -452 -167 265 -325 -128 16 -370 -563 -331 -222 -431 -98 164 -371 226 342 -274 -236 85 259 119
4350 119 149 75 -25 328 326 -187 -39 231 248 15 330 -1 333 443 261 -432 262 408 -115 -349 -45 -394
4372 -394 -174 342 226 -579 84 283 -150 320 35 -550 -58 536 -129 -367 9 -173 -86 -17 -457 -579 3
4393 3 -192 -655 -243 -160 89 144 466 -241 -268 664 78 107 182 77 282 237 291 -25 219 512 27 -180 316
4416C16J42n01N67o58j16N36N66j019J89M26j13j63j40j68k15R29m62l50J99O4
4436B9j83J63l55j69J6Q58o73k22L37L42j94k05Rn29Q14L98k84n08K54J17J1J34
4458A60k81r4Q41o01k81K92N17l64N0J62p36L42P73l64n98N91K1n94L61K11n87
4479a79K22O6k85j50M05j05j08j47K44m57P37p9p38K22N18k23m42J14N5k19R53
4500D04m38n86O64N7l1l59L28k93K99K51m53KL92J40nj02j63n8L01K14o54J31
4522D1M80J6j42J53m97j22M97L22j037L08M01rm42K67l93j30L73K17n59L69j8
4543I5k74K76l08j88J96O46p62l55Q75o7o64K26K18k06K05L23n75K69M21n94j08
4564c51L7J63J26K98l31k41N82%l5j70Qm13O75M02o41m46Q85o5j91k93P2m71N31
$$ plain form
4416 316 458 -43 524 -134 -250 286 852 -167 22 448 335 172 32 -136 -351 578 116 -234 -35 29
4436 29 -154 9 -346 -515 -499 359 -314 -536 -199 143 -51 -256 -247 -776 38 436 152 -356 -102 15 26 160
4458 160 -121 -215 626 25 -256 36 553 189 239 401 -335 7 780 416 -182 409 430 -164 197 408 -179
4479 -179 43 109 -176 -326 79 -26 -134 -281 -37 -494 243 164 -574 -352 166 -57 -499 -385 -330 -549 404
4500 404 -34 -620 44 101 70 -289 39 -254 45 296 -157 -155 237 377 372 270 107 49 350 564 -90 41
4522 41 521 537 395 548 51 -71 426 748 -289 19 420 411 -31 236 -157 -287 86 303 -256 113 95
4543 95 -179 97 -211 -399 -203 443 -319 -674 201 134 -530 -304 -86 -292 -87 236 -339 -70 351 -243 -351
4564 -351 -314 -151 -25 273 -58 -299 283 283 248 78 86 -327 348 750 109 -337 548 483 292 -1 71 -400 131
4587A31M67n71n47O19L48l75j58k11L33J82K5n51J71K48n32K00N51n81j96N37
4607I0J02p95O33k30J1j20R0j76L93J23k26k41N25k63Pp7n9K08K21J24p10J57
4629b13P39p43K85K76j52J34L57m64m23M74j8q9j19k59L49J74L09p30k06M96m
4650A73l71K57j44o17P05N53r88l21O84m9k73L44j81m59P64l10n16K0P31N9k15
4671a54j98J14K1M52l00m83L78M14m10P55m66k6l1R15r52n57J042k54k57L22j3
4692C12k27O0R9m47J2N98j73j69K6J86m47O04m63n82P54L46r81L3O49o02kP47
4714C33q25k47R83Jp47L63J18n75O19J45l29m01M40L26o14L77j43j83R92j87r85
4735e39K79Q67o57P6K62l06rM98o3p99N79N25l99l55K43k60K00M94p53m3P49l16
$$ plain form
4587 131 598 27 -520 99 447 72 -86 -297 36 218 243 -308 -137 111 -421 -221 330 -251 -447 90
4607 90 192 -603 30 -200 -189 -309 -219 -395 -2 121 -105 -346 179 -84 -77 -154 -213 -5 216 340 -370 -213
4629 -213 526 -217 68 344 192 326 683 219 -204 270 252 163 44 -215 134 308 617 -113 -319 177 173
4650 173 -198 59 -85 -702 3 556 -432 -753 -69 -118 -391 -47 -228 -687 77 -233 -749 -729 2 61 -154
4671 -154 -352 -238 -217 235 -65 -548 -170 244 -166 589 123 97 66 981 29 -528 514 260 3 325 312
4692 312 85 145 244 -203 -191 407 234 65 91 277 -170 434 -29 -611 143 489 -492 -459 190 -412 -414 333
4714 333 -492 -739 244 245 -502 -139 -21 -596 23 168 -161 -562 -122 204 -410 -33 -176 -359 633 446 -539
4735 -539 -260 607 -50 26 288 -18 -27 471 408 -391 188 713 314 -41 202 -58 142 636 -117 -160 589 273
4757B73k96K00ml90M76l19k43J49P45m45p65L36J90k52L3L93q32L21M86p10JN06
4779a47q7Q1J82o36K52N27M5n05J14N5M9O20r2r36K28Q15J31p44Q4J19K18K12
4801E85J69p11QL31m0p5O8m42M14L45q60j84O60K31p85M35p7m47M14m9j88l90
4823e88Q02j46m84K61j1n3j7p1k76L82o1k24J19M45l18n9O75l74p50J045K93n50
4845D0J03j32p0J71K30k74l08O15L12m03j01l20N39L48o60l31M01N45m27l16M16
4866C78j82l13O87j84j106K47J177n25j77q4l19M00J72j12l63j62L69j90k87L27
4886b47l11O54Q9j026M37P25k32o17L79K07m55L27M02l37l28Q81l11n14M93J71
4906C87k26q0J38o42P08K83l02l51N71k59M2K20n93l63P17N01n79l63M81l11K86
$$ plain form
4757 273 -23 177 173 -217 259 -60 -303 -154 591 146 -619 -283 -93 -345 -312 81 -751 -430 56 -654 -653 -147
4779 -147 -234 -153 29 -607 -355 172 217 -288 -174 -119 -70 550 458 -478 -250 565 696 -48 36 155 373 585
4801 585 754 43 51 382 342 267 335 -107 307 652 -208 -392 268 499 -286 149 72 -375 39 -10 -198 -588
4823 -588 214 68 -416 -155 -166 -219 -236 -307 -583 -201 -262 -486 -367 78 -240 -299 376 2 -748 297 590 40
4845 40 143 11 -59 112 342 68 -240 375 687 284 183 -137 402 750 90 -241 160 705 278 -38 378
4866 378 196 -117 570 386 -720 -473 704 179 2 -82 -401 -1 171 59 -304 -466 -97 -287 -574 -247
4886 -247 -558 96 185 -841 -404 321 89 -528 -149 58 -397 -70 332 -5 -333 548 237 -277 216 387
4906 387 161 81 219 -423 285 568 266 -85 486 227 269 489 -104 -467 250 751 172 -191 290 -21 265
4927B65J4m35j03P05j98n32J84L72l44J02l24m22O91O01o84m98O44o19K78L14
4947A1L0q20O42O66o75n11O45n8L43k14J58o86N80M41p75K04L10j37K19k10j63
4968@J3O61o41r4O24l68m72N94p5m94J23O00m42l84Q76k32j10J06k66m1R7J19
4990A94p26L3M84q5m0N16j054J20R46l56p66J2O95m95M59k8k85O4P38K8r15L40
5012a21K51k69O39p50J59M23J33n01q6K25j34L17M12p09m86P71M85q75K63L4l50
5033a69L35L9k57K6K20J13l98J35j81L10l14k40k74M96L17p32K87L44l30k98O93
5054A22m82k93O05J62q58N33L80j02j56K7N6j87Q01m56o32M10K85n00O14m36p4
5075a81J08Q90n59p26N48M82l67K25Q2q65P62J32l31n58L23K58J61l6m77j86L73
$$ plain form
4927 265 279 -156 -259 446 248 -284 -100 272 -72 30 -294 -716 -25 576 -108 -606 38 -581 -303 11
4947 11 41 -779 -137 529 -146 -657 -12 -70 273 59 217 -469 111 552 -223 -19 291 154 373 163 0
4968 0 13 674 33 -61 563 195 -277 317 242 -252 -129 471 29 -355 521 289 179 285 19 -22 75 194
4990 194 -532 -499 -15 -100 -140 376 -678 -558 388 32 -734 -722 -27 -522 -63 -91 -376 -312 426 454 -461 -121
5012 -121 130 -139 500 -250 -91 332 465 -36 -122 103 -31 286 698 -11 -497 274 759 -116 147 181 -169
5033 -169 166 205 -52 -26 194 307 -91 44 -137 173 -141 -381 -655 -159 158 -574 -287 57 -273 -571 122
5054 122 -360 -653 -48 114 -744 -211 169 67 -89 -62 -6 -193 608 152 -480 -70 215 -285 329 -107 -181
5075 -181 -73 817 258 -468 80 562 195 420 502 -363 399 531 200 -358 -35 223 384 348 -129 -315 58
5096E8L84o09P8K5j27K22J68o27k17Q46j21p38N57l9l02J29J89l48m9O32m25j31
$$ plain form
5096 58 442 -167 -89 -64 -191 31 199 -428 -645 201 80 -658 -101 -140 -442 -313 -124 -472 -521 111 -314 -445
$$ [...]
8191a09
##END NTUPLES=NMR FID
##END=
