##TITLE=1H_EC-3202(2)
 CDCl3, 8 sc, 
 25.7.2019
##JCAMPDX= 6.0         $$ Bruker NMR JCAMP-DX V2.0
##DATA TYPE= NMR FID
##DATA CLASS= NTUPLES
##ORIGIN= UXNMR, Bruker Analytische Messtechnik GmbH
##OWNER= root
$$ XWIN-NMR		Version 3.5
$$ Thu Jul 25 14:40:08 2019 Russian Standard Time (UT+4h)  she@DPX200
##.OBSERVE FREQUENCY= 200.13155
##.OBSERVE NUCLEUS= ^1H
##.DELAY= (6, 6)
##.ACQUISITION MODE= SIMULTANEOUS
##.ACQUISITION SCHEME= undefined
##.AVERAGES= 8
##.DIGITISER RES= 18
##SPECTROMETER/DATA SYSTEM= spect
##.PULSE SEQUENCE= zg30
##.SOLVENT NAME= D2O
##.SHIFT REFERENCE= (INTERNAL, D2O, 0, 15.7039)
##AUDIT TRAIL= $$ (NUMBER, WHEN, WHO, WHERE, WHAT)
$$ ##TITLE= Audit trail, XWIN-NMR		Version 3.5
$$ ##JCAMPDX= 5.01
$$ ##ORIGIN= Bruker BioSpin GmbH
$$ ##OWNER= she
$$ F:/spectra/data/she/nmr/H-F/1/audita.txt
$$ ##AUDIT TRAIL=  $$ (NUMBER, WHEN, WHO, WHERE, WHAT)
(   1,<2019-07-25 14:38:58.29 +0400>,<she>,<DPX200>,
      <created by zg, POWCHK disabled, PULCHK disabled
       configuration hash MD5:
       00 E9 B6 7A A2 85 ED C7 34 08 36 98 17 FE 4E 26
       data hash MD5: 16K
       2D 1D ED 44 0E FD D6 F1 13 DB 35 CC 92 83 2E A3>)
$$ ##END=
$$ 
$$ hash MD5
$$ CC D8 02 FA 5E D8 B9 46 A1 38 FE 0E BA 8E 9A 6A
##$RELAX= 
##$RELAX= 
##$RELAX= 
##$RELAX= 
##$RELAX= 
##$RELAX= 
$$ Bruker specific parameters
$$ --------------------------
##$DU= <F:/spectra>
##$EXPNO= 1
##$NAME= <H-F>
##$PROCNO= 1
##$TYPE= <nmr>
##$USER= <she>
##$AMP= (0..31)
100 100 100 100 100 100 100 100 100 100 100 100 100 100 100 100 100 100 
100 100 100 100 100 100 100 100 100 100 100 100 100 100 
##$AQSEQ= 0
##$AQ_mod= 1
##$AUNM= <au_zg>
##$AUTOPOS= <>
##$BF1= 200.13
##$BF2= 200.13
##$BF3= 200.13
##$BF4= 200.13
##$BF5= 200.13
##$BF6= 200.13
##$BF7= 200.13
##$BF8= 200.13
##$BYTORDA= 1
##$CFDGTYP= 0
##$CFRGTYP= 5
##$CHEMSTR= <none>
##$CNST= (0..31)
1 1 145 1 1 1 1 1 1 1 1 1 1 1 1 1 1 1 1 1 1 1 1 1 1 1 1 1 1 1 1 1 
##$CPDPRG= <>
##$CPDPRG1= <>
##$CPDPRG2= <>
##$CPDPRG3= <>
##$CPDPRG4= <mlev>
##$CPDPRG5= <mlev>
##$CPDPRG6= <mlev>
##$CPDPRG7= <mlev>
##$CPDPRG8= <mlev>
##$CPDPRGB= <>
##$CPDPRGT= <>
##$D= (0..31)
0 1.2 0 0 0 0 0 0 0 0 0 0.03 0 0 0 0 0 0 0 0 0 0 0 0 0 0 0 0 0 0 0 0 
##$DATE= 1564051137
##$DBL= (0..7)
120 120 120 120 120 120 120 120 
##$DBP= (0..7)
150 150 150 150 150 150 150 150 
##$DBP07= 0
##$DBPNAM0= <>
##$DBPNAM1= <>
##$DBPNAM2= <>
##$DBPNAM3= <>
##$DBPNAM4= <>
##$DBPNAM5= <>
##$DBPNAM6= <>
##$DBPNAM7= <>
##$DBPOAL= (0..7)
0.5 0.5 0.5 0.5 0.5 0.5 0.5 0.5 
##$DBPOFFS= (0..7)
0 0 0 0 0 0 0 0 
##$DE= 6
##$DECBNUC= <off>
##$DECIM= 24
##$DECNUC= <off>
##$DECSTAT= 4
##$DIGMOD= 1
##$DIGTYP= 9
##$DL= (0..7)
0 120 120 120 120 120 120 120 
##$DP= (0..7)
150 150 150 150 150 150 150 150 
##$DP07= 0
##$DPNAME0= <>
##$DPNAME1= <>
##$DPNAME2= <>
##$DPNAME3= <>
##$DPNAME4= <>
##$DPNAME5= <>
##$DPNAME6= <>
##$DPNAME7= <>
##$DPOAL= (0..7)
0.5 0.5 0.5 0.5 0.5 0.5 0.5 0.5 
##$DPOFFS= (0..7)
0 0 0 0 0 0 0 0 
##$DQDMODE= 0
##$DR= 18
##$DS= 0
##$DSLIST= <SSSSSSSSSSSSSSS>
##$DSPFIRM= 0
$$ [...]
##$SUBNAM2= <"">
##$SUBNAM3= <"">
##$SUBNAM4= <"">
##$SUBNAM5= <"">
##$SUBNAM6= <"">
##$SUBNAM7= <"">
##$SUBNAM8= <"">
##$SUBNAM9= <"">
##$SW= 24.9336996594482
##$SWIBOX= (0..15)
0 0 2 0 0 0 0 0 0 0 0 0 0 0 0 0 
##$SW_h= 4990.01996007984
##$TD= 16384
##$TD0= 1
##$TE= 0
##$TE2= 300
##$TE3= 300
##$TEG= 300
##$TL= (0..7)
0 120 120 120 120 120 120 120 
##$TP= (0..7)
150 150 150 150 150 150 150 150 
##$TP07= 0
##$TPNAME0= <>
##$TPNAME1= <>
##$TPNAME2= <>
##$TPNAME3= <>
##$TPNAME4= <>
##$TPNAME5= <>
##$TPNAME6= <>
##$TPNAME7= <>
##$TPOAL= (0..7)
0.5 0.5 0.5 0.5 0.5 0.5 0.5 0.5 
##$TPOFFS= (0..7)
0 0 0 0 0 0 0 0 
##$TUNHIN= 0
##$TUNHOUT= 0
##$TUNXOUT= 0
##$USERA1= <user>
##$USERA2= <user>
##$USERA3= <user>
##$USERA4= <user>
##$USERA5= <user>
##$V9= 5
##$VALIST= <valist>
##$VCLIST= <CCCCCCCCCCCCCCC>
##$VD= 0
##$VDLIST= <DDDDDDDDDDDDDDD>
##$VPLIST= <PPPPPPPPPPPPPPP>
##$VTLIST= <TTTTTTTTTTTTTTT>
##$WBST= 1024
##$WBSW= 4
##$XGAIN= (0..3)
0 0 0 0 
##$XL= 0
##$YL= 0
##$YMAX_a= 172844
##$YMIN_a= -302820
##$ZGOPTNS= <>
##$ZL1= 120
##$ZL2= 120
##$ZL3= 120
##$ZL4= 120
##$ABSF1= 10
##$ABSF2= 0
##$ABSG= 5
##$ABSL= 3
##$ALPHA= 0
##$AQORDER= 0
##$ASSFAC= 0
##$ASSFACI= 0
##$ASSFACX= 0
##$ASSWID= 0
##$AUNMP= <proc_1d>
##$AZFE= 0.1
##$AZFW= 0.1
##$BCFW= 1
##$BC_mod= 2
##$BYTORDP= 1
##$COROFFS= 0
##$CY= 11.3945322036743
##$DATMOD= 1
##$DC= 2
##$DFILT= <>
##$DTYPP= 0
##$F1P= 18.9103706918063
##$F2P= -1.10871071338519
##$FCOR= 0.5
##$FTSIZE= 0
##$FT_mod= 4
##$GAMMA= 1
##$GB= 0.15
##$INTBC= 1
##$INTSCL= 1
##$ISEN= 128
##$LB= 0.24
##$LEV0= 0
##$LPBIN= 0
##$MAXI= 10000
##$MC2= 0
##$MEAN= 0
##$ME_mod= 0
##$MI= 1.114404
##$NCOEF= 0
##$NC_proc= 0
##$NLEV= 6
##$NOISF1= 3.799351
##$NOISF2= 2.8
##$NSP= 1
##$NTH_PI= 0
##$NZP= 0
##$OFFSET= 15.70392
##$PC= 1
##$PHC0= -8863.769
##$PHC1= 15.60097
##$PH_mod= 1
##$PKNL= yes
##$PPARMOD= 0
##$PSCAL= 0
##$PSIGN= 0
##$REVERSE= no
##$SF= 200.130013532006
##$SI= 16384
##$SIGF1= 3
##$SIGF2= 2
##$SINO= 400
##$SIOLD= 16384
##$SREGLST= <1H.CDCl3>
##$SSB= 0
##$STSI= 0
##$STSR= 0
##$SW_p= 3612.71676300578
##$SYMM= 0
##$S_DEV= 0
##$TDeff= 0
##$TDoff= 0
##$TI= <>
##$TILT= no
##$TM1= 0
##$TM2= 0
##$TOPLEV= 0
##$USERP1= <user>
##$USERP2= <user>
##$USERP3= <user>
##$USERP4= <user>
##$USERP5= <user>
##$WDW= 1
##$XDIM= 8192
##$YMAX_p= 0
##$YMIN_p= 0
$$ End of Bruker specific parameters
$$ ---------------------------------
##NTUPLES= NMR FID
##VAR_NAME=  TIME,          FID/REAL,        FID/IMAG
##SYMBOL=    X,             R,               I
##VAR_TYPE=  INDEPENDENT,   DEPENDENT,       DEPENDENT
##VAR_FORM=  AFFN,          ASDF,            ASDF
##VAR_DIM=   8192,          8192,            8192
##UNITS=     SECONDS,       ARBITRARY UNITS, ARBITRARY UNITS
##FACTOR=    0.0002004,     1,               1
##FIRST=     0,             0,               0
##LAST=      1.6414764,     0,               0
##MIN=       0,             -302820,         0
##MAX=       1.6414764,     172844,          0
$$ Real data points
##PAGE= N=1
##DATA TABLE= (X++(R..R)), XYDATA
0 0 0 0 0 0 0 0 0 -8 8 -8 16 -16 23 -24 32 -40 47 -56 64 -75 89 -105 121 -137 160 -184 208 -237 269 -305
30 -305 342 -388 431 -485 542 -602 671 -746 827 -916 1016 -1123 1242 -1377 1525 -1692 1879
47 1879 -2092 2337 -2622 2955 -3354 3841 -4456 5252 -6333 7898 -10367 14877 -25822 110791
61 110791 30896 -211465 -64090 111915 172844 39141 -104618 -93948 63763 62470 -68706
72 -68706 -98422 -919 35152 -8779 -100627 -133706 -27227 82984 -2190 -121084 -86682 956
84 956 16118 -3083 -52352 -76838 -6596 53694 5854 -25840 -2121 -15434 -25083 29067 56461
97 56461 33232 8256 -42485 -57251 55283 141493 54895 -57501 -56461 1808 65988 82299
109 82299 6086 -39184 25587 46865 -23660 -34680 25905 56198 45180 -20112 -103512 -53225
121 -53225 93088 98117 -30746 -89913 -49388 19532 67070 15833 -82675 -59835 42140 51223
133 51223 -8280 -46672 -59741 -13000 62004 29137 -62451 -54868 1502 7530 8065 3445 -31522
146 -31522 -18216 28528 -2266 -48187 -13502 29899 37424 38108 -8348 -63844 -11954 76189 67347
159 67347 16729 -13582 -37147 -1326 78188 62894 -16437 -21263 15456 18572 14134 -7976 -37708
172 -37708 7041 60723 3861 -69616 -46083 2794 23504 22108 -30794 -75103 -18106 38162
184 38162 -4135 -38763 -11297 3048 2768 1252 -30505 -32322 25496 33402 -14057 -9728 11793
197 11793 -9583 -9332 15532 8190 7686 17404 -19455 -32393 28748 43199 -15295 -27762 8526
210 8526 25065 19317 -21047 -62459 1035 97354 49632 -71529 -81058 2284 72947 71485 -23165
223 -23165 -94667 -12802 88900 39983 -50008 -35721 31274 64649 24224 -67141 -65027 64390
235 64390 112910 -117 -84470 -42497 37226 75595 25613 -72411 -65701 41231 59622 -22215
247 -22215 -54056 -23503 6326 20309 -8831 -51629 -21796 23575 -13214 -45262 -1342 25824
259 25824 2028 -18342 -35117 -24321 36565 48640 -17433 -35218 10952 19783 3315 9528
271 9528 12262 18824 25267 -20185 -51991 20198 85621 33666 -42678 -54748 -13603 54640 69315
284 69315 -20708 -80320 -12824 53658 28838 -17864 -37962 -19498 35433 34891 -40017 -52131
296 -52131 21640 43989 -840 -31154 -32460 4017 55712 25092 -59483 -49930 31588 54915
308 54915 20619 -22215 -49880 -12674 55365 41286 -20221 -23341 -3820 -3089 16024 24095 -5017
321 -5017 -9172 6797 -12373 -17237 16520 14784 -11868 -4171 -3216 -20429 -3852 14226 -94
334 -94 540 897 -32572 -27321 29720 34953 -10354 -28229 -22845 -638 41058 29052 -37034 -39944
348 -39944 16987 32915 12593 -3746 -22342 -9530 30054 17328 -22274 -4198 21419 903
360 903 -8853 973 -3299 8051 23301 -7130 -30124 -1671 11462 -189 11093 7058 -26808
373 -26808 -23755 6146 13288 17178 6296 -41707 -42369 27701 48765 -4304 -36387 -24849 6457
386 6457 39769 16713 -44394 -28488 42070 38112 -19320 -33880 -4863 37661 50081 -13930
398 -13930 -68229 -5652 74902 43001 -30859 -46157 -8109 47715 55511 -16991 -58852 771
410 771 47635 15285 -17781 -16586 -1996 20751 12019 -33475 -24984 29733 21297 -29076 -30743
423 -30743 -4878 9010 14929 -8499 -37999 -12288 18836 -8202 -26046 2442 10480 -8994
435 -8994 -18151 -21795 -2632 37114 17877 -48833 -42134 26538 46031 11070 -25876 -36724 7899
448 7899 59206 24300 -40303 -19507 37156 39839 8249 -19743 -16666 37557 63621 -4067 -55067
461 -55067 -3953 55065 44621 -3942 -46470 -33866 38977 59578 -14158 -58932 -21025 18310
473 18310 21627 -1565 -39229 -34633 17293 18986 -31606 -33261 4015 9932 -1806 -15344 -29709
486 -29709 -5136 32683 10791 -28830 -13833 8933 7019 11220 8073 -9473 -620 12017 -4376
499 -4376 1019 29269 10670 -24252 -11078 15123 20968 17874 -8135 -31789 1681 38293 9366
512 9366 -22920 -8950 6603 10432 8911 -14488 -20112 20137 29069 -18536 -32550 1645 21325
525 21325 20713 1370 -33134 -24652 27000 32699 -6463 -18450 -11364 -5888 16059 19895 -12164
538 -12164 -19742 1833 -244 -4449 7496 -5503 -23066 -2871 8187 -11183 -14751 -6071 -6247
551 -6247 6031 7679 -26617 -28169 20334 32877 -2766 -22415 -17040 11071 48661 31619 -30370
564 -30370 -29378 30504 49752 20624 -6716 -16309 9036 44378 21231 -23270 -5808 29192 14539
577 14539 -11938 -16181 -8540 16552 25112 -19869 -47614 -8458 21268 2054 -16645 -23838 -23876
590 -23876 -1197 6948 -19054 -19813 4451 -7275 -27328 -10236 5448 1385 -2646 -16276 -24786
603 -24786 9031 30355 -5748 -29634 -3030 19907 20019 7355 -16906 -11237 33461 36094 -12144
616 -12144 -18513 19468 34699 20388 -6726 -25307 9122 59333 31913 -34778 -33953 15777 44061
629 44061 31584 -15633 -45371 -2507 47457 17428 -32011 -22611 7963 18639 6451 -29548
641 -29548 -38109 11692 36102 -12103 -47001 -24954 3769 13750 -1581 -36951 -35125 9872 14394
654 14394 -23436 -27106 -3490 3473 4088 -3432 -19333 -3343 24417 7502 -12667 10421 25917
667 25917 10310 2635 4432 10742 33021 29867 -8087 -9117 28247 28530 127 -4949 3860 14769
681 14769 20584 -7982 -37880 -6031 35997 13201 -28998 -35358 -16694 11449 19505 -18554 -42868
694 -42868 -7157 16659 -9025 -25743 -13692 -98 13103 5947 -28871 -28814 14338 26585 2090
707 2090 -8652 -9535 -6462 16286 21898 -1832 -4802 9882 5487 5601 18130 3920 -11156 8145
721 8145 20053 6978 1498 -4527 -12367 7526 24272 -539 -18282 -2268 3905 -3064 -1667
734 -1667 -7574 -6727 16328 11422 -27903 -27410 9902 24852 14598 -5440 -30279 -19348 23657
747 23657 27569 -4372 -10683 -3491 -5337 1907 6601 -4290 740 10861 -10154 -22410 1941
760 1941 12034 -1983 -5360 -7242 -10998 3954 8098 -12641 -9748 11662 4476 -8769 695 3579
774 3579 -948 3811 -2288 -8070 16863 26104 -11869 -30724 -3545 23452 30313 11237 -30555
787 -30555 -35679 14340 38570 8698 -14278 -11298 -2399 12072 8968 -15154 -5192 29845 17425
800 17425 -24708 -25651 3556 27962 29882 -6632 -42954 -13598 35699 23884 -14704 -22508 -7413
813 -7413 14794 22171 -10523 -33537 -1678 25224 2800 -14783 -7945 -3327 1351 -231 -15533
826 -15533 -6879 21599 8159 -30658 -25975 5535 18113 13856 -6633 -28766 -10566 18403 5209
839 5209 -10579 8242 14958 -3701 -13824 -9621 8374 36195 24514 -24797 -29117 16671 34682
852 34682 13907 -7566 -16614 2832 31288 11939 -28755 -15571 23438 21539 -4393 -19648
864 -19648 -19354 5632 23077 -5107 -29495 -3628 16860 -852 -17519 -18466 -6660 19426 20794
877 20794 -19081 -33444 -2622 15226 9247 6018 -6109 -15879 -296 8486 -1869 4083 12964
890 12964 -2980 -9737 3568 2278 -944 10296 6804 -4370 2567 2345 -10544 1410 17908
903 17908 4844 -6160 -1059 -4346 -2262 10841 3096 -8612 5274 9408 -9322 -9804 2260
916 2260 2434 8434 11326 -10385 -19783 1465 9561 2813 6032 -257 -14584 -5029 6817 -1139
930 -1139 -590 6353 -6089 -9077 4271 -684 -11116 1038 6389 -2619 -939 -3781 -16425 -4257
944 -4257 16229 4986 -10146 -5023 -3508 -2397 7842 -27 -10555 8575 18587 -5876 -17521
957 -17521 -2744 11266 23036 18266 -15777 -26951 9604 31030 12686 -4249 -8344 -3811 15616
970 15616 15687 -11738 -11450 17530 16395 -7266 -13507 -7793 5011 19334 2277 -26876 -13152 16333
984 16333 6607 -14350 -15862 -8575 6891 14395 -12438 -32295 -5960 15667 1665 -8241 -6191
997 -6191 -7605 -1822 1283 -10222 -1388 22281 7880 -24356 -16598 11126 22777 17088 -5713
1010 -5713 -22606 2074 29201 9155 -13192 2610 17497 11147 -487 -12487 -4000 27854
1022 27854 26322 -17059 -26799 7444 25023 11653 -10968 -25073 -4585 30142 14385 -28751
1034 -28751 -26468 6389 16948 6990 -11673 -25534 -6310 17870 800 -20047 -4675 9412
1046 9412 118 -8669 -14079 -10435 14600 20655 -11691 -25139 -3354 9559 8373 7797 -5729 -13119
1060 -13119 3747 9508 -2568 2671 11463 -885 -5038 5491 4267 4416 12019 1029 -7974 8541
1074 8541 13539 -2382 -2365 5107 980 4614 8241 -6615 -8885 7243 4491 -7957 -1097 2447
1088 2447 -4555 -720 -2589 -14244 -2997 13693 724 -14042 -9356 -5602 206 13383 2341
1101 2341 -18451 -9005 6139 1810 1057 1915 -8141 -4118 9461 -116 -10085 2965 7412 -163
1115 -163 2151 -754 -9326 2970 15828 1745 -7719 750 2028 3480 11413 -51 -12389 3704
1129 3704 14807 1989 -4060 -2820 -4508 7424 17170 -3407 -16387 2410 11654 3283 398
1142 398 -4426 -6050 10309 12768 -11059 -13064 8897 11356 187 -5051 -11980 -5575 13934 6866
1156 6866 -17400 -11277 5787 -500 -7476 -6464 -8504 -1442 6521 -10787 -20410 1870 11405 -5461
1170 -5461 -10267 -4121 -149 8648 6068 -12052 -5453 20020 12943 -9202 -4999 8744 14666 14677
1184 14677 -1489 -14253 8906 29806 6521 -15908 -3937 12788 17289 8383 -13721 -16216
1196 -16216 15354 23696 -8122 -20424 -2567 9131 8515 -4484 -23288 -11305 18493 8627 -23155
1209 -23155 -21024 7 7030 4082 -11258 -24913 -6393 16611 1136 -18502 -7606 3100
1221 3100 2473 2867 -5229 -9902 8424 15465 -5090 -8598 8142 9942 4989 5364 -2525 -1826 14839
1236 14839 11027 -7023 -263 11292 3721 327 3529 -1667 3170 11426 -2056 -11796 5634 11572
1250 11572 -2017 -5150 -3964 -4657 6617 9476 -11325 -14800 4310 5438 -5080 -5297 -7394 -7519
1264 -7519 4691 1551 -15595 -9049 6738 188 -7513 -4857 -7070 -1460 11452 1543 -14289 -2335
1278 -2335 10085 4165 2909 1879 -5867 2456 14995 3726 -5520 4574 6196 546 6118 3562
1292 3562 -5243 3313 9535 -2707 -4164 4823 -656 -2100 6688 -994 -9774 1574 6185 -2387
1306 -2387 -735 -642 -9267 -127 11203 -1977 -11302 -1000 1316 -1240 3518 -2512 -10029 2878
1320 2878 8705 -6649 -7060 5287 1996 -1404 1261 -4827 -3609 10739 4508 -11503 -2707 8572
1334 8572 427 -1843 139 -4789 924 8218 -5774 -11553 5837 8028 -6852 -7156 -1172 731
1348 731 7612 2666 -14642 -6473 16335 9489 -7988 -6103 1514 7365 12658 29 -14166 3965
1362 3965 20633 3496 -10873 -2498 6740 11725 8728 -11631 -15553 11422 18375 -5107 -14208
1375 -14208 -4097 3440 8270 1877 -17020 -11010 12702 7679 -13393 -11818 -1270 2345 5316
1388 5316 -4183 -16805 -2984 12940 -1046 -13618 -3240 2828 2110 2915 -5970 -10278 7382 12565
1402 12565 -5374 -7549 5690 5864 3601 4214 -3914 -77 16160 8467 -9598 -1552 11378 7481
1416 7481 4095 537 -7189 3025 15194 -153 -11939 1290 8604 1201 -2684 -7949 -8719 7967
1430 7967 11989 -10636 -17629 -279 5632 571 -2562 -11154 -9226 7692 5197 -14316 -10010 5413
1444 5413 3406 -1453 -4459 -10671 -1994 13151 2559 -12886 -2490 7786 2827 1781 -273 -5521
1458 -5521 5570 14323 25 -7216 4723 6446 2191 6763 3822 -3249 4111 5981 -4046 1198
1472 1198 10492 1427 -4956 808 -1270 -2218 6903 2303 -8419 -1480 1964 -6114 -1933 5695 -2716
1487 -2716 -6167 -121 -4934 -5511 5400 1357 -8843 -2108 1759 -5643 -1684 3565 -4651 -3951 3878
1502 3878 -1336 -4173 3914 -1004 -7483 4203 8749 -2402 -3583 -261 -2675 5155 11613 -2093
1516 -2093 -8329 4814 5768 -2194 1558 4651 1675 5936 1363 -12025 -1982 17229 8704 -6676
1530 -6676 -6611 -3076 4400 13163 1206 -13869 -1548 11695 584 -7139 -2756 -670 4881 6549
1544 6549 -8859 -13590 5008 9157 -5638 -8254 -2053 -419 4096 -72 -15093 -8365 12399 7340
1558 7340 -9021 -9312 -4703 -59 8601 3186 -10204 -2124 8061 -2665 -6981 4152 7020 4115
1572 4115 2579 -7601 -8118 11718 16023 -2305 -6746 2006 4039 6503 5860 -5274 -2316 13482
1586 13482 6848 -9238 -4311 5587 5164 5010 -987 -10917 -434 11632 -1995 -12773 -1253 6497
1600 6497 2531 -1563 -12096 -13897 6929 14426 -5931 -15254 -5456 -181 2313 2935 -7249 -7727
1614 -7727 6792 3722 -12156 -6589 7087 6511 2563 -3430 -11166 -849 15460 5767 -8030 -332
1628 -332 6392 3006 3364 151 -4348 6867 13700 -1471 -7483 3525 4082 1040 5019 1147 -3310
1643 -3310 3825 1518 -8984 -644 10370 2117 -4907 -3648 -6482 -2178 8788 2853 -8110 -2056
1657 -2056 428 -6504 -1913 4299 -1860 -1436 2050 -6673 -7052 4588 3055 -4331 698 -4 -6216
1672 -6216 410 4731 -3962 -2376 5134 -45 -1810 2762 -2721 -5361 7256 9400 -2239 -3488
1686 -3488 -1329 -3153 5250 10310 -1761 -5790 3917 1646 -4214 2265 5024 1495 4139 -902 -11244
1701 -11244 -1092 13604 6270 -4370 -3532 -3758 976 10151 1592 -9497 550 8070 -1115 -4409
1715 -4409 -1446 -2690 2467 6330 -5438 -10023 2069 2773 -6305 -3574 517 -1526 1309 -1680 -12878
1730 -12878 -5435 10528 5736 -6117 -5665 -4816 -1808 8197 4740 -5995 -367 5166 -3597 -3894
1744 -3894 5505 5701 3614 4151 -5314 -6803 9529 12664 -839 -3224 1665 1967 6090 6007 -5205
1759 -5205 -3179 10738 6937 -5506 -3471 550 1075 6032 537 -9421 -2470 7655 -3333 -11343
1773 -11343 -2440 2804 2160 145 -11892 -15743 3141 12482 -2612 -11082 -6155 -3427 2282 4424
1787 4424 -5285 -6163 6900 3900 -8746 -4135 5665 5790 4911 -284 -9181 -137 13749 4584 -5908
1802 -5908 734 5702 3900 4528 -421 -5258 6838 12673 -835 -5182 3239 3063 942 3596 -880
1817 -880 -1968 6526 1844 -10811 -4311 6735 2722 -2270 -4458 -10313 -5142 6796 258 -9172
1831 -9172 -3231 -243 -5838 -2311 -240 -4175 771 4201 -6168 -7676 3365 3731 -471 2174 -575
1846 -575 -4295 4277 6558 -3121 -1461 6008 2518 701 3796 -1856 -3352 7805 6810 -1940 -176
1861 -176 2076 -1727 2923 5980 -2023 -1878 5275 -421 -5385 971 2250 -486 3061 -887 -9555
1876 -9555 -2173 6696 -611 -4205 -793 -3246 -2265 4007 -1676 -6710 2480 5008 -3996 -3418 800
1891 800 -1488 1748 4926 -3884 -5306 4521 2738 -4668 -739 1574 -953 2572 467 -8603 -2465
1906 -2465 7996 1836 -4363 -751 -1477 -1311 5294 1611 -5427 2332 6710 -2059 -2713 3318 1750
1921 1750 3274 5251 -3288 -5435 6465 7376 -2308 -1447 1784 468 3461 2953 -6850 -3705 8069
1936 8069 3539 -5641 -3347 -1071 -352 4262 -155 -9035 -1367 7011 -2489 -8078 -1760 368 1546
1951 1546 2444 -7205 -10581 3671 8393 -3505 -6967 -2022 -409 2901 3022 -6352 -4341 8193 5107
1966 5107 -5983 -2586 3723 3868 5316 1097 -6640 1747 11577 2617 -5655 677 4550 4152 4699
1981 4699 -1857 -6104 5141 9617 -2318 -5284 2178 1894 885 1604 -4177 -3817 6441 2860 -8697
1996 -8697 -4263 2952 795 -183 -2334 -8429 -3237 6150 -671 -8763 -2554 702 -2862 -877 -2073
2011 -2073 -6025 1088 5408 -4442 -6021 2740 3095 535 2333 -1692 -2817 6555 7456 -2649 -1015
2026 -1015 5188 2781 3460 4859 -2024 -1469 7686 4887 -2788 1068 3132 -206 2516 2159 -4419 -743
2042 -743 6426 -701 -6243 -289 670 -1226 1872 -2530 -7974 -583 4832 -3512 -4934 -350 -2192
2057 -2192 -2222 1740 -3994 -5786 3187 2895 -5639 -2912 1517 -654 1484 2085 -4734 -2807 6259 2311
2073 2311 -3891 813 2316 350 3965 2189 -4301 1004 7137 220 -2741 2399 1535 372 4435
2088 4435 -317 -4416 3690 6059 -2313 -2427 1939 34 2052 4208 -3639 -4645 4758 3866 -3770
2103 -3770 -1444 420 -1506 2114 1595 -6994 -3138 5728 455 -5759 -2020 -1315 -868 3404 -1626 -8686
2119 -8686 -824 5530 -1632 -5178 -1405 -1349 1107 3677 -4148 -6696 3774 6061 -2522 -3204 920
2134 920 944 4428 3357 -5281 -2733 8575 5353 -3428 -1001 2372 2487 5438 1781 -5341 992 9182
2150 9182 1386 -4557 605 2268 2515 3766 -2964 -6334 3727 6630 -3388 -4995 -93 -168 670
2165 670 1268 -5645 -4995 4409 1821 -7056 -3718 865 -955 478 -1047 -7588 -2197 5810 -308 -6481
2181 -6481 -821 1214 -87 2383 -959 -5519 2410 6603 -1425 -3345 2588 2016 1412 3818 -1208
2196 -1208 -2482 6133 5849 -3142 -1549 3876 2266 3337 3010 -4330 -2448 6887 3758 -3431 -743
2211 -743 1329 -827 2355 804 -5319 169 5822 -1946 -5758 20 844 -278 1747 -3272 -7632
2226 -7632 1239 4312 -3853 -5058 92 -1394 -392 1689 -4667 -5280 3459 2513 -4084 -1278 1658
2241 1658 -1551 1071 1946 -3401 -450 6485 519 -4621 1169 2878 1495 4547 1113 -4768 1424
2256 1424 6533 195 -795 3389 317 -618 3538 -170 -2361 4797 4115 -4014 -1867 1908 -238 1154
2272 1154 2437 -4500 -3832 4274 1246 -4764 -1307 -20 -2042 1909 290 -6734 -2833 3930 -586
2287 -586 -3729 -298 -1374 -1966 1852 -1303 -5408 2037 5484 -3224 -4862 -148 526 2629 4439 -3898
2303 -3898 -6169 3528 4346 -1114 -410 1404 -547 2384 2943 -3623 -812 7192 2952 -2835 503 1865
2319 1865 1611 5154 1567 -3962 1846 6920 -74 -2933 1364 1336 1677 3730 -2525 -6287 1753 4216
2335 4216 -3184 -2487 332 -2555 -1490 -238 -5548 -3453 4193 -177 -7477 -4167 -452 -625 1660
2350 1660 -247 -6394 -2211 4750 -540 -3830 1382 1613 527 2665 -525 -4035 3701 7143 -195
2365 -195 -1209 2831 1566 2415 4714 -406 -974 6828 4830 -3771 -1415 2960 2016 3993 2360 -5550
2381 -5550 -3550 4671 1472 -3185 -164 -459 -2855 -8 -1574 -5976 32 4606 -3051 -6087 -1104
2396 -1104 -914 -195 2073 -2969 -6032 1787 3327 -4143 -3061 1317 -21 1192 1435 -4517 -3917 4457
2412 4457 2695 -2469 365 1542 -1306 1489 1621 -1972 2818 7054 -334 -4799 1433 3499 3013
2427 3013 4803 238 -4643 1681 5492 -113 -551 2924 -617 -921 1716 -2141 -2482 4123 2480 -5014
2443 -5014 -2550 497 -1538 303 435 -4814 -2590 4007 -822 -6298 -1881 252 -591 2429 -589
2458 -589 -6699 -2138 3999 -171 -1495 1792 -564 -2461 1211 -960 -2554 5224 4826 -3288 -3779 1061
2474 1061 1589 4065 4667 -3002 -4254 3856 3923 -1287 901 2019 -790 1670 1721 -3740 -714 5434
2490 5434 836 -3453 770 713 -808 2084 -521 -3975 2620 5012 -2865 -4434 174 413 1988 3728
2506 3728 -3086 -5984 956 2092 -2583 -341 1594 -2580 -2071 -898 -4275 -658 5492 -120 -6577
2521 -6577 -3039 -47 23 2947 332 -5487 -1543 4152 -755 -2143 2264 1404 1040 3341 -225 -3155
2537 -3155 3644 5615 -786 -194 3175 784 1439 2904 -1334 -935 6331 3945 -4028 -1906 252 709
2553 709 4101 2516 -5379 -3987 2658 -87 -2651 816 -713 -2656 204 -2322 -5738 956 4463
2568 4463 -2973 -5114 -1605 -2053 309 2674 -2772 -4980 1775 2503 -2965 -1737 1497 -436 2200
2583 2200 2703 -3333 -2154 5048 2290 -1835 1780 2193 -149 2100 810 -2803 2804 7212 -97
2598 -97 -3644 632 875 1946 4787 -209 -4311 1773 3584 -2094 -1173 2433 -227 -84 622 -4149
2614 -4149 -3754 4258 2303 -4286 -2712 -636 -2086 271 111 -5307 -2439 3921 -977 -5340 -1630
2629 -1630 -285 -227 2723 -555 -5887 -644 4181 -968 -1585 2076 261 -215 2507 -1186 -2490 5189
2645 5189 4905 -1963 -1289 1546 770 3375 4016 -2110 -2042 4757 1996 -2316 1036 1861 -56 2079 765
2662 765 -4221 -144 4605 -976 -3122 556 -554 -1850 1106 -1917 -4328 2029 2860 -4174 -3964 -120
2678 -120 -668 601 2019 -3752 -4738 1602 1333 -3021 -340 1253 -1776 229 456 -3903 -360 5490
2694 5490 304 -3512 46 899 445 3297 650 -3729 1212 5203 -504 -1529 1922 769 1194 4084
2710 4084 -32 -2777 3128 3871 -1212 57 2134 -163 910 2000 -3195 -1521 5031 1828 -3523
2725 -3523 -1333 -438 -1212 2473 1237 -5015 -2499 2475 -1016 -3165 302 -1011 -2153 654 -1764
2740 -1764 -4987 1111 3351 -3081 -3276 95 -1084 606 2768 -2386 -3439 3328 2903 -2111 -284
2755 -284 1600 200 2663 3117 -2272 -495 5000 1631 -1730 1949 1907 612 2919 752 -3075 2186
2771 2186 5748 -141 -2455 820 -205 611 3204 -1244 -4315 1278 2176 -3192 -1618 884 -1713
2786 -1713 -241 611 -4261 -3422 3144 658 -4490 -1792 -700 -1529 1341 122 -5054 -1555 4021 -345
2802 -345 -3141 362 170 -545 3125 -199 -3581 2006 4068 -1251 -1417 2000 493 1502 3386 -1711
2818 -1711 -2415 4754 4006 -1730 -219 1565 -104 2616 2743 -2835 -1081 4554 816 -2907 562 1079
2834 1079 -374 1600 -434 -4138 332 4010 -1633 -3418 17 -750 -695 1423 -2208 -4138 1463 1927
2850 1927 -3870 -2720 654 -1227 -466 753 -3516 -2549 3270 870 -3716 -286 1017 -646 1630
2865 1630 744 -3170 173 4741 36 -2269 1786 1444 114 2829 605 -2286 2547 4553 -1048
2880 -1048 -1123 2695 760 1308 2770 -1301 -2172 3215 2574 -2286 -361 989 -1473 476 1542 -3378
2896 -3378 -1807 2908 -472 -3570 -195 -425 -1937 1190 -99 -4426 -912 2566 -1778 -2794 545
2911 545 -1299 -1484 1811 -1200 -3591 1431 2254 -2260 -1275 1614 -1036 558 2291 -1833 -1956 3576
2927 3576 1875 -1921 895 1615 100 2914 2657 -2346 121 4553 1179 -1388 1854 1022 110 2637
2943 2637 428 -3202 1313 3674 -1296 -1927 621 -850 34 2066 -2651 -4372 1501 1479 -3064 -1864
2959 -1864 -376 -2189 34 807 -3995 -3255 2477 4 -3637 -955 -390 -1013 1630 226 -4432 -403
2975 -403 4107 -131 -1886 924 -44 712 3789 399 -2765 2724 4103 -659 -185 2381 709 1645
2991 1645 2944 -1866 -1701 4327 2964 -2019 -334 869 -375 2131 1602 -3632 -986 3525 125
3006 125 -2740 371 -130 -1066 1454 -510 -4229 341 3139 -2557 -3092 287 -379 -427 1470 -2876 -4149
3023 -4149 2240 2616 -2977 -1675 595 -1138 828 1652 -2611 -1525 3552 728 -3059 465 1893
3038 1893 127 1951 492 -3176 783 5111 342 -1685 1751 1336 532 3128 182 -2152 2600
3053 2600 3289 -1529 -1221 1789 -94 554 1844 -1947 -2190 2976 1218 -3127 -829 653 -1324 416
3069 416 213 -3838 -2094 2872 -1038 -3413 -549 -876 -2073 1291 -203 -3425 347 2391 -1963 -2175
3085 -2175 1333 -287 -363 1955 -1362 -2598 2627 2692 -1883 364 2025 -544 829 2602 -1519 -943
3101 -943 3867 1265 -1389 999 1102 -651 2324 1854 -1981 281 3406 -750 -1234 1772 526 -367
3117 -367 2259 -644 -3331 1284 2640 -1737 -1275 577 -1652 -533 1859 -2667 -3467 1659 786 -3516
3133 -3516 -1380 -526 -2237 934 1170 -3599 -2583 2584 -161 -2257 428 74 -983 2152 57 -3919
3149 -3919 739 4428 462 -1280 1064 -523 863 4279 647 -2453 2372 3089 -992 430 1901
3164 1901 -60 1807 2527 -2452 -1583 3675 1649 -2095 -265 -18 -1497 1620 655 -4098 -1286 2909
3180 2909 -1022 -3058 -643 -1515 -1605 1768 -873 -4059 38 1787 -2766 -2380 1018 -623 404 1116
3196 1116 -3472 -3241 3225 3050 -2095 -1121 437 -864 1924 2076 -2418 -559 3729 659 -2224 1081
3212 1081 1898 818 2619 115 -3039 1541 4699 -119 -1494 1316 780 894 2616 -1217 -2883 2420
3228 2420 3023 -1672 -1373 273 -1220 236 1619 -1912 -2215 1799 -592 -3962 -662 952 -1034 532
3244 532 -762 -4510 -1385 3122 -349 -2401 -123 -847 -1927 1618 110 -2113 1416 1926 -2540 -1046
3260 -1046 2380 407 621 2138 -672 -1499 3041 1772 -1507 847 2326 -5 1438 1699 -1935 -123
3276 -123 3876 1519 -1477 1190 408 -1304 1727 1582 -1700 439 2189 -2176 -1989 830 57 -513
3292 -513 1387 -1989 -4031 758 2108 -1542 -931 -275 -2328 -806 1323 -1995 -2413 1725 571 -2707
3308 -2707 -507 -96 -1787 1236 1392 -2692 -770 2706 -272 -1053 1219 507 -124 2529 353 -2907
3324 -2907 1305 3654 396 -98 1218 -1178 320 3618 218 -1317 2227 1630 -1723 -27 1364
3339 1364 -152 1839 1511 -2734 -2107 2605 697 -1787 -36 -536 -1166 932 -367 -3810 -831 2302
3355 2302 -1419 -2685 -612 -1661 -878 1544 -952 -3117 637 1408 -2324 -1764 933 13 844 1378
3371 1378 -2732 -2480 3486 2624 -1508 30 583 -637 2132 2066 -1655 317 3881 354 -1842 955
3387 955 1216 806 2976 613 -2748 1039 3432 -530 -1280 963 -45 624 1667 -1963 -2945 1828
3403 1828 2025 -2053 -1546 -230 -1566 -8 1022 -2592 -2118 1739 -703 -3273 -354 296 -673 808
3419 808 -688 -3897 -199 2666 -796 -1810 590 -123 -564 1646 -462 -1675 1970 2150 -1896 -920
3435 -920 2034 61 940 2135 -1119 -390 3366 1202 -1824 1002 2054 540 1414 1108 -2367 8
3451 8 3376 342 -1479 980 -304 -1288 959 -53 -1897 903 1708 -2193 -2318 685 -375 -559 950
3468 950 -2316 -3399 861 974 -2272 -620 -20 -1785 -92 1192 -1950 -1735 1815 230 -1674 757
3484 757 267 -1106 1750 1627 -1851 361 2843 -43 -687 1518 496 751 3126 625 -1997 924
3500 924 2579 -105 335 1385 -1069 94 2207 -219 -904 2127 400 -1996 -157 371 -970 773
3516 773 1127 -2860 -1720 2095 -382 -2222 9 -997 -1423 825 -312 -3275 -363 1690 -1603 -1652
3532 -1652 219 -1003 -630 1712 -921 -2538 1726 1754 -1914 -546 468 -165 1794 1963 -2286 -1848
3548 -1848 3219 2103 -732 724 228 24 2494 1530 -1849 339 3823 419 -1078 596 -169 423
3564 423 2565 -373 -3096 798 2378 -737 -1086 120 -1174 505 1219 -2211 -2811 1582 779 -2390
3580 -2390 -1305 -386 -1378 442 -138 -3280 -1164 2382 -566 -2329 -66 192 -601 1101 -179 -2656
3596 -2656 673 2536 -964 -1034 1131 166 265 1608 -683 -1192 2734 2482 -1177 -134 1574 520 1124
3613 1124 1298 -1140 -510 3199 767 -1770 634 1059 -23 1005 538 -2431 62 2429 -424 -1897
3629 -1897 421 -379 -864 779 -627 -2942 433 1242 -1969 -1456 215 -1266 -260 1062 -1869 -2361
3645 -2361 1261 580 -1852 -22 228 -1001 535 1056 -1952 -766 2313 110 -1181 1128 359 -537
3661 -537 1863 1095 -1381 1042 2634 -128 -264 1837 537 89 1847 256 -1257 1711 1870 -779
3677 -779 312 717 -930 103 1593 -1571 -1115 1326 6 -2262 -446 118 -1273 425 341 -2959
3693 -2959 -904 1504 -844 -1841 -23 -893 -936 1186 -475 -2730 340 1700 -999 -878 497 -693
3709 -693 284 1639 -841 -1600 2018 1848 -1236 233 556 -76 1981 1993 -1473 -874 2465 1473 -554
3726 -554 671 209 -452 2268 920 -2242 121 2482 -3 -788 581 -474 -382 1944 -728 -2585
3742 -2585 559 1429 -1358 -925 -300 -1395 30 555 -2317 -2384 995 104 -2244 -537 -370 -979 553
3759 553 106 -2492 -552 2298 -570 -1600 538 226 183 1466 -193 -2238 986 2517 -607 -759
3775 -759 1212 411 676 1732 -967 -896 2676 2282 -1237 -161 1461 253 1464 1307 -1849 -700 2558
3792 2558 413 -1607 -66 57 -327 1075 -238 -2722 -229 1593 -833 -1624 -3 -758 -759 960 -1236
3809 -1236 -2694 694 1024 -1830 -938 -8 -1043 79 1360 -1535 -1541 1561 661 -1035 132 570 -849
3826 -849 902 1337 -1219 240 2290 233 -727 1507 855 -359 1755 668 -965 1335 2082 -557
3842 -557 -254 1477 70 147 1511 -639 -1627 1501 734 -1410 -77 843 -907 105 733 -1784 -1460
3859 -1460 1598 -213 -2061 -179 -275 -1446 484 153 -2334 -567 1354 -1146 -1498 389 -578 -383
3875 -383 1337 -643 -1873 667 1956 -839 -136 861 -710 566 1790 -556 -1077 1868 1388 -503
3891 -503 580 581 -276 1764 2027 -1188 -314 2052 605 -156 711 -56 -575 1483 387 -2058 137 1437
3909 1437 -914 -827 141 -931 -440 1066 -1132 -2325 686 669 -1926 -934 -237 -1358 191 1115 -2084
3926 -2084 -1589 1320 180 -1659 -12 43 -480 983 353 -1908 177 2342 -212 -1201 486 422 365
3943 365 2036 -204 -1705 1594 2498 -463 202 1372 425 1060 1639 -871 -949 2282 1533 -914 -296
3960 -296 635 -666 478 945 -2209 -277 2309 -101 -1731 -229 -711 -879 1268 -239 -2714 -504
3976 -504 1080 -1326 -1217 435 -820 -668 600 -1205 -2082 941 1086 -1765 -725 398 -801 484
3992 484 1388 -1233 -802 1860 390 -1133 893 768 -60 1519 917 -1283 848 2231 -108 -491 1572
4009 1572 619 91 1339 29 -1219 1794 1987 -1073 -877 678 -306 118 1140 -1189 -1582 1091 251
4026 251 -2108 -79 145 -1175 -295 -109 -2095 -647 1444 -658 -1672 -480 -694 -847 716 -269 -2018
4043 -2018 -171 1199 -827 -916 642 -592 97 1836 -55 -1425 1138 1012 -435 730 1105 -762
4059 -762 702 1718 -496 -623 1988 1147 -454 504 395 -481 1258 1671 -1435 -690 1696 -434 -561
4076 -561 832 -218 -634 1110 -464 -1964 427 855 -1120 -558 -79 -1134 -766 627 -1472 -1928 1008
4093 1008 372 -1543 -861 37 -853 596 766 -1904 -949 1413 -136 -1140 404 224 -484 951 474
4110 474 -1778 645 2569 7 -874 539 33 314 2000 38 -1231 1495 1617 -794 90 760 -301
4127 -301 978 1932 -1241 -1255 1451 717 -698 -198 160 -918 345 302 -2041 -647 1660 -662 -1669
4144 -1669 -126 -840 -1044 1419 -379 -2493 -370 561 -1165 -1095 745 -864 -214 687 -1063 -1425 1042
4161 1042 977 -1389 247 432 -468 886 1178 -934 -374 2193 479 -1215 1016 592 -140 1654 585
4178 585 -1056 640 1987 -337 -365 1598 285 -329 1191 -872 -1385 1572 1144 -1466 -1082 386 -866
4195 -866 -45 866 -1623 -1567 1033 -260 -1789 -89 -31 -1525 19 47 -2252 -812 1234 -745 -1429
4212 -1429 309 -453 -909 1103 189 -1663 147 1276 -448 -153 879 -439 491 2183 50 -732
4228 -732 1109 888 -404 1241 1027 -386 730 1553 -1071 -245 2165 793 -885 586 -164 -983 1027
4245 1027 501 -1539 -74 1068 -968 -982 490 -704 -952 808 -857 -1874 495 789 -1365 -684
4261 -684 288 -1150 -457 885 -1273 -1419 1157 649 -1444 92 241 -882 699 1236 -1471 -338 1756
4278 1756 261 -487 736 447 -139 1592 410 -1649 862 2258 76 2 691 -437 351 2077 -134
4295 -134 -1239 1412 1240 -1100 263 718 -808 383 1272 -1174 -988 1106 405 -970 159 -124 -1065
4312 -1065 566 192 -2300 -487 1165 -758 -1197 403 -896 -831 974 -487 -1817 380 946 -1189
4328 -1189 -267 542 -342 110 996 -978 -1134 1695 850 -940 485 835 -303 959 1273 -1119 97
4345 97 2141 156 -846 1104 420 70 1627 489 -1493 751 1764 -890 -666 538 -432 -414 1277
4362 1277 -803 -1610 1125 754 -1498 -634 149 -1220 -45 491 -1593 -1119 642 -65 -1312 -129 -367
4379 -367 -1166 585 239 -1549 -371 1368 -421 -846 764 -104 -463 1090 -187 -1092 1076 1145 -704
4396 -704 105 1499 -196 261 1834 -178 -565 1600 615 -777 1168 1018 -639 711 977 -1219 -63
4413 -63 1869 -488 -1185 600 -247 -909 987 165 -1573 25 950 -1241 -1003 600 -1006 -731 736
4430 736 -1031 -1949 398 748 -1341 -651 231 -1037 -297 926 -1701 -1046 1314 364 -833 336 310
4447 310 -273 1265 852 -1158 -245 1729 179 -344 1089 -22 171 1577 312 -1150 721 1725
4463 1725 -330 0 907 -458 174 1919 -593 -1002 1018 333 -1007 201 64 -1055 388 582 -1552
4480 -1552 -1035 1062 -577 -1355 108 -526 -1278 442 37 -1934 -232 906 -943 -1146 423 -518 -620
4497 -620 1188 -240 -1569 855 1055 -1360 -30 772 -156 465 1245 -883 -585 1747 768 -764 692
4514 692 568 -81 1181 703 -1284 102 1757 -124 -810 656 225 -135 946 4 -1493 774 886
4531 886 -1055 -564 101 -567 -136 917 -1308 -1715 607 237 -1085 -254 -36 -1221 267 326 -1581 -1237
4549 -1237 1008 -251 -1341 356 -49 -847 815 408 -1321 509 1286 -350 -162 1066 -90 -70 1333
4566 1333 175 -514 1409 1415 -614 557 1316 -378 640 1238 -306 -577 1389 486 -882 719 493
4583 493 -833 329 422 -1462 -468 1107 -525 -1212 0 -568 -723 375 -140 -1661 -54 551 -907
4600 -907 -876 339 -974 -151 984 -884 -1222 805 487 -1040 -10 318 -911 660 843 -1080 -775
4617 -775 1340 436 -673 1054 521 -411 1604 1056 -991 650 1453 74 -250 1007 -127 -11 1722
4634 1722 69 -1108 454 865 -719 -172 515 -988 93 972 -549 -1214 864 52 -1067 49
4650 49 -172 -1114 351 234 -1363 -654 1270 -673 -1137 226 -425 -515 803 -41 -1717 299 1061 -686
4668 -686 -373 648 -524 260 1235 -381 -1010 1173 845 -698 180 651 -314 554 1249 -760 -5 1618
4686 1618 500 -682 640 381 -237 1221 635 -873 228 1300 202 -666 617 -583 -712 840
4702 840 -418 -1458 405 638 -925 -508 507 -961 -271 639 -1229 -1235 676 109 -1016 -27 -255 -808
4720 -808 136 344 -1292 -644 1352 -143 -748 681 57 -256 830 386 -877 565 1336 -630 45
4737 45 872 7 214 1311 37 -792 1440 1038 -545 364 717 -487 548 777 -775 -441 1141 -150
4755 -150 -1069 330 -58 -576 413 44 -1674 -243 622 -523 -848 131 -757 -855 568 -350 -1616 217
4773 217 662 -830 -467 250 -711 -154 726 -467 -949 616 500 -468 281 186 -282 724 1149 -683 -22
4792 -22 1395 424 95 958 -86 -340 1207 715 -899 702 987 -636 117 601 -354 -138 1227 -375
4810 -375 -1298 483 407 -589 -239 324 -938 92 508 -1156 -883 645 -396 -987 -20 -559 -1121 451
4828 451 200 -1382 -369 644 -607 -817 464 -75 0 1055 -197 -1408 535 917 -527 39 533
4845 533 -324 282 1192 -126 -366 1090 578 -445 352 562 -43 675 1106 -780 -194 1233 280 -220
4863 -220 648 -70 -595 951 69 -1403 -123 874 -803 -515 577 -586 -711 897 -403 -1162 551
4880 551 319 -1082 -110 136 -724 90 423 -877 -916 972 114 -844 326 120 -604 388 455 -762 -23
4899 -23 1037 -344 -182 753 101 -26 1016 604 -656 855 963 -509 143 806 103 298 946 -382
4917 -382 -487 1152 570 -407 172 223 -708 225 708 -711 -371 937 -579 -986 385 -108 -856 272
4935 272 -255 -1516 -50 714 -486 -599 401 -726 -478 591 -775 -1160 344 397 -780 -177 321
4952 321 -481 -68 1174 -377 -537 891 262 -506 440 482 -4 783 1109 -781 214 864 154 -132 839
4971 839 -396 3 722 360 -259 560 719 -671 -43 593 -439 101 750 -648 -1111 387 -29 -852
4989 -852 162 -70 -786 219 198 -961 -656 342 -292 -623 262 -454 -935 506 178 -1171 -15 740
5007 740 -340 -626 471 -219 -62 1105 -160 -874 316 1058 -267 119 573 -242 478 954 -277 -351
5025 -351 1415 512 -528 238 269 -170 670 371 -739 56 950 -69 -357 268 -138 -419 521 -131 -1050
5044 -1050 -32 196 -544 -597 -40 -690 -424 305 -586 -1226 637 158 -1105 -172 133 -512 161 634 -929
5063 -929 -721 1302 451 -728 526 151 -385 796 420 -718 329 1165 18 -221 666 206 68 798
5081 798 77 -596 716 771 -309 -160 750 -428 245 547 -419 -585 651 257 -643 271 -28 -536 106
5100 106 285 -897 -325 452 -547 -706 75 -868 -790 514 -81 -1103 -51 823 -798 -326 379 -646
5118 -646 -201 686 -385 -741 514 368 -439 238 438 -432 394 841 -486 57 849 135 -398 756 368
5137 368 -177 721 767 -392 366 433 -274 0 901 -5 -286 721 34 -730 463 485 -533 -197 183 -586
5157 -586 -183 534 -762 -880 512 -249 -665 -138 -180 -743 181 462 -1260 -623 532 -125 -356 78 -176
5176 -176 -772 542 383 -954 57 674 -220 22 334 -164 149 710 244 -955 918 956 148 313 155
5195 155 -205 453 995 -323 -231 974 87 -286 486 103 -158 539 570 -1101 -308 413 -345 -621 119 -471
5215 -471 -635 556 -336 -1269 190 314 -855 -608 -120 -487 -222 358 -528 -856 661 173 -553 -97 203
5234 203 -219 459 231 -567 -152 1198 319 -634 340 63 -173 966 450 -714 696 1059 -312 -27
5252 -27 832 -150 261 1039 -33 -520 556 687 -401 -235 302 -128 207 450 -701 -678 717 81 -878
5271 -878 85 -157 -429 -92 -179 -1229 -425 716 -664 -847 36 -493 -582 578 -307 -978 280 489 -484
5290 -484 -168 501 -107 -106 543 -167 -165 759 477 -237 355 695 -131 563 901 -206 -122 986 131 -421 671
5311 671 132 -74 722 196 -724 213 563 -219 -308 331 -319 -453 334 -439 -704 586 87 -507 -103 -43
5331 -43 -431 -258 369 -778 -684 255 -354 -684 220 -208 -710 91 -46 -858 -68 636 -106 -322 371 -137
5351 -137 -125 765 164 -380 210 926 -10 214 444 -278 -5 938 -107 -668 597 615 -68 256 266 -282
5371 -282 564 765 -1029 -515 908 62 -588 121 -111 -634 275 227 -768 -378 42 -486 -673 -279 -676 -487
5391 -487 314 -573 -984 265 225 -668 -198 256 -687 219 873 -326 -570 962 564 -83 297 429 -175
5410 -175 788 539 -636 115 1047 240 140 364 99 -216 782 420 -760 188 834 -192 102 352 -158
5429 -158 -20 471 -289 -845 346 325 -813 -170 -38 -570 -302 433 -937 -667 637 -384 -522 310 -228
5448 -228 -406 445 294 -732 -162 623 -205 -572 213 -297 -188 586 -217 -802 354 566 -406 91 875
5467 875 -116 372 1041 -21 -225 877 285 -357 335 287 -328 676 507 -469 0 824 -4 -98 414 -112
5487 -112 -246 189 65 -464 148 307 -571 -269 9 -138 -281 309 -84 -1067 248 191 -723 -397 -42 -662
5507 -662 -118 56 -818 -356 291 -450 -406 311 4 -255 538 452 -396 -130 930 12 -109 569 -247 -212 688
5528 688 248 -590 411 509 -135 196 295 -417 86 757 -250 -393 323 305 -122 147 483 -247 133 455
5548 455 -476 -506 512 -214 -252 472 -377 -245 353 435 -1138 157 409 -420 -302 248 -353 -261 760 -315
5568 -315 -705 202 -123 -229 186 86 -419 282 590 -513 -368 763 -13 -499 268 278 -296 525 445 -478
5588 -478 88 805 50 -179 392 -306 199 811 148 -527 309 445 -405 -129 140 -604 -122 618 -811 -652
5608 -652 379 492 -520 -115 -217 -551 116 307 -1107 -487 372 -343 -540 170 27 -955 508 20 -1140
5627 -1140 140 491 -569 -477 236 -6 25 591 -293 -691 758 480 4 346 549 -188 109 785 -522
5646 -522 -100 789 211 -161 599 216 -5 393 445 -615 160 658 -248 -131 152 -198 -123 613 -226 -835
5666 -835 94 402 -534 -262 63 -25 -532 349 -696 -700 291 -110 -668 253 -68 -475 103 123 -560 -158 356
5687 356 -236 -452 436 13 -356 800 179 -619 157 629 -120 -161 885 -214 -153 722 -112 -150 454 598
5707 598 -310 226 230 -540 189 576 -589 -293 756 -150 -474 530 294 -512 212 -12 -822 -228 424 -263
5727 -263 -200 187 -400 -451 614 -228 -744 -97 -15 -330 -406 81 -630 -193 530 -31 -455 417 86 -481 338
5748 338 299 -329 384 661 -351 -306 724 117 -46 823 140 93 629 583 -408 40 738 -188 -35 357 -317
5769 -317 -107 716 -69 -887 458 307 -302 -119 -177 -582 164 267 -536 -894 236 -95 -696 -234 -73 -650
5789 -650 157 -174 -466 -288 406 -255 -389 187 -126 -91 333 -97 -577 227 142 -39 -34 321 -243 349 433 -601
5811 -601 -422 597 633 -227 399 302 -5 531 565 -116 -159 1056 221 -275 234 27 -242 250 -164 -589 57
5832 57 645 60 -499 -33 -616 -181 157 -282 -749 -92 54 -880 -387 56 -452 -167 205 -279 -320 459 499
5853 499 -434 62 185 -331 343 393 -494 -114 757 -3 -59 556 124 -12 625 206 -254 405 665 -16 219
5874 219 610 -150 -267 850 39 -485 388 194 -411 179 116 -602 205 296 -362 -96 232 -95 -370 153
5894 153 -324 -400 20 128 -548 -208 384 -282 -520 221 134 -253 665 -263 -658 223 202 -488 89 394 -253
5915 -253 157 729 -242 -324 394 465 131 564 383 -229 522 507 -269 62 774 -76 -213 559 -153 -379 563
5936 563 257 -433 -152 409 -535 -285 422 -499 -89 266 -171 -746 270 -22 -244 -72 -145 -678 -308 318
5956 318 -647 -451 127 -217 -291 204 -129 -112 324 103 -888 -88 567 -151 -43 296 -7 -197 685 10 -360
5977 -360 590 756 -100 -194 228 -210 363 621 102 -446 326 267 -146 97 -65 -344 269 446 -440 -296 583
5998 583 193 -580 51 -59 -523 194 -5 -736 115 389 -244 -281 -7 -160 -260 92 -57 -860 19 416
6018 416 -559 -194 -52 -305 291 219 -247 -408 544 46 -547 274 390 -535 116 329 -195 210 786 -288
6038 -288 -136 284 0 112 468 189 -663 347 236 -309 30 438 -137 80 480 -81 -356 614 303 -311
6058 -311 -107 -96 -422 -68 149 -605 -238 450 -250 -282 205 -77 -648 73 86 -773 109 430 -187 -6 55
6079 55 -254 70 556 -143 -423 232 243 -281 190 313 -481 226 120 -368 -28 210 32 -153 585 127 -538
6100 -538 70 507 -254 216 354 -238 190 344 -149 -311 238 232 -535 100 228 32 -47 123 -412 -294 635
6121 635 -137 -437 206 -1 -438 -19 80 -439 -171 146 -875 -420 174 47 -305 186 -194 -391 437 155
6141 155 -434 443 679 76 -43 269 213 -46 508 397 -384 234 612 221 -17 302 -313 193 363 -170
6161 -170 -398 458 186 -336 314 148 -92 312 375 -416 -259 348 24 -284 218 -141 -11 -73 -42 -668 165
6182 165 284 -421 -74 -156 -472 -308 413 -498 -754 247 181 -248 165 147 -227 192 461 -339 -220 338 232
6203 232 -119 150 467 -280 705 273 -265 236 643 -181 22 335 211 86 284 118 -446 334 241 -91
6223 -91 -97 51 -524 -167 428 -513 -420 299 -299 -450 -169 108 -384 39 143 -487 100 416 -350 -580 141
6244 141 -255 -533 35 83 -578 124 304 -586 -103 388 -200 -124 67 -148 -406 455 416 -231 262 483 -162
6265 -162 302 369 65 163 504 286 -89 534 242 -134 257 333 -109 298 493 -243 -217 459 -348 -258 407 8
6287 8 -367 176 129 -803 -61 -3 -384 -319 561 -91 -222 134 -47 -498 104 -330 -565 66 4 -259 -151 46
6309 46 -195 -299 300 -12 -86 557 112 -107 170 675 249 -190 380 69 42 346 123 -560 145 221 -27
6330 -27 3 176 -177 165 92 -240 -570 161 -84 -341 51 -109 -722 188 469 -715 -333 245 -373 -187 -95
6351 -95 -333 -452 55 -257 -655 -167 -72 -105 -82 243 -120 126 281 -233 -462 493 -162 -134 353 235 -105 -15
6373 -15 458 -329 -129 442 214 83 334 147 -38 723 263 -354 153 473 165 -17 292 -240 -45 224
6393 224 -96 -365 195 237 -536 -369 -93 -340 307 79 -626 -367 199 31 -413 -20 -156 -382 -150 -32
6413 -32 -350 -87 171 -428 -213 358 -156 -245 269 152 -211 370 495 -216 12 375 320 262 642 -37 -213
6434 -213 389 202 -306 120 454 -284 369 469 -184 -1 245 159 -339 50 193 -346 313 117 -620 15
6454 15 379 -374 -392 265 -135 -321 -15 -327 -419 28 52 -411 -427 202 -313 -98 238 -454 -135 273 44 -270
6476 -270 134 452 -251 225 773 -209 185 355 -168 -71 355 101 -209 578 123 -382 155 326 122 -72
6496 -72 518 -89 329 420 -94 -320 388 118 -416 178 -2 -469 -61 315 -428 -321 84 137 -488 24 20 -328
6518 -328 -165 107 -323 -10 457 -260 -398 -109 -296 -151 205 4 -389 19 250 -405 27 323 -255 224
6538 224 462 26 -87 351 324 53 -179 22 -147 533 411 -166 19 427 63 -321 203 228 278 318 40
6559 40 -465 45 357 91 -148 -69 -292 -223 197 -383 -615 150 83 -280 -77 -37 -417 -278 223 -570 -170 114
6581 114 -169 -492 458 96 -331 171 -43 -439 -230 560 -106 -111 79 147 124 539 -138 -86 84 461 -114 91
6603 91 287 -74 -129 377 -128 -485 289 243 -131 280 14 -72 -2 226 -250 -170 249 58 -159 36 93 -332
6625 -332 27 93 -513 62 377 -363 -53 -30 -460 -35 88 -247 -202 162 -85 -8 -161 137 -291 -126 322
6646 322 -293 -114 395 -56 -337 98 -85 -3 123 157 -199 188 204 213 212 439 129 -318 269 203 -446 280 246
6669 246 -250 201 183 -121 -120 346 71 -15 212 120 -236 107 -110 -86 -94 209 -482 -215 78 -519 -12 13 -110
6692 -110 -451 118 -235 -430 -178 77 -216 -379 133 -356 -235 513 -138 -244 107 415 -264 274 422 -179
6712 -179 -153 378 -98 -193 114 -6 -12 285 66 -6 678 358 -176 -33 420 -158 -143 307 92 -266 761 -150
6734 -150 -366 -64 -139 -454 221 69 -379 -187 204 -510 -392 22 -59 -417 96 -21 -573 -35 182 -147 106
6755 106 155 -160 -312 -166 -208 -177 244 -81 -333 89 437 -244 -14 335 -112 -100 471 -24 -15 255 222 9
6777 9 252 186 84 106 638 -148 71 11 -69 -109 67 21 -346 169 -16 -438 32 272 -153 -500 69 5 -202
6800 -202 199 -178 -335 -21 147 -405 -65 325 -297 -396 101 -347 -405 245 -109 -296 282 110 -176 177 269
6821 269 -195 3 349 191 -185 228 570 -206 415 280 147 316 245 201 -52 380 -90 -101 538 64 -382
6842 -382 591 127 123 215 -205 -269 -206 243 -96 -261 250 -61 -306 279 -210 -313 100 -156 -122 -193 235 -232
6864 -232 -433 -171 -218 -482 265 -48 -425 277 391 -152 -233 223 -225 -180 290 -91 -265 518 127 -47 162
6885 162 -72 -187 281 225 209 84 248 39 47 94 -181 -98 46 340 -258 140 148 -271 49 290 -252 -221 285
6908 285 -205 -514 -311 238 -321 -247 122 -201 137 353 -363 -499 -41 -57 -687 153 167 -297 226 357 -226
6929 -226 -91 289 8 75 -177 197 -62 0 196 -360 10 444 6 60 336 -72 71 381 -22 -392 153
6950 153 350 13 33 181 18 295 375 -97 -306 244 -259 -201 -22 154 -227 265 -16 -363 98 445 -224
6971 -224 -280 -116 -281 -144 -91 -39 -618 -39 -30 -219 -232 501 -109 -175 304 93 -59 397 163 -153 255 264 -288
6994 -288 247 449 -84 11 413 56 5 161 57 131 351 35 57 349 567 -242 120 468 -23 -214 -181 -306
7016 -306 -261 402 34 -372 85 52 -275 -11 152 -147 -423 106 -346 -462 -40 138 -433 44 218 -224 194
7037 194 135 -150 -206 -26 215 -141 325 -129 -259 381 361 -303 54 27 -63 70 415 -183 -33 221 345 -57
7059 -57 370 261 -17 264 165 -193 -475 358 80 -141 423 -122 -204 416 31 -25 -153 89 36 -248 366 -242
7081 -242 5 227 187 -129 -14 472 -379 28 -193 -259 -418 6 -210 -480 152 -190 -249 148 -3 31 494
7102 494 223 -138 73 86 -185 -212 447 48 -300 440 6 214 302 445 -113 153 87 -120 -183 522 -248 -84
7124 -84 129 -2 -243 240 -90 -60 172 321 50 -277 43 -266 -378 173 -240 -309 403 -47 -567 -75 197
7145 197 -345 213 173 -140 -128 377 126 -247 305 -68 93 -50 165 105 -203 289 -152 -273 229 55 -46
7166 -46 297 332 -230 249 401 -330 89 455 -37 -50 174 -41 -191 431 7 -372 74 427 -172 -184 25
7187 25 -183 -103 311 -211 -359 168 111 -215 63 -143 -346 260 -37 -300 -96 474 28 -232 65 -11 -244
7208 -244 346 72 -440 -235 169 -325 -380 573 1 -146 431 -33 -294 454 37 -208 199 -56 10 136 396
7229 396 -31 -254 128 -47 82 362 205 -395 148 315 -124 -205 379 25 -208 117 88 -120 94 134 -113
7250 -113 -17 132 -238 -54 255 -265 -184 153 -138 -291 172 235 -307 2 124 -131 -57 286 -73 162 289
7271 289 97 69 207 -336 -280 130 169 -59 264 177 -47 -283 540 84 -87 401 8 56 99 314 -238 293
7293 293 286 79 -86 205 -93 -298 207 -69 -50 39 -110 -486 -32 173 -232 5 321 -282 -117 -180 -161 -30
7315 -30 71 -194 -530 -24 -24 -165 15 136 -221 -182 343 62 -303 215 -116 22 109 7 -462 187 411 45
7337 45 135 235 -101 145 101 105 48 204 205 -279 57 346 -293 -81 -5 -359 5 44 65 -261 115 30 -328 -177
7361 -177 174 -132 -325 90 64 -532 55 180 -328 147 -72 -253 -180 -119 -239 -264 95 66 -179 162 -121 -144
7383 -144 230 273 -278 264 212 138 -38 256 -134 91 663 -19 -233 131 151 -112 230 178 -166 302 259 -416
7405 -416 212 216 -126 69 165 26 -33 153 133 -215 140 207 -97 -457 68 -271 -447 -126 -5 -488 -98 176
7427 176 -123 -177 22 -243 -83 124 -185 -305 23 -22 -650 -39 -34 -172 214 298 -267 -113 330 -88 0 292
7449 292 -171 -30 269 213 -177 55 178 -111 -79 51 -152 -352 267 217 -429 348 55 -29 -137 165 -255
7470 -255 -86 156 -163 -161 293 -224 -87 122 -68 -44 23 73 -248 -145 199 -308 -253 139 -276 156 401 -294
7492 -294 -150 -71 -286 -166 -81 35 239 -92 630 51 47 339 78 -97 -82 287 -193 374 291 -112 -2 463
7514 463 -288 -147 143 -38 37 277 4 -86 146 263 -20 134 41 -123 -290 127 12 -438 -191 -262 -387
7535 -387 -228 -188 -170 -26 168 -65 -207 90 69 -233 13 -109 -392 261 32 -305 -61 264 -146 -7 416
7556 416 -63 -140 268 91 -229 385 334 155 -58 369 12 275 244 -291 -138 433 271 -237 279 66 325
7577 325 317 416 258 11 -25 112 -465 38 -71 -136 -2 -59 -19 -21 27 -182 184 -78 112 -128 338 -58 -229
7600 -229 105 -212 -149 84 100 178 -79 259 -127 -163 212 302 -67 164 -32 -415 -82 381 -352 125 509 97
7622 97 -149 360 309 -182 543 -25 25 10 269 286 0 311 103 -263 347 -297 -202 290 -89 -247 175 37
7644 37 -559 106 329 -287 -142 125 -209 -255 268 -29 -485 -149 -96 -320 -26 89 46 125 -40 -20 -110 125
7666 125 27 -311 186 271 -109 164 396 -315 -4 269 190 -184 119 -33 46 65 420 -151 -102 496 -36 -54
7688 -54 295 -173 264 -164 35 -57 329 254 35 -97 -10 -249 -350 -36 -211 55 5 -249 -235 156 -103 -283
7710 -283 233 83 -472 -55 291 -234 -300 221 -318 -41 284 94 -217 163 -245 -59 92 79 78 55 78 95
7732 95 -238 469 -22 -131 411 258 103 268 301 -134 407 164 -84 -584 199 195 -95 235 -75 -85 93 254
7754 254 -465 -91 191 -180 -183 105 -64 -96 97 248 -187 197 71 -197 -74 22 -133 -148 247 -194 -606 397
7776 397 189 -412 203 124 -134 55 359 -338 -356 133 172 -219 227 14 -385 180 210 77 -162 391 -91
7797 -91 -81 100 -184 -13 66 15 -193 -115 257 -65 67 214 -149 -100 49 77 -422 264 -7 -229 -104 -30 -444
7820 -444 14 120 -286 97 -95 122 -107 -30 -355 -233 13 -148 -111 -35 137 -184 -95 219 72 205 -41
7841 -41 193 -154 217 87 -239 199 145 -202 124 246 -124 -287 106 -67 -354 172 -25 -325 130 438 147
7862 147 -48 105 -304 54 186 -42 -118 263 284 -484 103 266 -291 -198 74 -268 -27 87 -396 -125 -43
7883 -43 -147 -408 -16 108 -290 67 224 -182 -89 -2 -211 -135 102 -60 -88 375 34 58 75 302 -92 156
7905 156 285 121 -153 180 205 -206 157 87 -163 8 62 -11 335 207 -176 -408 111 -99 -239 -25 71 -162
7927 -162 51 162 -428 -383 241 3 -86 110 -235 -282 -20 -100 -222 32 63 -296 -108 31 -47 -301 436 -359
7949 -359 -241 -26 295 -263 42 151 -180 183 467 21 153 583 165 102 83 56 -2 293 37 -175 25
7970 25 -14 -282 161 119 -247 -180 -165 12 -102 205 150 -179 -394 203 -217 -329 46 -522 -271 169 -339 -252
7992 -252 -22 -24 -647 7 -150 -209 66 87 -199 -166 402 -296 41 275 244 -377 152 -75 -270 91 88 -20 136
8015 136 388 -98 -122 158 115 -161 207 23 31 -14 -19 -360 -299 255 74 -34 249 -109 18 -2 -224 -422 60
8038 60 157 -219 -19 39 -29 -360 148 -223 -160 -172 -28 -556 122 -77 -187 -103 239 -250 -226 144 99 -268 287
8061 287 124 -272 201 744 -128 116 292 243 -78 342 92 -97 504 175 59 111 184 -104 37 347 47
8082 47 -403 290 -210 -23 64 433 -108 -38 -18 -208 41 124 -337 -319 -34 -74 -106 84 -390 76 -70 119 -256
8105 -256 -221 120 -77 -23 -97 -439 -172 -37 -257 -201 -47 120 -12 99 38 -194 74 187 -314 -97 -24 -92
8127 -92 -257 435 205 -255 -157 151 -233 -69 425 4 200 -51 -141 -84 178 87 -213 171 64 178 -76 10
8149 10 -117 -227 472 -65 -223 199 140 -116 83 51 -262 -303 6 -293 -6 -41 -32 -302 183 81 -177 235
8171 235 -142 -216 325 250 -233 129 -138 -64 -112 395 60 -470 107 64 65 242 220 40 -28 -55
8191e5
$$ Imaginary data points
##PAGE= N=2
##DATA TABLE= (X++(I..I)), XYDATA
0 0 0 0 0 0 0 0 0 8 -8 8 -8 8 -16 16 -21 24 -29 32 -40 48 -56 64 -72 85 -98 111 -126 145 -162 184 -207
31 -207 232 -261 292 -326 360 -400 446 -494 548 -606 671 -744 822 -912 1014 -1128 1256 -1407
49 -1407 1581 -1789 2042 -2354 2750 -3279 4017 -5122 6954 -10554 20303 -101509 -302820 -72330
63 -72330 123706 99732 -74864 -182221 -122209 42042 38560 -100969 -116586 5477 35692
74 35692 -31637 -93091 -78602 29241 111468 13237 -104161 -40677 72298 65846 16082 -16266
86 -16266 -18179 46354 95433 32519 -18806 15901 26332 12091 50856 66480 18327 -13892
98 -13892 -26523 -17107 70138 119013 5687 -105400 -61263 30452 67164 46442 -30899 -71355
110 -71355 -3461 31480 -35787 -48901 20049 36435 -6399 -56979 -91338 -25812 97561 72247
122 72247 -75799 -111900 -22182 48200 55999 -5169 -83368 -45229 61962 55276 -30164 -55218
134 -55218 -29604 16849 65549 24044 -65418 -44680 35978 38773 11999 7394 -13712 -5571 38614
147 38614 17669 -28446 10002 58053 40500 14252 -16206 -45418 9290 86823 51626 -27819
159 -27819 -43137 -30048 5972 61177 32020 -56581 -55396 2585 5776 -14176 -25260 -38205
171 -38205 -4574 37585 -16893 -83359 -37861 29713 30236 4592 -33553 -56587 3589 60616
183 60616 11416 -34802 1406 25753 11144 4864 -10157 -10136 37888 43876 -12762 -16846 17640
196 17640 3816 -5787 20315 14530 -1895 6286 -12035 -23851 27740 41839 -21354 -35513 13371
209 13371 25739 3061 -23122 -38381 15911 85901 23979 -91350 -68706 41553 84626 39732
221 39732 -48305 -87131 4361 97390 30878 -68303 -36890 40736 48207 -7035 -69741 -47327
233 -47327 67591 89999 -40282 -111770 -30324 55860 54399 -13403 -86721 -59130 49367 57610
245 57610 -39998 -66587 -8483 24122 18758 -9074 -39372 -8871 39701 8262 -29352 14206
257 14206 43115 6777 -16529 -10573 7306 48794 49108 -18998 -37045 21026 35006 4345 3464
270 3464 9625 4741 4925 -20813 -38225 24652 72747 2885 -73482 -51569 11821 55118 41332
283 41332 -43526 -84533 -1291 66606 19532 -39052 -37096 -4717 34624 26882 -39995 -45485 32336
296 32336 50224 -11772 -38005 -14426 19879 47307 12072 -59432 -37438 51240 58087 -3803
308 -3803 -40049 -38121 4769 57557 30112 -40419 -37246 4698 9013 11190 15331 -13139 -22777
321 -22777 1061 -5852 -14994 14344 15223 -17712 -13124 1555 -10582 -408 19743 2235 -8960
334 -8960 -1333 -17051 -11962 36517 35577 -20093 -31940 -4094 17818 36924 18257 -39367 -34544
347 -34544 30866 41073 377 -17197 -17987 -3890 27688 15513 -26689 -12266 21070 813
359 813 -17256 -692 2086 1420 11223 -11318 -31956 376 21535 372 -1708 720 -23431 -17507
373 -17507 18551 20785 5044 -4919 -31244 -24051 39790 50728 -14763 -42532 -8561 24862 36819
386 36819 9405 -40300 -20831 48069 37237 -29347 -33734 11266 39545 29390 -25886 -61190
398 -61190 6039 76513 25070 -56355 -48810 9879 46981 31682 -36882 -64987 3885 51526
410 51526 4131 -37891 -21432 1376 12869 2235 -32501 -24429 27750 19241 -35690 -30974 9891
423 9891 18322 8849 -9343 -29129 -3765 30090 4696 -20092 9035 21173 -3835 -10284 146
436 146 14504 36449 15576 -39461 -23881 48063 54240 -916 -30337 -18311 23800 57477 15527
449 15527 -46405 -17743 44148 33304 -12655 -28218 -11902 28562 38748 -25560 -66481 -4445
461 -4445 52441 18039 -39607 -56520 -25165 35541 40698 -36702 -72329 -13300 32910 15995
473 15995 -15064 -36553 -22702 25711 26136 -25791 -25928 20340 24650 136 -8700 -9245 10968 38999
487 38999 14598 -26759 -7456 25773 17187 7768 6120 -7683 -1882 15099 2441 -2481 19223
500 19223 4656 -28703 -10759 21978 16917 543 -16264 -27832 3251 35379 2657 -33531
512 -33531 -11612 12874 7461 -98 -13432 -16002 16057 22881 -22835 -32878 10317 27611 8881
525 8881 -11843 -29736 -14883 31303 30251 -19296 -29486 -5638 4310 13470 12525 -17152 -24367
538 -24367 4255 8035 -4862 2424 -2079 -17408 689 16730 -3282 -10032 6408 8075 10036
551 10036 11660 -10663 -11113 32967 40047 -4886 -21012 1095 26261 42330 17517 -36872 -28207
564 -28207 35540 44516 -3705 -29975 -22112 3371 26723 1367 -42199 -22819 17582 -233
576 -233 -31614 -25042 -8100 6438 7058 -29359 -47861 -2026 29713 -73 -25123 -18786 -8560
589 -8560 9287 16409 -7881 -13223 13030 8471 -12316 4330 23340 11826 1847 -1647 -3804
602 -3804 21939 37574 629 -22748 10818 34769 20651 1677 -11462 -3132 32580 30403 -18762
615 -18762 -24191 19861 29433 415 -21908 -24248 6914 41338 7198 -55202 -39860 21201 35329
628 35329 1880 -38396 -49112 -2225 41020 3305 -48642 -28924 12062 12762 -8718 -32051
640 -32051 -29581 15317 33028 -18447 -48786 -10556 23715 19043 -2365 -25406 -16485 26980 30739
653 30739 -11095 -14271 18596 24574 13682 7623 -1234 11214 34404 17583 -8023 11685 28768
666 28768 7121 -5486 3055 8914 17185 10354 -22211 -23152 14512 13887 -21088 -24622 -6582 -452
680 -452 -2427 -22685 -40370 -8421 29508 16 -44115 -33991 -276 19277 15666 -17414 -34836
693 -34836 3822 30877 454 -18716 2021 17730 18313 8350 -16148 -11820 30056 36705 641
706 641 -12461 -918 6144 19868 21473 -4297 -10479 9356 7737 -304 7454 -582 -15458 1490
720 1490 14780 -3565 -13400 -9560 -10904 2885 16330 -7712 -26743 -5168 7279 -3652 -4096
733 -4096 -3142 -4125 10449 6983 -24522 -19931 22085 29054 2642 -16534 -24723 -7560 29818 26629
747 26629 -14070 -21848 -2211 513 1939 6939 -3750 -5269 5303 -8326 -19330 5853 18530
760 18530 -1822 -8655 -2485 -2789 6602 12150 -6226 -7052 15343 10085 -8151 968 9041 859
774 859 2590 2564 -3212 12140 18033 -15500 -29199 6312 30878 18485 -7349 -33549 -25935 24073
788 24073 41060 -1844 -28208 -12006 4000 11612 7100 -12165 -6940 22399 9330 -30762 -23140
801 -23140 15215 27944 12335 -20237 -41504 -6206 39631 18034 -28339 -26358 955 16602
813 16602 13287 -15082 -31481 2796 29227 1671 -21742 -6999 3628 3184 2217 -7203 -3013
826 -3013 19458 7705 -27443 -15904 22226 26218 7328 -10633 -21025 265 28607 14138
838 14138 -9266 5723 15635 -4647 -11452 2005 16464 27718 9917 -32024 -27645 22393 34011
851 34011 -1598 -22936 -18131 1964 20792 1045 -34872 -17951 23326 14365 -18871 -26274 -12573
864 -12573 9038 19429 -7192 -29722 -1825 21932 -51 -18654 -8042 7035 21118 15631
876 15631 -19714 -27881 10732 29181 10076 -1689 -6652 -10831 4656 16311 3070 951 9981
889 9981 -2853 -11287 4614 7880 -618 5727 4828 -8170 -2931 3070 -6919 232 15783 1056
903 1056 -14035 -4440 -697 -1628 7944 2519 -11321 -446 7490 -10043 -11657 5769 6282 2560
917 2560 3487 -12141 -18539 5181 15617 1173 -2440 -3399 -13094 -3661 11271 1960 -4265 3347
931 3347 -3820 -9760 4279 4201 -7974 1500 9730 -1955 -4343 -439 -7205 1845 19555 7191
945 7191 -12451 -3500 5296 4079 9105 5023 -6135 7382 17265 -6346 -16693 5008 19061
958 19061 16019 4307 -20428 -23628 14204 31774 2358 -19067 -12653 -2572 10064 8473 -15954
971 -15954 -16945 11616 10005 -17943 -19776 -3707 5724 10482 -4882 -28291 -12450 18934 7149
984 7149 -18419 -13141 1518 10561 11016 -10383 -24657 4175 27226 6365 -9969 -2149 2125
997 2125 4419 9303 1213 3521 20868 7632 -21389 -8062 24070 25121 6592 -11669 -18953
1010 -18953 5848 29748 6319 -20027 -2432 15670 3151 -10222 -12386 -3383 19085 12974
1022 12974 -27194 -31354 9423 23546 -1588 -22396 -23028 -678 25290 6171 -34656 -24649
1034 -24649 16023 20257 -1495 -16758 -19172 913 22357 4457 -19014 -1991 15628 2437
1046 2437 -8421 -4894 1792 18014 18674 -12088 -22500 7213 21636 9926 2672 -4681 -9181
1059 -9181 7165 15307 128 -432 9547 -807 -7420 5057 6521 428 4814 -1775 -11076 2733
1073 2733 9719 -7367 -10079 2057 -783 -3190 825 -9037 -12590 4029 4087 -11119 -5359 2632
1087 2632 -4659 -4229 -863 -8249 -1239 14314 1021 -16150 -5405 5084 6269 11630 2371 -15919
1101 -15919 -5055 14284 7475 -160 2207 -3279 -1874 10662 4126 -8275 3826 11582 -140
1114 -140 -1749 1306 -4476 3955 15174 572 -11811 447 6148 1986 5626 -1517 -12675 2049
1128 2049 14259 -1512 -10617 -2935 -958 4918 10614 -6627 -18727 2266 13817 -318 -6957
1141 -6957 -5194 -5127 5225 8352 -12919 -15279 8973 10389 -7205 -11181 -9096 -3306 10961 4341
1155 4341 -18958 -11576 9805 3652 -8038 -2995 -671 2555 8684 -3086 -11724 9145 19942
1168 19942 -70 -6984 5617 9570 11133 8832 -5504 -1436 21265 13357 -11317 -5805 12730
1181 12730 12473 4272 -7159 -14611 5367 22434 -3009 -25559 -7527 11966 7153 -5662 -19916
1194 -19916 -17541 11221 16674 -16777 -27950 -1341 11073 1147 -11158 -19817 -6589 18657 7740
1207 7740 -23910 -17459 10731 14061 2160 -8653 -14187 3866 24123 6818 -14837 -1214 15141
1220 15141 9555 4651 880 -2179 11281 17641 -2592 -8595 10586 12610 907 -483 -2338 -2567
1234 -2567 9641 7141 -11556 -6830 8112 743 -7398 -1616 -2884 -2828 4337 -5287 -14904 1424
1248 1424 9252 -7224 -12433 -3682 -2484 2711 4372 -12286 -15268 5808 8364 -7128 -7232 -2456
1262 -2456 -2448 5459 4990 -10158 -4862 12932 6628 -5516 115 3129 5084 13330 4853 -10246 1453
1277 1453 16506 7114 -952 1560 -2327 1847 12752 2326 -10154 931 6182 -2205 -576 887
1291 887 -7459 -2115 6234 -4956 -8950 2202 388 -5297 1822 -1233 -10187 -51 7348 -3430
1305 -3430 -5117 -508 -5734 -719 10098 -1453 -12325 -44 6469 -280 1040 -507 -7466 3165
1319 3165 10090 -4533 -7537 6794 5060 -3360 365 -1313 -2137 8460 4562 -11500 -3455 10016
1333 10016 1320 -5528 -305 -1503 96 6413 -3093 -10378 5770 10483 -6171 -7180 4327 5241
1347 5241 5671 2325 -10040 -3071 18169 10359 -11301 -6018 6876 8503 7072 -3063 -13358 2744
1361 2744 17745 -1082 -17367 -3970 7784 5651 -1046 -14631 -15130 9439 15239 -10926 -19731
1374 -19731 -2182 6995 4286 -2573 -14792 -8374 14017 8742 -14819 -10683 6062 6967 3219 -2756
1388 -2756 -10757 1161 16926 2314 -11961 1118 10517 5171 2764 -1443 -4579 10031 15154
1401 15154 -3646 -7783 8219 9072 1006 1051 -2090 -974 11205 5255 -13210 -5414 10476 3753
1415 3753 -5230 -5359 -7950 -1219 8878 -4026 -16993 -2259 8181 -3516 -9108 -7503 -5909 6074
1429 6074 8491 -12050 -17685 4105 10699 -587 -4802 -6661 -4112 9908 8321 -10576 -6879 11682
1443 11682 8335 -2182 -1985 -2611 3528 15282 5178 -11046 397 13368 5357 -375 1235 -1460
1457 -1460 5191 12526 -994 -10193 2985 7613 -709 501 495 -6748 -874 3891 -5524 -3990 5781
1472 5781 -2134 -11002 -2859 -473 -3647 2535 554 -10771 -4813 3064 -3855 -2961 4763 -2126 -7472
1487 -7472 471 -108 -3108 5616 3596 -7656 -1474 6164 -1397 -654 6200 -638 -2572 6070 2718
1502 2718 -3103 4334 3126 -3898 4767 10441 -2127 -5323 2429 1983 4513 9246 -2857 -9859 4290
1517 4290 7961 -3203 -1130 4352 -282 -59 -1233 -9556 -1534 14983 4426 -14006 -9794 530
1531 530 4949 7667 -2307 -15899 -2969 11318 -776 -11042 -3052 1967 2091 2431 -8500 -11910
1545 -11910 6278 11197 -6485 -9841 1811 3546 2750 -143 -9776 -3780 15290 9453 -10613 -7841
1559 -7841 3857 6328 9132 4046 -8166 -1679 11048 1671 -5482 6387 9323 1014 -1167 -4919
1573 -4919 -4327 11826 14679 -6495 -11933 2373 5348 1985 795 -6630 -5318 8472 3174 -13918
1587 -13918 -7547 6171 2765 -2327 -5500 -10620 -2707 9236 -2828 -14846 -858 8141 -278
1600 -278 -5894 -8495 -7039 9561 14774 -6828 -16178 30 8146 5058 3013 -3168 -4536 8276
1614 8276 7275 -8394 -2575 13116 9039 -475 -3339 -4953 3473 16182 5686 -10252 -1800 8750
1628 8750 2880 -471 -728 -3639 3713 9321 -4981 -11961 1760 5000 -2007 -427 -1624 -6600 -1125
1643 -1125 361 -8138 -2387 9147 -112 -10323 -4950 -2564 -367 7730 1747 -10302 -3873 3454
1657 3454 -3147 -993 5898 -221 -3469 1587 -2793 -4244 6874 6322 -4016 -868 2593 -3139 885
1672 885 7005 -801 -2323 6068 2339 -3448 2332 915 -3127 7005 8691 -5203 -6667 606 790
1687 790 4233 7896 -3300 -8810 2084 3406 -4128 1121 5196 -1034 -860 -1939 -8723 -437 13434
1702 13434 3406 -10578 -5983 -953 1605 6704 -484 -11226 -2079 7757 -2360 -8448 -981 -19
1716 -19 647 3643 -5591 -10395 2853 6051 -4759 -3391 3438 566 -345 219 -6461 -667 14113
1731 14113 7334 -7821 -4817 2119 3792 9649 6362 -5139 -1354 7527 -63 -3118 7305 7123
1745 7123 475 -136 -4228 -5116 8915 11181 -5112 -8549 926 1811 1254 1440 -7070 -6327 6852 3383
1761 3383 -10854 -7558 1267 142 451 -2340 -10425 -4380 6285 -2896 -11954 -548 6042 1161
1775 1161 -2997 -8259 -8493 8618 15783 -2287 -11424 -759 5280 6300 6932 -1388 -3490 8157
1789 8157 7172 -6342 -1169 10424 7448 1629 -1285 -6192 1845 13591 4078 -9107 -981 6493
1803 6493 1528 -432 -2416 -4974 3402 8740 -5069 -10737 404 2583 -3289 -1483 -2784 -5467
1817 -5467 895 -914 -11908 -5550 7468 1330 -6966 -5970 -6441 -1676 8416 2559 -8714 -2026
1831 -2026 4585 -996 18 4548 597 2257 6020 -1867 -4749 7310 8160 -194 1119 2006 -1638
1846 -1638 4322 7385 -2239 -2566 6177 2805 -2165 1240 -1327 -3227 5463 5255 -5802 -4203 1140
1861 1140 -1825 -280 3960 -3329 -5554 2336 -869 -7413 -288 3375 -2258 -1076 -1581 -7931 -1601
1876 -1601 8079 237 -6352 -653 -252 -1381 3660 596 -5293 2537 6597 -3138 -4064 3176 1688
1891 1688 1034 4057 -2727 -5251 4550 4258 -4725 -1379 3837 26 413 863 -5350 -749 9438 2913
1907 2913 -5995 -788 2333 751 4830 2784 -4581 1136 7337 -1866 -4535 3808 3380 -134 1904
1922 1904 -3324 -6254 4672 6426 -5371 -5655 1446 -306 -240 402 -6449 -4984 6684 2489 -8784
1937 -8784 -4971 1431 58 1550 -525 -8077 -1758 7505 -1328 -8482 344 4564 1515 1209 -4513
1952 -4513 -6683 6223 11009 -2524 -6980 1814 4808 4099 3614 -3079 -2332 9032 6704 -6200 -2230
1967 -2230 6588 4565 2083 -415 -5343 970 10125 1118 -9040 -890 5299 681 -786 -3641 -6919
1982 -6919 2428 7243 -5262 -9364 600 2075 -2130 -1744 -4148 -4791 3863 1704 -9251 -5228 4898
1997 4898 1337 -2986 -2735 -5185 -1228 7528 1254 -7796 -493 5245 747 128 1771 -1411 3239
2012 3239 7845 -855 -4155 5987 7181 873 1839 956 -943 5918 6982 -3479 -3134 5244 2910
2027 2910 -396 1098 -2580 -3856 4407 2803 -6716 -3217 2070 -2019 -2150 -547 -5474 -3229 3978
2042 3978 -1887 -8421 -1319 2003 -1962 -881 -1979 -6765 -83 6056 -1874 -5678 1248 1303 -657
2057 -657 2721 -285 -3686 4200 5482 -3544 -1735 5003 2224 1237 3226 -1992 -1240 7143 4031 -4408
2073 -4408 246 4415 630 1664 2043 -4278 -497 6425 -105 -4945 1375 1993 -1583 1344 -915
2088 -915 -5150 1888 4949 -4037 -5118 1479 620 -837 1236 -3831 -5972 3523 3530 -5468 -3919 1215
2104 1215 -1126 -416 1123 -5345 -3107 5574 1495 -6594 -1918 2060 810 2433 -124 -5833 481
2119 481 8208 195 -4983 1149 2991 2235 3780 -1263 -4186 5446 8240 -2534 -3684 3355 3155
2134 3155 3172 2755 -3612 -2612 7771 5132 -5826 -2792 3196 2061 1808 -532 -6529 -839 7023
2149 7023 -810 -7897 -1398 2443 -531 -641 -3581 -6873 1907 5572 -5350 -7901 651 1220 -888
2164 -888 -19 -4015 -4530 4354 3200 -6497 -2865 4055 1556 56 497 -3597 -155 7846 1891 -5242
2180 -5242 966 5334 1716 2076 1085 -2646 3151 7888 -398 -3773 3006 3839 653 1886 -556 -2762
2196 -2762 4231 4714 -4525 -3797 3653 1904 -891 -130 -4777 -3584 5129 2004 -6461 -3574 1246 -1433
2212 -1433 -821 -508 -5046 -1775 4367 -2162 -7155 34 2663 -1120 -243 -2236 -5408 1901 5756 -3155
2228 -3155 -4834 2040 1866 431 2478 -1611 -3000 5147 5426 -3053 -662 4247 1121 1339 2976 -851
2244 -851 12 6262 1411 -4937 1430 4700 1326 1515 234 -4498 250 6210 -292 -3904 977 242
2260 242 -2565 1237 -256 -3585 1599 2410 -5553 -4315 2101 -197 -1466 342 -4258 -4392 3489 1739
2276 1739 -5574 -2355 1644 -831 425 761 -4733 -1689 5855 1261 -4178 496 1483 -682 2387
2291 2387 981 -2880 2865 6473 -2001 -4270 2627 3469 2758 3167 -2522 -4813 4524 6503 -1728 -1600
2307 -1600 2259 523 1461 2672 -2499 -917 6300 2308 -5410 -1370 2526 795 1579 -296 -5744
2322 -5744 -821 4704 -2317 -6468 -323 1203 -1279 -264 -4111 -6961 707 3804 -4067 -4892 672
2337 672 -1273 -2195 807 -2530 -2238 4786 1443 -6008 -1537 4572 2653 2366 1641 -3175 7 7537
2353 7537 2688 -2519 2743 4414 869 2122 994 -1827 4037 7348 -845 -3763 2260 2182 202
2368 202 2015 -1553 -3078 3312 2549 -6346 -4522 2348 639 -869 -1573 -6827 -5072 3858 1280 -5447
2384 -5447 -2547 -181 -2860 -1128 -275 -3645 370 4729 -2374 -6044 943 2860 689 2254 -1088
2399 -1088 -4000 2887 5390 -2190 -2260 4032 2502 952 2232 -2060 -2300 5772 4919 -2563 -620 3131
2415 3131 -538 909 2811 -525 1624 5301 -1445 -6234 1293 4864 1517 793 -1855 -6048 -44
2430 -44 4918 -1421 -3938 680 -1427 -3714 -491 -1803 -3190 2412 1391 -6422 -3913 1810 -281
2445 -281 -1402 479 -2739 -1888 4203 777 -5249 -263 3787 1337 1849 310 -4500 -266 6425 1940
2461 1940 -1906 1919 1366 -1286 2144 1867 -415 4203 4690 -3961 -4186 3336 3690 2527 2134 -3486
2477 -3486 -4902 3645 4187 -2638 -1214 1157 -1374 -476 763 -3286 -1572 4609 134 -5280 -622
2492 -622 1247 -1230 118 -119 -3716 1372 4260 -3307 -5914 1116 2245 653 1279 -3355 -6234 1587
2508 1587 3824 -1870 -1669 1815 -1876 -2580 528 -968 208 5301 520 -6088 -605 4440 2615
2523 2615 2843 1777 -3884 155 6207 1581 -2149 2797 3197 104 2026 197 -2455 2696 5164
2538 5164 -2136 -2971 2056 163 -1183 923 -2314 -2582 3648 1228 -6768 -4684 865 440 605 -365
2554 -365 -6541 -4990 3247 791 -3781 -163 254 -2938 -373 -357 -2953 1592 5680 -2039 -5100 1293
2570 1293 2465 2160 3375 -623 -3315 3682 4978 -1825 -956 3883 2245 1689 2411 -1813 -1669 5397
2586 5397 3257 -2933 263 2281 -510 -70 933 -2346 948 5034 -1818 -6374 -175 2008 446
2601 446 1274 -1722 -5772 -265 3267 -3284 -3467 1447 -335 -2575 -803 -3140 -3307 3424 1851 -5380
2617 -5380 -3514 1503 -192 118 1124 -2999 -1179 4798 1018 -4344 482 3425 1469 2493 660
2632 660 -3633 1243 6558 1345 -1403 2462 1859 -235 2255 569 -1456 4168 4147 -3384 -3012 2253
2648 2253 1441 1074 1378 -3272 -3466 2936 1480 -4256 -1455 1669 -1425 -970 -785 -4267 -1410 3725
2664 3725 -1125 -4728 -178 226 -2056 187 -565 -3406 1653 3069 -3741 -3954 1957 1706 673 1995
2680 1995 -1822 -3383 3487 3756 -2238 60 3255 -86 209 1900 -867 493 5501 868 -4031
2695 -4031 463 3188 1006 2244 1001 -3091 682 4764 -349 -3090 1546 1461 -381 1815 -989
2710 -989 -4005 1411 3538 -2271 -2299 1066 -1299 -1363 797 -2608 -3161 3034 886 -5832 -2772 1105
2726 1105 -665 617 484 -4870 -2780 3629 366 -3150 626 851 -1675 815 143 -2613 2381 4843
2742 4843 -1175 -2684 2444 1668 1150 3118 -466 -1922 4135 4674 -1572 -398 3037 1045 1422 2298
2758 2298 -1732 -1413 4016 1259 -3439 480 1836 -1253 -199 -339 -3667 151 4059 -2278 -5215
2773 -5215 -561 260 -1176 949 -1797 -5110 42 2254 -3283 -2968 1606 -629 -1390 633 -2383 -2492
2789 -2492 3660 1937 -4097 -1160 2167 83 1366 1608 -2825 119 5393 1451 -2714 1295 2546
2804 2546 703 2721 1168 -2706 1539 4779 -860 -2248 2534 1622 39 1613 -1210 -2903 3481
2819 3481 3383 -3170 -2397 1567 -277 284 1010 -3156 -2779 2992 200 -4651 -916 1302 -1632 -648 -717
2836 -717 -4187 -565 3643 -2043 -4618 436 532 -1068 662 -871 -3697 1592 3350 -2837 -2372 2408
2852 2408 1099 -127 1825 -1147 -1424 4251 2773 -3104 -22 3560 698 920 2077 -1731 328
2867 328 5210 952 -2961 1462 2432 -312 1017 632 -2473 1120 3576 -2265 -3027 1754 525 -1413
2883 -1413 456 -1955 -3530 1319 2023 -3941 -2505 1126 -1341 -1361 792 -2689 -2541 2532 115 -4017
2899 -4017 -572 1517 -1424 431 848 -2730 -425 3735 -260 -2558 1869 1411 -284 2100 651
2914 651 -2355 1848 3652 -930 -568 2975 782 371 2953 -69 -1616 3820 2843 -1853 20 2459
2930 2459 53 1061 1977 -2653 -1138 3601 362 -3311 175 555 -1565 192 -549 -4309 -351 2582
2946 2582 -2577 -4264 61 -447 -1318 546 -2160 -4095 1216 2826 -3189 -2314 1389 -275 248 1659
2962 1659 -2053 -1927 3980 1940 -2800 78 2640 613 2092 1764 -2266 1120 5510 1084 -2374
2977 -2374 1316 2058 623 2773 723 -2725 1789 4102 -1300 -2035 2101 565 -681 1189 -2552
2992 -2552 -2997 2973 1793 -4079 -2416 909 -847 6 263 -3617 -2236 2913 30 -4369 -365 931
3008 931 -1387 262 -565 -3600 507 3449 -1629 -3584 1285 1540 -146 1139 -1240 -2356 2982 3533
3024 3533 -2226 -1917 2208 702 1022 2235 -1051 -1152 4162 1626 -2889 897 3414 892 532 423
3040 423 -2490 842 4614 -51 -3189 795 1376 -640 944 -559 -3025 845 2810 -2768 -2903 1178
3056 1178 -271 -1537 291 -2128 -3189 1694 951 -4017 -1430 1449 -1026 -865 -27 -2687 -1476 3253
3072 3253 364 -3190 273 1611 -706 1270 1393 -1997 825 3797 -999 -2089 2764 1687 43
3087 43 2010 168 -1792 2548 3359 -1390 -728 2308 -38 -380 2125 -830 -1592 3203 1225 -2823
3103 -2823 -274 1519 -1156 332 1386 -2631 -1179 2519 -854 -2998 668 509 -1895 129 -751
3118 -751 -3681 124 2470 -2422 -3081 764 -938 -923 1323 -1201 -3012 2052 1989 -2858 -1357 1809
3134 1809 20 629 2161 -1961 -1532 3771 1811 -1595 1260 2199 59 1827 1504 -1861 1677 4879
3150 4879 437 -2253 862 681 768 3074 -25 -2991 827 2954 -2022 -1591 1419 -305 -499 676
3166 676 -2780 -3015 2622 1295 -3803 -1955 233 -1755 167 -39 -3718 -1620 3014 -331 -3542 -328
3182 -328 583 -644 1331 77 -3022 355 3193 -1300 -1661 2646 1586 -69 1231 -1064 -1459 4195
3198 4195 3965 -2101 -1764 1810 898 1796 2421 -1213 -1017 3730 1186 -2841 685 2344 251 504 -286
3215 -286 -2903 628 3955 -994 -3273 486 517 -938 490 -1547 -3380 1410 2264 -2979 -3441 409
3231 409 -812 -540 765 -1992 -2793 1645 393 -3761 -176 2284 -568 -398 43 -2456 34 4239
3247 4239 755 -2147 770 1137 -404 1894 1820 -1410 1042 3055 -922 -661 3338 1466 -314 1734
3263 1734 -141 -1250 2704 2192 -2667 -315 2310 -310 -750 721 -1866 -1548 2695 112 -2987 -454
3279 -454 112 -2367 206 632 -2560 -1407 1072 -2090 -3051 1292 108 -1385 -163 -1666 -3631 977
3295 977 2990 -1502 -1841 919 -838 -187 2434 -242 -1992 2563 1982 -1752 127 2004 -40 1517
3311 1517 2149 -1358 -439 3500 1054 -1337 1606 1684 -287 1467 405 -2608 1052 3839 -311 -1968
3327 -1968 221 -701 -646 2213 -142 -2970 825 788 -2795 -1370 1421 -468 -899 314 -3325 -2669 1967
3344 1967 719 -2664 -1207 -21 -1740 333 612 -2883 -289 3009 -748 -3019 392 882 -347
3359 -347 1912 452 -1894 1248 2845 -1319 -620 2314 1335 683 1585 -1107 -1295 4089 3245 -1524 -610
3376 -610 1783 258 1154 1741 -1759 -750 3220 278 -3081 388 1207 -304 660 -740 -3843 53
3392 53 2351 -1525 -3001 -117 23 -1185 181 -1768 -3254 1582 2046 -2727 -2471 120 -789 -73 1301
3409 1301 -1751 -1426 2281 315 -2752 406 2438 -83 93 321 -1922 599 4231 518 -1807 1370
3425 1370 1173 -33 1853 929 -972 1857 2782 -1684 -952 2308 940 148 1047 -429 -1157 1954 788
3442 788 -2738 -341 1797 -546 -769 -44 -2325 -1095 2276 -288 -3261 -455 -385 -1739 137 491
3458 491 -2199 -565 1174 -2227 -2523 1129 389 -1119 426 -1038 -2371 1536 2581 -1539 -775 1471
3474 1471 12 80 2254 -573 -963 2767 1639 -1159 624 1724 -270 1209 1887 -1315 130 3073
3490 3073 126 -1359 1431 785 -712 1424 -222 -2638 211 2455 -965 -1542 378 -1192 -1146 1491
3506 1491 -749 -2561 387 176 -2830 -631 681 -1291 -487 507 -2878 -1665 1986 78 -2115 -43
3522 -43 379 -1066 571 570 -2313 329 2792 -273 -1662 1289 663 -15 1910 -22 -1390 2066 2881
3539 2881 -1052 -455 1854 1075 1086 1702 -1413 -1359 3102 2005 -1813 -205 900 -406 909 961 -2438
3556 -2438 -820 2694 -600 -2677 -185 162 -485 683 -951 -3514 -133 2170 -1908 -2534 -35 -639
3572 -639 -574 536 -1626 -2444 1526 1583 -2176 -1142 1332 -320 379 1045 -1526 -633 3080 738 -1972
3589 -1972 729 2041 296 1405 794 -1525 1334 3061 -112 -1149 1910 1173 -98 1189 82
3604 82 -1146 2131 2055 -1998 -923 1704 189 -319 471 -1773 -1453 1932 283 -3028 -825 623 -905
3621 -905 -617 -292 -2246 -859 1864 -828 -3002 -4 250 -1325 509 -507 -2596 475 2184 -1527
3637 -1527 -1476 1299 264 -135 1439 -406 -1388 1842 1957 -1218 176 1874 51 851 1629 -594 -410
3654 -410 2764 1236 -1171 1198 1358 -354 1070 1284 -1377 134 2281 -433 -1418 1184 149 -886
3670 -886 922 -390 -2148 336 1368 -1960 -1339 410 -895 -1168 789 -1330 -1782 1092 161 -2591
3686 -2591 -542 342 -1120 -83 645 -2048 -857 2203 316 -1748 445 885 -335 1076 756 -1233
3702 -1233 855 2649 -362 -655 1348 518 458 2030 20 -1472 2071 2603 -834 -211 1346 272
3718 272 928 1246 -1446 -1345 2122 1134 -1653 -710 38 -606 728 473 -2354 -1125 1866 -664 -2255
3735 -2255 -363 -457 -816 766 -1026 -2957 114 1577 -1815 -1821 496 -616 94 813 -1398 -1785 1590
3752 1590 1374 -1456 -210 967 73 721 1221 -832 53 3115 320 -1688 978 1521 510 1388 382
3769 382 -1044 1260 3033 -783 -862 1332 379 -109 990 -592 -1111 1981 1511 -1979 -1061 930 -70
3786 -70 -157 139 -2258 -1611 1554 105 -2677 -394 403 -842 -331 -45 -2657 -592 1776 -869 -2178
3803 -2178 209 242 -520 857 -183 -1899 1010 2073 -1127 -1104 1262 557 -11 1729 -417 -936 2111
3820 2111 1572 -948 974 1766 -129 540 1603 -909 -307 1971 423 -1336 1226 505 -832 665
3836 665 252 -1427 167 1563 -1494 -1469 776 -294 -1136 264 -802 -2191 603 428 -2233 -1225
3852 -1225 542 -861 -886 425 -1462 -1268 1291 140 -2410 -280 711 -607 188 867 -1672 -114
3868 -114 2351 211 -1035 1303 857 155 1416 469 -1211 1073 2380 -413 -166 1246 266 382 1909
3885 1909 -391 -1125 1542 1172 -941 -318 603 -457 624 675 -1974 -1657 1240 299 -2037 92 -17
3902 -17 -1379 308 118 -2439 -826 1416 -1188 -1685 109 -635 -1087 735 -617 -1698 326 1371
3918 1371 -1400 -876 1056 -220 224 1007 -1131 -1225 2042 1283 -1204 568 1120 -84 871 918 -1173
3935 -1173 551 2910 -26 -1779 885 1319 188 1355 -167 -1723 776 2235 -900 -1256 668
3950 668 316 -217 786 -1243 -1556 1176 884 -2467 -1202 477 -631 -337 73 -2112 -1058 1514 -61
3967 -61 -2533 -557 388 -596 485 -248 -2408 -352 1958 -417 -1224 1151 173 -412 1011 113 -1162
3984 -1162 1444 1861 -1114 -407 1471 604 509 1817 -248 -496 2063 1304 -1040 526 1219 -400 657
4001 657 998 -1036 -30 1770 -157 -1688 731 300 -1335 -183 -82 -1454 464 1136 -2081 -1837
4017 -1837 414 -186 -760 237 -1181 -2090 678 637 -1842 -445 783 -785 -710 484 -1109 -678 2191
4034 2191 370 -1681 79 1068 -283 826 1002 -1101 379 2109 139 -891 1338 791 475 1737
4050 1737 393 -1270 961 2049 -441 -193 1036 -110 -230 1769 -459 -1207 1297 709 -1677 -620
4066 -620 507 -1035 312 991 -2036 -1365 922 -395 -1271 151 -447 -1408 332 5 -2225 339 1334
4083 1334 -992 -1193 445 -638 -428 784 -414 -1348 1242 959 -1711 -371 957 187 692 1333 -1184
4100 -1184 -846 2111 1048 -1163 706 1002 -299 735 845 -1309 568 2603 45 -1352 478 352
4116 352 227 1349 -26 -1792 850 1515 -1391 -934 264 -313 -121 434 -1646 -1757 1066 518 -1880
4133 -1880 -774 204 -1370 -287 236 -1888 -614 1732 -555 -1759 -246 265 -437 1203 383 -2147
4149 -2147 -86 1734 -432 -424 1454 432 -319 1308 49 -980 1891 1657 -887 43 1503 62
4165 62 362 1306 -610 -486 1976 591 -1406 283 1344 -128 416 149 -1816 -169 1693 -927 -1470
4182 -1470 444 299 -1211 -437 -736 -1923 459 973 -1849 -1892 388 -438 -255 790 -1375 -1715 1203
4199 1203 327 -1617 -209 986 -529 141 708 -1033 -138 1917 555 -1056 684 878 -212 1185
4215 1185 1118 -660 919 2137 -11 -453 1298 192 -254 1769 315 -1324 663 1050 -1311 149
4231 149 1002 -682 -693 467 -776 -1295 1661 272 -1807 -326 -51 -1196 -94 450 -1791 -1266 683
4248 683 -710 -1477 90 -418 -815 774 61 -1420 377 1595 -952 -576 886 108 -46 975 -349
4265 -349 -883 1840 1434 -866 322 1230 -11 643 1347 -1089 -399 2290 882 -747 647 798 -145
4282 -145 806 286 -1241 376 2084 -464 -1530 415 -442 -513 1064 -558 -1987 484 897 -1416 -1047
4299 -1047 146 -911 -403 680 -1383 -1643 1013 77 -1730 -322 69 -1010 299 540 -1330 -423
4315 -423 1447 -123 -1370 497 189 -267 1145 662 -1303 660 1887 -525 -89 1704 605 -215
4331 -215 1385 -275 -880 1992 1232 -1193 86 1139 178 261 919 -1084 -591 1668 330 -1612 431
4348 431 652 -527 612 -108 -1781 -236 1416 -780 -1531 409 -269 -847 314 -689 -1875 734
4364 734 904 -1605 -1111 367 -654 -459 697 -969 -1025 1263 614 -1520 244 855 -230 675 729 -959
4382 -959 162 2104 -54 -760 1335 405 -659 938 739 -726 661 1641 -526 -231 1040 -111
4398 -111 -138 1329 -182 -1124 1058 716 -1342 37 543 -815 -651 606 -1157 -868 899 -588 -1989
4415 -1989 28 169 -1255 165 354 -1981 -429 768 -925 -1119 649 172 -737 1042 -53 -1351
4431 -1351 1046 1349 -877 -397 1005 -259 352 1395 -332 -675 1896 1374 -854 512 850 -55 1077
4448 1077 1140 -1058 -353 1911 271 -963 710 146 -605 702 227 -1656 161 1176 -561 -1191 42
4465 42 -1046 -787 638 -686 -1739 641 651 -1248 -505 539 -983 -554 817 -1105 -946 1090 141
4482 141 -1197 353 549 -566 538 544 -1286 267 1685 -245 -330 889 320 -97 1392 533 -1231
4499 -1231 1062 1533 -550 -145 1149 153 156 937 -500 -452 1806 915 -1274 74 480 -700 307 755
4517 755 -1401 -983 1304 -458 -1813 266 16 -635 452 -350 -1736 -29 1146 -1336 -1108 614
4533 614 -648 -588 698 -533 -1671 813 939 -1048 -150 653 -146 44 1128 -839 -426 1601 425
4550 425 -781 847 743 18 828 1150 -391 361 1994 -262 -524 941 444 -545 828 649 -1186
4567 -1186 597 1266 -961 -388 959 -426 -259 516 -863 -1035 867 50 -1571 -375 330 -1066 -402
4584 -402 623 -1543 -530 999 -402 -1372 -120 14 -937 370 126 -1326 -203 1309 -716 -775 705
4601 705 162 -28 906 69 -749 1034 1480 -745 -155 1112 94 496 1043 -363 -390 1712 666 -900
4619 -900 644 464 -343 816 758 -1043 -238 1470 -254 -811 642 -53 -688 702 -235 -1610 -141
4636 -141 1037 -1056 -915 103 -774 -588 605 -722 -1452 879 539 -1363 -219 466 -630 59 732
4653 732 -987 -631 1260 180 -483 711 655 -482 712 786 -796 641 1621 -307 -612 793 242
4670 242 20 1042 142 -938 1203 1236 -692 -178 859 26 403 579 -692 -942 1385 310 -1366
4687 -1366 -219 192 -675 238 234 -1769 -498 1075 -363 -1596 -352 -393 -557 152 -110 -1562 65 872
4705 872 -1086 -644 230 -304 -192 731 -404 -1205 1136 872 -961 9 947 -430 428 1131 -597 -286
4723 -286 1502 452 -408 1138 944 -456 778 635 -726 347 1152 -635 -353 1097 333 -472 755
4740 755 -260 -1006 355 595 -1212 -531 418 -523 -259 346 -724 -1205 837 -57 -1320 95 33 -664
4758 -664 -84 -16 -1635 -704 959 -409 -1147 343 43 -615 458 489 -945 322 1099 -608 -237 975
4776 975 70 -16 1229 -27 -756 1029 1108 -556 404 771 -88 386 1280 -867 -358 1597 653 -945
4794 -945 292 34 -621 579 587 -1078 -520 797 -663 -1082 673 -348 -909 297 -309 -1147 186 409
4812 409 -1044 -713 -46 -1051 -537 742 -963 -1061 744 121 -1180 143 610 -536 638 1032 -818
4829 -818 -194 1327 161 -560 743 624 -185 830 214 -786 554 1734 -213 -6 600 136 108 939
4847 939 47 -854 1013 773 -966 -265 362 -361 -218 852 -1080 -672 915 81 -1310 -252 -134 -791
4865 -791 81 -175 -1771 -200 911 -608 -1205 148 -445 -584 838 -91 -938 263 845 -881 -117
4882 -117 939 -86 105 666 -409 -283 1414 672 -494 111 594 -426 564 773 -382 100 1619
4899 1619 239 -474 950 585 -91 856 547 -818 417 1261 -827 -621 644 -406 -466 379 -523 -1364
4917 -1364 822 578 -1043 -571 229 -761 -441 409 -887 -604 732 -166 -1409 -151 286 -658 413
4934 413 321 -963 -660 1009 83 -584 448 135 -172 742 322 -445 791 1215 -414 -23 1193 219
4952 219 110 1003 138 -410 1170 664 -575 297 655 -431 384 1217 -940 -471 941 195 -495 296
4970 296 -94 -758 368 229 -1264 -347 139 -722 -549 337 -285 -723 378 -507 -1146 337 -22 -688 -282
4989 -282 416 -685 -284 821 -493 -767 994 589 -668 309 424 -276 443 960 -883 211 1356
5006 1356 72 -279 525 607 -47 1011 394 -798 661 1298 -166 -184 502 -207 -34 761 -329 -1188
5024 -1188 829 222 -901 -413 126 -532 -86 575 -1338 -945 731 -348 -893 -30 -177 -643 106 5
5042 5 -1356 -126 626 -295 -563 371 -217 -481 643 100 -621 888 710 -593 -267 802 -2 170 990
5061 990 -193 -269 793 495 -579 445 631 180 530 573 -862 291 1098 -347 -799 374 230 -604
5079 -604 592 -255 -926 77 952 -847 -759 394 -165 -313 187 -527 -1175 274 406 -895 -67 71
5097 71 -766 -70 29 -830 -187 1118 -96 -632 45 101 -182 348 112 -717 315 909 -170 -343 857
5116 857 -10 -14 860 174 -457 809 572 -234 312 871 -135 67 611 -138 -318 596 388 -641 420
5135 420 336 -603 203 238 -618 -174 370 -202 -764 150 -276 -801 121 2 -1128 125 226 -1042 -157 338
5155 338 -271 -383 349 -172 -954 416 338 -753 -99 172 -192 20 570 -410 -437 1300 138 -495 151
5174 151 201 -195 540 716 -401 201 1213 18 -217 514 122 83 849 5 -972 491 772 -593 13
5193 13 155 -262 -76 447 -573 -822 641 362 -591 -93 141 -739 218 277 -842 -734 433 -420 -798
5212 -798 168 -322 -556 372 103 -1072 98 1065 -391 -645 419 7 -178 892 -293 -515 592 790
5230 790 -315 12 785 102 405 589 -288 -296 1398 383 -705 464 632 -102 346 404 -766 327 807
5249 807 -234 -665 689 117 -133 581 -211 -893 191 556 -609 -779 148 -465 -244 9 -344 -753 658
5268 658 -94 -948 -189 174 -416 218 400 -661 -128 598 -263 -624 569 308 -184 545 372 -704 708
5287 708 793 -89 204 722 369 -132 724 236 -580 711 696 -514 68 794 -28 180 684 -497 -428 995
5307 995 3 -795 30 5 -608 141 108 -921 -522 467 -533 -777 111 -411 -468 169 -365 -857 17 204
5327 204 -529 -415 470 -221 -57 670 -191 -461 510 245 -455 160 406 -168 551 695 -357 -9 1006
5346 1006 356 74 682 224 -126 509 323 -569 280 1279 31 -59 541 -197 -17 486 66 -646 560
5365 560 609 -659 -352 85 -389 -217 622 -849 -590 640 -187 -593 242 -140 -634 -89 371 -853 -273
5384 -273 360 -170 -340 150 94 -406 745 184 -474 383 795 -105 115 496 -36 6 822 -62 -182 1015
5404 1015 715 -399 55 420 -16 335 676 -615 -470 1180 164 -639 385 34 -209 306 -98 -812
5422 -812 -138 516 -796 -616 135 -613 -223 53 -536 -843 130 72 -745 -91 465 -128 -139 304 -575 -556 680
5443 680 3 -509 164 499 -220 318 580 -442 -68 856 154 -182 406 276 -79 834 24 -150 733 1026
5463 1026 -282 -86 822 291 -241 680 73 -416 282 223 -695 36 512 -452 -17 450 -594 -330 489
5482 489 -27 -911 -27 -137 -783 237 -4 -684 -79 427 -694 -420 356 -208 -613 84 5 -608 219 344
5502 344 -455 -38 384 -179 109 788 -165 -499 859 413 -182 282 492 38 243 626 -190 -66 889 62
5522 62 -83 358 14 -295 408 192 -742 77 664 -294 -336 134 -456 -306 518 -291 -714 166 317 -510 206
5543 206 -169 -712 -63 267 -524 -464 373 131 -544 -74 -132 -451 495 216 -523 -89 754 -281 -343 283 -171
5564 -171 -9 516 18 -548 169 640 -239 -82 375 -81 143 756 -309 -142 701 390 -476 27 201 -129
5584 -129 384 409 -609 -397 637 -81 -445 318 -194 -498 442 -170 -1044 -53 615 -514 -311 57 -277
5603 -277 -137 684 -233 -730 60 272 -631 -255 113 -489 127 256 -546 -620 638 47 -392 54 161 -158
5623 -158 280 517 -662 93 1137 -266 -432 412 252 321 269 183 -218 529 521 -460 34 486 -193 -263 714
5644 714 -10 -754 316 53 -614 -94 493 -465 -194 -58 -604 -353 385 -93 -650 172 -260 -583 238 -55
5664 -55 -734 -66 193 -356 -839 392 -55 -235 196 -77 -275 461 136 -385 29 813 -289 -111 612 196
5684 196 -105 1001 160 -659 529 352 155 830 655 -143 276 572 7 -259 535 58 -315 487 21
5703 21 -675 158 297 -152 -667 256 -192 -397 547 -385 -915 468 -70 -572 -164 71 -443 -288 337 -689
5723 -689 -634 670 -341 -136 238 -247 -166 516 300 -539 264 363 -65 -198 234 143 -82 717 267 -392 597
5744 597 880 -144 303 751 106 215 503 -501 43 913 338 -467 -58 2 -308 368 108 -711 -184 321
5764 321 -274 -574 249 -342 -450 372 91 -1022 115 107 -552 -179 -253 -213 -45 462 -662 -620 610 98
5784 98 -551 -124 302 -148 144 570 -445 63 748 116 -264 434 425 68 522 633 -398 246 875 -164
5804 -164 -466 539 -249 4 508 -27 -323 280 610 -286 -240 184 -136 -77 150 -356 -486 139 -90 -710
5824 -710 -209 3 -499 63 -32 -821 -220 432 -440 -480 192 50 -387 262 88 -592 263 519 -607 -218
5844 -218 407 -128 -113 809 -10 37 660 436 -323 186 586 -170 193 530 -106 -108 850 218 -545 389 152
5865 152 -1 125 489 -461 -2 205 -531 -209 258 -116 -460 221 -30 -650 -2 -9 -452 -257 388 -562 -232
5886 -232 123 -443 -370 449 -204 -617 30 -111 -494 165 440 -595 -393 579 -129 -377 420 289 -488 462
5906 462 347 -675 450 631 101 -25 848 102 51 557 163 -315 416 529 -519 250 172 -494 -62 647
5926 647 -72 -356 427 24 -401 -101 -146 -723 334 210 -707 -159 516 -534 -389 14 -192 -428 296 46
5946 46 -232 252 367 -527 -61 149 -322 -45 549 -270 -365 645 323 -181 93 364 -35 492 723 -521
5966 -521 -119 712 55 -64 154 258 126 477 202 -736 371 766 -103 -188 443 194 -394 490 -184 -807
5986 -807 130 529 -468 -321 38 -122 -130 321 -304 -484 309 -167 -630 -188 168 -675 -4 71 -663 -140 664
6007 664 -175 -456 314 -150 -341 180 105 -284 315 348 -204 -34 591 89 64 617 -63 81 750 303 -430
6028 -430 259 -124 -92 252 543 -332 -58 519 107 -217 471 16 -306 266 218 -462 54 578 -604 -545 199
6049 199 -432 -428 -76 -111 -614 231 391 -507 -57 298 -353 -28 533 -265 -155 -27 189 -798 -67 153 -152
6070 -152 28 247 -264 153 415 -149 -162 583 4 -367 247 304 -257 197 444 -271 93 419 -209 19 649
6091 649 -90 -111 451 179 -192 214 178 -444 107 187 -706 -134 628 -139 -481 19 -132 -304 178 33 -703
6112 -703 -178 572 -292 -491 27 -191 -182 217 -21 -474 268 223 -266 -236 419 -208 131 357 13 -126 467
6133 467 -45 -40 523 320 90 379 298 -560 206 685 66 -205 355 27 -417 542 256 -401 181 566 45
6154 45 -346 -74 -226 -317 344 -248 -437 22 63 -502 103 63 -286 83 178 -501 -277 414 66 -431 206 -80
6176 -80 -325 265 18 -569 -236 642 153 -327 399 -154 -118 415 -50 -580 312 259 -233 -77 271 -81 -34
6197 -34 626 59 -140 697 227 -267 12 350 -96 302 540 -259 141 621 -29 -476 260 31 -70 279
6217 279 108 -328 119 -5 -218 -360 147 3 -240 430 -272 -702 193 250 -576 -402 279 -538 -298 459
6237 459 -371 -242 691 6 -393 155 110 -218 108 125 -458 281 630 -231 -20 688 59 -347 398 444 -23
6258 -23 306 503 -485 -48 366 6 81 217 -178 -75 292 -14 -385 157 76 -261 -137 620 -246 -363 82
6279 82 -416 -440 -73 -202 -660 517 -33 -579 188 335 -319 74 447 -421 -26 587 -154 -219 414 581 -285
6300 -285 -34 229 -244 -55 397 -167 -179 566 146 -184 397 316 -411 369 71 -322 -15 314 -39 -403 183
6321 183 -268 -221 574 -130 -511 142 190 -36 -392 267 -479 82 136 -235 -241 70 2 22 -118 -122 -294 28 99
6344 99 -331 -105 30 -311 -64 404 25 -457 476 521 -326 383 385 -234 -109 278 180 53 368 160 -6 464
6366 464 428 -299 53 359 -123 296 430 -360 -246 403 159 -212 184 52 -610 -31 184 -487 -379 231
6386 231 -331 -333 -24 -197 -296 357 -150 -517 -34 228 -304 -182 374 94 -57 245 -430 -345 370 -22 -462
6407 -462 72 -44 -157 286 102 -333 13 279 -38 -301 317 268 -22 547 66 -307 208 498 19 -157
6427 -157 569 -63 -353 417 -9 -429 360 152 -156 20 347 -376 -98 11 -460 -500 356 38 -587 135
6447 135 52 -539 64 188 -351 -412 103 -386 -376 90 -72 -198 546 5 -187 327 381 -62 46 260 -84
6468 -84 -34 488 192 -338 714 302 -169 -45 311 -206 195 431 -197 -307 566 161 -139 396 -135 -382
6488 -382 362 -45 -269 53 410 -105 -241 211 -157 -619 89 -12 -434 -118 27 -552 24 129 -230 -191
6508 -191 44 -332 -325 135 -176 -332 19 199 -69 36 139 -329 39 380 139 -31 89 -87 -78 377 229
6529 229 -569 72 219 -60 76 713 56 210 438 63 -103 559 167 -3 -14 339 -47 381 178 -389
6549 -389 36 217 81 -148 209 -110 -134 230 -135 -473 -120 95 -323 -197 -20 -355 16 416 -13 -472
6569 -472 156 97 -146 -147 142 -500 -102 176 113 -528 211 313 -8 177 244 -276 49 372 116 43 408 -263
6591 -263 -79 65 49 55 124 417 -118 122 530 -12 -116 293 -81 147 434 -478 -231 635 -24 -698 88
6612 88 -143 -311 -70 169 -425 -334 77 -55 -517 -202 -280 -647 -55 80 -455 49 444 -601 3 113 131
6633 131 -250 25 97 -278 174 251 -273 154 158 97 -199 584 48 -322 726 94 3 211 415 131 293 105
6655 105 -68 -125 242 334 -110 190 -9 -71 295 215 -183 -348 366 -186 -335 -55 -191 -166 350 -166 -517 106
6677 106 150 -437 69 318 -569 -115 116 -186 -143 350 247 -316 278 65 -220 81 -27 -288 176 320 -264
6698 -264 -235 304 76 121 322 61 0 369 321 -124 151 541 95 107 184 95 -453 381 139 -409 -210 158
6720 158 -94 35 355 -288 -326 6 102 -383 -29 -219 -271 163 113 -479 -94 10 -282 -3 -12 68 -25 171 -420
6743 -420 -683 -38 111 -404 -300 187 -132 44 337 -149 -189 637 -46 -366 395 592 -370 399 259 -238
6763 -238 125 400 75 10 228 -181 -171 166 206 -275 -30 499 -362 -113 268 -256 -43 169 -269 -241 427
6784 427 4 -272 53 30 -112 -81 246 -462 -189 456 -223 -260 46 -305 -435 239 -116 -535 131 251 164
6805 164 25 280 359 -79 425 -200 -46 280 393 -352 -47 185 -125 186 432 108 -108 629 469 -207
6825 -207 -37 229 -377 377 109 -275 160 188 -132 -247 117 24 -302 -34 -237 -307 -94 39 -506 -116 196
6846 196 -176 -122 588 -275 -451 -29 -55 -243 169 36 14 264 160 39 13 551 145 -74 209 -27 -149
6867 -149 38 335 -95 -51 409 80 -79 184 60 -107 394 452 -469 204 563 -208 259 61 -142 -208 224
6888 224 -229 -179 -11 -124 -160 -260 111 -203 -121 264 -541 -309 -85 -51 -334 20 -28 -205 373 62 -359 -50
6910 -50 31 -413 -299 18 -136 15 115 -260 -202 367 218 -273 31 277 12 181 4 -266 -347 522 102
6931 102 -253 416 230 -131 311 -5 -238 -90 293 -153 -111 5 -68 10 203 -53 -277 47 -98 -23 -260
6952 -260 224 -223 -105 65 -142 -622 -186 -107 -529 -405 119 -39 -40 -23 -362 284 323 98 -486 14 -109 -59
6974 -59 179 217 -164 266 362 -70 -44 385 3 -295 76 210 -225 690 509 -249 -162 376 -59 -76 -1 -335
6996 -335 -99 407 35 -190 518 149 -79 -116 -68 -255 -196 297 -462 -100 -38 -1 -408 -117 288 -710 -114 0
7018 0 -621 -202 242 -255 -468 65 -47 -482 49 23 -278 -120 19 -211 242 254 -354 -232 323 137 -52
7039 -52 395 294 -21 203 128 -2 -24 318 -360 -81 492 7 -116 277 295 -442 77 60 -104 -64 117 -106
7061 -106 -232 152 -326 -370 219 -139 -376 146 15 -592 90 83 -471 -154 -156 -523 -304 343 -40 -280 -100 46
7083 46 -586 -79 159 -487 -228 142 170 -196 344 -169 -327 628 291 -284 236 251 -40 99 156 -289 -222 712
7105 712 -10 -78 78 2 132 219 175 -308 23 611 -136 42 25 -267 0 41 -262 -363 127 -147 -427 -253
7127 -253 381 -585 -136 30 -285 -514 605 -167 -360 -51 7 -288 175 -66 -316 174 197 233 1 246 -131
7148 -131 -79 104 65 -234 335 557 -149 158 160 31 230 395 -155 -35 -19 239 -147 -198 213 -139 87 316
7170 316 -67 -194 246 -12 -227 303 28 -104 132 -224 -571 -124 110 -237 145 163 -109 -265 -206 -496 -317
7191 -317 -86 335 -372 -273 111 -179 152 294 -231 -138 277 87 -525 -132 251 -122 51 125 39 68 451 -289
7213 -289 -230 158 -133 -93 269 290 -234 123 418 -111 211 442 -60 -35 20 -84 -328 146 118 -532 -123 0
7235 0 -282 53 236 -227 -146 116 -215 -363 57 -186 155 242 48 -443 -141 391 -195 55 325 79 -239
7256 -239 473 -171 -146 331 178 -39 220 226 57 106 483 -85 -74 177 317 -181 112 33 -36 250 307 -65 43
7279 43 163 -249 110 328 -169 -152 241 74 21 141 14 -259 -235 125 -77 101 164 -187 -471 -34 160 -614
7301 -614 -105 -166 -220 -51 170 -379 -306 315 -49 -426 276 173 -280 153 306 -220 -192 260 -110 -173 274 -53
7323 -53 93 343 139 -112 175 652 429 311 151 15 198 418 130 -368 273 78 -316 34 146 -219
7343 -219 378 -96 -261 -213 -42 -388 -160 -18 -464 -384 -22 2 -429 197 458 -132 -190 138 -379 -430 136 101
7365 101 -307 189 -102 -218 268 276 200 203 327 178 83 436 352 -65 168 355 -245 434 269 51 -74 160
7387 160 -75 172 472 -150 173 381 -12 -329 250 34 -331 41 284 -28 -114 182 23 -270 104 156 -536
7408 -536 108 7 -234 -13 139 -555 0 276 -452 -465 288 -173 90 321 100 -618 -7 209 -139 -255
7428 -255 468 57 -138 379 -133 -367 8 502 -377 234 170 -244 198 216 343 -167 225 -18 -166 150 -7
7449 -7 -231 -13 448 -262 -198 402 72 -205 90 -313 -123 171 34 -290 50 -146 -285 -122 -33 -157 -23
7470 -23 178 -75 -418 63 148 -397 42 223 -225 15 267 -92 -64 267 115 -200 201 33 -161 -92 57
7491 57 -213 219 289 -48 -148 331 -78 99 215 40 -128 52 217 -204 441 -28 -230 -100 417 -289 -254
7512 -254 263 -33 -112 267 197 -57 146 219 -431 -146 261 -106 -208 190 -96 -113 215 -34 -216 132 37 -216
7534 -216 -232 208 -164 -176 229 -167 -168 199 114 -467 43 221 -164 18 394 -130 7 439 162 -196 299 62
7556 62 -105 447 555 -58 -259 614 101 150 635 -60 -151 113 -30 -167 -65 134 -254 78 247 -207 -125
7577 -125 301 -202 -270 269 -20 -355 -34 63 -257 75 66 -221 -502 41 -17 -217 299 -15 -169 238 28 -97
7599 -97 80 66 -45 -128 197 -328 145 103 -12 -23 199 214 -211 343 271 2 219 63 -420 -245 579 -343
7621 -343 -595 346 -158 -276 115 -27 -315 243 65 -107 -406 186 -191 -208 168 -23 -292 240 -25 -392
7641 -392 0 -81 -261 67 269 -59 -79 510 -63 -185 -217 24 -192 45 534 -355 187 406 117 -72 226
7662 226 79 -68 353 204 -210 232 233 -115 -236 358 7 94 545 218 -271 3 51 -165 52 235 -163
7683 -163 -417 181 -110 -252 138 -88 -276 82 144 -464 82 -90 -150 -83 564 -401 -211 8 123 -47 304
7704 304 111 -471 -141 275 -135 33 293 -239 -103 201 -17 -375 158 -82 -216 57 -19 176 122 292 -194
7725 -194 -251 687 45 -98 72 -207 -185 -11 5 -308 -30 347 -149 -517 323 119 94 69 160 -322 -81 -106
7747 -106 -313 -234 -34 -537 -126 291 11 -340 90 -258 -584 61 38 -124 274 236 26 -33 321 -102 -365
7768 -365 346 -115 23 -86 179 -254 510 396 159 78 144 68 -274 302 2 -348 268 130 -102 126 122 -300
7790 -300 -255 -9 -184 -85 356 199 -156 106 -404 11 153 23 -641 -88 387 -269 -479 -27 -46 -19 250
7811 250 -18 -218 339 262 -54 32 150 -178 -367 121 -157 58 15 94 -266 275 48 -331 189 105 -138 -245
7833 -245 567 4 -49 128 -378 3 249 71 119 203 37 -195 -234 83 -351 -289 161 165 -321 233 47 -201
7855 -201 73 301 -181 -104 -34 -121 -266 240 -66 -76 102 177 -292 359 370 -486 -76 280 -134 -315 58 -122
7877 -122 -140 66 345 -22 400 29 -24 -40 298 23 -10 -141 -182 176 430 222 20 142 53 -103 134 -143
7899 -143 -230 235 540 -307 -157 23 -219 22 228 84 149 -241 142 -189 -291 224 -265 -109 328 -281 -104
7920 -104 271 -60 -386 -238 169 -310 -33 137 -586 -368 116 3 -321 225 153 -122 343 56 -239 78
7940 78 171 -62 166 234 51 -322 597 -98 -13 317 196 -34 -78 509 -70 215 417 -87 15 324 35 39
7962 39 -38 -90 -206 -17 -27 -79 -161 239 107 -18 374 -167 7 237 -74 -537 -122 -198 -181 40 123 -74 -244
7985 -244 129 -382 -162 -77 19 -216 162 -83 41 176 385 -13 221 277 1 63 333 249 -117 83 75 -303
8007 -303 95 465 20 173 234 163 -27 309 90 -55 189 68 -408 -67 -118 -91 195 110 213 -130 187 -16
8029 -16 -682 -66 -67 -419 119 110 -263 -286 41 -4 -167 -68 -35 -367 80 53 -181 -186 95 -306 -104 343 -176 -67
8053 -67 -33 -140 -250 -124 23 -230 140 390 -105 83 237 26 -223 449 37 113 353 -143 95 91 101 -327
8075 -327 -195 145 -3 38 316 -116 -314 15 -214 -11 -113 173 6 13 -19 -478 -34 -237 -21 -330 63
8096 63 -283 -219 350 -136 -283 13 74 -369 -216 404 -36 -203 351 -236 35 284 131 -137 275 469 -392
8117 -392 1 200 35 25 326 43 -331 -56 61 -90 -18 4 -448 -2 104 -197 -32 -68 57 124 -84 -37
8139 -37 -189 81 -97 -356 -86 -32 -298 -2 261 -108 -258 159 -62 -531 -238 -122 -254 56 260 -217 205
8160 205 277 157 -41 299 -50 -106 24 -2 -367 -205 186 -289 121 348 81 136 376 -44 -100 466 203 -196
8182 -196 96 368 -73 -1 213 -229 -302 226 -99
8191i9
##END NTUPLES=NMR FID
##END=
