##TITLE=1H_EC-3202(1)
 CDCl3, 8 sc, 
 25.7.2019
##JCAMPDX= 6.0         $$ Bruker NMR JCAMP-DX V2.0
##DATA TYPE= NMR FID
##DATA CLASS= NTUPLES
##ORIGIN= UXNMR, Bruker Analytische Messtechnik GmbH
##OWNER= root
$$ XWIN-NMR		Version 3.5
$$ Thu Jul 25 14:50:03 2019 Russian Standard Time (UT+4h)  she@DPX200
##.OBSERVE FREQUENCY= 200.13155
##.OBSERVE NUCLEUS= ^1H
##.DELAY= (6, 6)
##.ACQUISITION MODE= SIMULTANEOUS
##.ACQUISITION SCHEME= undefined
##.AVERAGES= 8
##.DIGITISER RES= 18
##SPECTROMETER/DATA SYSTEM= spect
##.PULSE SEQUENCE= zg30
##.SOLVENT NAME= D2O
##.SHIFT REFERENCE= (INTERNAL, D2O, 0, 15.7039)
##AUDIT TRAIL= $$ (NUMBER, WHEN, WHO, WHERE, WHAT)
$$ ##TITLE= Audit trail, XWIN-NMR		Version 3.5
$$ ##JCAMPDX= 5.01
$$ ##ORIGIN= Bruker BioSpin GmbH
$$ ##OWNER= she
$$ F:/spectra/data/she/nmr/H-F/1/audita.txt
$$ ##AUDIT TRAIL=  $$ (NUMBER, WHEN, WHO, WHERE, WHAT)
(   1,<2019-07-25 14:48:53.82 +0400>,<she>,<DPX200>,
      <created by zg, POWCHK disabled, PULCHK disabled
       configuration hash MD5:
       00 E9 B6 7A A2 85 ED C7 34 08 36 98 17 FE 4E 26
       data hash MD5: 16K
       C3 F0 4F E9 67 23 EF 9E 27 EB 44 43 20 D3 BE FC>)
$$ ##END=
$$ 
$$ hash MD5
$$ C0 98 73 65 D2 98 A3 38 6E 9B 5E 57 FE AB F4 3C
##$RELAX= 
##$RELAX= 
##$RELAX= 
##$RELAX= 
##$RELAX= 
##$RELAX= 
$$ Bruker specific parameters
$$ --------------------------
##$DU= <F:/spectra>
##$EXPNO= 1
##$NAME= <H-F>
##$PROCNO= 1
##$TYPE= <nmr>
##$USER= <she>
##$AMP= (0..31)
100 100 100 100 100 100 100 100 100 100 100 100 100 100 100 100 100 100 
100 100 100 100 100 100 100 100 100 100 100 100 100 100 
##$AQSEQ= 0
##$AQ_mod= 1
##$AUNM= <au_zg>
##$AUTOPOS= <>
##$BF1= 200.13
##$BF2= 200.13
##$BF3= 200.13
##$BF4= 200.13
##$BF5= 200.13
##$BF6= 200.13
##$BF7= 200.13
##$BF8= 200.13
##$BYTORDA= 1
##$CFDGTYP= 0
##$CFRGTYP= 5
##$CHEMSTR= <none>
##$CNST= (0..31)
1 1 145 1 1 1 1 1 1 1 1 1 1 1 1 1 1 1 1 1 1 1 1 1 1 1 1 1 1 1 1 1 
##$CPDPRG= <>
##$CPDPRG1= <>
##$CPDPRG2= <>
##$CPDPRG3= <>
##$CPDPRG4= <mlev>
##$CPDPRG5= <mlev>
##$CPDPRG6= <mlev>
##$CPDPRG7= <mlev>
##$CPDPRG8= <mlev>
##$CPDPRGB= <>
##$CPDPRGT= <>
##$D= (0..31)
0 1.2 0 0 0 0 0 0 0 0 0 0.03 0 0 0 0 0 0 0 0 0 0 0 0 0 0 0 0 0 0 0 0 
##$DATE= 1564051733
##$DBL= (0..7)
120 120 120 120 120 120 120 120 
##$DBP= (0..7)
150 150 150 150 150 150 150 150 
##$DBP07= 0
##$DBPNAM0= <>
##$DBPNAM1= <>
##$DBPNAM2= <>
##$DBPNAM3= <>
##$DBPNAM4= <>
##$DBPNAM5= <>
##$DBPNAM6= <>
##$DBPNAM7= <>
##$DBPOAL= (0..7)
0.5 0.5 0.5 0.5 0.5 0.5 0.5 0.5 
##$DBPOFFS= (0..7)
0 0 0 0 0 0 0 0 
##$DE= 6
##$DECBNUC= <off>
##$DECIM= 24
##$DECNUC= <off>
##$DECSTAT= 4
##$DIGMOD= 1
##$DIGTYP= 9
##$DL= (0..7)
0 120 120 120 120 120 120 120 
##$DP= (0..7)
150 150 150 150 150 150 150 150 
##$DP07= 0
##$DPNAME0= <>
##$DPNAME1= <>
##$DPNAME2= <>
##$DPNAME3= <>
##$DPNAME4= <>
##$DPNAME5= <>
##$DPNAME6= <>
##$DPNAME7= <>
##$DPOAL= (0..7)
0.5 0.5 0.5 0.5 0.5 0.5 0.5 0.5 
##$DPOFFS= (0..7)
0 0 0 0 0 0 0 0 
##$DQDMODE= 0
##$DR= 18
##$DS= 0
##$DSLIST= <SSSSSSSSSSSSSSS>
##$DSPFIRM= 0
$$ [...]
##$SUBNAM2= <"">
##$SUBNAM3= <"">
##$SUBNAM4= <"">
##$SUBNAM5= <"">
##$SUBNAM6= <"">
##$SUBNAM7= <"">
##$SUBNAM8= <"">
##$SUBNAM9= <"">
##$SW= 24.9336996594482
##$SWIBOX= (0..15)
0 0 2 0 0 0 0 0 0 0 0 0 0 0 0 0 
##$SW_h= 4990.01996007984
##$TD= 16384
##$TD0= 1
##$TE= 0
##$TE2= 300
##$TE3= 300
##$TEG= 300
##$TL= (0..7)
0 120 120 120 120 120 120 120 
##$TP= (0..7)
150 150 150 150 150 150 150 150 
##$TP07= 0
##$TPNAME0= <>
##$TPNAME1= <>
##$TPNAME2= <>
##$TPNAME3= <>
##$TPNAME4= <>
##$TPNAME5= <>
##$TPNAME6= <>
##$TPNAME7= <>
##$TPOAL= (0..7)
0.5 0.5 0.5 0.5 0.5 0.5 0.5 0.5 
##$TPOFFS= (0..7)
0 0 0 0 0 0 0 0 
##$TUNHIN= 0
##$TUNHOUT= 0
##$TUNXOUT= 0
##$USERA1= <user>
##$USERA2= <user>
##$USERA3= <user>
##$USERA4= <user>
##$USERA5= <user>
##$V9= 5
##$VALIST= <valist>
##$VCLIST= <CCCCCCCCCCCCCCC>
##$VD= 0
##$VDLIST= <DDDDDDDDDDDDDDD>
##$VPLIST= <PPPPPPPPPPPPPPP>
##$VTLIST= <TTTTTTTTTTTTTTT>
##$WBST= 1024
##$WBSW= 4
##$XGAIN= (0..3)
0 0 0 0 
##$XL= 0
##$YL= 0
##$YMAX_a= 666842
##$YMIN_a= -906249
##$ZGOPTNS= <>
##$ZL1= 120
##$ZL2= 120
##$ZL3= 120
##$ZL4= 120
##$ABSF1= 10
##$ABSF2= 0
##$ABSG= 5
##$ABSL= 3
##$ALPHA= 0
##$AQORDER= 0
##$ASSFAC= 0
##$ASSFACI= 0
##$ASSFACX= 0
##$ASSWID= 0
##$AUNMP= <proc_1d>
##$AZFE= 0.1
##$AZFW= 0.1
##$BCFW= 1
##$BC_mod= 2
##$BYTORDP= 1
##$COROFFS= 0
##$CY= 11.3945322036743
##$DATMOD= 1
##$DC= 2
##$DFILT= <>
##$DTYPP= 0
##$F1P= 18.9103706918063
##$F2P= -1.10871071338519
##$FCOR= 0.5
##$FTSIZE= 0
##$FT_mod= 4
##$GAMMA= 1
##$GB= 0.15
##$INTBC= 1
##$INTSCL= 1
##$ISEN= 128
##$LB= 0.24
##$LEV0= 0
##$LPBIN= 0
##$MAXI= 10000
##$MC2= 0
##$MEAN= 0
##$ME_mod= 0
##$MI= 1.114404
##$NCOEF= 0
##$NC_proc= 0
##$NLEV= 6
##$NOISF1= 3.799351
##$NOISF2= 2.8
##$NSP= 1
##$NTH_PI= 0
##$NZP= 0
##$OFFSET= 15.70392
##$PC= 1
##$PHC0= -8861.673
##$PHC1= 12.00097
##$PH_mod= 1
##$PKNL= yes
##$PPARMOD= 0
##$PSCAL= 0
##$PSIGN= 0
##$REVERSE= no
##$SF= 200.130013532006
##$SI= 16384
##$SIGF1= 3
##$SIGF2= 2
##$SINO= 400
##$SIOLD= 16384
##$SREGLST= <1H.CDCl3>
##$SSB= 0
##$STSI= 0
##$STSR= 0
##$SW_p= 3612.71676300578
##$SYMM= 0
##$S_DEV= 0
##$TDeff= 0
##$TDoff= 0
##$TI= <>
##$TILT= no
##$TM1= 0
##$TM2= 0
##$TOPLEV= 0
##$USERP1= <user>
##$USERP2= <user>
##$USERP3= <user>
##$USERP4= <user>
##$USERP5= <user>
##$WDW= 1
##$XDIM= 8192
##$YMAX_p= 0
##$YMIN_p= 0
$$ End of Bruker specific parameters
$$ ---------------------------------
##NTUPLES= NMR FID
##VAR_NAME=  TIME,          FID/REAL,        FID/IMAG
##SYMBOL=    X,             R,               I
##VAR_TYPE=  INDEPENDENT,   DEPENDENT,       DEPENDENT
##VAR_FORM=  AFFN,          ASDF,            ASDF
##VAR_DIM=   8192,          8192,            8192
##UNITS=     SECONDS,       ARBITRARY UNITS, ARBITRARY UNITS
##FACTOR=    0.0002004,     1,               1
##FIRST=     0,             0,               0
##LAST=      1.6414764,     0,               0
##MIN=       0,             -906249,         0
##MAX=       1.6414764,     666842,          0
$$ Real data points
##PAGE= N=1
##DATA TABLE= (X++(R..R)), XYDATA
$$ [...]
2490B364j296j194n63j95L500O19n879j183O830m4n178J768K357l534k80L065
$$ 2364 1068 -126 -689 -884 2616 3235 -2644 -3827 3003 2959 -2219 -451 1906 -1628 -1908 1157
2506A157j900j336L633M01m513j529L086L650j50m500j742L479J408j995Q16J059
$$ 1157 -743 -2079 1554 1955 -2558 -4087 -1001 2649 2499 -2001 -3743 -264 1144 -851 -35 1024
2522A024k615R57K953l454j654N331J171n256m51K976m54P88Q25l213j021M769
$$ 1024 -1591 -634 2319 -1135 -2789 2542 3713 -1543 -1994 982 528 1316 2141 -1072 -2093 2676
2538B676L36m726L1K313L17J046r91l219O51L143r47j088J168j307p13K207j443
$$ 2676 3012 -1714 -1683 630 947 1993 1002 -2217 -1566 1577 630 -458 710 -597 -1310 897 -546
2555e46k458M375K654n168k884M010J332j227J212p96k413M58K096N70j039j189
$$ -546 -3004 1371 4025 -1143 -4027 -17 1315 88 1300 504 -1909 -1451 645 1215 176 -1013
2571a013O44K362k134l575L990L634n038j978M991j071l753L421K178n218M85
$$ -1013 -369 1993 -141 -3716 274 3908 -1130 -3108 1883 812 -2941 480 2658 -2560 -2075
2586b075N425k156m721K104K772o44J96q78j497J199J024p16O08N81j896O93J485
$$ -2075 3350 1194 -3527 -1423 1349 705 901 23 -1474 -275 749 33 641 1222 -674 19 1504
2603A504k513l89M248j86l975L9J446l36J744Q47l665o90K971j53j673P44l5m56
$$ 1504 -1009 -1398 2850 2664 -1311 -1272 174 -162 1582 2429 -1236 -1926 1045 892 -781 -37 -72 -528
2621e28J395q41k114J448J353r26J50K6k466J902L079l544k389N307Q59n214P48
$$ -528 867 26 -2088 -640 713 -213 -63 -37 -2503 -601 2478 -1066 -3455 1852 2711 -2503 -1755
2638a755L091k373J6M085k412m231K534L850j970k284J085J589k78j624q71K728
$$ -1755 1336 -1037 -1021 3064 652 -3579 -1045 2805 835 -1449 -364 1225 947 -677 -1548 1180
2654A180J062k253l7R85k323M38M304j598n006K564M077k891k608J884Q67K27
$$ 1180 2242 -11 -48 937 -1386 -948 3356 1758 -3248 -684 3393 502 -2106 -222 645 872
2670H72O37k413j294K549J064j558M22q85j150K562P92m206M37M634j211l643
$$ 872 1509 -904 -2198 351 1415 -143 279 -606 -1756 806 1598 -2608 -2171 2463 1252 -2391
2686b391J060P64l80K435K8m393L64M399q48k452J173O61p64J373o71k121J610
$$ -2391 -1331 -567 -947 1488 1516 -2877 -2513 1886 1038 -1414 -241 420 -344 1029 358 -1763 -153
2703a53K015j004j320k49M64K055n5l781O66M483j615l222J922N42j760K351J591
$$ -153 1862 858 -462 -711 -247 1808 1753 -2028 -1362 3121 1506 -1716 206 748 -1012 1339 2930
2720B930m763j215M968M81l643M93J323k63j59r13r83K379J151k401o19J120j331
$$ 2930 -1833 -3048 1920 2401 -1242 -749 574 311 152 -761 -1744 635 1786 -615 -1234 -114 -1445
2737a445J390K881l505l435M250K458l718o94K146l16o21J202j021r86K030M37
$$ -1445 -55 2826 -679 -4114 136 2594 -1124 -1818 328 12 -609 593 -428 -1414 616 1053
2753A053j425P0j56P3J966o77l038J666L222k017j899J307m30L3K499j200l266
$$ 1053 -372 -302 -458 -385 1581 904 -2134 -468 2754 737 -1162 145 -285 -252 2247 1047 -2219
2770b219K048K160k393p2K038j690m37J880j629j543K810J273k820p67J274J72
$$ -2219 -171 1989 -404 -476 1562 -128 -565 1315 -314 -1857 953 2226 -594 -1361 -87 85
2786H5P41K49k643K53K482r99j310J638r75j264K816L27l846Q35L655j557k442
$$ 85 826 1075 -1568 -1315 1167 168 -1142 496 -479 -1743 1073 1400 -2446 -1611 2044 487 -1955
2803a955J433O56l55J116r79j703J692J189j087m3k44j336K155K425l535j952
$$ -1955 -522 134 -221 895 -84 -1787 -95 1094 7 -36 -280 -1616 539 2964 -571 -2523
2819b523L884N84k875R58R71j465P58J235k133n69K859j17j758K51p30J53K491
$$ -2523 1361 1945 -930 28 999 -466 292 1527 -606 -1175 1684 1567 -191 60 -670 -517 1974
2836A974q53l286J493K481j844q84J421j049k34K057j343k325K315J441j998j71
$$ 1974 1121 -2165 -672 1809 -35 -919 502 -547 -781 1276 -67 -2392 -77 1364 -634 -805
2852h05K09p11J677J543l441j003L515M21k317Q3P00n89J745K35k774N79K483
$$ -805 -596 -1307 370 1913 -1528 -2531 984 1405 -912 -829 -129 -718 1027 1262 -1512 -933 1550
2869A550p70j443R79p13J26K784j531l509J995L418k111j753J150k13J35J705
$$ 1550 780 -663 316 -397 -271 2513 982 -2527 -532 2886 775 -978 172 -41 94 1799
2885A799j599j799J816Q89j272J83n79o26K389R16m144k03M315q24k909J480O48
$$ 1799 200 -1599 217 1106 -166 17 -562 -1188 1201 2117 -2027 -2230 2085 1261 -1648 -168 480
2902D80j676J348R63k521m20K679k7j536o8pQ29J376j997j690K760J100k548K15
$$ 480 -1196 152 1115 -1406 -1826 853 826 -710 -778 -785 44 1420 -577 -2267 493 1593 -955 -740
2920g40J007j096R60J713k387j487L144N18k290K88P05p33J392O61k972J04L242
$$ -740 267 -829 131 1844 -543 -2030 1114 1632 -658 -370 335 -398 994 1655 -1317 -1213 2029
2937B029p11k238P50K62O4J418p90k420J135K160j425m40O79j747N45K794k086
$$ 2029 1318 -920 -170 92 156 1574 784 -1636 -501 1659 234 -206 473 -1274 -729 2065 -21
2954b1k581K974J740l083l30J727q41j31J463j209j366J481J044p15l64q92L68
$$ -21 -2602 372 2112 -971 -1301 426 -415 -546 917 -292 -1658 -177 867 152 -212 -1104 -736
2971g36K397q43l017J537K377k130p23K336j107j427K514J35l465J336L130j844
$$ -736 1661 818 -2199 -662 1715 -415 -1138 1198 91 -1336 1178 1313 -2152 -816 2314 470
2987D70j349P37p0M66J340j572j580J862J178j895N08M85j624J296J245k358o23
$$ 470 -879 -142 -212 254 1594 22 -1558 304 1482 -413 95 580 -1044 252 1497 -861 -1484
3004a484K859k73j472M77k68m50J792K67l211N81K712q95j459P58m73m62K038
$$ -1484 1375 1102 -370 107 -161 -611 1181 1448 -1763 -1182 1530 635 -824 -66 -539 -1001 1037
3021A037m94k229Q38J319q45R1j29p46J256J336k863j317M005J91k719J087N02
$$ 1037 543 -1686 -848 471 -374 -283 -412 -1158 98 1434 -1429 -2746 1259 1450 -1269 -182 320
3038C20j661J425K194k574j772K845P69j834J41K77J81J176p48k169J387J907
$$ 320 -1341 84 2278 -296 -2068 777 1546 -288 -147 130 311 1487 739 -1430 -43 1864
3054A864j456m10P81j580M22K402j384k821K052J940j816m74K25p68J283J242
$$ 1864 408 -2 779 -801 -379 2023 639 -2182 -130 1810 -6 -480 -255 -1023 260 1502
3070A502k376p94K387j96j420P97P0j475K211P52l309K1K932l18j638O92m95l15
$$ 1502 -874 -1668 719 523 -897 -100 -30 -1505 706 1458 -1851 -1830 1102 784 -854 -162 -657 -972
3088i72K241m78k416J130K057j761l66J019q86M38J810j336k152J761J272j075
$$ -972 1269 791 -1625 -495 1562 -199 -565 454 -432 6 1816 480 -1672 89 1361 286
3104B86m78L82q73J548L69k476K51K779p65j740J122k54j487K358P29k992M0K638
$$ 286 -192 190 -683 865 1234 -1242 -991 1788 1023 -717 405 151 -1336 1022 1751 -1241 -1201 1437
3122A437p36j451O18m40K95J715j653k109K084J464j720k6P54j626O08K548j967
$$ 1437 701 -750 -132 -572 -277 1438 -215 -2324 -240 1224 -496 -522 232 -1394 -786 1762 -205
3139b05k390K659J561k038m63N83m94J351Q03j935l26J187n8k56J004j227n35
$$ -205 -2595 64 1625 -413 -876 -293 -787 564 1367 -568 -894 293 235 -21 983 -244 -779
3156g79K143m13k707J657K280j657r61R02j124K32K168q76k147J225J170j426
$$ -779 1364 951 -1756 -99 2181 524 -437 465 -659 -427 1741 865 -1282 -57 1113 -313
3172c13o2J076j269M65J594j820j121J912M70j585O61p9p57J366J45k518Q28K642
$$ -313 -375 701 -568 -103 1491 -329 -1450 462 932 -653 8 -71 -828 538 683 -1835 -1007 1635
3190A635j108j434P72p69m97K536L25l091N49J968r56n91N60PK97P36j543r66
$$ 1635 527 -907 -135 -904 -1401 1135 1460 -1631 -1082 886 -70 -661 -101 -94 203 939 -604 -1570
3208a570K066M85r92N25q97j245K144K090l059j400K963O4j768Q02L70j361J667
$$ -1570 496 981 -11 514 -383 -1628 516 2606 -453 -1853 1110 1174 -594 208 578 -783 884
3225H84P77j998n17J438j79l54M00p89j0J600j062k156J666J865j634l16L57j358
$$ 884 1661 -337 -854 584 405 51 451 -338 -348 1252 190 -1966 -300 1565 -69 -385 -28 -1386
3243a386P33K179j225j931J389M79j333Q34O28p95O77O07k286j54K537q7j058
$$ -1386 -653 1526 301 -1630 -241 238 -1095 -261 367 -428 249 856 -1430 -1584 953 866 -192
3260a92o3m33l5J728n4k266J093J419j245k39R43j502N07K446r40k853J594J716
$$ -192 -255 -688 -723 1005 951 -1315 -222 1197 -48 -287 656 -846 -339 2107 1167 -1686 -92 1624
3278A624j455l39M45l53M09Q97j793q78J950O86q14K13j140j292K520J363k945
$$ 1624 169 -170 275 -78 331 1228 -565 -1443 507 1193 379 592 -548 -1840 680 2043 -902
3295i02l98K147q35j269J455o3j052J337J26k046K90J478j09l53K07j101Q55J603
$$ -902 -1300 847 12 -1257 198 135 -917 420 546 -1500 -1210 268 159 -194 13 -1088 -233 1370
3313A370j784j282K027N24j332N16Oj231J358J594j730j206J513Q4r53J015J3
$$ 1370 -414 -1696 331 855 -477 39 45 -1186 172 1766 36 -1170 343 427 -526 489 502
3330E02q78J404j7k434O04K280m84r06L76j308K07J923l12k130J201J089j264
$$ 502 -376 1028 1011 -1423 -819 1461 977 71 447 -861 -654 1269 957 -1173 28 1117 -147
3347a47R9K61j143O79J980j768j875J804R61j335J52K90o45Q50N12j840j54J719
$$ -147 -48 213 -930 -251 1729 -39 -1914 -110 851 -484 -332 -42 -687 163 675 -1165 -1319 400
3365D00Q4n13M5j358j61K900L8k967Q47J882j520m89J570o30q62J743k81k216
$$ 400 484 -29 16 -1342 -1503 1397 1435 -1532 -685 1197 -323 -812 758 128 -734 1009 728 -1488
3383a488J025J585m01l66k76q14J007J520j944p64J739n3j166R05m46j418J832
$$ -1488 -463 1122 721 355 79 -735 272 1792 -152 -916 823 770 -396 509 63 -1355 477
3400D77J392k367n59J711k68r99R33l37m58J270l50k062R61J606o50l37J6j300
$$ 477 1869 -498 -1057 654 386 -613 320 -17 -475 795 445 -1617 -656 950 300 -37 -21 -1321
3418a321O23J839q65j393J150m0r67J297M5j252J124J130k073q28K430N8j555
$$ -1321 -698 1141 276 -1117 33 -7 -974 323 368 -884 240 1370 -703 -1531 899 957 -598
3435e98P58j1r96J288P83j616m01J586k08k21j91q96L09K153j138j712J305Q53
$$ -598 160 149 -847 441 1224 -392 -793 793 585 364 173 -723 -414 1739 601 -1111 194 1047
3453A047j706M09J165j487L80J814j367k103J771J387r72l54m71p67J151J275
$$ 1047 -659 -250 915 -572 -192 1622 255 -1848 -77 1310 338 -16 -487 -1254 -103 1172
3469A172j399n00J010m00l52Q96q63o16J887q3k253M30J696p61OO69j279k8J902
$$ 1172 -227 -727 283 -117 -469 427 -436 -1052 835 752 -1501 -1071 625 -136 -130 539 -740 -768 1134
3488A134p73j501J004R07q13K95%j226O00J609r81r01J234m0q43Q22n24o21J731
$$ 1134 361 -1140 -136 771 -42 253 253 -973 -373 1236 255 -646 588 548 -295 527 3 -618 1113
3507A113K06k532K12K111o99o86R15q99j011J940O00k180O5J559n61o41J54m59
$$ 1113 1319 -1213 -1001 1110 411 -275 640 -259 -1270 670 1270 -910 -845 714 153 -488 -334 -793
3525g93O63J201j224j297J297P38r45N62l99j175J242J663k001j359K035M61q21
$$ -793 -130 1071 -153 -1450 -153 585 -360 202 -197 -1372 -130 1533 -468 -1827 208 669 -152
3542a52K90o84n67J817L91j783L0J221m95l1N37j208L1K045m08k112P29J263p81
$$ -152 138 -546 -1113 704 1095 -688 -658 563 68 37 574 -634 -603 1442 1034 -1078 -349 914 133
3561A33K10J22j080J55J905q51j665J472K74q79J97K57j039O19J398j403q38J146
$$ 133 343 465 -615 -460 1445 594 -1071 401 675 -204 -7 250 -789 -170 1228 -175 -1013 133
3579A33R7m62K17k97l30J399m22j517O98J193q01p6N54j407J93K070o79j824J002
$$ 133 230 -232 -15 -312 -642 757 335 -1182 -484 709 -92 -168 386 -1021 -828 1242 563 -1261 -259
3598b59J196j147j02L77q10P79J284j572p80J454K82q09O47m21j014J542J194
$$ -259 937 -210 -312 65 -745 34 1318 -254 -1034 420 702 -107 540 119 -895 647 1841
3615A841k304p05J842l4o79K11m31k47J299R5j219j77P99k74K00K45j229K96J603
$$ 1841 -463 -1168 674 640 -39 172 -259 -506 793 888 -331 -508 291 17 217 462 -767 -471 1132
3634A132q83j436J313K69p48O22k00j356R34J439j231q08J175l00o66J148l98
$$ 1132 249 -1187 126 395 -353 269 69 -1287 -353 1086 -145 -953 222 -78 -744 404 6
3651Fj074J212Q39j734j38J561m98n67Q01o77m25J465kj611M68J092o92J42L84
$$ 6 -1068 144 983 -751 -889 672 174 -393 408 -269 -694 771 769 -842 -374 718 26 168 552
3670E52j004M4J545n51j312Q58N29n00K07l53n60R75O09j588k8Q70m00K90O82
$$ 552 -452 -408 1137 586 -726 132 661 161 368 15 -545 430 1039 -549 -577 293 -107 183 865
3689H65j626q24K292O60k281j50J626o54l24Q35r66m62J902k22j867N40Q70l73
$$ 865 -761 -1585 707 1367 -914 -1064 562 -92 -416 419 -547 -1009 893 671 -1196 -656 214 -159
3707a59L66l3j216N82J447j164q99J302J51m54M93l07r35R12J052j117n79R83
$$ -159 207 174 -1042 -460 987 -177 -1076 226 377 -77 416 109 -826 86 1138 21 -558 425
3725D25k20k07M64n89n12J638j70j566M49R42o43N14J34j442J76J891r73j334
$$ 425 205 -2 462 -127 -639 999 829 -737 -288 654 11 525 659 -783 -607 1284 311 -1023
3743a023J410K21j156O93K53j369O87J480j323j226J379O46j040L34J32p61Q32
$$ -1023 387 608 -548 145 398 -971 -284 1196 -127 -1353 26 672 -368 -34 98 -663 169
3760A69O29j340l71R81j06J42J94j229K96J717p33j453R59R05r40L85M35j318
$$ 169 798 -542 -913 68 -38 104 298 -931 -635 1082 349 -1104 -145 760 -180 205 640 -678
3778f78L50J427m98j362P77L82k86N36m13j115J033R91j239m92J153k62n45R51
$$ -678 -328 1099 601 -761 16 398 112 648 235 -880 153 1144 -95 -587 566 304 -241 710
3796G10r70q66J379Q54j648k09J141m41k36N60p43l67J249k36j068O00M49m61
$$ 710 -260 -1126 253 1107 -541 -750 391 -50 -286 274 -469 -836 413 177 -891 -291 158 -303
3814c03N84j28p40K18Q46o89m09P62j3m28P29m11q62J202O06j651R2J399p24l45
$$ -303 281 153 -587 -369 477 -212 -621 141 128 -300 429 18 -844 358 964 -687 -595 804 80 -265
3834b65R24n08p93J178N83j631N9R35k31QM83j158NJ471o03j198P13N17n65M37
$$ -265 659 151 -642 536 1119 -512 -453 482 251 259 742 -416 -411 1060 457 -741 -28 489 -76 361
3854C61k38p16M13J162q03r90N87L12k43N57q65n12J197O86j461K00N72m19k2
$$ 361 123 -593 -180 982 179 -811 -224 88 -155 402 -463 -975 222 908 -553 -353 219 -200 -222
3873b22R02j209r37J932K27j310J09P67m09K75K28j116J20J705n46j356P70K00
$$ -222 680 -529 -1466 466 693 -617 -508 259 -150 125 353 -763 -643 1062 516 -840 -70 130
3891A30k21O50n9j346O71J160q84n60P98R1m93K83j62o50J298J51j267n9Q99m98
$$ 130 -91 559 500 -846 -175 985 101 -459 339 430 -63 220 58 -592 706 857 -410 -469 430 -68
3911f8J53L49r85L9J026k23j152N02N74l12L89j84j333P28J506j227r13J274J63
$$ -68 85 434 -551 -512 514 291 -861 -359 215 -97 292 108 -1225 -497 1009 -218 -1131 143 306
3930C06p46N17j56r18J062J109j103j249J156L11J9K9q77k19J411K00j269M58
$$ 306 -440 77 -79 -997 65 1174 71 -1178 -22 289 308 337 -540 -759 652 852 -417 41
3948D1L64n59L33N33j509J95J738m47j303K54R22n50L15J24j057O28P37o99m53
$$ 41 405 -154 179 712 -797 -602 1136 689 -614 -360 562 12 327 451 -606 22 759 60 -393
3967c93N18k83qQ45o52r95J175N28j325N9P79n86P7M27o21k93J309r2j246K31
$$ -393 125 -158 -166 679 27 -968 207 735 -590 -531 248 -338 -261 166 -455 -748 561 469 -777 -546
3987e46Q94n76Q9N79q48j70J096k59r61O90M30l71K96k33r50J148Q80j389k26
$$ -546 348 -228 -139 440 -408 -578 518 259 -702 -12 418 47 343 110 -840 308 1188 -201 -427
4006d27J022m57j04P53n56j042J208R22j759j27R50k55K19P8q48k48J152P6j047
$$ -427 595 138 34 787 231 -811 397 1319 -440 -567 383 128 347 425 -423 -671 481 557 -490
4025d90N32N8l20M59Rj116N37J247o27j057O86j1m16P63n7j094O01J000r33l57
$$ -490 42 100 -220 239 248 -868 -331 916 289 -768 -82 -93 -509 254 197 -897 -296 704 -229 -586
4045e86P19n06Q8Q64q61p45J236M01q97K23L37o34J90O67o93j54J327l94j287
$$ -586 133 -373 -285 579 -282 -1027 209 610 -287 -64 273 -361 -171 496 -197 -351 976 582 -705
4064g05Q75k8k97P35M9j206K55J072n28p17Q26k03k24P69o56q21J227N32j298
$$ -705 170 142 -155 580 629 -577 -322 750 222 -495 331 128 -96 673 17 -804 423 955 -343
4083c43j59P06l29K02M46q90o53J720o0j452J17N91K4J13K01j096Q1J239k87q15
$$ -343 -502 204 -125 77 523 -367 -1020 700 640 -812 -695 -104 -80 33 234 -862 -781 458 171 -644
4103f44Q62k04k54O37o02q50J017J313j310q60R87l7j07O08k33j098R61O52j036
$$ -644 218 14 -240 397 -205 -1055 -38 1275 -35 -895 92 55 -52 556 323 -775 186 838 -198
4122a98K35L38k44P4M83r51m01J550m15j031O56K92p12M94L64j296M20J166p18
$$ -198 37 375 131 205 688 -263 -664 886 471 -560 96 388 -324 170 534 -762 -342 824 106
4141A06j062P94K16k42O47l01j178O50R18j116K1Q75l80k37L74l85n10J428k04
$$ 106 -956 -162 54 -188 459 158 -1020 -370 548 -568 -547 328 -52 -289 85 -300 -810 618 414
4160D14j155K89O15m89L95O13j411J46J569l61j214O87L86m00K84p8o86L55R02
$$ 414 -741 -452 163 -326 69 682 -729 -583 986 625 -589 98 484 84 368 290 -396 -41 861
4179H61o28l66L74j55n7N21n04p38J264N72j418k63P55o43L77Q81q47r25J187
$$ 861 233 -133 241 86 29 550 46 -692 572 1144 -274 -537 218 -425 -48 833 -14 -939 248
4198B48K86r96J55K61j02L3K88r31J72J116k63o41L42k68l07J040k90q23N13Q94
$$ 248 534 -462 -307 -46 -148 -115 173 -758 -586 530 267 -374 -32 -300 -607 433 143 -680 -167 727
4218G27q07k66L59j80k69R11k44r74P98O28r95K10M89k60j31M34o84j22R76l4
$$ 727 -80 -346 13 -167 -436 475 231 -743 55 683 -312 -102 387 127 -4 430 -254 -376 600 566
4238E66r53L70J76m31O85L07j196o0J326o42p78Q36K61p18N82O0j104M51Q86q07
$$ 566 -387 -17 159 -272 413 720 -476 -536 790 148 -630 206 467 -251 331 391 -713 -262 624 -183
4258a83l04K53n7K42M58q90n33J492J47j169J43L92n17O52N04j027n57J365Or75
$$ -183 -487 -234 -291 -49 409 -481 -1014 478 625 -544 -401 -9 -526 126 630 -397 -954 411 417 -558
4278e58J75L11j20N81j32r14K65J142n38m61M67l96j11J083n92r56R95O96j147
$$ -558 -383 -72 -192 389 257 -657 -392 750 212 -249 218 -178 -289 794 202 -754 241 937 -210
4297b10Q0N75m80r1O67o28m25R56J80p88J60M09o67L67L38j010J67J045m38q99
$$ -210 -130 445 -35 -126 541 -87 -512 444 624 -164 -4 405 -262 105 443 -567 -400 645 207 -692
4317f92O40J76n36P88j7j109N63O58q53m47Q02K03m06M56j54o20P42N01p61m14
$$ -692 -52 124 -412 376 359 -750 -187 471 -382 -829 -27 176 -230 226 72 -548 194 695 -66 -480
4337d80M34j11M52K03j036J16J237l58r44Q44r3n71P72L42j378JJ283k84q05L30
$$ -480 -46 -157 295 498 -538 -422 815 457 -487 357 264 -307 465 807 -571 -570 713 429 -376 -46
4357d6K33l84P22k69p04N03O08n77r4K93o28L08O25n90j085J329L9p71M35L65
$$ -46 187 -197 525 256 -448 55 663 86 -8 285 -343 -35 590 0 -1085 244 283 -488 -53 312
4377C12p98N09L29q74N9P63j00m34J67R8j60N24o0r59N24O84q97j48Q50l14m49
$$ 312 -486 23 352 -522 -463 300 200 -234 -67 31 -129 395 335 -624 -100 584 -313 -461 389 75 -374
4398c74R90m14p27P61O21j028k03Q22l69l29P96n90o99J237K78q79j87L49k43
$$ -374 616 202 -525 236 857 -171 -374 448 79 -250 546 -44 -743 494 772 -107 -294 55 -188
4417a88M15Q9p27oR33o67o7L73k41l10P59J19j467O21J192r03l81N62n27J65Q10
$$ -188 227 316 -411 -417 516 -151 -218 155 -86 -396 363 482 -985 -364 828 -75 -456 106 -421 -256 554
4438E54p56o82R74L31p63R3L91n06L94P19j099m73J268J77q74J96K99n42M48N27
$$ 554 -202 -884 90 421 -342 -249 142 -364 30 749 -350 -823 445 622 -252 -56 243 -299 149 676
4458F76r10j90J166l44m10K29k80K29M55m59p03O78K14n58j67O13m83J69Q08j055
$$ 676 -234 -424 742 398 -12 217 -63 166 621 162 -541 137 351 -207 -374 239 -244 -75 733 -322
4478c22l23R54J85j109O35N4p02P53N05j175k83J210j25p35L61M20m73M34M5j141
$$ -322 -645 309 494 -615 20 74 -628 125 630 -545 -828 382 257 -478 -117 303 -170 264 309 -832
4498h32M31J081o02n36M80m8l00J033j93j363P39P50q55j50O44l96L41L01m34
$$ -832 -401 680 78 -458 22 -26 -326 707 514 -849 -110 640 -215 -365 279 -117 224 525 91
4517I1n40Q17k9j78J42l34l04O55K44j049O4J254o62o40Q75m21o34R48K36j144
$$ 91 -449 368 339 161 303 -31 -335 320 564 -485 -421 833 171 -469 406 -15 -649 299 535 -609
4537f09M09P11n94l57N22j82k42Q58n01o57N27L69n93M2L90m47O9P01p67k46R26
$$ -609 -200 511 -83 -440 82 -100 -342 516 15 -642 -115 254 -339 -297 93 -354 -285 416 -351 -597 329
4558C29l1o84L57K01m41N44J87q53L2R13k96n51N20k21j89N88k11p15O69N12q57
$$ 329 298 -386 -29 172 -269 275 462 -391 -359 554 258 -293 227 6 -183 405 194 -521 148 660 -197
4579a97J01M72l39k76R35o37q23J217K82q46j90N70o89L02P92p33o51J051j59
$$ -197 -96 376 37 -239 696 59 -764 453 735 -111 -301 269 -420 -118 674 -59 -710 341 182
4598A82p69L46o8k3O17J64r87J90R22q36k4M61n29j30R46l08p38M48O30n01J10
$$ 182 -587 -241 -309 -332 285 449 -538 -348 574 -262 -286 175 -354 -484 462 154 -584 -136 494 -7 103
4619A03P0k94R1M29l50j87N38j53n62N27j0n01O05K55q43n6J047m64k78K54p8
$$ 103 173 -121 -30 399 49 -138 400 247 -315 212 202 -299 306 561 -282 -338 709 245 -33 221 143
4640A43n09O24K27r86J77P80l18n10O22l78j23N78m85n92P74O0m39K85J59m08
$$ 143 -366 258 485 -501 -324 456 138 -372 250 -128 -251 327 -158 -750 24 84 -355 -70 89 -319
4660c19M58K48p50n11J168N7p25L84M8m48O30K16q74p6Q58k44l59K90l06K39N64
$$ -319 139 387 -363 -874 294 351 -374 10 58 -390 240 456 -418 -494 364 120 -239 51 -255 -16 548
4681E48m75o90P44K91m69J00L78p09JJ031m91q79R34L79q14J45K96o38L76O34
$$ 548 73 -617 127 418 -51 49 427 -282 -281 750 259 -620 314 693 -121 24 320 -318 58 692
4701F92q04m48R18k50m67M18j79k38N57J37r24L53O24p24m9P97n88l94J025m16
$$ 692 -112 -560 358 108 -359 59 -120 -358 199 336 -588 -235 389 -335 -384 413 -175 -569 456 40
4721D0p77P28N32p02k36K98o1M2M57l34o79R26J46o04J99rj36N89J4j128M74R58
$$ 40 -737 -9 523 -179 -415 -117 -178 -136 321 -13 -692 234 380 -224 -25 -34 -170 419 433 -695 -221 737
4743G37m05m80N02j78l07N58O0p94m1P70j15m59K17j25P3L25l86m57O92L9n18
$$ 737 332 -148 354 176 -131 427 487 -307 -348 422 307 -152 65 -60 13 338 -48 -505 187 226 -292
4764b92M86k0p71L99P81r39l43J024Qj013N78L14o35M30N01p71q2P02l00j70J82
$$ -292 194 174 -597 -198 583 -356 -699 325 333 -680 -102 212 -423 7 508 -263 -345 357 57 -113 69
4785F9l04L0M00%p07O93L51p49L20L26o33N2Q10n77m30O35J83q38L99J23k58J98
$$ 69 -235 -205 195 195 -512 181 532 -217 103 429 -204 -152 658 81 -349 286 469 -369 30 153 -105 93
4807I3L13m63l23Q17l38q6K61m28r5P11j14r38M77P87j026K0N37l27n95R80Q7
$$ 93 406 -57 -380 437 99 13 274 -154 -249 462 348 -590 -113 674 -352 -332 205 -122 -717 263 350
4828C50r21L78P52n79j60J52j16J76K53l92l92O29J8j59L13l21o51Q73M29r16
$$ 350 -571 -193 559 -20 -180 -28 -144 32 285 -107 -499 130 148 -11 302 -19 -670 203 632 -284
4848b84J2P73l37l02L73k88k47O20Ln64L30K84l96L0K51o01L28N19o55k26N64
$$ -284 -272 501 164 -138 235 -53 -300 320 323 -241 89 373 -23 7 258 -343 -15 504 -151 -377 187
4869A87J34n19J81K45q82O39O68o66n11O39K75o23J49K50m77K88L19n07j95P28
$$ 187 321 -198 -17 228 -654 -15 653 -13 -524 115 390 -233 -84 166 -311 -23 296 -211 -406 322
4889C22l81q8K51n40J52Q12m21q12Q79J82n71J25M65p82L04P17m18r15P01N00
$$ 322 -59 -147 104 -436 -284 528 107 -705 174 356 -215 -90 375 -407 -103 614 196 -719 -18 482
4909D82m47o7J64j73K49J71n18o7M69l6l23N01p28p2J011k40o33J66P52o81j99
$$ 482 35 -32 132 -41 208 379 -139 -206 263 227 -96 405 -323 -395 616 376 -257 -91 661 -20 -219
4930b19P47n01l90O14J7p59J60M70rk91k2j99L14L92n73k03N78l39j76N15j93
$$ -219 528 27 -363 251 268 -491 -331 139 130 -161 -183 -382 -68 324 -249 -452 126 -213 -389 126 -67
4951f7l98L85O61r17o7Q20j34o70N92k07l29M81J31l76j45N54j56j88K40k74M1
$$ -67 -465 -80 581 -336 -403 417 283 -387 205 -2 -331 150 281 -95 -240 314 158 -30 210 -64 -23
4972b3L63k75l67O39N3o66K90K28n46M28N11q09l67R35K1q55N17n1j47K15J55
$$ -23 340 65 -302 337 390 -276 14 242 -304 124 635 -174 -541 394 415 -440 77 26 -121 94 249
4993B49l29k84N10l51J81K07m82k92R46l41n70M91N77j026L22N16n47N2N72k28
$$ 249 -80 -364 146 -205 -24 183 -299 -591 355 14 -556 -65 512 -514 -192 324 -223 -171 401 173
5013A73o54K54N02k47m1J8j26L9L85k82j87M24k52r5N32l75m51P09K11r40L42
$$ 173 -481 -227 275 28 -13 5 -121 -82 303 21 -166 258 6 -89 443 68 -383 326 537 -403 -61
5034f1L93k76j22K86j30l51L82M9n30K55M36m73L01j00l87L22N08p84j08O17j38
$$ -61 332 56 -66 220 90 -261 121 170 -360 -105 331 -142 159 59 -328 -6 502 -282 -390 227 89
5055H9l07M74k10o34Q70K76j015lQ07r3m66K85r9l57L99J95m66K65J23k29J48
$$ 89 -218 256 46 -588 282 558 -457 -460 347 254 -212 73 -26 -383 16 211 -255 10 133 -96 52
5076E2K09n21J69P12o52m59O14J24m22K24K73o01M4Q03m76m69M44J76j27Mj10
$$ 52 261 -260 -91 621 -31 -490 124 248 -174 50 323 -278 -234 569 93 -376 68 244 117 121 11
5097A1l01L91K08m55Q6K30l87J90L28m91Q3N53j68q03M94K00k67P1K00l23o4M82
$$ 11 -290 101 309 -146 -60 170 -217 -27 301 -190 -107 446 278 -525 -31 169 -98 -27 173 -150 -214 268
5119B68j26n32K56L45n54K57M2k87M14K38p55L20L73l73QM26l12n72R67J63q26
$$ 268 142 -390 -134 211 -343 -86 -44 -331 83 321 -434 -114 259 -114 -106 320 8 -564 403 566 -260
5140b60k5P09m23j93M79k65l10M58J06n12J65K80p5O5k66j27M23P6l71l28O77
$$ -260 -285 424 1 -192 287 22 -288 170 276 -236 -71 209 134 199 -67 -194 229 305 -66 -394 283
5161B83l02k37M24J64r06N36O90q63k59O44K8m89J16K5m9M04M4m57Q0J24j07K30
$$ 283 -19 -256 168 332 -574 -38 652 -211 -470 174 202 -287 -171 -146 -195 209 253 -204 -124 0 -107 123
5183A23jm10R3O39l42n70N23K46m61K80J85n17N3N97k44n30P16Nm38K46q4j86
$$ 123 122 -288 -195 444 102 -468 55 301 -160 120 305 -212 -159 438 194 -336 380 385 -53 193 109 -77
5205g7K14O8k83N5N6r8J05J83m36n2R29l88r22N31O01p24J18L27m18l66Q88l5
$$ -77 137 205 -78 -23 33 -65 40 223 -213 -265 664 276 -646 -115 486 -238 -120 207 -211 -577 311 276
5227B76n69K32K87l24N7l9k46L24N02q08K59J67j18k88P30l86n10O74K61p06n
$$ 276 -293 -61 226 -98 -41 -80 -326 -2 500 -308 -49 118 0 -288 442 56 -454 220 481 -225 -230
5248b30O08O2m50J88k30q0K97J00l93J1L31l53K74k40l84M44P32q66j88M73q4
$$ -230 378 440 -10 178 -52 -132 165 265 -128 -117 214 -139 135 -105 -489 -45 687 -179 -367 106 22
5269B2k73M64j17n21L82M97m77l65M26P7l86K21J74m09M14Rl98J07J50r7L42J99
$$ 22 -251 213 96 -425 -43 454 -23 -388 38 115 -271 -50 124 -285 129 138 -260 -153 -3 -100 242 441
5291D41r20M24N83m94l51K72J28m07L57K19p73K83O55m92k24M83L04l95Q7j20
$$ 441 -479 -55 528 34 -317 -45 83 -324 33 252 -521 -238 417 -75 -299 184 488 93 180 60
5311F0k47O83j72n90K97L27o55M28K81m66j73N57J50j026M01O26n91j66L68j23
$$ 60 -187 496 324 -266 31 358 -297 131 412 -54 -227 330 480 -546 -145 481 -110 -276 92 -31
5331c1k82O11j54o17K02K58M6j64J04m08N05J64o20O6O25m31q4P49n39m96P05
$$ -31 -313 298 144 -473 -271 -13 33 -131 -27 -435 70 234 -386 -320 305 -126 -210 539 0 -496 209
5352B09J98o66r3O13j03l01K24m2o6J87J02m36K31K9J9k2J05m51L93L51o19k61
$$ 209 407 -259 -352 261 158 -143 81 39 -27 160 262 -174 57 86 105 83 188 -263 130 481 -138 -399
5374c99Q58l42n56M96L59p34K50N90n24m15N94M4m02K9m0J8L18k6k58K74O5n15
$$ -399 459 117 -439 57 416 -318 -68 522 -2 -417 177 221 -181 -152 -192 -174 144 118 -140 134 199 -316
5396c16N49m4n18n8R10n42l62M38M18p44P2M51n49P1O63l89l42K34O9J94j1l90
$$ -316 233 189 -329 -387 523 -19 -381 57 475 -269 -197 254 -295 -224 439 50 -292 -58 11 205 194 -196
5418a96n4N70k52m12L23J17j14J2N19o75j14N96P3p19J03N93n84J52K94j41l22
$$ -196 -250 320 68 -344 -21 96 -18 -6 513 -162 -276 320 393 -326 -223 370 -214 -62 232 91 -231
5439b31K37K10m97K24r4j57N28q8o94N56K37o26J20O60m00l94O79l32m90M50M74
$$ -231 6 216 -281 -57 -151 -308 220 132 -562 -6 231 -395 -275 385 -15 -409 270 -62 -552 -102 372
5460C72n46j85M30J31l60L32j97j54L34l73J76K53j59k50N39J6q29M70N61o25
$$ 372 -174 -359 71 202 -158 174 -23 -177 157 -216 -40 213 54 -196 343 359 -470 0 561 -64
5480f4k62P20k6p28O11N3n95K53L39k52m53L74K9J03j14j18O3L63k45k73K36j49
$$ -64 -326 394 368 -360 251 304 -291 -38 301 49 -404 -30 -1 102 -12 -130 -67 296 51 -222 14 -135
5502a35k49K77K67m67k32J166n41p76M55M57n86L38L62n57N6L03j72n1J59j22
$$ -135 -384 -107 160 -307 -539 627 86 -690 -235 222 -364 -26 336 -221 -165 138 -34 -85 74 -48
5522d8J31K50l31k97O80j66n02J97L01m71J04O33m79l27O30J22n33N6J39Lk20
$$ -48 83 333 2 -295 385 219 -283 -86 215 -256 -152 481 2 -325 305 427 -106 -50 89 92 -128
5543a28L41j85k1Q5j41L5P3q4j29M61l25n76Q90J64q67L07N13n24k06L50L9n88
$$ -128 213 28 7 92 -49 -14 59 -25 -154 307 -18 -594 296 460 -407 -100 413 -111 -317 33 72 -516
5565e16N28L48m83k50N32J0l34Q6j10N7M56k05k44K00J1l19N22n2n57K41O13l13
$$ -516 12 360 -123 -373 159 169 -165 -79 -189 -132 324 119 -125 75 86 -233 289 237 -320 -79 534 221
5587B21l99N59k96m37N30m8k73ON35k84k16K20j69J60J99m41p7M03k03j87M06
$$ 221 -178 381 85 -352 178 130 -143 -137 398 114 -102 118 -51 109 308 -133 -210 193 -10 -197 209
5608B09k02k83K34M23p14k61R99l24m85M05J45l40J07K88n83N2M18o3j99K39n8
$$ 209 7 -276 -42 381 -333 -594 405 81 -404 1 146 -194 -87 201 -382 -330 88 25 -174 65 7
5629Gl5L77m34k21N05J93o82L81K17m66j22N39k83m85Q99N8o82J77J94j72R1K32
$$ 7 -28 349 -85 -306 199 392 -290 91 308 -158 -280 259 -24 -509 390 448 -234 -57 137 -35 56 288
5651B88m31j72O02l44r6L59l08m4M93l97o43O76O43q08j4M51j85j06J50q7m05
$$ 288 -143 -315 287 -57 -153 206 -102 -146 347 -50 -693 -17 626 -182 -196 255 70 -36 114 27 -378
5672c78K41M32k79Q5r6o6PQ6j80l5L98j70j57K82o7k18L22l6o91L17O98l87m16
$$ -378 -137 295 16 101 5 -61 -54 32 -148 -183 215 45 -112 170 103 -115 207 171 -520 -203 495 108 -308
5695c08N49k18k17K81n4k27K34K62m45J38J39k01L8L84l92p6L10N6k41j83K76
$$ -308 241 23 -194 87 33 -194 40 302 -143 -5 134 -67 -29 355 -37 -113 197 253 12 -171 105
5716A05m61L23L91o28M3N57j78k27K2K00k72M20j23l77J47L43k19k66K83k82Q9
$$ 105 -356 -33 358 -270 -227 330 152 -75 -53 147 -125 295 172 -205 -58 285 66 -200 83 -199 -110
5737a10L14l11m44N25L19n37P3L33l36Q0M15l52j50K72R5l93N3L75l05J00K07
$$ -110 204 -107 -551 -26 293 -244 -171 162 -174 -94 321 -31 -181 91 186 -207 -154 221 -84 16 223
5758B23j79k08N30l75j00J96nj04L30o9m50J67K42j33k88N30k86n5M68l49l75
$$ 223 44 -164 366 -9 -109 87 82 -22 308 239 -211 -44 198 65 -223 307 21 -34 434 85 -290
5779b90M04j07l33K32K43k32K11j56k24J53J52j46k13N41j66m19M63K70o60J84
$$ -290 114 7 -326 -94 149 -83 128 -28 -252 -99 53 -93 -306 235 69 -350 113 383 -277 -93
5799i3M42m15k27J36K44l50L83O9o11K49N13k93k03K03k47K08K62m83l2O09j87
$$ -93 349 -66 -293 -157 87 -263 120 189 -422 -173 340 47 -156 47 -200 8 270 -213 -245 364 177
5820A77n04L78Nl68L95K35l13m67O61r3k14J80J29k01K29j31k33K96J53k02l36
$$ 177 -327 51 56 -312 83 318 5 -462 199 106 -108 72 201 0 229 98 -135 161 314 112 -224
5841b24L18k72M3M64m66l57N74J93n06O0L75n91J43N29l08n98O50J08m26K70K7
$$ -224 94 -178 -135 329 -137 -494 80 273 -233 -173 202 -389 -246 283 -25 -623 27 135 -291 -21 6
5862FJK20r7k34J3L67m32J65J07j6l65M70J35r63N95N44p51O6M76l43j70N51k74
$$ 6 7 227 130 -104 -91 276 -156 9 116 100 -265 205 340 -623 -28 516 -235 -169 307 -36 -206 345 71
5885G1m56M17K81k87J21j65m8j20K71l18R6N41l19o34O85j6m48N11J3m41N8L76
$$ 71 -385 32 313 26 147 -18 -66 -186 85 -233 -137 404 85 -549 136 120 -328 183 196 -245 -187 189
5907A89k5m77M05L34p11K22p3%J70Qj32r9L20k33M3M47m89p2M68j60m12J54M72
$$ 189 164 -313 92 426 -285 -63 -136 -136 34 42 -90 -189 131 -102 -59 388 -101 -173 295 135 -277 -123 349
5930C49n36N4L22k09l28M40J08m34M34o8k93K24P2l91L15J69l96J10K78l71r2
$$ 349 -187 -133 189 -20 -348 92 200 -234 200 132 -161 63 135 -256 59 228 -168 -58 220 -151 -243
5951b43N36k54k62K79J96o40J84L52k56k8L74k59m85M80P4j51O8nl1K13n3j85
$$ -243 293 39 -223 56 252 -388 -204 148 -108 -136 238 -21 -506 -26 48 -103 -35 -40 -71 142 89 -96
5973i6O3K62n27R1N74l27k47L89J57n44J87M73m24j18L28j14l35L85o9j90J19
$$ -96 -33 229 -298 -207 367 40 -207 182 339 -205 -18 455 31 -87 241 127 -208 177 108 -82 37
5994C7J08n6J33J4l60K06L09o03O9K39n5n49P79k39n02N57L87o01j87M38Lm36
$$ 37 145 89 222 236 -124 82 391 -212 -143 96 41 -508 271 32 -470 87 474 -127 -314 124 127 -309
6016c09M28r7j35K38j35K2M2K21k92J00J47l67J03M15o22j42N76K7n39M64L2l39
$$ -309 119 22 -113 125 -10 12 54 275 -17 83 230 -137 -34 381 -241 -383 193 220 -319 145 177 -162
6038a62R2K93j42m65M72N5j88J89n6k02J84J41m92L90P4n35L66L13n58M2M78k69
$$ -162 -70 223 81 -384 88 143 -45 144 88 -114 70 211 -281 109 183 -352 14 327 -231 -189 289 20
6060B0n96N84L39l99j22M50l42l69M95j7l58L83j14%J16j06k03M80o0m84L43L25
$$ 20 -576 8 347 -52 -174 276 -66 -435 60 43 -315 68 -46 -46 70 -36 -239 241 181 -303 40 365
6082C65n52J22K82k22k49M12R6m12J82L04k65k76J83J53l12L41k1l07K08J10j60
$$ 365 -187 -65 217 -5 -254 158 254 -158 24 328 63 -213 -30 123 -189 152 131 -176 32 142 -18
6103a8P5J3j30J03J15m19l5Q38n66l49M76n8m02M42K87m51n4L58K9m92L15p2j69
$$ -18 57 70 -60 43 158 -261 -296 542 -24 -373 103 45 -357 85 372 -79 -133 225 254 -238 77 5 -164
6126a64R7m9L1J21r0j84q7N45l86j48O18m07m15R40j53p96M34L16l36j20O95l74
$$ -164 -67 -116 -85 36 -54 -238 -325 220 -166 -314 304 -103 -518 422 269 -527 -93 223 -113 -233 462 88
6148H8k27J62R1k00J18L8k55L71ln43M89J94n57J50J50l09j3O38l08m19L19M05
$$ 88 -139 23 114 -86 32 70 -185 186 183 -360 129 323 -234 -84 66 -243 -256 382 74 -345 -26 379
6170C79n87j7L33l46L5M68m22J53J79l05l5K16l4j55L60p4m88L49J94l64j30L56
$$ 379 -208 -225 108 -238 -203 265 -157 -4 175 -130 -165 51 17 -138 222 148 -340 9 203 -161 -291 65
6192F5O1m98L72L46n87K64J88k51rK54l15o6L74k72k05L97o6k19L62j37l24K93
$$ 65 126 -372 0 346 -241 23 211 -40 -49 205 -110 -176 198 -74 -279 118 52 -167 195 58 -266 27
6214B7M42o14k08N85j68k45L70p4l81J11M89n67R8L87k93p6K09k40j52N13k77
$$ 27 469 -145 -353 232 64 -181 189 115 -266 -155 334 -233 -135 252 -41 -117 92 -148 -300 213 -64
6235f4k26M30J13l79k15N11m30Q2M67m77j29L87J77m24K22O9l23K34L56m81j86
$$ -64 -290 140 253 -126 -341 170 -260 -178 289 -188 -317 70 247 -177 45 114 -209 25 381 -100 -286
6256b86L91k3j94K24j42k00M15J93o07L15J92l11o5L06j25k28M42l76l5K34M1
$$ -286 105 82 -112 112 -30 -230 185 378 -229 86 278 -33 -98 208 83 -145 297 -79 -114 120 161
6277A61l90K07J70j65j03L30j59k55K97j64P2J37k07j83L56K10m37k05M71j12
$$ 161 -229 -22 148 -17 -120 210 51 -204 93 -71 1 138 -69 -252 104 314 -123 -328 143 31
6297C1l27M36l7l01M79k00l41K60J54l45J78J95l69N8J74n6k81N30k09j14K50
$$ 31 -296 140 103 -198 281 81 -260 0 154 -191 -13 182 -187 -129 45 -11 -292 238 29 -85 165
6318A65J9l12J3L29k35l69N49j53j75J50J53k72K64Q7l38J49J69j13r5L00l92
$$ 165 184 -128 -115 214 -21 -390 159 6 -169 -19 134 -138 126 213 -125 24 193 80 -15 285 -107
6339a07j56M69q9l74K01K16m46L14K07m01J21K63j74m05M86K2l27N0M36o43K00
$$ -107 -263 206 117 -257 -56 160 -286 28 235 -166 -45 218 44 -361 125 147 -180 -130 306 -337 -137
6360a37L56m16JK09k3p0K20k18k09L65N1m03K54M24n54j7L23j53k52N58l87j47
$$ -137 219 -197 -196 13 -10 -80 140 -78 -287 78 129 -274 -20 404 -150 -167 156 3 -249 309 -78 -225
6382b25J88K87l95J79P2j23r0K97k38j34L74j77k14N25j24n02K88K91n23N7L53
$$ -225 -37 250 -145 34 106 -17 -107 190 -48 -182 192 15 -199 326 202 -300 -12 279 -244 -187 166
6403A66m7l34L81p2m42M44J07n17K14K30k71K8L36m58J40J66j62j39L67o1k80
$$ 166 119 -215 166 94 -348 96 203 -314 -100 130 -141 -113 223 -235 -95 71 -91 -230 137 76 -204
6424b04J83k9j61J09L82n47M7L52M4m84M67j78p9l3L03m43J71K91k16o8M37n66
$$ -204 -21 -50 -211 -102 280 -267 -220 132 176 -308 159 -19 -98 -131 172 -271 -100 191 -25 -93 344 -222
6446b22K51L39n09k4L01J61m04J51K47n12j07O74k87l76N75ml75Q3R4k73R7L09
$$ -222 29 368 -141 -165 136 297 -107 44 291 -221 -328 346 59 -317 258 254 -121 -38 56 -217 -120 189
6468A89l87K58J90k52k95M09j53k36O42q6r35P22K05n35r3M86k20j62M25L9n15
$$ 189 -198 60 250 -2 -297 112 -41 -277 365 279 -656 66 271 -264 -357 129 -91 -253 172 211 -304
6489c04K96K23k24J58p0k63J67R1k65Q0L80j64l12K92oj37J44J70l06j16L95l13
$$ -304 -8 215 -9 149 79 -184 -17 74 -191 -111 269 105 -207 85 79 -58 86 256 -50 -166 229 -84
6511h4JJ91Rl30K37Q9k86J34P9j89N2K38l02J42K28k50l70N33Q0n74L14L92o87
$$ -84 -83 108 117 -213 24 113 -173 -39 40 -149 -97 141 -161 -19 209 -41 -411 122 202 -372 -58 334 -353
6534c53Q1N08j52k77K91J4k24K27r1j10J73r9Q2m1L1r5K4L0k11n0L74R4m53L27
$$ -353 -272 236 84 -193 98 112 -112 115 24 -86 87 -12 70 29 60 -35 -11 19 -192 -242 132 226 -227 100
6558A00K94o07J75K75l96MN11j40n51K42N1j57L63k13k32R9J34j42J07J57k29
$$ 100 394 -213 -38 237 -159 -155 356 216 -335 -93 -42 -199 164 -49 -281 -182 -48 -190 -83 74 -155
6579a55L6L35j17m38M45J84n43P0K83q1l07N22k74n7L27j46k29J03J96j69Q5K18
$$ -155 -119 216 99 -339 106 290 -253 -183 100 19 -288 234 -40 -97 230 84 -145 -42 154 -15 70 288
6601B88m19o3M92o97M06K36l08n9K88O8n20L17L69n56j16N07j44k57K75j41l5
$$ 288 -131 -194 298 -399 7 243 -65 -124 164 232 -288 29 398 -158 -274 233 89 -168 107 -34 -69
6622f9K71J43m55J3Q5k16J35MQ7n4K72k07l55M52N5o24O41j39k77K92J94k83j41
$$ -69 202 345 -110 -97 -12 -228 -93 -89 -2 -56 216 9 -346 106 161 -463 178 39 -238 54 248 -35 -176
6645a76K15O8k58J79K8j29J60m2l08L28K8l09K89J86l72j8M62l52l65M19K65m29
$$ -176 39 107 -151 28 56 -73 87 45 -263 65 93 -216 73 259 -113 -131 331 -21 -386 33 298 -131
6667a31J21K25l76r6M52q6k40K40L1l69L21k23J20Q3j10j03J13K23l59r2P56o13
$$ -131 -10 215 -161 -257 195 109 -131 109 140 -229 92 -131 -11 72 -38 -141 -28 195 -164 -256 500 -113
6689a13j22M46R6o83L01K69k47j28L35l00J2L24j58n2J10k5j82J89l2l29J92K83
$$ -113 -235 211 307 -376 -75 194 -53 -181 154 -146 -134 190 32 -20 90 65 -117 72 40 -289 -97 186
6711A86m02l4N19k45k69L61J8k93O5L76m18QK47l2j63J38j13n1L53j68k42K75
$$ 186 -216 -250 269 24 -245 116 134 -159 -94 282 -136 -128 119 87 -76 62 -51 -102 251 83 -159 116
6733A16J7l35K09J64k47M4L35l83k47M14j77N8mK21m54J74L33j95j73J09j20J97
$$ 116 133 -202 7 171 -76 -32 303 -80 -327 87 -90 -32 -36 185 -269 -95 238 43 -130 -21 -141 56
6755E6J23j75n7K20J96n07J89L1k16M4K84l15o3L69j96j35J76J45j91N2K65m03
$$ 56 179 4 -53 167 363 -144 45 76 -140 -96 188 -127 -190 179 -17 -152 24 169 -22 30 295 -108
6777a08j40L66k31q1J52J16j51P2l6j10J94J85l94R6K07k69j22N14r0l48K78K0
$$ -108 -248 118 -113 -194 -42 74 -77 -5 -41 -151 43 228 -166 -70 137 -132 -254 260 170 -178 100 120
6799A20l70K25K04j75o2J51l6k36L78l00L1J49j79j52M57j68k73K32K72m74L6
$$ 120 -250 -25 179 4 -58 93 57 -179 199 -101 -70 79 -100 -252 205 37 -236 -4 268 -206 -170
6820a70L76m9n40O22j66j98J62K66m89mK03P2j21n9J73j90L86j96l36L29J71l12
$$ -170 206 157 -383 239 73 -125 37 303 -186 -190 13 85 -36 -95 78 -112 274 78 -258 71 242 -70
6842g0J12M26o18j49M72l14l1M75j41l55L31N3k95P4K60k77n5K09q4k65M83j41
$$ -70 42 468 -150 -299 173 -141 -172 303 162 -193 138 191 -104 -30 230 -47 -102 107 23 -242 241 100
6864A00l70M70j64k94K26P7l20K54K23k95l54M61K85l33N4K32l15k06L95j03k41
$$ 100 -270 200 36 -258 -32 45 -275 -21 202 -93 -447 14 299 -34 20 252 -63 -269 126 23 -218
6885b18M03k35j82K82J0l56M23j06j25K57l5k82O1M14l61j60K10l8l82M97k0l53
$$ -218 185 -50 -232 50 60 -296 127 21 -104 153 118 -164 -103 311 -50 -210 0 -38 -420 77 57 -296
6907b96L33Pj06l0K31j23k79M19j1m03K55N3l63L26K85n32J43L26k64j71J82L6
$$ -296 37 44 -62 -92 139 16 -263 156 145 -258 -3 50 -313 13 298 -234 -91 235 -29 -200 -18 18
6929A8L1K25j90m52L04K35k49mJ82K0k23K02j82l0M55k26j47J15Q3m29K02L65
$$ 18 49 274 84 -368 -64 171 -78 -82 100 120 -103 99 -83 -113 342 116 -31 84 167 -262 -60 305
6951C05m34l3L18j52q4J27P0k02K25l8j57j05L62l61K22L2r6m3J67Qm50L14M42
$$ 305 -129 -162 156 4 -80 47 117 -85 140 102 -55 -160 202 -159 63 95 -1 -44 123 131 -319 -5 437
6974D37p86K78J29k72J36J68r0l49N34N3n89L68R3k88K11K72m12Q5K63k98j12
$$ 437 -349 -71 58 -214 -78 90 0 -349 185 238 -351 17 110 -178 33 305 -107 -22 241 -57 -169
6995a69K12Q9j74K61j39l47M63N9l50k5M08k70k61M25M9n49K78M33o07K35L01
$$ -169 43 132 -42 219 80 -267 196 255 -95 -120 288 18 -243 182 231 -318 -40 393 -214 21 322
7016C22m25J2P3R4p9N0j97j72L14J02l57K21K41n27J66N52m36j66M27l79j05K55
$$ 322 -103 -91 -18 76 -3 47 -150 -322 -8 94 -263 -42 199 -328 -162 390 -46 -212 215 -164 -269 -14
7038a4J28m16M16j11k22O0L44l44J23K48k00m03N20j55l02L32J63l57Q7M74m41
$$ -14 114 -302 114 3 -219 -159 185 -159 -36 212 12 -391 129 -26 -328 4 167 -190 -103 371 -70
7059g0O6J87j0l97M70j92k1j15K22k26Q9N7l28K25L92k75j71K65k03k81M23J64
$$ -70 -4 183 173 -224 246 54 33 -82 140 -86 3 60 -268 -43 349 74 -97 168 -35 -316 107 271
7081B71m78K75L36m43N6Q7l9l08K50J42j69O2Q8n20K27K49k11J3M03k67j95L55
$$ 271 -207 68 404 -39 17 104 65 -243 7 149 -20 42 130 -390 -163 86 -125 -112 291 24 -171 184
7103A84l33N0K95qm65J68M93m05k00N04k53k97K87N6m33K50K53k01O3M8j72J37
$$ 184 -149 -99 196 188 -277 -109 384 -21 -221 283 30 -267 20 76 -357 -107 146 -55 8 56 -116 21
7125B1L28k17k56M17j46k46K64j84k72M42J9m45J66J88k9k34L52k91o1K49j31
$$ 21 349 132 -124 293 147 -99 165 -19 -291 151 170 -275 -109 79 50 -184 168 -123 -184 65 -66
7146f6k97M64j46r3M0L24j70k40K28j83j46M63Rl72J94J26k43Q0M70m49j72L65
$$ -66 -363 101 -45 -138 -98 226 56 -184 44 -139 -285 178 187 -185 9 135 -108 -28 442 -7 -179 186
7168A86j00j25m6P8J65j96O3k75N1M35l79K10J67l16k10L72K8l56M11J57m01O7
$$ 186 86 -39 -85 -7 158 -38 25 -250 -199 236 -143 67 234 -82 -292 80 108 -248 163 320 -81 -14
7190a4J37k79m6K34p2j47L11r3l16L09q0k9M9m9Km7L04k80j33M85j50k36J21K33
$$ -14 123 -156 -202 32 -40 -187 124 31 -285 24 -56 -85 -36 -85 -83 -130 174 -106 -239 246 96 -140 -19 214
7214B14m19J14M38m05j63O53k62l74L09J24l75K07r0k89M65q4k01K32K42l67l0
$$ 214 -205 -91 347 -58 -221 432 170 -204 105 229 -146 61 -29 -318 147 63 -138 94 336 -31 -61
7235f1K73j22m06O90j83l25J12J09j66LK70j61m51M78o4k95J99J66j67PK08k15
$$ -61 212 90 -316 374 191 -134 -22 87 -79 -76 194 33 -418 60 -4 -299 -100 66 -101 -94 114 -101
7257a01P8L10l88J01J90j73j74K39Q0m34K45K04l58P7L73m19n4M79l18o3J41r5
$$ -101 -23 287 -101 0 190 17 -157 82 162 -272 -27 177 -181 -104 269 -150 -204 275 -43 -106 35 -60
7279f0j22K44K08m86L90j69j98MM84k73k19L60n2l67L89m1l94J63M18j77k35K59
$$ -60 -182 62 270 -216 174 5 -193 -189 295 22 -197 163 111 -256 133 92 -302 -139 279 102 -133 126
7301A26k22j75K94O5p6Q0mj69K23J7l83K57K49l00j33L71l49n6L46R3n55J88M31
$$ 126 -96 -271 23 88 12 92 88 -81 142 159 -224 33 282 -18 -151 220 -129 -185 161 254 -301 -113 318
7324C18k79j77L27r2l08L12m1k59L14K0k26J85j22j3Q6K62l99j80N12k37m96P02
$$ 318 39 -138 189 97 -211 101 60 -199 115 135 -91 94 -28 -41 45 307 -92 -272 240 3 -493 209
7346B09Qm93L55L10o43K36J78k1j85K10j01k42K70J32l58M49l23k53K71J59j99
$$ 209 217 -276 79 389 -254 -18 160 139 -46 164 63 -179 91 223 -135 314 -9 -262 9 168 -31
7367c1k74O38n08k6M83j96l69K69K55m02M7K50j57q7L56l39qK00p5l64M16J32
$$ -31 -305 333 -175 -201 282 86 -283 -14 241 -161 -114 136 -21 -108 248 -91 -99 101 26 -338 78 210
7389B10l84M2Q4q7L9K77l4l24K66K18m90L45R9l60LJ13j02k5L45k24l34K83J41
$$ 210 -174 -132 -48 -135 -96 181 147 -177 89 307 -183 162 261 -99 -96 17 -85 -110 235 11 -323 -40 101
7412A01q5J11q9j94K20J71n49L13L12j82j84K30k54j37M63J3m73Q7L18k52J22
$$ 101 16 127 38 -156 64 235 -314 -1 311 129 -55 175 -79 -216 247 260 -213 -126 192 -60 62
7433F2J4j00j97K70l59J86K17J01l54K65l3m74M20Ok11j06O04q5l76J77K77n64
$$ 62 76 -24 -221 49 -310 -124 93 194 -160 105 72 -402 18 24 -187 -293 311 226 -150 27 304 -260
7455b60K89K43j36k96K52o8k85K78j4j75L11j60k13L46P6k82J38K84n26O9L94
$$ -260 29 272 136 -160 92 24 -261 17 3 -172 139 -21 -234 112 188 -94 44 328 -198 -129 265
7476B65l09j51L50p0j73K73o2l33M9L76k56k79M07J46l38K10j38j82J56J52l05
$$ 265 -44 -195 155 85 -88 185 123 -210 -161 215 -41 -320 87 233 -105 105 -33 -215 -59 93 -212
7497b12R2L38n56K40L05k40J3L03j22n60M98n8k08r5L27r2j18L80j78k41L44k2
$$ -212 -120 218 -338 -98 207 -33 -20 283 161 -399 99 41 -167 -262 65 -27 -145 235 57 -184 160 138
7519A38k44J70j1j98J71K43o91K47N37l84k43J58J72l49L76K80m75nK31l4j42
$$ 138 -106 64 53 -145 26 269 -422 -175 362 -22 -265 -107 65 -284 92 372 -103 -108 123 89 -53
7540e3K50k88p8L42J3n47M00k4j92K57J0q6k9L96l31k08L89l62q8L46R2l80J37
$$ -53 197 -91 -169 173 186 -361 39 15 -177 80 90 4 -25 371 40 -168 221 -141 -229 117 209 -171 -34
7563c4L35m45j9M73m26l4K82q4j54K35Km57L03qp4j49M45j91r9L55k98k72N90
$$ -34 301 -144 -163 310 -116 -150 132 48 -106 129 131 -326 -23 -31 -105 -254 191 0 -99 256 -42 -314 276
7586B76j18j98R0J99m22K1K75j55j02L51j88k43M46j90o5R3J4k90J71J29k20k3
$$ 276 158 -40 50 249 -173 -152 123 -32 -134 217 29 -214 232 42 -23 70 84 -206 -35 94 -126 -149
7608a49M20n22k21P19j22k82J05J63l49J38J89j63L3K41j20m7J5J2j87L72j07
$$ -149 271 -251 -472 247 125 -157 -52 111 -238 -100 89 -74 -41 200 80 33 48 60 -127 245 138
7629A38l25J08L06n25K05L25l78p8L88k75M6lJ24j99J64J71l08L4L09k31j75L53
$$ 138 -187 -79 227 -298 -93 232 -146 -224 164 -111 -65 -68 56 -143 21 192 -116 -82 227 -4 -179 174
7651A74K0l14Q6J12m00O10j17k66J0K59j83k85N11Pn35M87J03m33R7J20k21J9
$$ 174 194 -120 -34 78 -322 288 171 -95 -85 174 -9 -294 217 224 -311 176 279 -154 -57 63 -158 -139
7673a39K61j74%J36j56k0M46l52k42J65J76m04J64M09k78j5M07m45l2J9K22l46
$$ -139 122 -52 -52 84 -72 -92 354 2 -240 -75 101 -303 -139 270 -8 -23 384 -61 -93 -74 148 -198
7695a98K15J54k92K16K2o9j35J32o5j83M41k17l86N11L5n48K30L65k00k37M99
$$ -198 17 171 -121 95 117 48 -87 45 -20 -203 238 21 -365 146 181 -367 -137 228 28 -209 290
7716B90j17m59M38M0l51J67J54j93n1K09j02j23K38m16J45J97l4k71L86N6k86
$$ 290 173 -286 152 192 -159 8 162 -31 -82 127 25 -98 140 -276 -131 66 32 -239 147 203 -83
7737h3R7K63m72k4M93l31k58M79j84k16L12J51l50R2K33k76%R0j39k01L11n4k77
$$ -83 14 277 -195 -219 274 -57 -315 164 -20 -236 76 227 -123 -31 202 -74 -74 16 -123 -324 -13 -67 -344
7760c44N51L8m40R1K53l88Q3L45j32l39M00j9k90L80K5k47m3K00l29N9M45l23
$$ -344 207 245 -195 -104 149 -239 -156 189 57 -282 118 99 -191 189 214 -33 -76 124 -205 -146 299 -24
7782b4q1J64K18m93L12j21j10k0N43n43nM14j68l87M65j18k98L02P7m20K14K56
$$ -24 -105 59 277 -216 96 -25 -135 -155 388 -155 -160 254 86 -301 164 46 -252 50 127 -293 -79 177
7804A77m32K57K44l27p9M68j40j81K36o2n32P53k42l82J78L11n79R4N21j60m53
$$ 177 -255 2 246 -81 -160 308 168 -13 223 161 -371 382 140 -242 -64 247 -332 -238 283 123 -330
7825c30L79P3j22j76M01l34J66L2j60N5J72j77l77K62K43k76L48M6n07J58L34
$$ -330 49 122 0 -176 225 -109 57 89 -71 -16 156 -21 -398 -136 107 -169 179 225 -282 -124 210
7846B10l61R9J05j21j17K39J14j97k4K08k68R8O3j32J47K79m25j21L65j15l4J44
$$ 210 -151 -52 53 -68 -185 54 168 -29 -53 155 -113 -15 48 -84 63 342 -83 -204 161 46 12 156
7868A56L8l17J69L1r9l2L52l10j52M46k46j92K35o6o6p9L21j94KN7j54N5J13l13
$$ 156 194 -123 46 77 -22 -54 298 -12 -164 282 36 -156 79 13 -53 -132 189 -5 -3 54 -100 -45 68 -245
7892b45Q1L18j30m32M97J77l88J09L86n41l58R02l95k49L02J52l14J69K25k94
$$ -245 -164 154 24 -408 89 266 -122 -13 373 -168 -526 376 -19 -268 34 186 -128 41 266 -28
7912b8R1P5k23k37M90j14l10K31J07k40K32J04l15QL28j87k02K59J89l96K23J21
$$ -28 63 138 -85 -322 168 54 -256 -25 82 -158 74 178 -137 -129 199 12 -190 69 258 -138 85 206
7934B06l03J55K06l74k0L24k53j24L18j69k97N35k62J8L6K32l30k5M12k49l56
$$ 206 -97 58 264 -110 -130 194 -59 -183 135 -34 -331 204 -58 -40 -4 228 -102 -127 285 36 -320
7955c20N49j07k44K80J21l06L3K62l95R7J70k10L8L62m00j93M43m3n10M61J35
$$ -320 229 122 -122 158 279 -27 6 268 -127 -30 140 -70 -32 330 -70 -263 180 137 -373 88 223
7976B23m26K23L51m67L0N13m85k74L39J04k67K54L1k10nQ9p2K2K78l85O4K24j22
$$ 223 -203 20 371 -96 -66 447 -38 -312 27 131 -136 118 149 -61 -66 23 -49 -27 251 -134 -70 154 32
7999C2k76L53J61n58J97L54m08J96P2m7l17K17K72m03L3J74j47L3J13j11PK92
$$ 32 -244 109 270 -288 -91 263 -145 51 123 76 -241 -24 248 -155 -122 52 -95 -62 51 -60 -53 239
8021B39k28r6K34k85p2L87l2m66L98M5j57q3K59m13J7N00j23j70J67j1k56K25
$$ 239 11 -85 149 -136 -208 179 147 -319 79 124 -33 -116 143 -270 -253 247 124 -46 121 110 -146 79
8043G9q2k29J30J62j76lK35p3q2J69N8n62N21J67n83L01J02o8m14N25j16k50J84
$$ 79 -3 -232 -102 60 -116 -119 116 43 -39 130 188 -374 147 314 -269 32 134 66 -348 177 61 -189 -5
8066en8P9j2K36m60L24j06j27M8J98r8k83L95j2m98M41K47m76mN01l42j52M74
$$ -5 -63 16 4 240 -220 104 -2 -129 -81 117 19 -264 131 119 -379 62 309 -167 -171 330 -12 -164 310
8089C10k85k89K07K24k74Q0L08m04J25R8o1l59L81k21O2L01j09m42O26k6m77J26
$$ 310 25 -264 -57 167 -107 -27 281 -123 2 100 39 -320 61 -160 -98 203 94 -348 278 252 -225 -99
8111i9J07j05j39M40l14j81M56k30j45M48k85p3K56L6k20J20K84m06q9N28m21
$$ -99 8 -97 -236 204 -110 -291 165 -65 -210 238 -47 -120 136 172 -48 72 356 -50 -139 389 -32
8132c2l04N62k34j24K65J05o12J25M52k68j67L30K5j75J65Q4k50J87Q3k99L6L60
$$ -32 -336 226 -8 -132 133 238 -374 -249 203 -65 -232 98 123 -52 113 197 -53 134 217 -82 -46 314
8154C14m75n0M13m49Q6L57J2k83K87J52n53j13N09m13MM26k16j20J91J8k58J34
$$ 314 -161 -211 202 -247 -161 196 208 -75 212 364 -189 -302 207 -206 -202 224 8 -112 79 97 -161 -27
8176b7K31k61J96j18j35lL34j52r9K28j57j45R9K23m91
$$ -27 204 -57 139 21 -114 -117 217 65 -34 194 37 -108 -9 214 -277
8191b77
$$ Imaginary data points
##PAGE= N=2
##DATA TABLE= (X++(I..I)), XYDATA
0@%%%Qj6J2j2K4m0M8n0O6r2J10j26J54j90K26k63L07l64M27m90N62o49P45q46
$$ 0 0 0 0 8 -8 4 -8 16 -24 24 -26 40 -52 58 -68 86 -104 122 -141 166 -198 229 -261 301 -348 397 -449
27d49R58j087J230j384J551j736J945k170K414k685K982l308L664m056M491m970
$$ -449 509 -578 652 -732 819 -917 1028 -1142 1272 -1413 1569 -1739 1925 -2131 2360 -2610
43b610N503o099O769p525Q384r376J0531j1895J3540j5570J8138k1504K6133l2920
$$ -2610 2893 -3206 3563 -3962 4422 -4954 5577 -6318 7222 -8348 9790 -11714 14419 -18501
57a8501M3827o4098J13720m34709n46488J392716J80375j195291J1413J079306
$$ -18501 25326 -38772 74948 -359761 -906249 486467 666842 -528449 -517036 562270
67E62270l12484q95071M74786P68128n97916n76424O35504M33795o64110k89829
$$ 562270 249786 -645285 -170499 597629 -287 -576711 58793 492588 -171522 -461351
77d61351O40547K19419n74854j32221M68531O8760l59021J3919K63065n9793j96956
$$ -461351 179196 398615 -176239 -308460 160071 228831 -130190 -116271 146794 87001 -109955
88a09955Q9873J59877p8124j54758L9494J49458Q376j41640l1304J25217R007
$$ -109955 -20082 139795 61671 -93087 -53593 95865 104241 -37399 -68703 56514 65521
99F5521j47760J7293J94972j0401k48851m7845K57060J02610k45673j17059K51039
$$ 65521 -82239 -64946 130026 119625 -129226 -177071 79989 182599 -63074 -180133 70906
110G0906Q6366l03580m0425L68697j9166m05048J18158M10003k60545m04201M09348
$$ 70906 157272 -146308 -186733 181964 162798 -242250 -124092 285911 25366 -378835 30513
121C0513L98648n06665l63546N41074K77637n32107j46584N14046L017m91352
$$ 30513 429161 -77504 -441050 100024 377661 -154446 -301030 213016 216033 -275319
131b75319J31405M65520k42527m31768L23264L88624l60030l18737L60927K21633
$$ -275319 -143914 321606 79079 -352689 -29425 359199 -831 -319568 41359 262992
141B62992l40525j11650L15575K5468k78287K5815K29352m5799j82141M6159J59772
$$ 262992 -77533 -189183 126392 151860 -126427 -100612 128740 82941 -99200 -53041 106731
152A06731k3040j61663k1908J61546N6464j49230n4517J33409O392j43249M4014
$$ 106731 83691 -77972 -99880 61666 118130 -31100 -85617 47792 54184 -89065 -45051
163d5051J65518p1940j86011O8247J84394o1198j81258N3625J84748m5431j87527
$$ -45051 120467 48527 -137484 -69237 115157 53959 -127299 -73674 111074 65643 -121884
174a21884L9736J74683n4126j46266J01034J29007j53439j24204J91193J28044
$$ -121884 -82148 92535 38409 -107857 -6823 122184 -31255 -155459 35734 163778
184A63778j98577j13885K01784R3502k08385p0334K22816M9370k31769j7753K37207
$$ 163778 -34799 -148684 53100 146602 -61783 -132117 90699 140069 -91700 -109453 127754
195A27754k7639k40697P2908K30001j09915j99372J32916J44293j53758r0137
$$ 127754 100115 -140582 -67674 162327 52412 -146960 -14044 130249 -23509 -113646
205a13646J63375M9407j64156l1494J55884L1859j52011n3495J49184Q9180j33216
$$ -113646 49729 99136 -65020 -96514 59370 91229 -60782 -114277 34907 124087 -9129
216i129j12473J03667R9138p7204m6265Q1055j0293j10885M3601J45545m8765
$$ -9129 -121602 -17935 81203 3999 -42266 38789 28496 -82389 -38788 106757 57992
227E7992j67421M7759J83866n0870k05106N0461K19651m4700k07134M4396J57703
$$ 57992 -109429 -61670 122196 71326 -133780 -83319 136332 91632 -115502 -71106 86597
238H6597p1780r4240J20296M3402j69968k0262J95998J6907j94064k0898J77119
$$ 86597 14817 -79423 40873 84275 -85693 -105955 90043 106950 -87114 -108012 69107
249F9107K3891j55738j8200J44600O308j40654J2781J41731k9104j29923M7902
$$ 69107 92998 -62740 -80940 63660 69968 -70686 -57905 83826 54722 -75201 -27299
260b7299J03485o9937p1560R6165N0911j10630m8098J02359M9661q4663m8957
$$ -27299 76186 6249 -65311 30854 81765 -28865 -76963 25396 75057 -9606 -58563
271e8563P5121M7364q6863o3239R6829Q4403q8896r1498N9878O2215l8417j3342
$$ -58563 16558 63922 -22941 -86180 10649 95052 6156 -85342 -25464 36751 -1666 -15008
283a5008M3352k6986p1333L6731J04083k0926j26580K371J42622R279j50927n857
$$ -15008 28344 1358 -69975 -33244 70839 49913 -76667 -74296 68326 77605 -73322 -79179
295g9179J53180m540j37020K6536J07591n4383o9646Q8947M1051j20149l0688
$$ -79179 74001 69461 -67559 -41023 66568 12185 -57461 31486 72537 -47612 -78300
306g8300J40485M1262j42631o0091J25526O5581j04632m8289R4512J0417j03928
$$ -78300 62185 103447 -39184 -99275 26251 91832 -12800 -61089 33423 43840 -60088
317f0088K2367J16933m2039j18519M7956R9804n4266p6622N8785O2522n6944o0070
$$ -60088 -37721 79212 37173 -81346 -33390 66414 12148 -64474 -5689 56833 -111 -60181
329f0181M7324N8210m1612n0424N2686M5484p7033m7869R9173N6114r9622n5024
$$ -60181 -12857 45353 3741 -46683 6003 51487 -25546 -73415 25758 81872 -17750 -72774
341g2774Q3401L9541o1415j4180N2283n871n6626J2835P1228q349q6516K988R6143
$$ -72774 10627 50168 -11247 -25427 26856 20985 -35641 -22806 48422 40073 -46443 -43455 52688
354E2688n831r8705J8200R4448l6377q5687N0619P0482n9532n4156O3338M0821
$$ 52688 46857 -51848 -33648 60800 24423 -61264 -10645 59837 305 -53851 9487 50308
366E0308o7574m0546O7852N0070o3721n7473N5214M8416n3701k1437O6480r766
$$ 50308 -17266 -57812 10040 60110 -3611 -61084 -5870 42546 -11155 -32592 33888 24122
378B4122q9282K8639J08710k7808j10261J5810R5945j475p4746o118N8402P867
$$ 24122 -65160 -36521 72189 44381 -65880 -50070 45875 44400 -30346 -36464 21938 29805
390B9805m7159J671L9607k3867l4856N8854L7816r3110m8845J10724O2507j03000
$$ 29805 -17354 -15683 23924 57 -34799 24055 61871 -31239 -80084 30640 93147 -9853
402i853o8627P5600O0396m6255m1128K9748J9282l3314l355M8991o926o8592J6422
$$ -9853 -78480 -2880 57516 11261 -29867 -119 19163 -14151 -17506 31485 24559 -44033 -27611
415b7611Q1645k9433q9008M0880Q9251m6268q1850M0654O6728l1459m9346K5088
$$ -27611 54034 24601 -64407 -23527 65724 19456 -62394 -21740 44988 13529 -35817 -10729
427a0729L7691k5884l6679K9835M2312l3638m1698L8660K8846m8438p356O7662
$$ -10729 26962 1078 -35601 -5766 36546 2908 -38790 -130 28716 -19722 -27078 40584
439D0584q186q5716Q400R4522Q123q6213k6425O8211L8287m9910l6453M0990K2647
$$ 40584 32398 -53318 -44918 49604 57727 -28486 -54911 13300 51587 1677 -34776 6214 28861
452B8861l9455P17M1270l1357m5730O3005N2925q6899o6423Q9610P7543p1879
$$ 28861 -10594 -9877 31393 36 -45694 17311 70236 -16663 -83086 6524 84067 12188
464A2188q1278M2045O7571k1795m4210K1015J9097m1307j696O8193q377q8468
$$ 12188 -69090 -27045 40526 18731 -25479 -4464 14633 -26674 -28370 39823 31446 -57022
476e7022J7109R6360k5679r1604L3066Q1583l2124o4634K7082M7365k1437l1097
$$ -57022 -39913 56447 30768 -60836 -27770 53813 21689 -42945 -15863 31502 10065 -21032
488b1032K4698K5261l3504k9097M3237L6460m6817l6102M4007K2580m2759m019
$$ -21032 3666 28927 -4577 -33674 9563 46023 -794 -36896 7111 29691 -13068 -17087
500a7087M5114r579n0304N984N0345Q056m5003k4887L7117L2009l4347k8606L8157
$$ -17087 28027 18448 -31856 -25872 24473 32529 -12474 -37361 -244 31765 -2582 -31188 6969
513F969J7621m4043k193M7342j3232m6463K9615M7134l8387n1690L7758O0207
$$ 6969 24590 -19453 -21646 25696 12464 -33999 -4384 42750 4363 -47327 -9569 50638
525E0638k5696o5002J3746N9908j3072m8807K9469L7496n7915l2876Q0370L0029
$$ 50638 24942 -40060 -26314 33594 20522 -28285 1184 38680 -19235 -52111 28259 58288
537E8288r0249k5481Q3685J2713p2386J313O1641j3171n5990K2389N3421l0960
$$ 58288 -31961 -57442 26243 38956 -33430 -32117 29524 16353 -39637 -17248 36173 5213
549E213n4844M5098O1767n7027o7194O3987O8432n8019n2293M7899K5743l7077
$$ 5213 -49631 -4533 57234 207 -66987 -3000 65432 7413 -44880 3019 28762 -8315
561h315O223L5907k6575m1211L1000M8997k0633n4917M085N4942N956n3952r241
$$ -8315 -2092 33815 7240 -33971 -2971 46026 25393 -29524 -25439 29503 35459 -18493 -27734
574b7734M7773K605m1110K642K5856j0749j1663J6803K02k3813k704K4129J5350
$$ -27734 20039 22644 -18466 -15824 10032 -717 -12380 4423 4625 -19188 -21892 2237 17587
587A7587j8145l0555J1425M0266j0399m1178K0229M2914l1025m3186L7774M4985
$$ 17587 -558 -31113 -19688 20578 10179 -30999 -10770 32144 1119 -42067 -4293 40692
599D0692l2146l9174K5603L0836k2391j9374K9672J1399m3381k791O1850p535
$$ 40692 8546 -30628 -5025 25811 3420 -15954 13718 25117 -18264 -21055 40795 33260
611C3260q0986J8421R4746k6144r8445K7459Q6463k6279o3238K4051L2973k6797
$$ 33260 -47726 -29305 65441 39297 -59148 -31689 54774 28495 -34743 -10692 22281 -4516
623d516q453L6417p319n4239P210P2872L153q6759j6179Q8068J9936q0486j3801
$$ -4516 -12969 23448 16129 -38110 -30900 41972 45125 -41634 -57813 30255 50191 -30295 -44096
636d4096O5858N48m8283J3572K7302k7964j0288M2546M852n3192j2252N4353K6127
$$ -44096 21762 22310 -25973 -12401 14901 -13063 -23351 19195 24047 -29145 -41397 12956 39083
649C9083m5506l1243L7068K6786l1964j5653L4402Q547k9294k441J9526p94n550
$$ 39083 -6423 -37666 -598 26188 -5776 -21429 12973 21520 -7774 -10215 9311 8517 2967
662B967N228j81k603j866m192R902J1229k1411j3228L3771P204m8409k415N5490
$$ 2967 8195 8014 5411 3545 -647 9255 20484 -927 -14155 19616 26820 -21589 -24004 31486
676C1486l466n7871K075M9051j432l8643l302K3688o94j4890J2534J4142l2779
$$ 31486 28020 -29851 -27776 21275 19843 -18800 -22102 1586 892 -13998 -1464 12678 -20101
689b0101k5070M8975L9547n3638m3102N2358L6611m8770k1582M9930J5029m4321
$$ -20101 -45171 3804 43351 -10287 -53389 -1031 35580 -13190 -34772 15158 30187 -14134
701a4134q199L8373Q88l3303J5182M4301k6913o1334L0834P1931k9297o4355L2587
$$ -14134 -22333 16040 16928 -16375 -1193 43108 16195 -45139 -14305 57626 28329 -36026 -3439
714c439M1537m5914j9293N8494K151o5930M637N9456q084m9802M389L6999k446
$$ -3439 38098 -7816 -27109 31385 33536 -32394 -27757 31699 23615 -26187 -21798 15201 12755
727A2755k8276J446K3317o401k3774J2947K5349k0412k2412K9626J8529l7047
$$ 12755 -15521 -14075 9242 2841 -20933 -7986 17363 -3049 -25461 4165 22694 -14353
739a4353j8064L8572K4197k5019k5933N492J8972O954n532l21o38j5261m225K4872
$$ -14353 -32417 6155 30352 5333 -20600 -15108 3864 10818 5286 4965 4327 -10934 -15159 9713
753I713J0808k1797q649J3986n61j1916M512J4288L551j5999j8663J6050K9454
$$ 9713 20521 -1276 -9925 4061 3500 -8416 -3904 10384 13935 -2064 -20727 -4677 24777
766B4777k0331l2717L1679L0901m4209k4735N0871J2763m9581M310M3914k2494
$$ 24777 4446 -28271 3408 34309 -9900 -34635 16236 28999 -20582 -16272 27642 5148
778E148l6565L8735L0886n2989l2132O2719M1157o3116n0837N1850M6361l8625
$$ 5148 -31417 7318 38204 -14785 -46917 15802 56959 -6157 -56994 -5144 41217 2592
790B592k4191L3960n933m0310L0313M5301m3846m2733N2358L6417n6400l5366
$$ 2592 -21599 12361 6428 -33882 -3569 41732 -2114 -44847 7511 43928 -12472 -47838
802d7838N1155L8624l3190l5942J4014K2362n840l680J3864j0322k6603J8402
$$ -47838 3317 41941 8751 -27191 -13177 9185 3345 -335 13529 3207 -23396 -4994
814d994L4436k4220l4659K8171K9891k6054k0684J6079P639m581L268m991n067
$$ -4994 29442 5222 -29437 -1266 28625 2571 -18113 -2034 5605 1024 4292 -699 -5766
827e766J2912j506k2340P220K8334p829k3889O789J1716j1140n00K0155l270k7957
$$ -5766 7146 5640 -16700 -9480 18854 11025 -12864 -6075 5641 -5499 -5999 14156 10886 -17071
841a7071N126L4758j1100m4472J9931N7611k4768o4986K5734N5803k7988l3617
$$ -17071 -11945 22813 11713 -32759 -12828 44783 20015 -44971 -19237 36566 8578 -25039
853b5039L5476P812m4697J2120M8757k6662m9850L4617N0949l2620n2958K1367
$$ -25039 10437 18249 -26448 -14328 34429 7767 -42083 -7466 43483 10863 -42095 -20728
865b0728M7105j0419l2552J1306J7195k3804p015L6831K261m1351O415L9525j5628
$$ -20728 26377 15958 -16594 -5288 11907 -11897 -18912 17919 20180 -21171 -14756 24769 9141
878I141l5643K0257L0628j4055j9436N144N436n16K658K261m8m688q730L608J4211
$$ 9141 -26502 -6245 24383 10328 -9108 -3964 1472 956 3614 5875 5827 1139 -7591 -3983 10228
893A0228k261j4843M53J2114J059q863n940M970P285n304l395J3876m713k9584
$$ 10228 7967 -6876 -6423 5691 6750 -2113 -8053 -3083 4202 -1102 -4497 9379 4666 -24918
907b4918R934M1083j2631m0084J9169K9896l0478j9665L9723J4581l7305q185
$$ -24918 -14984 26099 13468 -26616 -7447 22449 -8029 -27694 12029 26610 -10695 -18880
919a8880K9017k500k4430J3436L0495j5758l7311J1135L6864j0059k8413J9391
$$ -18880 10137 7637 -16793 -3357 27138 11380 -25931 -14796 22068 12009 -16404 2987
931B987J9402l3331j4956M0931J1558l8581o383K7923L53j5660L392M389o811
$$ 2987 22389 -10942 -25898 15033 26591 -11990 -18373 9550 9903 -5757 -2365 2024 -4787
944d787J820R053P02j0475j0081Q122J8930m361k2055L462K1395l548k0332j118
$$ -4787 -2967 6086 6788 -3687 -13768 -5646 13284 8923 -13132 -9670 11725 8177 -12155 -13273
958a3273J8689J3061j0833k2510n52J9061N981k157L676j5932k1809K5273L4594
$$ -13273 5416 18477 7644 -14866 -15418 3643 9624 7467 11143 -4789 -26598 -1325 33269
971C3269k7219l4567K7777K6959k9656k0720K7511J6246k0001j1110J1879K585
$$ 33269 6050 -28517 -740 26219 -3437 -24157 3354 19600 -401 -11511 368 2953
983B953j1328N575J7542j2244k6251J7886L2487k3038l4775K6673L0825k5756
$$ 2953 -8375 -2800 14742 2498 -23753 -5867 26620 3582 -31193 -4520 26305 549
995E49k0573K2975Q952j9345j039J4346j95m787O15k877m680K123J1741R672j3409
$$ 549 -20024 2951 11903 -7442 -8481 5865 5670 883 1498 -1379 -6059 -3936 7805 17477 4068
1010D068k3567P746K9770r07k5124k818J6200M179j0045r254N135J5850p03j7835
$$ 4068 -19499 -11753 18017 17110 -8014 -10832 5368 9547 -498 -9752 -4617 11233 10530 -7305
1024g305k628R357j496M816J1660j8485k3288K6464K9392k7766k9975K4116K6323
$$ -7305 -9933 -576 -2072 2744 14404 -4081 -27369 -905 28487 721 -29254 -5138 21185
1037B1185j6158j9187Q014J0535m467k647R397j462j7712L315K5795o462k9573
$$ 21185 5027 -14160 -6146 4389 -78 -2725 6672 5210 -12502 -9187 16608 10146 -19427
1050a9427J2368L1728j7894k9687J8915K1960j5319j0382J2522M30j1594K197
$$ -19427 -7059 24669 6775 -22912 -3997 17963 2644 -7738 4784 5214 -6380 -4183
1062d183J0188J075p712m829O494M295r751j550J5156j419j8196L117J6469n113
$$ -4183 6005 7080 -632 -5461 1033 5328 -4423 -5973 9183 7764 -10432 -7315 9154 4041
1076D041j2108M579Q482k62n823p366M080J1500l910j0008P951L171j4840M631
$$ 4041 -8067 -3488 4994 4732 -1091 -8457 -4377 7123 3213 -6795 1156 4327 -10513 -5882
1090e882J9807j0287j9961J3820J7210j5227j3615J3585J1782r649r835P999Q316
$$ -5882 13925 3638 -16323 -2503 14707 -520 -14135 -550 11232 1583 -8252 -253 8063
1103H063j0615p574J7771P433k3985o408K7558K694k6710L248K1155q376j2703
$$ 8063 -2552 -10126 7645 15078 -8907 -15315 12243 14937 -11773 -8525 12630 4254 -8449
1116h449J1940M509j5548j124J7317M596j6759j2856J3072J8956r669j9581Q790
$$ -8449 3491 8000 -7548 -8672 8645 13241 -3518 -16374 -3302 15654 5985 -13596 -4806
1129d806J4605j1047o129J1568k735j0163J1805Q590j7757q881J7316J1728q958
$$ -4806 9799 -1248 -7377 4191 1456 -8707 3098 11688 -6069 -14950 2366 14094 5136
1142E136j4431j736J5267R510j3613j0465J1192O121q498J17M942n716j420Q010
$$ 5136 -9295 -11031 4236 13746 133 -10332 860 6981 -1517 -1400 3542 -2174 -3594 4416
1156D416n57q443p73P545L933p877j0361J0526J6646j4273k0926J7132J9335j7143
$$ 4416 3859 -4584 -5357 2188 6121 -1756 -12117 -1591 15055 782 -20144 -3012 16323 -820
1170h20j2449J5701L648j1822M339P256q301k323J1829J397j3007o245J3294J7154
$$ -820 -13269 2432 6080 -5742 -1403 5853 -2448 -4771 7058 8455 -4552 -10797 2497 19651
1184A9651j0023k7539N644L1241k189k6447J983J5166n013l487Q542p517j2686
$$ 19651 9628 -17911 -12267 18974 16785 -9662 -7679 7487 2474 -1013 7529 12 -12674
1197a2674J2515J5818j3418k0662Q068K4030j279k6401m908K4075O100j7561k285
$$ -12674 -159 15659 2241 -18421 -10353 13677 12398 -14003 -18911 5164 11264 -6297 -8582
1210h582Q356n041J395J2699p183j6188R277J5458n781r890J085N657N853l354
$$ -8582 -226 -5267 -3872 8827 1644 -14544 -5267 10191 4410 -5480 -4395 1262 7115 3761
1224C761j1173N196J5821p973j5023R740J0367r768k536Q406m288o272P310L024
$$ 3761 -7412 -2216 13605 5632 -9391 349 10716 948 -1588 6818 2530 -3742 3568 6592
1238F592p216k305M865L441l588r127J860J5261j472k0131L00J9034l61j3965
$$ 6592 -624 -2929 1936 5377 1789 -7338 -5478 9783 8311 -11820 -11520 7514 7153 -6812
1252f812R24O076k448r15M929n72p760k142J1324P101j5381j1015K0533J2330
$$ -6812 -5888 188 -2260 -3175 1754 1182 -6578 -8720 2604 9705 -5676 -16691 3842 16172
1266A6172k3342q357K3384J655j8985P917J3128j5685o373J9805L322j7632k574
$$ 16172 -7170 -15527 7857 9512 -9473 -1556 11572 -4113 -10486 9319 12641 -4991 -7565
1279g565J1704L803m908m830J163N631k117n357O722L183j1920q59J4660k479
$$ -7565 4139 7942 3034 -1796 -633 4998 2881 -2476 4246 7429 -4491 -5350 9310 6831
1293F831j5307L400J2395k541q934j070M233L380k254l923K452k15m793N443P958
$$ 6831 -8476 -5076 7319 4778 -4156 -5226 -993 2387 133 -3790 -1338 -1553 -6346 -903 7055
1308G055j1231r158J3902Q266j2597m942Q977K702k936k190j417N099M419p954
$$ 7055 -4176 -13334 568 8834 -3763 -8705 272 2974 38 -2152 -3569 1530 5949 -2005
1322b005k952J0343j327q896Q551N254j5046K76J8899n803j8216Q751J5416r484
$$ -2005 -4957 5386 4059 -4837 3714 8968 -6078 -5802 13097 7294 -10922 -2171 13245 3761
1336C761j2771O308J0179j551q970l639P139L969m623oR40p343Q74J4883k479
$$ 3761 -9010 -2702 7477 5926 -3044 -6683 456 4425 -198 -204 736 -6607 -5733 9150 6671
1351F671j9150K179J9226J38j5426m530J0174R834m612j2772J634J1449j082m461
$$ 6671 -12479 -10300 8926 9064 -6362 -10892 -718 9116 4504 -8268 -6634 4815 3733 -728
1365g28L506m877p496J5168J1247k1427j2877K1559J1968j6189r407P924O340
$$ -728 2778 -2099 -9595 5573 16820 -4607 -17484 4075 16043 -146 -9553 -1629 4711
1378D711n17m841m286M115M642l292j610N74n014L517J2136o845j7178P972J7515
$$ 4711 4194 -647 -4933 -818 3824 532 -1078 -504 -5518 -2001 10135 3290 -13888 -5916 11599
1393A1599o649j3367M076Q367o62m989k608M406N198m100m369L300J37j410O734
$$ 11599 4950 -8417 -4341 4026 3364 -1625 -4233 173 5371 1271 -3098 202 339 -1071 5663
1408E663m81j2853J736J5675k043j3669n8Q585L649k705q360j940J1611K504j2285
$$ 5663 5182 -7671 -5935 9740 7697 -5972 -6030 2555 6204 3499 -4861 -6801 4810 7314 -4971
1423d971k21R617m507l935Q489m316j1430J0983J3872j3764j4788J0429J3365
$$ -4971 -5192 4425 -82 -4017 4472 156 -11274 -291 13581 -183 -14971 -4542 8823
1436H823l584j0165j317O985K211n943J756O227o168n437J1457K599j5516J734
$$ 8823 5239 -4926 -6243 742 2953 -2990 -1234 4993 -1175 -6612 4845 7444 -8072 -6338
1450f338J7639l876j6069M580J0821l413n088K639J959k146k300J802N377l918
$$ -6338 11301 7425 -8644 -4064 6757 3344 -1744 895 2854 708 -1592 210 5587 1669
1464A669p822O340R022r317p857R904K930r223L157P033p744m711O846J479k654
$$ 1669 -6153 187 9209 -108 -7965 1939 4869 -4354 -1197 5836 -1908 -6619 227 1706 -948
1479i48J188j894j627M528j915n475O661N847r184m159Q156Q38m574K250L043
$$ -948 240 -1654 -3281 1247 -668 -6143 518 6365 -2819 -6978 1178 2016 -2558 -308 2735
1494B735k542k187L18K823K199m398j377P784k223j1203O680J3428j0828j1931
$$ 2735 193 -1994 -1676 1147 3346 -1052 -2429 5355 3132 -8071 -1391 12037 1209 -10722
1508a0722J3633Q277j3438m753R204J725l470J949q04n257q33O283O120n147j2370
$$ -10722 2911 11188 -2250 -7003 2201 3926 456 2405 1601 -3656 -4489 1794 7914 2767 -9603
1523i603L913J5675m944j6845O870J5124o966r609M265Q57j847Q096J242j1888
$$ -9603 -5690 9985 5041 -11804 -4934 10190 3224 -6385 -2120 -1263 -3110 4986 6228 -5660
1537e660l200J0079N562m583q070r57J0939N276j2717o630J0630N929n417j834
$$ -5660 -8860 1219 6781 2198 -5872 -6829 4110 9386 -3331 -9961 669 6598 1181 -653
1551f53o58k228M590L257n462j221M824l63k096j105m112M743J1552o209j6554
$$ -653 -1311 -3539 1051 4308 -1154 -2375 2449 2086 -10 -1115 -5227 -484 11068 4859 -11695
1566a1695O035J4873n142r157N284L622m130j129P77j49K248K055j644l172m641
$$ -11695 -5660 9213 4071 -5086 198 3820 -310 -1439 -662 -811 1437 3492 1848 -1324 -5965
1581e965L085J2259k211j7805K156J9102k710j6649K335J0037j625q24J522o884
$$ -5965 -2880 9379 7168 -10637 -8481 10621 7911 -8738 -6403 3634 2009 1185 2707 -4177
1595d177l204Q147N514m960o244J33P465K431j0678l748J4396N313j3373n786
$$ -4177 -7381 766 6280 1320 -4924 -4791 2674 5105 -5573 -9321 5075 10388 -2985 -8771
1609h771O786K643J679L810n688p879M772O811j285j746j699j185M743L81p966
$$ -8771 -1985 658 2337 6147 459 -7420 -2648 4163 2878 1132 -567 -1752 2991 3372 -4594
1624d594K393J0270m240r238M811N318m748j111K973q74n24P12q32m31j068k242
$$ -4594 -2201 8069 3829 -5409 -598 4720 -28 -1139 1834 960 436 1148 316 -115 -1183 -3425
1640c425N015N109q691o062R786J900j0267L943J1097p266j0221N498N301k559
$$ -3425 1590 6699 -1992 -8054 1732 3632 -6635 -2692 8405 1139 -9082 -3584 1717 -842
1654h42J162K399l448m134J22N370N810m693p736M692N579o490j253Q910j912
$$ -842 320 2719 -729 -4863 -4741 629 6439 1746 -5990 -1298 4281 -2209 -3462 5448 3536
1669C536q071M978M549o493j273O174M36k673j214j894K631M119m846m029O889
$$ 3536 -4535 443 4992 -1501 -2774 3400 3836 1163 -51 -1945 686 4805 -41 -4070 2819
1684B819K166o628l6K413l942K143Q355l600j0598J69O846M510j587o712j252
$$ 2819 4985 -1643 -1679 734 -3208 -1065 7290 3690 -6908 -6739 107 4617 3030 -3682 -4934
1699d934P042m11p873M197P644n564l858N104l350m935J0238O066j1251o910Q567
$$ -4934 2108 1697 -6176 -1979 5665 101 -3757 1347 -2003 -6938 3300 9366 -1885 -8795 -228
1714b28N882l362n596M21O338J981p452j949N834o38j886N045k026q608M974Q342
$$ -228 5654 2292 -3304 -2883 3455 5436 -2016 -3965 1869 1231 -655 4390 2364 -6244 -1270 7072
1730G072p681o025R188M550p602m600O56M162P100k121j0256k85P693N5k140J429
$$ 7072 -609 -6634 2554 7104 -498 -5098 -4442 -280 6820 4699 -5557 -5842 1851 1906 -234 1195
1746A195k287r43M902j549o741K554Q294N5o524m903K065R831J552j1983k031
$$ 1195 -1092 -2035 2867 1318 -5423 -2869 5425 5480 -1044 -5947 -3882 5949 7501 -4482 -6513
1761f513J1659K40q544J389K352l288M666O027r569q951R200Q865n098p530J314
$$ -6513 5146 5386 -3158 -1769 583 -2705 1961 7988 -1581 -10532 -1332 7533 2435 -5095 -3781
1776c781O780O72q517j921J0214K461p958m28K612n230L294J1412n907j3639O183
$$ -3781 2999 3671 -4846 -6767 3447 5908 -2050 -2478 134 -5096 -1802 9610 3703 -9936 -3753
1791c753J1291n680o136M426L091j580j291j904K93L934J52k635J77m55p74L695
$$ -3753 7538 1858 -4278 148 3239 1659 368 -1536 -1243 2691 2843 208 385 -70 -844 2851
1807B851n71n926K475O327k907n086M76P38K538L989m698o063N377L399o434Q35
$$ 2851 2280 -3646 -1171 5156 2249 -2837 -2361 -1623 915 4904 206 -5857 -480 2919 -3515 -2680
1823b680P001l760n113L855J97l514L994M643m329n243Q00M512L911l116n906
$$ -2680 4321 561 -4552 -697 -500 -4014 -20 4623 294 -4949 -4149 363 4274 1158 -4748
1838d748L932M959n853k329Q566j687q084O358O185r209l975R918J697p449k1
$$ -4748 -816 4143 -1710 -4039 4527 2840 -5244 1114 7299 -1910 -5885 4033 5730 -1719 -1740
1853a740M963l80l358p10K675J303k695l18M078l756p099O829R001p521q055N608
$$ -1740 3223 2843 -515 -1225 1450 2753 58 -260 3818 62 -7037 -208 8793 1272 -6783 -1175
1869a175K721m065K930K129n523o80M536j569k340K277O23n8Q92l881k222P433
$$ -1175 1546 -2519 411 2540 -2983 -3663 873 -696 -3036 -759 -136 -194 698 -3183 -5405 2028
1885B028L107p637j751N043N58q20M66k205k65N070q49m404J476J710j062K385
$$ 2028 5135 -2502 -4253 790 1348 528 994 -1211 -1476 3594 2745 -1659 -183 1527 465 2850
1901B850L76n641J236O703l888o334M323N701k265n276j932L130N116j511n460
$$ 2850 3226 -2415 -1179 5524 1636 -4698 -375 5326 3061 -2215 -4147 -1017 4099 2588 -2872
1916b872R96J858k301L020K974q006j800J1952n58j3966K053J3202j778q633O76
$$ -2872 -1876 -18 -2319 701 3675 -4331 -6131 5821 5263 -8703 -6650 6552 4774 -3859 -3183
1931c183K423N67K772q19m317j61L650K613r18n859k326R308M698j0794m804Q834
$$ -3183 -760 -193 2579 1760 -2557 -2718 932 3545 2627 -3232 -5558 3750 8448 -2346 -7150 1684
1947A684L508n870n77J282j030K184J630m099k269M158K662j287l474l341M297
$$ 1684 5192 -678 -1255 27 -1003 1181 2811 -1288 -3557 601 3263 1976 -1498 -4839 -542
1962e42O742m867p030M893M816m038j241J603j420J709L420m993l741O097K601
$$ -542 6200 1333 -5697 -804 4012 -26 -1267 336 -1084 625 4045 -948 -4689 1408 4009
1977D009m740J9J089k480L290L163o773k908Q172K485p360k290M093K297m7k879
$$ 4009 -731 -712 377 -2103 1187 4350 -2423 -5331 2841 5326 -2034 -4324 -231 2066 2019 -860
1993h60j939K246J440j435R87J7m306L124O196n828p011P465O112o485l956M306
$$ -860 -2799 -553 887 -548 439 456 -3850 -726 5470 -358 -7369 96 6208 -277 -4233 73
2009G3R94j383J244p89j313J087N14N99O66l663j189P195K91q777J645P892l728
$$ 73 1067 -316 928 139 -1174 -87 427 1026 1692 -1971 -3160 4035 4326 -4451 -2806 5086 1358
2026A358m940N446J428n713J637M387l356k222K860R13j138j254q86J815K359
$$ 1358 -3582 1864 3292 -2421 -784 3603 247 -1975 885 1798 660 -594 -1480 335 2694
2041B694l006k257L085L40k890K257J523m181M88L804k415j839K273k07o39J985
$$ 2694 -312 -2569 516 856 -2034 223 1746 -2435 -1947 1857 -558 -2397 -124 -331 -970 1015
2057A015k043k795N076K085o219l66N216j171j751K136j297j966L502J561l426
$$ 1015 -1028 -3823 1253 3338 -2881 -3247 1969 798 -953 1183 -114 -2080 1422 2983 -443
2072d43m56J193O60K024j034n305K833O573m359o314M921M061m122p33J836k692
$$ -443 -899 294 954 2978 1944 -3361 -528 6045 1686 -4628 293 4354 232 -501 1335 -1357
2088a357n22M923j59n487q40L705L323k462n826J387P434k035p427L023M830l517
$$ -1357 -1879 3044 2885 -2602 -3442 263 3586 1124 -4702 -3315 4119 2084 -5343 -2320 2510 -1007
2104a007n84L311l757k797P225K303q033j590O203K160k555k901j042M265L194
$$ -1007 -1591 1720 -2037 -4834 2391 4694 -3339 -4929 1274 3434 879 -2022 -3064 1201 4395
2119D395m793k689L734J129j518J511j787l284M846L895o349l531N527K412k136
$$ 4395 -398 -3087 647 1776 258 1769 -18 -3302 1544 5439 -910 -4441 1086 3498 1362
2134A362j564k027L79N542n9o583k1N498o45k426J08r36J051L047j888l991J557
$$ 1362 -202 -2229 -1850 3692 3633 -2950 -2971 2527 1882 -544 -436 -1372 -321 2726 838 -3153 -1596
2151a596K840L86o12l413j756O372K954q133k619P964M96n396J707J666l336J935
$$ -1596 1244 1630 1018 -2395 -4151 2221 5175 -2958 -5577 2387 2883 -2513 -806 860 -2476 -541
2167e41M119m086l825M018L737k663l402k13M237K880n241l370N195K089m257
$$ -541 3578 -508 -4333 -315 3422 759 -2643 -2856 1381 4261 -980 -4350 845 2934 -1323
2182a323J209K484m361o6O484k379o213L276N149k784l034R72J074J481K92l385
$$ -1323 -114 2370 -1991 -2057 4427 2048 -4165 -889 4260 1476 -1558 -586 488 1969 2261 -1124
2198a124l28K957n46j285J666j438j865L483Q05m645L23L564j209j184J135k109
$$ -1124 -1452 1505 959 -326 1340 -98 -1963 1520 2325 -2320 -1997 1567 358 -826 309 -1800
2214a800j45M178j647m141K906K446l748L61K990k419j456L638K34l622O51K147
$$ -1800 -1945 2233 586 -3555 -649 1797 -1951 -1590 1400 -1019 -2475 1163 1397 -2225 -1574 573
2230E73J53j53j569l29L224j99m178K109L813l561j327M458k050m824N063M308
$$ 573 726 573 -996 -1325 1899 1700 -2478 -369 3444 -117 -1444 3014 964 -3860 1203 5511
2246E511n893k843M455J130k227J18j92K41J056j502j073J502k34p04K844j612
$$ 5511 -382 -3225 1230 2360 133 251 59 300 1356 -146 -1219 283 49 -655 2189 577
2262E77n208L044O373l780m966K724K335j368N34o76k369K428K925k875k160J966
$$ 577 -4631 -1587 4786 1006 -3960 -1236 1099 -269 265 -411 -2780 -352 2573 -302 -2462 -496
2278d96J44P10J399l222j924N130J446n081r33L667R76l85j485l149K161M748
$$ -496 -352 358 1757 -1465 -3389 1741 3187 -1894 -2827 840 1816 1431 -54 -3203 -1042 3706
2294C706j480l907J468O25j223K790J69m525J726N168l736m848L400M215j353
$$ 3706 2226 -1681 -213 412 -811 1979 2148 -2377 -651 4517 781 -4067 -667 3548 2195
2309B195k572j599M74L579J53l696J35J699j125J570P83m392p13P013k30p238
$$ 2195 -377 -1976 -1502 2077 2230 -1466 -1331 368 -757 813 1596 -2796 -3509 3504 3274 -3964
2325c964R07N004q09k180r8r4J591J987l061k418K486J962J28M65l414l109N457
$$ -3964 -3057 1947 1138 -1042 -1140 -1234 357 2344 -717 -3135 -649 1313 1441 1906 -1508 -4617 840
2342H40M371n181l361M251R49k530L85J97l98K548m65m020M79L106N7l17l75l046
$$ 840 5211 30 -3331 920 1869 -661 -276 -79 -477 2071 1606 -2414 -1935 1171 1228 911 536 -2510
2360b510O71M884j189n012K032L515j544j686M81q71J411J856j904j283J973m69
$$ -2510 -1839 3045 1856 -3156 -1124 2391 847 -839 -358 -1229 182 2038 134 -1149 824 355
2376C55j246K075n77k047L299J068n524r45N465O85k705j16j146p80K892K13k389
$$ 355 -891 1184 607 -1440 1859 2927 -2597 -3542 1923 2608 -97 -213 -1359 -2139 753 966 -1423
2393a423J063J119k510R17J389k752M85M525j930n099K870L541k092q00J227j001
$$ -1423 -360 759 -1751 -834 555 -2197 -1712 2813 883 -4216 -1346 2195 103 -697 530 -471
2409d71K75J328j190k40J086n2N78J328l408k207M783K419m435o98K565j678j252
$$ -471 -196 1132 -58 -298 788 736 1314 2642 -766 -2973 1810 4229 -206 -904 1661 -17 -1269
2426a269K651l08j535J085K58k323R0J196L40J714j363m429J895M723k590l192
$$ -1269 1382 1074 -461 624 882 -1441 -1351 -155 185 1899 536 -3893 -1998 2725 135 -3057
2442c057L190N53k819J951J073l480J113M391k048l298J491R33j12J278j318j449
$$ -3057 133 686 -2133 -182 891 -2589 -1476 2915 867 -2431 -940 -7 -119 1159 -159 -1608
2458a608K647R66l623o45L318Q67k10j046l269M95M521K20k370k0r14n63L175
$$ -1608 1039 2005 -1618 -2263 1055 1922 1712 666 -2603 -2108 2413 2633 263 243 -671 -1234 1941
2475A941j18m084K142M408l752m279L383K667j611j9n79k371J713K742j731j948
$$ 1941 1823 -2261 -119 4289 537 -3742 -359 2308 697 678 99 -2272 -559 2183 452 -1496
2491a496P03K40J858O03n022r96O738K59n865Q12L648k651j405L769o89k440K582
$$ -1496 -793 -553 1305 1908 -3114 -4110 2628 2887 -2978 -2166 1482 -1169 -2574 1195 506 -1934 648
2508F48J322m551m54M103K744j952m125j002M047K228k731m11J680j895l68K885
$$ 648 1970 -2581 -3035 1068 3812 1860 -2265 -3267 780 3008 277 -134 1546 -349 -717 2168
2524B168j800k408M455J643n952r35M209K94j258P38k375j057M394K79n088K07
$$ 2168 368 -2040 2415 4058 -1894 -2829 1380 1674 416 1154 -1221 -2278 2116 2395 -2693 -2486
2540b486L727q3p33o11k362Q81L500p85k031R46m27j049J893r7k232L001K618
$$ -2486 1241 1158 425 -186 -2548 -1667 1833 1048 -983 -37 -464 -1513 380 283 -1949 1052 3670
2557C670n320k658M674K538k454j47j08k097J104K144j1j518o66M12J827j309
$$ 3670 -1650 -4308 366 2904 450 303 195 -1902 -798 1346 1335 -183 -849 -437 1390 81
2573H1k734K781L847m680l016N085P59m612K176L352m534o44N187j262n224K296
$$ 81 -2653 128 3975 -705 -3721 1364 2123 -2489 -313 3039 -1495 -2139 3048 1786 -3438 -1142
2589a142L840j267j434p4j153J059J712j093l33P72j472j98J946j628r17L685
$$ -1142 2698 1431 -3 -77 -1230 -171 1541 448 115 887 -585 -783 1163 -465 -1382 2303
2605B303k27m484J21K733P5K13K36k693j059L492K97k384O77Q53p28O70j23j974
$$ 2303 2076 -2408 -2287 446 521 734 970 -1723 -2782 710 1007 -1377 -700 153 -575 95 -28 -2002
2623b002J427K107j397p93Q17j423R33K769k587k858M522J755n291j21M629j550
$$ -2002 -575 1532 135 -658 159 -1264 -331 2438 -149 -3007 1515 3270 -2021 -2142 2487 937
2639I37j877L236j080m580K608M371k410l038J594J489k04j682o54K350R66k529
$$ 937 -940 2296 1216 -3364 -756 3615 1205 -1833 -239 1250 1046 -636 -1290 1060 2026 -503
2655e03q17J623r28j78L149j203m710K142M602l013l133K645J427p92l03j224
$$ -503 -1320 303 -625 -803 2346 1143 -3567 -1425 3177 164 -2969 -324 1103 311 8 -1216
2671a216j150K692J409k139n52K83o41J801J203l644j45M656o75m558J198K668
$$ -1216 -2366 326 1735 -404 -956 -673 -1314 487 1690 -1954 -2099 2557 1882 -2676 -1478 1190
2687A190q29Q42K42l762N22M534p49l224Q79J576j084M61pj772J305K107j445
$$ 1190 361 1203 1445 -2317 -1795 2739 1990 -1234 -355 1221 137 598 591 -1181 124 2231 786
2704G86j833M38Q97J131k00l195P01L815j244m013J935K048j991R48J519l989
$$ 786 -1047 -609 288 1419 1219 -1976 -1275 2540 1296 -2717 -782 1266 -725 223 1742 -2247
2720b247j089M985Q12m231R5K278l83p32l42l59J865J067k736q92K151m86J68
$$ -2247 -3336 1649 2461 -1770 -1675 603 220 -512 -854 -1213 652 1719 -1017 -1909 242 -244 -76
2737g6K210k289l376L779L167l842j896L328L06j383P54m25j121J960M59j707
$$ -76 2134 -155 -3531 248 3415 -427 -2323 1005 1311 -72 682 257 -864 1096 1555 -152
2753a52j98N92LQ90m06k287J193L110k388k200J783N95o66J550o58l213J742K798
$$ -152 -350 242 245 1135 729 -1558 -365 2745 357 -1843 -60 535 -131 1419 761 -2452 -710 2088
2771B088k225j019J895q19j338K086n38k101K440J588l080j359K478L69k81K58
$$ 2088 -137 -1156 739 -80 -1418 668 130 -1971 469 2057 -1023 -2382 96 465 184 442
2787D42j951o2K719n21j876J467q2j276J849P35l246J58M029j129l214J475J390
$$ 442 -1509 -1571 1148 627 -1249 218 136 -1140 709 1444 -1802 -1644 2385 1256 -1958 -483 907
2804I07o63J96j36j423J221J678j394o95K27m15J189K080l075k250L670J483l459
$$ 907 244 440 304 -1119 102 1780 386 -309 -82 -497 692 2772 -303 -2553 1117 2600 -859
2821h59J60K024j292k98J524j784j025K724J11k120q2N88l44K045o48l337J116
$$ -859 -699 1325 33 -265 1259 -525 -1550 1174 1285 -835 -917 -329 -673 1372 724 -2613 -1497
2838a497L254j869j551J667j81q24J519l61k269K082J874k411q34J593l94N08
$$ -1497 1757 -112 -1663 4 -177 -1001 518 157 -2112 -30 1844 -567 -1401 192 -202 306
2854C06J207k308j188L345R86l112k15J611l54O88K37k287J26K843n00k277R37
$$ 306 1513 -795 -1983 1362 2348 -764 -979 632 278 966 1203 -1084 -958 1885 1385 -892 45
2871D5L07o96K080q25l416J792L525k137k671J498P70m00R86j026j538J478J527
$$ 45 352 -344 1736 911 -2505 -713 2812 675 -1996 -498 272 -128 858 -168 -1706 -228 1299
2888A299j690j63L80q45J536Q50l329n70M413j94l808J034K028j604P31J019j978
$$ 1299 -391 -554 -174 -1019 517 1367 -1962 -2532 1881 1687 -2121 -1087 941 -663 68 1087 -891
2905h91p01K859m3k324O15M68M91R01j705j578K730J383k628p68J916n63k67J690
$$ -891 -1592 1267 1224 -1100 -485 -17 474 1375 -330 -1908 822 2205 -423 -1191 725 162 -105 1585
2923A585j549k116K999J405k935k59J654q54P06P50k536p3L064n57k693P48R53
$$ 1585 36 -2080 919 2324 -611 -870 784 -70 636 1386 -1150 -1223 1841 1284 -1409 -661 292
2940B92j65P32n33k082J084K326j502j515J391q06O2K100j499k596K572K516l154
$$ 292 127 859 326 -1756 -672 1654 152 -1363 28 -778 -716 1384 -115 -2711 -139 2377 -777
2957g77j287K583p0r33J185m05k131J873J320j161p98N3M48J593n97k593J034
$$ -777 -2064 519 449 -484 701 296 -1835 38 1358 197 -601 -548 -100 1493 896 -1697 -663
2974f63K787j856j648K444k49k032K021O22l257J054L059j593k069J286L67j27
$$ -663 2124 268 -1380 1064 815 -1217 804 1426 -1831 -777 2282 689 -1380 -94 273 146
2990A46J062j025j849J836J409j625n99J131j026O42J091j988o32K567pk215L13
$$ 146 1208 183 -1666 170 1579 -46 -645 486 -540 102 1193 -795 -1427 1140 1133 -1082 -769
3007g69J048q78J147L21k808J74L202q62k225J130L69o89J446J4k374R76J828
$$ -769 279 -599 548 869 -1939 -1765 1437 575 -1650 -520 -151 -840 606 620 -1754 -778 1050
3024A050r22p21P55o94O99J592k576j341L833P73l470O11J682j760P83K046k079
$$ 1050 128 -593 162 -532 167 1759 -817 -2158 1675 2448 -1022 -411 1271 -489 294 2340 261
3041B61k187K759J375k543j13P49j50Q44o26j957J142K003j593j068R79m96j20
$$ 261 -1926 833 2208 -335 -448 301 151 995 369 -1588 -446 1557 -36 -1104 -125 -621 -741
3058g41J902j045k690J827K537k152j118J111j72N21J365k116j096K379N82k081
$$ -741 1161 116 -2574 -747 1790 -362 -1480 -369 -541 -20 1345 -771 -1867 512 1094 -987
3074i87N74Q26j142J095J014k646l71L367k34k313L52Q01n74J634k86k462O63
$$ -987 -413 413 -729 366 1380 -1266 -1637 1730 1496 -817 -465 336 -238 1396 1110 -1352 -689
3091f89K204j171j263J593k65m81J321q99k096J789J671j561p07P45o94Q68P66
$$ -689 1515 344 -919 674 409 -72 1249 350 -1746 43 1714 153 -554 191 -503 365 1131
3108A131k061l80K692m70k142P74O69j248J506R46k954l22K929n66k042R37N77
$$ 1131 -930 -1310 1382 912 -1230 -456 213 -1035 471 1417 -1537 -1859 1070 504 -1538 -601 -24
3125b4o4P84q56j693J541J999j920o39J316r91o5K124j125k547K467J826k162
$$ -24 -88 696 -160 -1853 -312 1687 -233 -872 444 -547 -612 1512 387 -2160 307 2133 -29
3142b9j107J299L57N71K98j719p14J796J73p88M72l64j053J681K22k653Q44K684
$$ -29 -1136 163 520 1091 1389 -330 -1044 752 925 137 609 245 -808 873 1095 -1558 -714 1970
3160A970j449j752J127Rm93J849n14k746J352J806j606l41J285r67j43J682j474
$$ 1970 521 -1231 -104 -95 -588 1261 747 -1999 -647 1159 -447 -788 497 -470 -613 1069 -405
3177d05j477K096P84j733J67Q13q63Q62O44k170M11K613p44k172P33L69p09K046
$$ -405 -1882 214 998 -735 -568 245 -618 244 888 -1282 -871 1742 998 -1174 -441 -72 -781 1265
3195A265N98l395J03K685o54j187P47L88m04M80j157p65K190P62j548k27J23j207
$$ 1265 1863 -1532 -1429 1256 602 -585 162 550 146 626 -531 -1296 894 1656 108 -119 4 -1203
3213a203J625K158k993j760L094P28k428L68J119j242O96J030j972n53J891L7
$$ -1203 422 2580 -413 -2173 921 1649 -779 -411 708 -534 162 1192 -780 -1333 558 595
3229E95j091L34l78j23J399p39j932J613K066j910j054Q88k83J23J935q05k359
$$ 595 -496 -162 -540 -663 736 -3 -1935 -322 1744 -166 -1220 -332 -615 -492 1443 638 -1721
3246a721J433J078j143K75R56j027K57P63j437n09K493L35k055qL75k87J465j08
$$ -1721 -288 790 -353 -78 878 -149 108 871 -566 -1075 1418 1753 -302 -310 65 -222 1243 1135
3264A135k169O02J994j177j012J253p27l79K249p83k984J367K315j697j097J491
$$ 1135 -1034 -432 1562 385 -627 626 -101 -480 1769 986 -1998 -631 1684 -13 -1110 381
3280C81l79j98P65j279p52J657R99j449l32j73o70K055J269k940p71K575m17j717
$$ 381 2 -196 569 -710 -1462 195 1194 -255 -587 -760 -1430 625 1894 -1046 -1817 758 341 -1376
3298a376J546L47j053O93N20j842L4K243m22r86R6l73L22J784j306j756K119R59
$$ -1376 170 517 -536 157 677 -1165 -1131 1112 690 -296 -200 -573 -251 1533 227 -1529 590 1549
3316A549j805k04J098j095N45J774j669j546J893M54j470N56P43j057N91M47k096
$$ 1549 -256 -460 638 -457 88 1862 193 -1353 540 994 -476 80 823 -234 357 804 -1292
3333a292L07K469o08j542M20l46k77J934k61k150P40J481j244k88O60m97J18J691
$$ -1292 -985 1484 876 -666 -246 -592 -869 1065 804 -1346 -606 875 -369 -657 3 -494 -376 1315
3351A315j352k024J914J555j445m58P08n80J57Q19j213n54K073K43j110j48o56
$$ 1315 -37 -2061 -147 1408 -37 -495 213 -367 -210 609 -604 -1158 915 1158 48 -100 -756
3368g56J59K267J5l008K55K519j157r86J558k13j390J446J74k354J128J888q46
$$ -756 -597 1670 1685 -1323 -1068 1451 294 -692 866 653 -737 709 883 -1471 -343 1545 699
3385F99j143Ql06R32J079j331j286J594P02j684O85L28j167J072J239k143q38
$$ 699 -444 -436 -742 190 1269 -62 -1348 246 948 -736 -51 277 -890 182 1421 -722 -1560
3402a560K128j19j335O81K66p79J078L2j816P07K052p79j275M76o16M58J666o21
$$ -1560 568 449 -886 -205 61 -718 360 392 -1424 -717 1335 556 -719 -243 -859 -401 1265 644
3420F44j761R54Q57j030M60Q75j324L85J380j977r23K474O28k066J35Q50r93P10
$$ 644 -1117 -163 694 -336 124 999 -325 60 1440 -537 -1460 1014 1642 -424 -289 561 -432 278
3438B78Q41j536o87J819K2r87K0l54J12J660p47j881J145J215j598m3J468r46
$$ 278 1119 -417 -1104 715 737 -250 -230 -584 -472 1188 441 -1440 -295 920 -678 -721 747 -199
3456a99m52J670r29k211J789J792j390r47L48k35J047P65j423p51J422j79o99
$$ -199 -651 1019 90 -2121 -332 1460 70 -877 -529 -764 283 1048 -375 -1126 296 117 -582
3473e82Q43m50o72J754K26k305M04J779o3j014M92n67l95J641j76k019P67J592
$$ -582 261 -189 -861 893 1119 -1186 -782 997 934 -80 412 -155 -550 1091 915 -1104 -337 1255
3491A255q79m06M70r60K14J512q64j050R13L23p89K90J85r36J108N20k385K92
$$ 1255 376 -30 440 -520 -306 1206 342 -708 205 528 -261 29 214 -722 386 906 -1479 -1187
3509a187K385m95j504P49j65j077J425J122k180k20J777l01j159L74J63J42R40
$$ -1187 1198 703 -801 -52 -217 -1294 131 1253 -927 -1147 630 329 -830 -456 -293 -151 789
3526G89p63j522J501Q59q98l3J96q38P97J583j921j373J993J164j468l27K00n26
$$ 789 26 -1496 5 864 -34 -67 129 -709 88 1671 -250 -1623 370 1534 66 -261 -61 -587
3544e87J335P39j837m90J639k64n95M39o83q4J345j07k181P24J862q58q06O20
$$ -587 748 1487 -350 -840 799 535 -60 379 -304 -388 957 850 -1331 -607 1255 397 -409 211
3562B11q18j72J838p47j575J261R31j502M4O76q72O08J068j327r54J505M26r16
$$ 211 -607 -779 1059 312 -1263 -2 929 -573 -529 147 -725 -117 951 -376 -1330 175 601 -315
3580c15J43J71l00Q81k78j523Q50J368q25m88O28p79j89J896m88k056J036J668
$$ -315 -172 -1 -301 580 302 -1221 -371 997 172 -316 312 -467 -656 1240 752 -1304 -268 1400
3598A400j155o83P67m99J46J176j063j294J559Q14j338J31L06j030J100J163j993
$$ 1400 245 -438 329 -170 -24 1152 89 -1205 354 1168 -170 -39 267 -763 337 1500 -493
3615d93j016K175K64j364lK38m75J128M96j644l05J226j03l36L33q08J30J459
$$ -493 -1509 666 930 -434 -437 -199 -674 454 950 -694 -999 227 124 -212 121 -687 -557 902
3633I02p41j577J169Q66r00J45K03q72M05J587j239j140J338M32j021O78K09j224
$$ 902 161 -1416 -247 619 -281 -136 67 -805 -400 1187 -52 -1192 146 578 -443 235 444 -780
3651g80R35R17j384o09J973k95j250Q56q1r01J073L89j477K74J277n91m41L85
$$ -780 155 1072 -312 -921 1052 757 -493 363 282 -619 454 843 -634 -360 917 326 -115 270
3669B70o65L6J286n92j464P74J064p85j88J0j84O35M88j337n18J306L49q91P56
$$ 270 -395 -359 927 335 -1129 -355 709 -76 -264 -254 -438 197 685 -652 -1170 136 485 -406 350
3688C50q32q98K132O39k303l66K207o35j000J011m39p68J299O38j995K63J469
$$ 350 -482 -1380 752 1391 -912 -1278 929 294 -706 305 -134 -902 397 1035 -960 -697 772
3705G72l16n20L01p86L46J538r10j377J019P75o27N8K49j183O75J252j458n12
$$ 772 456 -64 237 -549 -203 1335 425 -952 67 842 215 273 522 -661 14 1266 -192 -704
3723g04J199o4n40L18m09l01J030M6j588L02J392m99l39L48o53n7J279m41j642
$$ -704 495 431 -109 209 -200 -501 529 575 -1013 -711 681 182 -157 191 -462 -519 760 319 -1323
3742a323J074Q88j256K40O78j060L04J599j362j339J688Q55j265r0L59j41K60
$$ -1323 -249 639 -617 -377 301 -759 -455 1144 -218 -1557 131 986 -279 -369 -10 -151 109
3759A09P49r08o74J053k2j1j6n09k82J561m10j592P40J149p23m72O58q69J04J332
$$ 109 858 -50 -724 329 307 296 280 -229 -511 1050 640 -952 -212 937 214 -258 400 -469 -365 967
3779I67m01j545O88J064p00qq1p14M96J305j331j000J645J23r96M62Q6r57R88
$$ 967 566 -979 -291 773 73 65 -16 -730 -234 1071 -260 -1260 385 508 -488 -26 60 -897 91
3798I1J113j611o67J181k1n29P66o00m94J393k46j087JJ156k82k81L71n74R9Q49
$$ 91 1204 -407 -1074 107 86 -443 323 -277 -771 622 376 -711 -710 446 164 -117 254 -320 -221 628
3818F28k98r85R61J84o18N24j03q57Q07J003j509m69J361Q7j191O58K0p84Q23
$$ 628 330 -655 306 490 -128 396 293 -564 243 1246 -263 -732 629 716 -475 183 203 -581 242
3837B42O41j472k8J281l35n99K93m70q5J299k39j315L48J097p19k94N12p18k9
$$ 242 883 -589 -617 664 329 -270 23 -447 -532 767 528 -787 -439 658 -61 -355 157 -561 -590
3856e90J387p12j235R75L74k56K92n76m91J095Q49j730k39J346m83M2M67q98m52
$$ -590 797 85 -1150 -175 199 -57 235 -341 -832 263 1112 -618 -857 489 6 48 515 -383 -835
3875h35J371P01j908K3J101k43j12M39p51j39J337m05j497J028N01n32K39J08
$$ -835 536 1237 -671 -648 453 210 98 537 -214 -353 984 579 -918 110 611 79 318 426
3893D26j026M12J216p92p98P41K48p90M53K4o63P94N32j438j18J194l73m24O32
$$ 426 -600 -188 1028 236 -562 179 427 -363 90 114 -549 245 777 -661 -779 415 42 -382 250
3912B50o09m35J346j01j491M57R63m26M0L50j243M65J494j111j114J410L75r55
$$ 250 -359 -794 552 451 -1040 -583 380 -46 -6 344 -899 -434 1060 -51 -1165 245 620 -335
3930c35J43M10p21N94J101j290j088J157Q34l45n7o60l18J148K81j413K21R44
$$ -335 -192 218 -503 91 1192 -98 -1186 -29 805 460 403 -257 -575 573 854 -559 -338 606
3948F06n19L0L54r17j12J505k61j641N09R79n84m1K76q08M35R44o28r60O17K88
$$ 606 87 117 471 -446 -558 947 686 -955 -446 533 -51 -92 184 -624 -189 755 127 -833 -216 72
3968G2j34L11k54j079P96J151j275j28J185n85p38Q75m47l24J133K07j754O95
$$ 72 -62 249 -5 -1084 -288 863 -412 -540 645 60 -678 197 -250 -574 559 766 -988 -293
3986b93R71n84k79O10m73l59R80j23q50M37O98n98L6j23n87P29P77j154m27J043
$$ -293 678 94 -185 425 -48 -407 573 450 -400 37 735 137 173 50 -537 192 969 -185 -612 431
4006D31k06o22O53j98o23P60P29j599l85J254J42n26L77p06l15J160K19j185M81
$$ 431 225 -397 256 58 -565 195 924 -675 -1060 194 336 -190 187 -519 -834 326 545 -640 -159
4025a59M19p04L35K68q30K16J444p47j337J022M22n56M23J11q82L06J138r18m62
$$ -159 260 -444 -109 159 -671 -455 989 242 -1095 -73 349 -207 216 327 -555 -249 889 -29 -491
4044d91Q34l1l84P24n83p12J053O96j204Q6N88o98j24O42p03j73J238m19j134
$$ -491 343 312 -72 652 69 -643 410 1106 -98 -12 576 -122 -246 396 -307 -480 758 339 -795
4063g95M30P20n17N15P9r31m8J152m18r20P89M15p15K88k69k53O00N48j101k82
$$ -795 -365 355 -162 353 432 -499 -547 605 187 -733 56 471 -244 44 -225 -478 122 670 -431 -713
4083g13R23k58j49N33o13m18J210O6j561J33J293j99q9J15r12q2J339k17q74M31
$$ -713 210 -48 -197 336 -277 -695 515 581 -980 -847 446 247 158 273 -639 -721 618 401 -473 -42
4103d2L13k58L09m0q38P38J240j317j187J268L22m66N28l53q83Q05Q14j189l01
$$ -42 271 13 322 282 -556 182 1422 105 -1082 186 508 42 570 217 -666 139 953 -236 -537
4122e37Q51j80k23O01q43l22J210Rj177M88L97n95J88L71j024Q0J270m89j252
$$ -537 314 134 -89 512 -331 -653 557 566 -611 -123 274 -321 -133 238 -786 -706 564 75 -1177
4141a177Q84N78m22K11Q2r82L96J134p88o94J273p0p58N87k88k68Q77J6j266L24
$$ -1177 -293 285 -137 74 156 -826 -430 704 -84 -778 495 425 -333 254 -34 -302 575 591 -675 -351
4161c51R35n63R9M79p41k40J202l03j125M49R71n88k76L44n72N5R89n94p20O32
$$ -351 584 21 120 599 -142 -382 820 517 -608 -159 812 224 -52 292 -280 -225 764 170 -550 82
4181H2J01n53O91l32p88R49Q15j574k64J110k07k56P70n57j109J098N86r31j09
$$ 82 183 -370 321 -11 -799 150 965 -609 -873 237 30 -226 544 -13 -1122 -24 562 -369 -478
4200d78P90m00J40K06p13J05Q90q6r29L70J93m50P45K95j170R2J336o31q72J055
$$ -478 312 -88 52 258 -455 -350 540 454 -475 -105 88 -362 383 678 -492 -400 936 305 -567 488
4220D88J7p81O18l4j061P79R33r93k24P51l22l64M87l19m21Q52O1j101M21M05
$$ 488 505 -276 342 308 -753 26 959 -34 -258 493 171 -193 294 -25 -446 406 467 -634 -213 192
4240A92l40J54O42j241L3J296o48q92Q47L24o19J22K96p64J88J213p96n93O14
$$ 192 -148 6 648 -593 -560 736 88 -804 43 367 -252 -130 166 -598 -410 803 7 -586 28
4259B8J52k48L15m57l56R53J73q52k66O77n5N4O48r46n17J379J26j094J94M75
$$ 28 180 -68 247 -210 -566 387 560 -292 -558 119 64 118 766 -180 -697 682 808 -286 -92 383
4279C83m08J87l5l17O9R03m38q82N94J16l16P34l44j205R54R86r72m99Q22l64
$$ 383 -25 162 127 -190 -121 782 344 -538 56 172 -144 590 246 -959 -5 981 9 -490 332 -32
4299c2l17P97o12o28Q85K82j140L06O49m13J20L09n27k9O31k07p26N24N11n51
$$ -32 -349 448 -164 -792 93 375 -765 -459 190 -223 -103 206 -321 -350 281 74 -652 -128 383 -168
4319a68L05K30j168N14J114p65q52J147l5p27O97k36k99M30P76j017l13O52m7
$$ -168 137 367 -801 -287 827 62 -790 357 322 -405 292 56 -243 187 963 -54 -367 285 238
4338B38K4J00q41N2J015J79j379O59M13p39K97O73j179l76J632l06j150N13L71
$$ 238 262 362 -479 -427 588 767 -612 47 460 -279 18 691 -488 -864 768 462 -688 -175 196
4357A96l09J86j40n50L84O00o18l95M62J25l23R37p48p10R37M36j124K38O41n02
$$ 196 -113 73 -67 -617 -233 367 -251 -646 -184 -59 -382 555 -193 -903 34 470 -654 -416 225 -277
4377b77j76P75j59p52J110r4p08K51M15m87K43K95o84M8J002o47o41P62L8q30
$$ -277 -453 322 163 -589 521 427 -281 -30 385 -102 141 436 -248 -200 802 155 -486 276 314 -516
4397e16J052j33j001N51Q02j018m41J135j28p06Q45k97p53P49L15o86k76M60l7
$$ -516 536 403 -598 -47 755 -263 -704 431 303 -403 442 145 -608 141 456 -230 -506 -46 -83
4416h3J18K46j003Q7J054l08q73P40J97o39O78R1j050L25J394q53r87Q41J05j68
$$ -83 35 281 -722 -635 419 111 -762 -22 175 -464 214 305 -745 -420 974 121 -866 -25 80 -88
4436h8N90l25r69R50O10p85r0M34m39J85O32o05p08J027L72j142J74N09m69J08
$$ -88 502 177 -792 158 768 -17 -107 327 -112 73 705 100 -608 419 791 -351 -177 332 -137 -29
4456b9P04q32k63Q08N6p84L12N0j31N19j91o25K11N53l63l14M43l17Q1L20n17
$$ -29 675 -157 -420 388 444 -340 -28 22 -109 410 219 -406 -195 358 -5 -319 124 -193 -112 208 -309
4477c09l39R07L48j176J86P98q72Q0R45p78m96J143J38j169L76N79k37%O8o39
$$ -309 -648 259 607 -569 -383 415 -457 -377 568 -210 -706 437 575 -594 -218 361 124 124 192 -447
4497d47J19J114n45p15Q97k21r9L01r4r10O99P07r22k58N98r3l43N39n44j03M12
$$ -447 -328 786 241 -474 423 202 103 404 310 -600 99 806 -116 -374 224 131 -212 327 -217 -320 92
4518I2K63o43K62K28n68O51J00r38J36R68m64p17M79J96m56N17L85j137r8J506
$$ 92 355 -288 -26 202 -366 285 385 -553 -417 551 87 -630 -151 45 -411 106 491 -646 -744 762
4538G62p44n27P78j76m47M37J39p25L80P02p27j63N28k41o9O20n20n11J073J11
$$ 762 18 -509 269 93 -354 83 222 -503 -123 579 -148 -311 217 -24 -93 527 7 -504 569 680
4558F80r60J42O30m19M22No29l34J048k01q11O50m4l05M50R7j091N41P97j035
$$ 680 -280 -138 492 73 495 500 -129 -463 585 384 -427 223 179 -126 324 421 -670 -129 668 -367
4578c67N2O50m93k8M61k07j092J080N58r07j11P54m73o5N65l94p83J004j16l73
$$ -367 -315 335 -158 -186 275 68 -1024 56 614 -293 -404 350 -123 -188 377 -17 -800 204 88 -285
$$ [...]
8191b50
##END NTUPLES=NMR FID
##END=
