##TITLE=1H_EC-3201
 CDCl3, 8 sc, 
 23.7.2019
##JCAMPDX= 6.0         $$ Bruker NMR JCAMP-DX V2.0
##DATA TYPE= NMR FID
##DATA CLASS= NTUPLES
##ORIGIN= UXNMR, Bruker Analytische Messtechnik GmbH
##OWNER= root
$$ XWIN-NMR		Version 3.5
$$ Tue Jul 23 13:51:16 2019 Russian Standard Time (UT+4h)  she@DPX200
##.OBSERVE FREQUENCY= 200.13155
##.OBSERVE NUCLEUS= ^1H
##.DELAY= (6, 6)
##.ACQUISITION MODE= SIMULTANEOUS
##.ACQUISITION SCHEME= undefined
##.AVERAGES= 8
##.DIGITISER RES= 18
##SPECTROMETER/DATA SYSTEM= spect
##.PULSE SEQUENCE= zg30
##.SOLVENT NAME= D2O
##.SHIFT REFERENCE= (INTERNAL, D2O, 0, 15.7039)
##AUDIT TRAIL= $$ (NUMBER, WHEN, WHO, WHERE, WHAT)
$$ ##TITLE= Audit trail, XWIN-NMR		Version 3.5
$$ ##JCAMPDX= 5.01
$$ ##ORIGIN= Bruker BioSpin GmbH
$$ ##OWNER= she
$$ F:/spectra/data/she/nmr/H-F/1/audita.txt
$$ ##AUDIT TRAIL=  $$ (NUMBER, WHEN, WHO, WHERE, WHAT)
(   1,<2019-07-23 13:49:33.90 +0400>,<she>,<DPX200>,
      <created by zg, POWCHK disabled, PULCHK disabled
       configuration hash MD5:
       00 E9 B6 7A A2 85 ED C7 34 08 36 98 17 FE 4E 26
       data hash MD5: 16K
       48 BD 22 97 4F B5 2C B1 7D AC 0B F4 19 C8 18 32>)
$$ ##END=
$$ 
$$ hash MD5
$$ E1 0F CB AB 6A AC 03 DA 1D 26 4C F0 73 14 65 66
##$RELAX= 
##$RELAX= 
##$RELAX= 
##$RELAX= 
##$RELAX= 
##$RELAX= 
$$ Bruker specific parameters
$$ --------------------------
##$DU= <F:/spectra>
##$EXPNO= 1
##$NAME= <H-F>
##$PROCNO= 1
##$TYPE= <nmr>
##$USER= <she>
##$AMP= (0..31)
100 100 100 100 100 100 100 100 100 100 100 100 100 100 100 100 100 100 
100 100 100 100 100 100 100 100 100 100 100 100 100 100 
##$AQSEQ= 0
##$AQ_mod= 1
##$AUNM= <au_zg>
##$AUTOPOS= <>
##$BF1= 200.13
##$BF2= 200.13
##$BF3= 200.13
##$BF4= 200.13
##$BF5= 200.13
##$BF6= 200.13
##$BF7= 200.13
##$BF8= 200.13
##$BYTORDA= 1
##$CFDGTYP= 0
##$CFRGTYP= 5
##$CHEMSTR= <none>
##$CNST= (0..31)
1 1 145 1 1 1 1 1 1 1 1 1 1 1 1 1 1 1 1 1 1 1 1 1 1 1 1 1 1 1 1 1 
##$CPDPRG= <>
##$CPDPRG1= <>
##$CPDPRG2= <>
##$CPDPRG3= <>
##$CPDPRG4= <mlev>
##$CPDPRG5= <mlev>
##$CPDPRG6= <mlev>
##$CPDPRG7= <mlev>
##$CPDPRG8= <mlev>
##$CPDPRGB= <>
##$CPDPRGT= <>
##$D= (0..31)
0 1.2 0 0 0 0 0 0 0 0 0 0.03 0 0 0 0 0 0 0 0 0 0 0 0 0 0 0 0 0 0 0 0 
##$DATE= 1563875373
##$DBL= (0..7)
120 120 120 120 120 120 120 120 
##$DBP= (0..7)
150 150 150 150 150 150 150 150 
##$DBP07= 0
##$DBPNAM0= <>
##$DBPNAM1= <>
##$DBPNAM2= <>
##$DBPNAM3= <>
##$DBPNAM4= <>
##$DBPNAM5= <>
##$DBPNAM6= <>
##$DBPNAM7= <>
##$DBPOAL= (0..7)
0.5 0.5 0.5 0.5 0.5 0.5 0.5 0.5 
##$DBPOFFS= (0..7)
0 0 0 0 0 0 0 0 
##$DE= 6
##$DECBNUC= <off>
##$DECIM= 24
##$DECNUC= <off>
##$DECSTAT= 4
##$DIGMOD= 1
##$DIGTYP= 9
##$DL= (0..7)
0 120 120 120 120 120 120 120 
##$DP= (0..7)
150 150 150 150 150 150 150 150 
##$DP07= 0
##$DPNAME0= <>
##$DPNAME1= <>
##$DPNAME2= <>
##$DPNAME3= <>
##$DPNAME4= <>
##$DPNAME5= <>
##$DPNAME6= <>
##$DPNAME7= <>
##$DPOAL= (0..7)
0.5 0.5 0.5 0.5 0.5 0.5 0.5 0.5 
##$DPOFFS= (0..7)
0 0 0 0 0 0 0 0 
##$DQDMODE= 0
##$DR= 18
##$DS= 0
##$DSLIST= <SSSSSSSSSSSSSSS>
##$DSPFIRM= 0
$$ [...]
##$SUBNAM2= <"">
##$SUBNAM3= <"">
##$SUBNAM4= <"">
##$SUBNAM5= <"">
##$SUBNAM6= <"">
##$SUBNAM7= <"">
##$SUBNAM8= <"">
##$SUBNAM9= <"">
##$SW= 24.9336996594482
##$SWIBOX= (0..15)
0 0 2 0 0 0 0 0 0 0 0 0 0 0 0 0 
##$SW_h= 4990.01996007984
##$TD= 16384
##$TD0= 1
##$TE= 0
##$TE2= 300
##$TE3= 300
##$TEG= 300
##$TL= (0..7)
0 120 120 120 120 120 120 120 
##$TP= (0..7)
150 150 150 150 150 150 150 150 
##$TP07= 0
##$TPNAME0= <>
##$TPNAME1= <>
##$TPNAME2= <>
##$TPNAME3= <>
##$TPNAME4= <>
##$TPNAME5= <>
##$TPNAME6= <>
##$TPNAME7= <>
##$TPOAL= (0..7)
0.5 0.5 0.5 0.5 0.5 0.5 0.5 0.5 
##$TPOFFS= (0..7)
0 0 0 0 0 0 0 0 
##$TUNHIN= 0
##$TUNHOUT= 0
##$TUNXOUT= 0
##$USERA1= <user>
##$USERA2= <user>
##$USERA3= <user>
##$USERA4= <user>
##$USERA5= <user>
##$V9= 5
##$VALIST= <valist>
##$VCLIST= <CCCCCCCCCCCCCCC>
##$VD= 0
##$VDLIST= <DDDDDDDDDDDDDDD>
##$VPLIST= <PPPPPPPPPPPPPPP>
##$VTLIST= <TTTTTTTTTTTTTTT>
##$WBST= 1024
##$WBSW= 4
##$XGAIN= (0..3)
0 0 0 0 
##$XL= 0
##$YL= 0
##$YMAX_a= 336441
##$YMIN_a= -484586
##$ZGOPTNS= <>
##$ZL1= 120
##$ZL2= 120
##$ZL3= 120
##$ZL4= 120
##$ABSF1= 10
##$ABSF2= 0
##$ABSG= 5
##$ABSL= 3
##$ALPHA= 0
##$AQORDER= 0
##$ASSFAC= 0
##$ASSFACI= 0
##$ASSFACX= 0
##$ASSWID= 0
##$AUNMP= <proc_1d>
##$AZFE= 0.1
##$AZFW= 0.1
##$BCFW= 1
##$BC_mod= 2
##$BYTORDP= 1
##$COROFFS= 0
##$CY= 11.3945322036743
##$DATMOD= 1
##$DC= 2
##$DFILT= <>
##$DTYPP= 0
##$F1P= 18.9103706918063
##$F2P= -1.10871071338519
##$FCOR= 0.5
##$FTSIZE= 0
##$FT_mod= 4
##$GAMMA= 1
##$GB= 0.15
##$INTBC= 1
##$INTSCL= 1
##$ISEN= 128
##$LB= 0.24
##$LEV0= 0
##$LPBIN= 0
##$MAXI= 10000
##$MC2= 0
##$MEAN= 0
##$ME_mod= 0
##$MI= 1.114404
##$NCOEF= 0
##$NC_proc= 0
##$NLEV= 6
##$NOISF1= 3.799351
##$NOISF2= 2.8
##$NSP= 1
##$NTH_PI= 0
##$NZP= 0
##$OFFSET= 15.70392
##$PC= 1
##$PHC0= -8859.584
##$PHC1= 13.40096
##$PH_mod= 1
##$PKNL= yes
##$PPARMOD= 0
##$PSCAL= 0
##$PSIGN= 0
##$REVERSE= no
##$SF= 200.130013532006
##$SI= 16384
##$SIGF1= 3
##$SIGF2= 2
##$SINO= 400
##$SIOLD= 16384
##$SREGLST= <1H.CDCl3>
##$SSB= 0
##$STSI= 0
##$STSR= 0
##$SW_p= 3612.71676300578
##$SYMM= 0
##$S_DEV= 0
##$TDeff= 0
##$TDoff= 0
##$TI= <>
##$TILT= no
##$TM1= 0
##$TM2= 0
##$TOPLEV= 0
##$USERP1= <user>
##$USERP2= <user>
##$USERP3= <user>
##$USERP4= <user>
##$USERP5= <user>
##$WDW= 1
##$XDIM= 8192
##$YMAX_p= 0
##$YMIN_p= 0
$$ End of Bruker specific parameters
$$ ---------------------------------
##NTUPLES= NMR FID
##VAR_NAME=  TIME,          FID/REAL,        FID/IMAG
##SYMBOL=    X,             R,               I
##VAR_TYPE=  INDEPENDENT,   DEPENDENT,       DEPENDENT
##VAR_FORM=  AFFN,          ASDF,            ASDF
##VAR_DIM=   8192,          8192,            8192
##UNITS=     SECONDS,       ARBITRARY UNITS, ARBITRARY UNITS
##FACTOR=    0.0002004,     1,               1
##FIRST=     0,             0,               0
##LAST=      1.6414764,     0,               0
##MIN=       0,             -484586,         0
##MAX=       1.6414764,     336441,          0
$$ Real data points
##PAGE= N=1
##DATA TABLE= (X++(R..R)), XYDATA
0@%%%%Qj6J6j6K4l3M1n6P2q8J05j29J60j91K24k63L10l62M17m84N60o43P36q35
28d43R48j075J210j362J531j715J916k138K379k646K941l260L612l999M427m900
44b574N427o019O679p426Q285r275J0429j1803J3469j5536J8180k1705K6679l4272
58a9462M7450p6772K56080o2779l10529L75515J26938k16366j12042K35958K7863
69B71854k45989j40896K14243J21576k06860j62721K20610J28302k61401k05090
79b66372J71391J31975r2720m6378O0683o9806j41194P636J59284P0118j16328
90a31711j08783P4427N8482j03685j7300J54922M825j38603N5071J42532j06582
101a16405j64443J16659K27084k99j70980n6357J13064N0037q3017M0987J84293
$$ y = [0, 0, 0, 0, 0, 8, -8, 8, -8, 16, -17, 24, -32, 40, -48, 57, -72, 88, -103, 121, -142, 168, -194, 223, -261, 299, -344, 392, -443, 505, -570, 640, -722, 809, -906, 1010, -1128, 1251, -1395, 1546, -1714, 1898, -2101, 2326, -2574, 2853, -3166, 3513, -3913, 4372, -4903, 5526, -6277, 7192, -8344, 9836, -11869, 14810, -19462, 27988, -48784, 207296, 144517, -166012, 209503, 336441, 120075, 8033, 243991, 271854, 25865, -115031, 99212, 220788, 13928, -148793, 71817, 200119, -61282, -266372, -94981, 36994, -55726, -102104, -41421, -111227, -252421, -244785, -85501, -15383, -131711, -240494, -166067, -107585, -211270, -228570, -73648, -68823, -207426, -152355, -9823, -116405, -280848, -164189, 62895, 62596, -108384, -164741, -51677, -1640, -84657, -43670, 140623]
112A40623l9378k39295K3127K42924k088j84789K7401J65635K3j29022n1580O0933
124A4514O1613j5720j4040N3751k1715j44259k8625J48802O8034p5614n0785j6110
136b0154k4175K9961M1065l2816k5260L7630J3845l0076l3477k4241K7665O8689
148B8656K397l1718K1968l2629r8758N7797J76446m598j47768j7334Q7746J4841
160E7046l7254N251N1037K7513m8231l9324O1555K7336r3555m901J46401K5323
172A78197j41056n2165O4027K3051j537K6710o607n3478m4265M523N2065J9333
184F8798o7334k8565O5919p236r5727M259N9800l9760l1846P4545J2788j13396
196i7755o1731O7632Q6765n154q0792k6375O0623n261p5087M9288J07956o2241
$$ y = [140623, 101245, -138050, -114923, 128001, 125913, -58876, -31475, 134160, 134183, 5161, -46419, 14514, 76127, 60407, 46367, 100118, 78403, -65856, -94481, 54321, 122355, 46741, -4044, -20154, -44329, -14368, 26697, -6119, -31379, 6251, 20096, -9980, -43457, -67698, -40033, 28656, 31053, -665, 21303, -11326, -110084, -52287, 124159, 119561, -28207, -45541, 42205, 57046, 19792, 25043, 76080, 103593, 55362, 16038, 77593, 104929, 11374, 6473, 152874, 178197, 37141, -15024, 49003, 72054, 70517, 97227, 90620, 37142, -7123, -2600, 49465, 68798, 1464, -27101, 38818, 31582, -64145, -59886, -86, -39846, -71692, 2853, 15641, -97755, -159486, -91854, -5089, -10243, -91035, -117410, -56787, -62048, -137135, -87847, 20109, -42132]
208d2132j05534P7682R5434p6199q0081O7828R6912l600p0819k5512N5561K3402
220A2942m4897L3417R7885m5027j20620M4089J14499k5128o4333L2972M0059k2094
232E3764k6529K349K1972M530k7089J3665N6532l9025j00325L0682R6486k6652
244F0360n9799L1138O804o2812l394N6447J0618l9964l2366J4089M0619k0997
256G43o7277K1873P4907k7529n8493L7414J9865o4214k516P6262J5191n0133k8027
269e1934R225L1192J5106k5601j496L8336j4941m1488L4574L4800m6120j1841
281c0188N9420P258m4087n530J1401J707J9234R003j4872l875r609j9208L0649
294A1303L2915l9472k4652M0945o76m1681J6257K5569k7202n773K8598p571k3848
$$ y = [-42132, -147666, -69984, 25450, -50749, -130830, -63002, 33910, 30310, -40509, -66021, -10460, 12942, -31955, 1462, 99347, 54320, -66300, -22211, 92288, 67160, 2827, 35799, 75858, 53764, 27235, 29584, 51556, 56086, 28997, 42662, 99194, 60169, -40156, -9474, 87012, 60360, 561, 31699, 38503, -24309, -27703, 28744, 39362, -602, -32968, -18879, 21740, 743, -66534, -44661, 30246, 2717, -55776, -18362, 1503, -62711, -65227, 11035, 26226, -23907, -51934, -42709, -11517, 3589, -22012, -23508, 14828, -113, -41601, -7027, 27773, -18347, -30188, 29232, 36490, -7597, -13127, -1726, -19, 19215, 28218, 13346, 9471, -138, -19346, 11303, 44218, 4746, -19906, 21039, 20363, -21318, -5061, 20508, -6694, -12467, 16131, 8560, -15288]
307a5288k754j48J5614K3748k4099k8069K4829N912k9133K2006L2652l5283k2664
320c2677L5656N945k4582R006J0784o200J1001J442j8942R569J1636j7563J3228
333H303L1079k8566l0146L3946J5891k6557P656J9188k0477q201J7479l782m290
346A1523Q253j2864j996K4771j4120l1139K3591K0022l0203j816K6405j9355k1696
359a8624K1732O631j3961N076m668j2373J6190M244k5551R321K1607k4105j0609
372b5090K9645n726k7325J6467J4787j7464K602P860j4708N232J6380j6918m389
385a8647K3216j2075j9755K5376R406k7871N562J9961j5025l942J5803j0357o626
398a4974J8105p861j3471K0938J442k6269J3727K1327k2194p026K2452o734j2564
$$ y = [-15288, -18042, -18190, -2576, 21172, -2927, -30996, -6167, -255, -29388, -7382, 25270, -10013, -32677, 2979, 8924, -15658, -6652, 4132, -2068, 8933, 10375, -8567, 1002, 12638, -4925, 8303, 39382, 10816, -19330, 14616, 30507, 3950, 11606, 30794, 10317, 2116, 19595, 15813, 11523, 19776, 6912, 4916, 29687, 15567, -15572, 8019, 28041, -2162, -3978, 22427, 3072, -18624, 3108, 9739, -4222, 854, -3814, -16187, 3, 4247, -21304, -11983, 9624, -14481, -25090, 4555, -1171, -28496, -12029, 2758, -14706, -12104, -4244, -18952, -13720, 2660, -14258, -18647, 4569, -7506, -27261, -1885, 7521, -20350, -14788, 5173, -9852, -13794, 2009, -8348, -14974, 3131, -4730, -18201, 2737, 4179, -22090, -8363, 12964, -9230, -16256, 6196, -538, -13102]
411a3102J6467m76j2621J3849J933j6767J5702J3325k4931N75K7979j1278j6898
424f243K2139M162j8890J0632J1569j3423M967R434j5239M869J9857j7146j1551
437E137K4867j361k3683J4746J3080k1845o70J6879j1497o729J1602j1382p601
450A543J8503p482k1582J5727O237k5126M251K0203j9792j3075J8081m926j4981
463b2419J1810j184j5019J1883M717k1051N017J5898j7300l702K2861r963j9062
476c7514J7842O074j5073J1639J0365j8016L568J8301j3182m472K1911n129j2681
489a6367J9079L112j9492J0417J5707j1732L548J3498j7601n676K2477l902j2644
502D24J7664Q81k2303R120J4271j7744j357J7727j0165q814J1983j0177j3964
$$ y = [-13102, 3365, 2889, -9732, 4117, 6050, -10717, 4985, 18310, -6621, -6046, 21933, 10655, -6243, 15896, 20058, 1168, 11800, 23369, 9946, 14913, 24347, 9108, 13977, 33834, 16688, 5137, 30004, 28643, 4960, 19706, 32786, 10941, 10271, 27150, 15653, 8924, 20526, 9144, 1543, 20046, 12564, -9018, 6709, 12946, -12180, -7929, 12274, -7518, -20593, -2512, -7438, -22419, -10609, -11793, -26812, -14929, -10212, -31263, -26246, -10348, -27648, -31350, -8489, -18452, -37514, -19672, -13598, -28671, -17032, -6667, -24683, -21115, -2814, -15996, -20468, 1443, -3686, -16367, 2712, 5824, -13668, -3251, 12456, 724, 4272, 17770, 169, -5507, 16970, 13068, 424, 18088, 18969, -3334, 5786, 20057, 2313, 956, 18683, 8518, -296, 11687, 1510, -12454]
515a2454K0123N650j8922N598O509k2252Q48K3593p595j2682J2798m161j3162
528a6109J3522L640j4720J2679J3439j7757j786J4991j3501m080K9248K913k1365
541A114N393O062j1506J2081J7789j2254l727J1403j1136m930J9373m420j3433
554A1809K0414O474k6529k738J2599r989L981K0612j4681k3441O264j566p814
567d605J7957L861k6695k851J0022j5979n291J5690p357p868J4858j0073k6517
580d4848Q036J2419o883J2427J1341k8028j6852J8744O554J334J6280n873j9333
593c4682J0626J0269j3113R138K1646p717j459J5044j3178j6570K1688J8989K12
606B0893R406o617k8210N808K8165J272O96J0835j8187j7478J8813N918j6159
$$ y = [-12454, 7669, 13319, -5603, -5, 6504, -15748, -14900, 8693, 1098, -11584, 1214, -2947, -16109, -2587, 1053, -13667, -988, 12451, -5306, -7092, 7899, -5602, -9682, 19566, 22479, 1114, 6507, 12569, 1063, 13144, 30933, 18679, 14952, 26355, 15219, 10289, 29662, 25242, 11809, 32223, 38697, 12168, 9430, 22029, 12040, 16021, 36633, 21952, -1489, 4775, 3209, -4605, 13352, 17213, -9482, -12333, -2311, -18290, -23581, -7891, -15248, -23116, -8258, -18331, -44848, -36812, -24393, -31276, -18849, -7508, -35536, -52388, -33644, -27090, -25756, -9476, -15349, -34682, -24056, -13787, -26900, -17762, 3884, -3833, -5292, 9752, -3426, -19996, 1692, 20681, 20893, 30299, 23682, -4528, 1280, 29445, 30717, 31413, 42248, 24061, 6583, 25396, 31314, 15155]
619A5155J0073J4899j4832q263Q65j8998m842K4871P105j0597o165k4901k2524
632c8154K5817K5735j8020j0171M857k0528j3138J9623N000j0296R161J873j4217
645c2458O50n472j6893K2678L8205j1068k7933k36l749j10L0990J9519j3890p585
659g352n577r689J9443K4637j2905m719K6769k340k7139K868J2393J434K0173
672C7996J7484k1468k3864k541J945K0700L0319j3472l3247N33L539j0570J5567
685B2921J5944j9065q499J4852j2352k4683M070J1476J0708J4777j3654l6849
697b0354m439J3557K322K0697K1731l2270l9159J5682K3212l222J593N264l572
710A042L802n274k1031P260K4722k484J920K2049k0009m7256J0488M5216J2168
$$ y = [15155, 25228, 40127, 25295, 17032, 17897, -1101, -5943, 18928, 26033, 15436, 9271, -15630, -38154, -12337, 13398, -4622, -14793, -9936, -30464, -43602, -23979, -18979, -29275, -20114, -18241, -32458, -31808, -37280, -54173, -31495, 6710, -4358, -32291, -32527, -36276, -36386, -5396, 14123, 233, -7352, -12929, -22618, -3175, 21462, 8557, 3838, 30607, 28267, 1128, 3996, 16389, 17823, 37996, 55480, 34012, 10148, 7607, 9552, 30252, 60571, 47099, 13852, 14385, 17924, 7354, 22921, 38865, 19800, 11301, 26153, 13801, -10882, -6812, 4664, 15372, 30149, 16495, -20354, -24793, -11236, -8914, 11783, 33514, 1244, -37915, -22233, 979, -2243, -650, 4614, 1042, 4844, -430, -21461, -14201, 10521, 8037, 9957, 32006, 11997, -35259, -24771, 20445, 32613]
723C2613o710j1502k2735n504J6010M161L714J2039j3912k0882J2222L239k8109
736b5356K470L0176J659j2611r536k6874j5094K9583K5554p273j2672k0260k2625
749f2859J4160K6572p299p598J0126j0929j4201J3592J360j5624J6048K7975l423
762a2100j5367j3021j2763K0499M2775M025k1204k038o251q502K8776K9642j1943
775B2528j1282J0069o57l78R202o070M58L0437J1371k6658j5658K177J530K3177
789E0246K5208j6318k5998n405o542O927L0505o58l4369k689J6795j3790j3851
802A0061O372M35K443J1990j3519k6298m224J70L567K7918Q765m1937k5880J6773
816b3364J0512K711J1586r204j8966O675O040j1694L806Q490m883J1426J4909
$$ y = [32613, 25903, 14401, -8334, -13838, 2172, 6333, 10047, 22086, 8174, -12708, -486, 2753, -25356, -22886, 7290, 8949, -3662, -13198, -40072, -55166, -25583, -29, -7302, -19974, -40234, -62859, -48699, -22127, -29426, -37024, -26898, -37827, -52028, -38436, -37076, -52700, -36652, -8677, -12100, -27467, -40488, -53251, -32752, 10023, 14048, -7156, -9194, -15445, -23947, 4829, 34471, 22528, 11246, 21315, 20658, 20280, 29482, 23412, 23870, 54307, 65678, 39020, 23362, 25539, 27069, 50246, 75454, 59136, 33138, 27733, 21191, 28118, 58623, 57965, 23596, 20907, 37702, 23912, 10061, 16433, 16868, 19311, 31301, 17782, -8516, -12740, -12570, -9003, 18915, 27680, -14257, -40137, -23364, -12852, -10141, 1445, -7759, -26725, -20050, -14010, -25704, -21898, -13408, -18291, -6865, 8044]
829H044k5668k5589J7326K0019N843J1993p611l2963m540K4660J1388L596n13
842E985j7740m493J8009n387j6189J4220J3045j1594L551N840k6196j5221K5100
855a1070K0477J61p953k5045j6827K2414J9004r528O31M649k0352o193K1721k45
869h156j4462R221J2112r19q32j4110j6688K0290L0913n285j0770J899j6032p994
883b0813L1405K0901j5495q547K650m316Q214R115j0083J281J9161l288j2633
896A7552M956p579j2454K4828K4228j8605k0975j709l224P846K0636n267j8286
909A1947l08l717p653J3617M471k1838K206K1301j1882k2512K778K888L00J5347
923F945J111k1623q954P89q18J7963J3846k3280j7220J5554L445r959R728M970
$$ y = [8044, -17624, -43213, -25887, -5868, -25, 11968, 4357, -28606, -33146, -8486, 2902, 6498, 5985, -11755, -16248, 1761, -3626, -19815, -5595, 7450, -4144, -593, 5247, -20949, -36170, -11070, 9407, 9568, 1615, -23430, -40257, -17843, 1161, -8367, -7736, -3087, -23439, -29632, -7911, -8156, -22618, -13397, -1285, -2204, -3036, -17146, -33834, -13544, 17369, 12084, 1314, 3213, -12819, -20813, 10592, 31493, 15998, 7451, 10101, 5785, 13999, 23114, 13031, 14312, 33473, 30185, 17552, 22508, 14929, 2475, 27303, 51531, 32926, 11951, 10242, 7018, 14864, 35500, 30233, 11947, 11639, 7922, 269, 13886, 18357, -3481, -1275, 20026, 8144, -14368, -11590, -8702, -8402, 6945, 8056, -13567, -22521, -21732, -22550, -4587, 9259, -14021, -31241, -15687, -12242, -22201, -12473, -7503]
937g503j1504O113R638j2284p402Q543O52P989J6385j3623k3802R458J4908j866
951d298Q565N068j9081o489J6421J449m530P488l521o922J2921J146j9277K782
965h278J5474l337J655P624j7030j3892J7257J0765n671L505l552j6632P196J6352
979A1436q805n437R713m454n028J1759m063j4721J0493J1879o547J355J961j6386
993f845O60K1785j70j1640N399l440j0552J3173R778j2993j682R409o779j678
1007D425J0065r224r701J5389N480j3117J192J613j1354O210J4997r374j0030
1020c429O070m775m100J3629j126j6751O102Q783j0673l66Q408j0233m403J4761
1034A897k026j1600M450M24p736J0913O921j5514k385J1087n695k645J2019n778
$$ y = [-7503, -19007, -12894, -3256, -15540, -22942, -14399, -13747, -5758, 10627, -2996, -26798, -17340, -2432, -4298, 4267, 9335, -9746, -16235, 186, 1635, -2895, 4593, 1072, -5850, 7071, 8217, -11060, -8278, 7196, 3859, 5514, 13138, -3892, -17784, -527, 10238, 4567, 8072, 4520, -12112, -4916, 11436, 2631, -2806, 6907, 2453, -2575, 9184, 5121, -9600, 893, 12772, 6225, 7580, 9541, -6845, -6185, 15600, 15430, 3790, 9189, 5749, -4803, 8370, 18148, 5155, 3473, 12882, 6103, 4425, 14490, 5266, -4435, 10954, 16434, 3317, 4509, 6122, -5232, 978, 15975, 6601, -3429, 2641, -2134, -6234, 7395, 6269, -10482, -4380, 4403, -6270, -6636, 1772, -8461, -12864, 1897, -129, -11729, -7279, -6855, -14591, -3678, 3243, -12271, -14656, -3569, -9264, -11909, 110, -5668]
1048e668j1406J0686N473r895M313M196j0871M597J3360j0327p778J1880q67p876
1062a0183J0925L464j4233L247J0783o784J06Q151r080l788J4581j940j0629Q895
1076C515L278j1525P294J0305j1948l253J1961m309m580J0600l616r864J0408
1089H266M862j1547L675Q224j1501j97J3291n942r198Q690j14q189Q672K747j2780
1104a041L587Q776j0647j418J0911p465q423J1608L60j1914N650M013r979L718
1118b264P814j1371k566J0765o461o964J2112q58j3335O938P628j0803J174Q591
1132D00p511k553J0325n382o065J1104j691j0540J0518O809j4303J027J2871p410
1146b401m862J0987k993p643Q327R39p199P295K721j2051N530J0944j1907m302
$$ y = [-5668, -17074, -6388, -915, -10810, -6497, -2301, -13172, -8575, 4785, -5542, -13320, -1440, -2307, -10183, 742, 4206, -10027, -6780, 4003, -2781, -2675, 5476, -3604, -7392, 7189, 5249, -5380, 3515, 6793, -4732, 2562, 12867, 919, -2334, 9627, 5318, 738, 11338, 7722, -2142, 8266, 13128, 1581, 5256, 13480, 1979, 1782, 15073, 9131, -67, 8623, 8509, 320, 8992, 11739, -1041, 2546, 11322, 675, -743, 10168, 2703, -5720, 5888, 6248, -5666, -16, 3997, -5982, -2264, 5550, -5821, -8387, 2378, -4083, -11047, 1065, 207, -13128, -6190, 1438, -9365, -8191, 400, -7111, -9664, 661, -4721, -10786, 318, -1373, -11913, -1395, 5414, -8889, -7862, 5009, -2401, -7263, 3724, 731, -6912, 1415, 2354, -4845, 2450, 5171, -6880, -1350, 9594, -2313, -6615]
1160f615J3980l482j1159J0082M367j1245K952O325p194J921O128r213q98J1984
1174G933o268q719J2705J202j4406O933J1529j0653l446R737l020m535Q216k268
1188D940n222Q359n97r962R167O056j3340K118J4249q860r025J1097J121r537
1202E64O344M065r037J675L683p593L209P660j1137m129J2566n770j2601J0739
1216B38N387j3858J718R066r928n726P789j925k720O778o161q356R081J130j1439
1231a8926Q408R685j4818l874J4404m249r684J0667N128p548K927J987p092N547
1245g438P215o545L717R538j2015o901J7018K816j1556Q142Q103j1764j683R614
1259H261k495j130P858l744l149O877p156q342J5232P263j5223N44R517j1617
$$ y = [-6615, 7365, 3883, -7276, 2806, 7173, -4072, -1120, 5205, -1989, -68, 6060, -3153, -4051, 7933, 1665, -7054, 5651, 6853, -7553, -620, 10909, 256, -3190, 6547, 3527, -1008, 7208, 4940, -282, 8077, 7480, -2482, 6685, 12741, -599, 1519, 15768, 6908, -2117, 8980, 10101, 564, 6908, 10973, 1936, 3611, 7294, -299, 2910, 10570, -567, -4696, 7870, 2100, -10501, 238, 5625, -8233, -6515, 2551, -7377, -13103, -5314, -7239, -9959, -3181, -9342, -17698, -8617, -7487, -18926, -10518, -833, -15651, -19525, -5121, -9370, -19054, -8387, -3259, -10807, -7880, -5893, -12985, -7438, -223, -6768, -3051, 6487, -5528, -12429, 4589, 7405, -4151, 3991, 12094, 330, -1353, 8261, 5766, 4636, 12494, 8750, 5601, 12478, 5322, -3020, 12212, 19475, 4252, 4796, 14313, 2696]
1273B696o658J5047K333r326J986q06o350M379J267p460Q188P216j4614m460J1693
1288E131o106q344J6019N912j5888l300O051l848K953Q247n071j496M430r323
1302d633l966J5318k46j1797J0426Q529j7705n718J3125Q75k217P913l605r819
1316c520K139l70k048J2750L074j6778j91J0806j0181o495J4899J895j0810M059
1330g71J505j2320P17Q238m39M405K314j5328n549J2843m85n172J2842M83j8084
1345a4801J777J2156o194k744J0833K60m409K249p200m462J3629M730o667P127
1359F284J584j9191n60K1170J522q940N781j166r822L685N150l963O006M961r754
1374B747o65M975j1774l344J8968M037j3905n56l18j1505N839J5050l584p172
$$ y = [2696, -3962, 11085, 13418, 4092, 6078, 5272, -1078, 3301, 4568, -2892, 5296, 12512, -2102, -6562, 5131, -975, -9319, 6700, 12612, -3276, -6576, -525, -4373, -1420, 6827, 1756, 260, 4690, -4633, -8599, 6719, 6473, -5324, 5102, 13631, -4074, -9792, 3333, 4208, 1991, 9904, 6299, -3520, -1381, -1751, -3799, 8951, 12025, -4753, -4944, 5862, -4319, -10814, 4085, 5980, -4830, -771, 734, -11586, -10869, -2631, -3070, 1335, 3649, -11679, -17228, -4385, -4870, -10042, 2800, 3283, -14801, -13024, -868, -7062, -9806, 1027, 1287, -3122, -873, -8073, -12535, 1094, 5824, -843, 6284, 7868, -11323, -11883, 9287, 10809, 1869, 7650, 6484, -3338, 347, 5497, 1534, 7540, 12501, 2747, 2082, 7057, -4717, -8061, 10907, 14944, 1039, 483, 165, -11340, -5501, 9549, 5965, -1207]
1388a207P09o845k802R579k211n817J1425K242j5894L13Q348q932N25J8628J1
1403H072j5918l080J257J628J1792M013r246J624J757j0969L068J6911m925r437
1417c453J2631L726j5760j337Q333K12P397O719j1474q986L889j242L973J5113
1431A9741l839j7594L295O113q646K220J1575n383o302P544m342j1551L666N548
1445B045J526Q556l801j9627q06J2185k843K098J2260r003j8267O239R591m659
1459d506J082N034m398J493J373j2064j978J4781J713m074Q170o447j9234N837
1473a3218J8110k55k393J736j0217n657J0523J796l527O596L22q753M339J449
1487H51j2957L205J7811j432q574J693p498r561J3226J3219n178m153l865r188
$$ y = [-1207, -498, -7343, -10145, -566, -2777, -8594, 2831, 5073, -10821, -10508, -2160, -11092, -10567, 8061, 8072, -7846, -10926, -9669, -8041, 3751, 7764, -1482, 142, 1899, -9070, -6002, 10909, 5984, -3453, 9178, 12904, -2856, -4193, 4140, 4352, 11749, 18468, 6994, -1992, 1897, 655, 4628, 19741, 15902, -1692, 1603, 7716, -930, 1290, 12865, 7482, 1180, 8724, 4382, -7169, -3503, 2045, 3571, 12127, 8326, -11301, -12107, 78, -2765, -667, 11593, 2590, -15677, -9438, 153, -4506, -3424, 1610, -2788, -1295, 78, -11986, -13964, 817, 2530, -1544, 6626, 179, -19055, -13218, 4892, 4637, 2244, 3980, -6237, -11894, -1371, 425, -3102, 3494, 3816, -4937, -598, 851, -12106, -8901, 8910, 7478, -1096, 597, -6901, -16462, -3236, 9983, 4805, 652, -3213, -12401]
1501a2401N092J2015n988l788J0966l001j1912N094L365q475O730J4138m989r240
1515b394k656n473M432J7876R20j2712M27j036p206Q427J2326q041m959Q528l460
1530D999p297M565j71k108J2173M541j4937n622L360j917P588J4008q631j5143
1544d592L026K419l065R300M058j1218o64O680p063m402O747j135MJ0430m404
1559F121j7719J556Q786k27O369M928j4071r159Q852K475q19P761l019j1055N450
1574c771N171r763l10R978k248m00O208r472j1036R201Q313j521M305k350j5613
1589a3308Q50J4559j072l280N176m763o712Q256J614r356M326Q675m497k74K654
1604B848j0568l017J4441N003o415R16m284r380R401J0850o341l388M997n620
$$ y = [-12401, -7309, 4706, -1282, -5070, 5896, 2895, -9017, -3923, -558, -9033, -2303, 11835, 6846, -2394, -5050, -10523, -6091, 11785, 12705, -7, 420, -616, -7822, 605, 12931, 4890, -69, 8459, 4999, -2298, 2267, 2096, -12, 12161, 16702, 1765, -3857, -497, -2414, 5174, 19182, 10551, -4592, -1566, 853, -2212, 7088, 11146, -72, -736, 5944, -1119, -5521, 1226, 91, 95, 10525, 6121, -11598, -10042, -1256, -1483, 4886, 9814, -4257, -13416, -4564, -2089, -2908, 4853, 1834, -9221, -3771, 1400, -8363, -8673, 1305, -943, -1343, 4865, -4607, -15643, -6442, 1871, 350, 4655, 2305, -13308, -12458, 2101, 1029, -2251, 2925, -1838, -8550, -294, 1320, -8036, -3710, 4965, 468, 194, 2848, -7720, -10737, 3704, 8707, 2292, 3208, -1076, -10456, -1055, 9795, 3454, 66, 5063, -557]
1618e57k536R404k514p517Q027N622p017N79O65r433M074J4396l431q922J957
1633B797k964l985J1155M963j0667j074M416m487K20O857p166l860J0736J26j0076
1648c009J900J461o561P464R330r813p632M809k014J53R852l112j0635M622L805
1663F20n933K880N014q333m78J1005l957r293M695J229k567P826J813j1205n66
1678g250P004l303K054P420p992p462R764L515q065K001L960n719K709O577p002
1693a789m280O357j217j199Q405m121j1689O162Q120o050n5N356p249l515R591
1708B827j66o569L726L26m437O702K309j0348N02R520m013k324O857m674p030
1723f792P925N184o637P26K444n321L066P030o727l535P798j921m523Q146l4j0487
$$ y = [-557, -3093, 6311, 3797, -3720, 4307, 9929, 2912, 3491, 4156, -5277, -1203, 13193, 9762, 840, 2797, -167, -4152, 7003, 11966, 1299, 225, 4641, 154, 374, 7231, 65, -3795, 6941, 7067, -3009, -1109, 352, -6209, 1255, 10585, 772, -6860, -2051, -4065, -3912, 5940, 2828, -7807, -3185, 620, -5313, -2433, 2581, -5752, -6230, 4775, 818, -8475, -3780, -2551, -5118, 2708, 4521, -6684, -7250, -246, -3549, -1495, 5925, -2067, -9529, 235, 3750, -4315, -2314, 1646, -4073, -1364, 5213, -1789, -6069, 288, -929, -2128, 6277, 2156, -9533, -3371, 4749, -1301, -1356, 4000, -3249, -6764, 2827, 2661, -3908, -182, 144, -4293, 2409, 4718, -5630, -5128, 4392, 379, -1945, 4912, 238, -6792, 1133, 6317, -320, 406, 2850, -2471, 595, 7625, 898, -2637, 5161, 3240, -1283, 6863, 6829, -3658]
1739c658L494Q760m953k623M691m305k729Q267j399o291M041L74n831O178M320
1754H336j0698j485R498l341n096O207j575p302N313L895n864N81K480o086K004
1769c133P409o789n113Q155m44p066O624K798r583Q86Q360m005k151M076m047
1784d023j797P551j124o347N623K080p533M061P012q010l069Q991n69n534M524
1799A836l09n265N289L155n836J682L542o898P90Q686m805o581P354J965q390
1814c785L838L905o519K01N843l850j751M274m436k824Q403p14q616M847L653
1829B469p505J705P520n561m152O617r80m375M707k8n132N123L277p644J683O535
1845D259n830k079Q688j752p376N458K563n404L090L686n916O76N216m692j511
$$ y = [-3658, -164, 8596, 3643, 1020, 5711, 1406, -1323, 6944, 5545, -746, 3295, 3669, -2162, 4016, 8336, -2362, -3847, 5651, 2310, -2786, 3421, 1846, -5456, -143, 3752, -2112, -1531, 949, -5137, -3133, 4276, -2513, -7626, 529, 85, -6981, -357, 2441, -7142, -6256, 2104, -1901, -4052, 24, -4023, -5820, 1731, 607, -5740, -117, 1963, -5570, -1509, 5503, -2507, -5576, 3415, 2846, -2688, 1836, 1527, -3738, 1551, 4706, -1130, 552, 4094, -2804, -2014, 6672, 1867, -4714, 2640, 4605, -3785, 53, 3958, -2561, -2360, 3483, -367, -2118, 2156, -2280, -5104, 3299, 2585, -6031, -1184, 2469, -5036, -3331, 4189, -1372, -5524, 1093, 113, -4262, 445, 417, -4715, 408, 3685, -3959, -2276, 4259, -1571, -3650, 5038, 3286, -4090, 1368, 3931, -1473, 1617, 5303, -613, 63, 5279, 587, -924]
1860i24O961l322n599P244J217p990K705N340o045j33N830m566l642N853j445
1875A484m274M806M87p223L802M115o505j85O114m243m013O929j164n636M869
1890f37J939o360K781M524o218l5O710l906l698O392q75n571N320K818n894J833
1906h77M141n289j26O827l630l539O077n40o321N312K882o396J823N303o222j039
1922a614O177l340l549O390o29o628M188K181o159K299N489n505k482N552l312
1937i42l169O295r42n607M435J906o824J839N873n065j210O470l204n706N323
1952e28J330m587M812K320o671M98N289m617l48P265l051n461N558Q42o104L788
1968C35M414n170L88M641n756j851O382r33l854N678o06p424L157M274m945J293
$$ y = [-924, 6037, 2715, -2884, 4360, 5577, -2413, 292, 5632, -413, -546, 5284, 718, -2924, 2929, 1484, -2790, 2016, 2503, -4720, -918, 3197, -3308, -3493, 2621, -1622, -5635, 1294, 130, -5506, -637, 1302, -5058, -2277, 2247, -3971, -4006, 2704, -1202, -4900, 1492, 617, -4954, 366, 3184, -2710, -877, 3264, -2025, -2151, 4676, 1046, -2493, 3584, 3044, -3277, 2035, 4917, -1479, 344, 5647, -575, -1614, 4563, 1223, -2326, 4064, 3435, -3193, 995, 3176, -2983, -684, 4805, -700, -3182, 2370, -942, -4111, 2184, 1242, -4365, 70, 1976, -4848, -3009, 2864, -2201, -3411, 3059, -145, -5851, -528, 802, -3785, 1027, 3347, -3324, -2826, 2463, -2154, -2502, 4763, 1712, -3749, 1809, 2651, -3453, 335, 4749, -421, -33, 4608, -1148, -2999, 3383, 2450, -1404, 4274, 3668, -3756, -599, 3675, -1270, 23]
1984B3N102n433k989N452k001m228O179J093n831K336K129o971J579P223l413
1999B50k673N136l307n889N856L526n157K254L237n730k79M952m127n79P312k072
2015B710o099M205P43n734M222O434n491k261L552m465j533P295k74m880L648
2030B072P56o862K095M657m198R32N692m789n105M419o20l146O187K947p538r31
2046c432K771l588J684O305l262l775N029k405o136N539M657n132J774M585o434
2061a820l242N005j19O00N440l063o849L340K466m035M330N846o596l196M893
2076C000k306m169O384K161m216K529j86p050J267O048j620M98L960p035n617
2091f352O201K206m030M368K667q183j106M477k913n31N824j113k821K119l807
$$ y = [23, 5125, -308, -3297, 2155, 154, -4074, 2105, 3198, -2633, -297, 1832, -5139, -3560, 3663, 250, -2423, 2713, -594, -6483, -627, 2899, -2258, -4, 3233, -2497, -2776, 2176, -1951, -2530, 4782, 2710, -3389, 816, 1559, -4175, 47, 6481, 990, -1271, 2281, -2184, -3717, 3578, 3304, -1576, 2072, 2828, -4034, -1939, 2718, -1480, -548, 5144, 355, -4750, -331, -951, -4097, 2090, 5037, -2501, -3432, -661, -4249, -2565, 3740, 478, -3297, 1732, -673, -6809, -1270, 3387, -1745, 29, 4614, -1820, -5062, -57, -176, 424, 5864, 2801, -4048, -708, 1758, -2277, 2053, 7899, 1303, -1893, 3000, 694, -3475, 2909, 5070, 854, 3383, 3197, -3853, -2586, 3462, 1842, 2340, 6300, -735, -6352, -151, 2055, -1975, 2393, 5060, -3123, -4229, 248, -2665, -3196, 2628, 1515, -1306, 813, -2994]
2106b994n856P194O357m936l74K829o768l284Q305K565l128K208j252n230K905
2121a459K723m296L734N817n317l793L713k957l090Q649M243o396k076N59m408
2136d354K250P613k251k520J825l983l516N840R11m571M563M418q268l873M556
2151a360j393K94P126r80o881l67j238j081P347M313q011j404M820m313l322P242
2167G92K083m065L241O55o119l87L577m67M346M509p245o444N301J034j473P013
2183F351J523q931n83M303k687j62N340j268j955K925l582n895M552L803k209
2198A525L304J135r887l421Q505J396k217L987k750o841K378K755l081K546L277
2213B611m445p44L446n181m343Q081L936m350Q50p60p170J881P984r1j563J235
$$ y = [-2994, -8850, -1656, 4701, -235, -609, 2220, -4548, -7832, 473, 3038, -90, 2118, 866, -4364, -1459, 1264, -3032, 702, 6519, 1202, -2591, 1122, -1835, -4925, 3724, 7967, 1571, -505, 54, -4354, -2104, 5509, 3258, 738, 2563, -1420, -4936, 904, 1815, -2756, 1807, 6225, -2043, -5916, -1360, -2753, -2459, 4667, 3687, -3194, -3561, -4799, -5880, 1467, 5780, -2231, -3635, 1185, -3128, -6450, 792, 2875, -1190, 2051, 2706, -3413, -3800, -223, -690, 3656, 8165, 920, -5524, -223, 811, -662, 6351, 7874, -1057, -1640, 2663, -24, -186, 5154, 3886, 1931, 4856, 1274, -4621, -69, 3734, 1525, 4829, 5964, -3923, -7344, 1161, 2557, 340, 4327, 1577, -5264, -2886, -131, -3212, -666, 2611, -1834, -2578, 868, -4313, -8656, -575, 3361, -989, -139, -899, -8069, -6188, 1796, 1705, 142, 1377]
2229A377n027k741O631R24m479M652K564n963N12L507m732j031Q787P39n262J56
2245F14k238k989N864N455m355j229J441n274K68P310j977n014M943J187n788
2260a782N76K060l004K428N400l546m113P04k191l11Q756K02q185O41L030m150
2276c485J271N940l052l547M170l00l803J591K39j546N444K481p912j879M631
2291B43j758M45O812j944p963J826L644j698J478J818l935J035L694m294k386
2306b983N073q27k467N474M29q748J54O133j004Q6K832m566l429M154Q29j988
2322h48L021p09m968L339L886o221j758O337p24k699L455j640n970L546M103j638
2338E12R29J34o208J019O924k721l187L996k10m746L859K244n843P39M866j092
$$ y = [1377, -3650, -6391, 240, 1164, -3315, 1337, 3901, -2062, -1550, 1957, -2775, -3806, 4981, 5720, 458, 614, -1624, -4613, 1251, 6706, 2351, 1122, 2563, -2711, -2443, 4867, 2890, -2124, 2819, 4006, -1782, -1206, 854, -2150, 278, 5678, 2132, -1981, -1277, -3468, -3779, 4977, 5179, -3006, -2365, 665, -3485, -2214, 3726, 674, -2873, 1297, 997, -2806, -1215, -976, -2522, 2922, 5403, -2509, -4388, 243, -1515, -1070, 5742, 3798, -4165, -2339, 1305, -393, 1085, 2903, -1032, 3, 3697, -597, -2983, 2090, 1263, -1204, 4270, 4699, -4049, -3895, 2238, 1234, 1320, 4152, -414, -3843, 311, 1140, -848, 2173, 1464, -3504, -165, 3721, -2500, -4258, 2079, 1355, -1344, 2111, 471, -5499, -1953, 2150, 512, 1441, 1575, -4633, -3614, 3310, 589, -2598, 1398, 1188, -3558, 301, 2545, -3298, -2559, 2307, 1215]
2354A215j038J665m149k090O663J305m184J840k46n080L209N804m492k956M510
2369A976o73l184L724p03m308L422L281l549M5J449m878P82O923k015n073K704
2385g7R3l813L742L478n585m63L619j904j269L035l195k150N809M74n104R24K383
2402cl802J736N455l872m034L510M48k127L959k99m691K867L262l520L4L658l569
2419i88q60O056j258m911K475J786k287K821K370m703p62M246j575p56L482k429
2435B707l828N234K124n787Q10L153l632N41M481l467l705L746K18k459K862l95
2451B603n203K290L867l725j491L585l502j907N289j045m960K180J593k962J853
2466a535K318m246j399M881j971j851L644j472m043M398K506n043N18L450k792
$$ y = [1215, 177, 1842, -2307, -4397, 2266, 3571, -613, 1227, 981, -4099, -890, 4914, 422, -2534, 1976, 1303, -1881, 1843, 1140, -3168, 254, 3535, -14, 31, 1480, -3398, -2616, 4307, 2292, -2781, -77, 16, -3797, -55, 3423, -2162, -2625, 994, -910, -2179, 856, -2339, -4489, 1320, 1794, -3310, -2386, -3, -3805, -2069, 3386, -486, -4520, -1010, -562, -2689, 1270, 971, -3720, -853, 2409, -1111, -1077, 2581, -988, -1848, 4208, 2950, -1961, 514, 2300, 13, 2834, 5204, 501, -261, 3985, 2410, 1654, 5136, 2707, -1121, 4113, 6237, 450, 1260, 4413, 781, 1322, 5803, 2336, -1369, 2377, 2595, 136, 2998, 2603, -2600, -310, 3557, -168, -1659, 1926, -1576, -3483, 1806, 761, -4199, -2019, -426, -3388, -1535, 783, -3463, -4862, 19, -1952, -3803, -159, -1631, -5674, -1276, 1230, -3813, -3295, 155, -2637]
2481b637JM576k993l072L834O60k878L342J33m336J867M382l643j149M131k340
2497a22k621M579J23m283K122K235l301J390K417m258q37M433j145k925L719m76
2513A050m435K810L242m638K85L651l090m55L588k054k612L745N95l301K642J477
2529B500n030J486M865k689k204L805j209k627L535J367l801J642K231l476P97
2544A192L319l691j056M655j192l335K705N82l992K351L127m038j044L100k390
2559B93j292L660j372l718L560N87m320K218K122m348j38M310k932k612L574l94
2575h02l149L014Q60l596J146K199l286L61L883l005k001M512q85l276L163J735
2591H73m029J547L033l501k78L905j873j874M101q69l527L561J670m104J736K942
$$ y = [-2637, -2636, 1940, -1053, -4125, -291, 369, -2509, 833, 966, -3370, -1503, 2879, -764, -1913, 2218, -122, -2743, 1836, 1959, -2324, -202, 2033, -1268, 122, 2539, -1719, -2556, 1877, 732, -2193, 1526, 1050, -3385, -575, 2667, -1971, -1686, 1965, -1125, -1580, 2008, -46, -2658, 1087, 1682, -1619, 1023, 2500, -2530, -1044, 3821, 1132, -1072, 2733, 1524, -1103, 2432, 3799, -2, 1640, 3871, 395, 1192, 4511, 820, -236, 4419, 3227, -108, 2597, 3179, -813, 1538, 4665, 627, -417, 2683, 293, -999, 2661, 1289, -2429, 1131, 1718, -2602, -384, 1738, -2610, -2748, 1562, -1370, -3982, -408, -802, -3951, -937, -77, -3673, -2527, -328, -3614, -3253, 630, -2375, -4376, 136, -749, -4025, -862, 873, -3156, -1609, 1424, -2077, -2355, 1550, -323, -2197, 1904, 1035, -2492, 1069, 2739, -1365, 371, 3313]
2607C313l690q83M273j603k522L365j16l524K914J155l469J299K698l580k37L694
2623C087k222k871M147R0l557J867J630l408R81K804k721p18L185k543j841L555
2639A465L05m009K861J924m396Q33L319k773j500M091j445k770L003q6l254K751
2655C19K100m258L25L390l594p57M536j138l917L074M24m046K435K161l273P80
2671a439K674k943j436L798r10l068L893L36m232J867K465l319O27M174k698k296
2687b507L221p72k481L588Q82l554K367J795m244K07M212j730j888M092j247m002
2703b061K829J664l310K332K242m257m78L258k747m41M210j329l391K369N67m107
2719b650K059L302k748n44K786l256j923L865J40k216K723n6m314J330L584k883
$$ y = [3313, -377, -1260, 3013, 1410, -1112, 2253, 2137, -1387, 1527, 2682, -787, 512, 3210, -370, -607, 3087, 865, -2006, 2141, 2231, -1326, 541, 2171, -1237, -256, 2548, -173, -891, 2294, -249, -2090, 1465, 1770, -2239, 622, 2546, -1850, -1017, 2302, -471, -1971, 2120, 675, -2095, 908, 822, -2432, 319, 2419, -1839, -1514, 1876, -1718, -2475, 2061, 923, -2994, 80, 504, -3542, -1107, 1054, -2219, -1439, 1235, -1708, -3144, 654, -256, -3324, 569, 905, -3327, -1460, 1005, -2314, -1687, 2487, -211, -2507, 714, -58, -2539, 1049, 1931, -1623, 744, 2539, -1705, -1498, 2714, 984, -904, 3188, 1941, -2061, 768, 2432, -878, 1454, 3696, -561, -1039, 2219, -528, -969, 3241, 1912, -1479, 890, 1457, -2650, -591, 2711, -37, -581, 2205, -1051, -2974, 891, 1031, -1185, 1538, 1482, -2832, -1502, 2082, -801]
2735h01j64M176k497l079L311k02k646L539J578l292L33J907l905N66M805j585
2751B044k458K961j132m156L073K727l060R28K363m016j471L563k075j080L951
2766B162o11m092J303J098l832K437M101l529k196K351k109k013M030Q59l027
2781c068K037J57l952Q18L570k093Q1L971k147m303K878J336j822L218K172l876
2797a023j020K795k159Q20M538j188l397L133l02m033L094L105k471M59K442l598
2813A195k184L489N24j300K880l63n132J248K444k342M66L591k869k662K669j384
2829B70k463L226J599k994J041J89m050P13M061j383j190K720k686m062L374K401
2845G66k375J453K050l991n64K638j607n92M278n43l219J799j31l436K390M767
$$ y = [-801, -965, 3211, 714, -2365, 946, 744, -1902, 1637, 3215, -77, 256, 2163, -1742, -1176, 3629, 2044, -414, 2547, 1415, -2741, 332, 3059, -1, 927, 3290, -726, -2197, 1366, -709, -1789, 2162, 1551, -2541, -1238, -140, -3972, -1535, 2566, -963, -3159, -808, -2917, -4930, -900, -41, -3068, -1031, -874, -4826, -4008, -438, -2531, -2450, 1521, -626, -4929, -2051, -715, -2537, 681, 2853, -1023, -2043, 752, -1407, -587, 3951, 2763, -634, 2499, 2197, -1836, 1258, 4363, 1892, 2351, 4793, 1195, -989, 2500, 3024, 1724, 4604, 4241, -891, 357, 2801, 459, 925, 4516, 1647, -1015, 1654, 270, -2193, 1033, 2632, -362, 679, 868, -3182, -2469, 1592, 209, -981, 1739, -947, -5009, -1635, 766, -1609, -156, 1894, -2097, -2661, -23, -1630, -2222, 2056, 1513, -1706, 93, -38, -3474, -1084, 3683]
2861C683k602j564K019l055j692M555N07k432J729J55m015J112K803l059O55L905
2877B704k438l438K264m06k456M044J910m026p44J017k733J100M042j192k948
2892c300L091j147m006L323K164k658J084L196l382j887K690n50l91M690o65m513
2908b261J702J305j995K324L591l315j469K982r88k300L340Q18k156K399Q84l948
2924I13m98L477j324K21L336k814m203L283J267k501K419J380l950o98K908k120
2940A096j234L211p02k088K557r91m537K194L209k436J62K118l998k199L618O80
2956F60j858J844l20l774J859J929l037M61L348k552j316K596j828l452L811K525
2972H96k894N14P29l561K76M106j114j337J708j454k796L846R08l933K011L121
$$ y = [3683, 1081, -483, 1536, -1519, -3211, 1344, 1851, -581, 1148, 1303, -2712, -1600, 1203, -1856, -1201, 2704, 266, -3172, -908, -1314, -3770, 274, 2184, -1842, -2586, -1569, -4302, -3202, 840, -352, -3300, -209, -1356, -5362, -2039, 125, -2533, -1449, 1747, -1635, -3522, -832, -1382, -1773, 2917, 2252, -2261, -559, 746, -1249, 1075, 4666, 1351, -118, 2864, 1876, -424, 2916, 3734, 1578, 3977, 4861, 913, 415, 3892, 2568, 2789, 6125, 3311, -892, 2391, 3658, 1157, 3576, 4956, 1006, 308, 3216, 1096, -138, 3073, 2371, 283, 2840, 1849, -2688, -494, 2715, 279, 441, 2559, -1439, -3638, -20, 660, -1198, 646, 326, -3448, -1589, 340, -2697, -2236, 1112, -1440, -2756, -160, -1988, -5440, -1629, 896, -1998, -1484, -755, -4316, -4040, 66, -1048, -2385, -677, -2131, -4927, -1081, -173, -4106, -2095, 1026]
2988A026l122j254K513j961j238M448L9k912J069j77k339K981K959l184r43K657
3004E62j681j770L829l14l136K623K161l513K77J592j880R87L935k251k933K360
3020H48k81j613L421J519m487J63K587j713o04K781j319j344K728k42l161J629
3036I12J377k363K019L044m332j712L312j23j368L006j95l709J609J910k027L98
3052A758K223k695k99L321j766l107K986Q84k460K193J247m338k46L351j138r20
3068I94K059k288k234L100L00l209J715P36k739M48K657l044k236L331L6k470
3084b844J957n02l228J503K719k429l6J516k767p55M019j155l003K331P60k453
3100d367J750J725l159J85L157j306q96K140j368j898L853R41l298J263J590k107
$$ y = [1026, -2096, -3350, -837, -2798, -4036, 412, 451, -2461, -1392, -1569, -3908, -927, 2032, -1152, -2095, 562, -1119, -2889, 940, 626, -2510, 113, 2274, -1239, -962, 630, -1250, -263, 3672, 1421, -1512, 848, 567, -1046, 2375, 3894, -593, -430, 2157, 444, -160, 2621, 1302, -42, 2686, 2444, -717, 912, 2289, -74, 1945, 4989, 657, -1055, 2257, 2134, 766, 3772, 3577, -132, 1477, 3387, 1360, 1758, 3981, 1286, 987, 4308, 2542, -565, 2421, 3305, 845, 3038, 4285, -53, -299, 3052, 1914, 994, 3053, 765, -1469, 1631, 1931, -1278, 437, 1173, -1566, -1118, 1539, -1505, -3741, -410, -374, -2844, -887, -1389, -4617, -3114, -395, -2824, -2860, -1344, -4111, -4866, -847, -2002, -5005, -2674, -1914, -4367, -2617, -892, -4051, -3866, -709, -2015, -2911, -771, -2139, -4037, -184, 757, -2541, -1278, 312, -1795]
3116a795L63L405k115k031K881M86j835J941k3l005K167K483l199o4K256k197
3132b82r41L558l55l323J398J285j984R77J495k960n4K680j153j609K183p62k280
3149b127K858J635l368L13K205k087J41K887j619j950K512M14j730J572R00l003
3165d47J577K731k520l22K167j231j510L650n13k455J174J458k401P17K125l032
3181A168m81L069j413k228K431q26k640K119J679l218j80J801k027p91L026j918
3197d29k630K761k45k026J554R06l267R99K090k064j541K800j055j542K850J4
3213h25l374J705J820k291R29K061k258r08L009p37j950K578L72k735K494J300
3229A190k584o8K723j644l08K590j269k013K163Q69k106J133J432k728K93K499
$$ y = [-1795, -1432, 1973, -142, -2173, 708, 1194, -641, 1300, 1277, -1728, 439, 2922, -277, -341, 1915, -282, -1223, 2335, 1980, -1343, 55, 1340, -644, 333, 1828, -1132, -1186, 1494, 341, -1268, 915, 153, -2127, 731, 2366, -1002, -689, 1516, -571, -430, 2457, 838, -1112, 1400, 1814, 84, 1656, 2556, -447, 1130, 3861, 1341, 1019, 3186, 1955, 445, 4095, 3582, 1127, 2301, 3759, 1358, 2075, 4200, 1168, 687, 3756, 2343, 115, 2546, 1720, -920, 1199, 2878, -340, -520, 1281, -746, -1537, 1489, -429, -3059, -298, -543, -2569, -1015, -109, -3376, -2377, -287, -2351, -3892, -1092, -2147, -3689, -839, -825, -4199, -2494, -674, -2965, -2036, 25, -2233, -3141, -132, -869, -2819, -241, 131, -2604, -110, 1190, -1394, -1462, 1261, -383, -691, 1899, 630, -1383, 780, 1649, -457, 676, 2108, -620, -327, 2172]
3245B172j640j262K503r64j893K032M71k782J151J614j688j57J769k031j026K849
3261A118m16k399K332L95k764J664J803k652l06K747j590j211K277n02j846K118
3277G68J100k746J239J557k256l84L135j518j954K301J99k227K251R32k931P29
3293A95K209k279k55K209j803j056K485R9k496J094J331k443M45K501k403q78
3309a045K148j430j136K450o86k194J621R76k444Q97J997k405q33K985j038k027
3325b164K464l1k273J470Q76k194M64K059j660k51K283j659j468K431J75k274
3341a752J429J538k683M53K195j719o94K563r35j639K275j83k014J433J542k222
3357d13J48K252k163j004K751l06k137K009M37k599J347J779k251K64K137j966
$$ y = [2172, 532, -730, 1773, 809, -1084, 948, 1419, -1363, -212, 1402, -286, -443, 1326, -705, -1731, 1118, 702, -1697, 635, 1030, -1734, -70, 1733, -919, -1225, 1522, -68, -1279, 998, 496, -1350, 768, 1868, -878, 361, 1918, -338, -722, 2413, 895, -1059, 1242, 1441, -786, 1465, 2397, -534, 195, 2404, 125, -130, 2079, 276, -780, 1705, 1804, -692, 402, 1733, -710, -265, 2236, -167, -1045, 1103, -327, -1463, 987, 301, -1893, -272, 704, -1740, -843, 1154, -1251, -2084, 901, -137, -2164, 300, 269, -2004, -534, 342, -1852, -1388, 671, -989, -1240, 1043, -616, -2084, 347, 522, -1752, -323, 1215, -1468, -1015, 1180, -539, -1233, 1330, 395, -1244, 1031, 848, -1166, 267, 1809, -413, -265, 1987, -176, -1180, 1571, 1265, -872, 1137, 1574, -1025, 322, 2101, -150, 114, 2251, 285]
3373B85j217K732p82k013K205O22k688J046J282k076J90K026j613j150K125j066
3389i2j811K271P10k799J364J239k619P8K201j360q91K067k79k447J717O64k027
3406b014J032J825k193l08J916j198r51K504M7k414J874M97k507J277K083j721
3422b51p4J714j137j131K005k34j483J856P95k720O60K136j709k42K338j249j729
3439d55J579j87j785J996J117k602P33J102k027m00K369p35j656J930l14k502
3455a837J368R54j658P29J405k149l59K016j236j031K575N4k908J383J364k449
3471a779L17K724j359r07J889j456r59J798O12j611J249O05k291N49K182j349
3487B14p86K078q27j900J567K18j537J427J284k366k4J430k260m15K915m18k237
$$ y = [285, -932, 1800, 1018, -995, 1210, 1832, -856, 190, 1472, -604, -414, 1612, -1, -1151, 974, -92, -1903, 368, 1078, -1721, -357, 882, -1737, -1659, 542, -818, -1709, 358, 79, -2368, -651, 13, -2014, -982, 843, -1350, -1658, 258, -940, -1891, 613, 660, -1754, 120, 617, -1890, -613, 1470, -251, -325, 1389, 252, -879, 1126, 892, -591, 1265, 2060, -660, 0, 2136, 427, 185, 2523, 1274, -455, 1124, 937, -848, 1148, 2265, -337, 396, 1498, -529, -929, 1440, 705, -951, 979, 665, -1837, -469, 485, -1173, -444, 961, -1188, -1547, 469, -767, -1798, 777, 831, -2077, -694, 670, -1779, -1462, 1262, -97, -1004, 885, -571, -1530, 268, 880, -731, 518, 1123, -1168, -619, 1563, 214, -572, 1506, 679, -1221, 346, 564, -973, 454, 1738, -628, -652, 778, -1482, -1897, 1018, 600, -1637]
3504a637J351L99k371Q05J648j584J76J327j747r46K168o82j065K118K63k427
3520b204P21J316j649L76K246p46j622J706m85r55J707J032j985J327R74k303
3536e44L35J960o95n95K199m56k227J080J045j307J427J271j867o91J743j304
3552A374p66K186m7k005J298k08j750P23K085j821n8J511k150j649K223M5j308
3569c17J487P3k428N21J354j455J69J717j171j502J840o39j973J587J291j565
3585a011L29O37j891p7J998m05q14J413p61k247J412J515j427L3J596j637j040
3602b377J827r37r48K164J48j812J086J50k262J179K202j559j012J363o43j782
3618c213K339Q62j635N31P18j491r5J508j121J77K158q16k111J090O82j561J690
$$ y = [-1637, -286, 113, -2258, -1453, 195, -1389, -1213, 114, -1633, -2579, -411, -1093, -2158, -40, 223, -2204, -1483, -167, -1816, -1440, 806, 60, -1562, 144, -341, -1296, 411, 1443, -542, 785, 1759, -544, -209, 1751, 1056, 461, 2660, 2204, -23, 1057, 2102, 795, 2222, 3493, 1626, 935, 2678, 1374, 608, 2794, 2747, 742, 2040, 1832, 82, 805, 2890, 1069, 1011, 2522, 372, -1277, 946, 991, -317, 1170, 1243, -1185, -664, 690, -765, -596, 1121, -50, -1552, 288, -351, -2324, -737, 554, -1011, -682, -45, -1936, -2013, -15, -420, -1234, 179, -582, -2829, -1417, 98, -1329, -1296, 300, -1337, -2377, -550, -1487, -2435, -271, -123, -1935, -849, -699, -2961, -1782, 420, -1139, -2151, -788, -1431, -3213, -874, -12, -1647, -1116, -398, -1889, -1984, -476, -1597, -1420, 738, -78, -2189, -1099, -417, -1978, -288]
3635b88J652j660o89J330q93j37J671k31j241J433n0j542J306R25j184L22J818
3652B542j319j654J667n9p24K051J74k592O21J298j617P68J884j434j062J777
3668B321l87j562J169J182j840R16Q01j765l12J947o92o03J697j002k121J626
3684A375Q94j389O40R72j629l39J169q66r65J872j85j431J162k11k124O56J711
3701A312j056p60J198j434j243J590R6j349R62Q5j630K30J169j236m42J570o47
3718a585j424J293l76j794J459J673j954k50J328j782K3K199k30j720J440J05
3734a595j346J350P11j403M28J904j256o39J348n15j256K416R4j103L14M20n80
3751g08L96J514j285n55J372m93q01J338K75j986J383J120j539q3J085r67k92
$$ y = [-288, 1364, -296, -985, 345, -548, -685, 986, 755, -486, 947, 897, -645, 661, 1586, 402, 724, 2542, 1223, -431, 1236, 1177, 453, 2504, 2678, 86, 707, 2005, 388, 1156, 3040, 1606, 544, 2321, 1934, 372, 1541, 2723, 883, 1799, 2600, 835, 523, 2470, 1778, 1175, 2872, 1870, -251, 1375, 2269, 880, 1520, 2492, 863, 524, 1693, 827, -138, 1734, 1549, 118, 1280, 1069, -1055, -399, 1312, 256, -504, 694, -740, -1983, -393, -297, -1646, -684, -599, -2229, -1999, -830, -2066, -2508, -938, -1585, -3009, -1716, -2092, -3886, -2427, -754, -2708, -2958, -1630, -3412, -3389, -1190, -1420, -3140, -1700, -1595, -2941, -1591, -880, -2283, -1855, 49, -1207, -1846, -498, -1013, -2269, 147, 241, -862, -548, -128, -708, -312, 1202, -83, -638, 734, 241, -560, 778, 1053, -933, 450, 1570, 31, -52, 1033, 66, -226]
3768b26J681p82j197J076M64j337J418R49j985K5J764j223n55J590k78q46J477
3785B015L71j774P13J089j264L81J562j362r95J516Q9q89J544n3j698Q02J104
3802C151j244k09Q94p25p17J256o36j328R49M09j483Q66M34j844l16J569p31j010
3820g15P80o44j381J045L88j738L27Q95j166J4J321j365j373J607J95j412J406
3837a816j67j538Q54J104j017k65J170p42k43J574%j557J233O59q23O13J124j434
3855a271m13J893k91q93J375r9j082J168R95j857L24J357j090j80J526l92j789
3872g19J742L47j453L73R43j675L36J500j132o92J351n21j166J411L78j745Q88
3889A66Q13j171N58J157j763k35J712l78q95P49L87j423Q60J234j353j6J410j484
$$ y = [-226, 1455, 673, -524, 552, 1016, -321, 1097, 2046, 61, 86, 1850, 627, 72, 1662, 1384, 538, 2015, 2386, 612, 1325, 2414, 1150, 1531, 3093, 1731, 736, 2252, 2341, 1452, 2996, 2943, 1245, 2047, 3151, 1907, 1698, 2592, 1867, 1150, 2406, 1770, 442, 1391, 1800, 317, 1183, 1617, -227, -543, 1026, 295, -715, 65, -579, -1960, -915, -527, -2265, -1938, -1043, -2209, -2195, -874, -2239, -3612, -2005, -1810, -3222, -1816, -1983, -3521, -2667, -1563, -2580, -2845, -1675, -2417, -2660, -1086, -1086, -2643, -1410, -751, -1574, -961, 163, -1271, -1684, 209, -82, -975, 400, 301, -781, 387, 1382, -475, -151, 1206, 116, -64, 1462, 1070, -719, 1023, 1370, -83, 290, 1233, -442, -106, 1394, 262, -430, 921, 400, -766, 645, 1023, -722, 166, 979, -192, 366, 1523, -240, -475, 1237, 859, -36, 713, 1100, -323, 537, 1771, 418, 402, 1812, 328]
3907C28q2J425n64j238J540N06j816P83N79j394M17J950j386j079J418p43q96
3924b52J138N95k137P96M29j236L44Q39j016o25J052n1j503R48K38j165O08R68
3942c0j460l55J431r81l13J289o59j105J251L59j419Q69J037j217M17R75q57p50
3960a518J282M5j007J366N62j780M07J066q70j13J548p73p52J252Pj212J344M96
3978A350j425N65R49j620l1J224m92p36J448l51j096M72R70j091m9J152j160l36
3996b57J744q15j303J490j4j301Q84O99j296L69J095j025l10R16p78o35J209N69
4014A241j874J105O77j634N28J198j414n34J537p98j034J406L32j811P94J226
4030I45j924K32J408j301o57J882p81j214J106l4j042R13O53j411K26J359j209
$$ y = [328, 246, 1671, 1107, -131, 1409, 1915, 99, 882, 1461, 67, 484, 2434, 1048, -31, 1387, 644, -252, 886, 1481, -656, 140, 569, -667, -323, 516, -500, -1125, -73, -124, -1627, -679, -441, -1606, -998, -30, -1490, -1845, -414, -1395, -1708, -419, -1078, -2183, -932, -573, -1992, -1123, -86, -1303, -886, 89, -768, -1518, -236, -191, -1198, 168, 730, -1050, -643, 423, -447, -560, 988, 215, -537, 715, 722, -490, 854, 1350, -75, 490, 1439, -181, -212, 1012, 520, -216, 1232, 881, -215, 257, 1227, 136, 87, 1239, 79, -257, 1487, 672, -631, 859, 845, -456, 428, 1127, -169, 200, 1295, 270, -40, 876, 98, -537, 672, 1241, -633, 472, 1149, -485, 43, 1241, -173, -707, 830, 32, -1002, 404, 736, -1075, -281, 945, -979, -747, 661, -640, -1297, 585, -196, -1410, -304, -338, -1380, -467, 186, -1225, -999, 360, -849]
4047h49k37J247m12r96J126J37j187O08J127j345K26J073j056l74J329j95j075
4064h53J545l47q03K79J199j337m2J212o25o63J205m17j147J215L72j028K53R57
4082I75j016k95J403j043m21J106r8j568J304M03j096R79p6o61k00J142o66p47
4100e75J706l84j051O69N71r72J86J256r42p29J194o29m54J312m04r44N84K70
4118F64j224P04R99j056l60R78m77r57R55l07p82P14M26j258P8J036j325j60J402
4137E0p20p58J029O5j449Q13R71j368J90J079j202l03J448k92q62J278j58j024
4155a213P57R61j383L60J721j309n71J427o5q13J287j87o36K02O57r58P4J655
4173A966j427n5R98m68o02J037L3q20N57P24j423k93R28k82o35J050p20n77O67
$$ y = [-849, -1086, 161, -251, -1247, -121, 16, -1171, -563, 564, -781, -555, 518, -538, -912, 417, 222, -853, 692, 345, -458, -179, 1020, -317, -359, 853, 228, -435, 770, 353, -794, 421, 793, -235, 18, 975, -41, -336, 1067, 24, -397, 709, 611, -957, 347, 750, -346, 633, 557, -104, -304, 838, 172, -575, 1131, 747, -304, 365, 936, -36, 150, 1406, 464, -265, 929, 300, -154, 1158, 754, -190, 394, 664, -560, 144, 1143, 87, -273, 705, 228, -729, 226, -81, -863, -149, 277, -981, -903, 133, -1192, -1352, 50, -670, -1428, -399, -334, -1783, -970, 1, -1367, -1177, -98, -1300, -1603, -155, -447, -1309, -31, -189, -1213, -456, 505, -878, -518, 1203, -106, -677, 750, 685, -128, 1159, 972, 336, 538, 1195, 237, 311, 1966, 539, 484, 1482, 1014, 412, 1449, 1482, 662, 1219, 1943, 520, 227, 1155, 873, 238, 1288, 568, -9, 658]
4192F58Q5j210P97P09j066k03J107j076p37J429l98q12R22J7j461Q82O17r47J46
4211e41J224r05r02Q53j54q16J456J54j418J25O74p42r4J462o79j150J033k16
4229f36r92R55L20q32M32O98j061o15J709p07n93R23j56p77L06M71q65K12J193
4248a5r67j27J051q30m07J373J36j332J130K58j242N14J204q65K12P27k60q39
4266b79J129K72q38M33J160j366N6Q50r26K25J365p96p91J281n47j061P95P75
4284A737j036L49Q33j242o36J557n15n36P64l62j093O43M79n73JR63r13o95J036
4303G61n24o48Q83M06j152O05M59j028N2J315q03m01Q18m59q48J111k70p03L67
4322e9R03j376l14J218o03m29J273n79r84O99o8j000O79O00p37j47O43r40m31
$$ y = [658, 743, -467, 330, 1039, -27, -230, 877, -199, -936, 493, 95, -717, 205, 222, -1239, -357, 260, -687, -541, 683, -222, -1124, -271, -425, -1241, 215, 369, -1049, -924, -250, -992, -1086, 376, -303, -1453, -420, -636, -1628, -673, -353, -1185, -753, -55, -1116, -1731, -22, -729, -1322, -399, -555, -1332, -1026, -555, -1420, -1208, -15, -982, -1109, -58, -888, -1295, 78, 214, -1118, 12, 270, -972, -458, 746, -119, 93, 820, 560, -279, 850, 1122, 284, 717, 1877, 511, 567, 1417, 491, 716, 2081, 1285, 494, 1775, 1228, 167, 962, 1737, 701, 1050, 1883, 641, 5, 1562, 1047, 511, 1275, 913, -180, 463, 942, 369, 370, 1333, 420, -275, 761, 237, -411, 472, 878, -274, 331, 790, -238, -186, 1129, 326, -75, 743, 284, -564, 547, 277, -426, -59, 844, -532, -846, 372, -231, -660, 613, 34, -950, -251, -319, -1319, -640, -40, -777, -924, -281, -1221, -1652]
4341a652J277k57j214J012J14j383N84Q90q48m72J110m71q91J397p43m46J149
4358h44L99r85N07N58p43M36J000m80k5L37k38l99P04O45j084P36Q19j458K56
4377A41J149n52m17J295l85j188Q62K77j026Q91M69p33l22N39l08o77R24n92q51
4396e04R16N21j497L50O46p91RJ136p31j174Q52K63l79M78P0j112N90O41o38K32
4416a22N95k79o38R35L47p11K65O17o22J95Q97j034K16P83j88p41J287j87j233
4435C82P81Q45j260M0J015n80n74N55m06r14J221m39m96J43M6j469K47J038q28
4454f53o72R38o02q99P28M35q88L72k35l79j07J035r22k71J415o82q33J275K1
4473i24j169N50J034q06R0J150j236L41J095m54l79P36N87r39L81R07j192L22
$$ y = [-1652, -375, -632, -1846, -834, -720, -2103, -1519, -629, -1477, -1949, -839, -1310, -2201, -804, -1547, -1993, -844, -445, -1430, -923, -365, -1108, -672, 328, -152, -177, 160, -78, -477, 227, 872, -212, 524, 1343, -115, 141, 1290, 738, 321, 1616, 1231, 43, 905, 1182, 156, 1047, 1516, 783, 461, 1000, 692, 15, 939, 347, -504, 412, 933, -564, -214, 432, -359, -350, 786, 55, -1119, -267, -4, -383, 95, 165, -947, -357, 284, -354, -122, 473, 194, -444, 491, 838, 127, 392, 1009, 387, 582, 1479, 445, 661, 1444, 1256, 515, 1802, 1615, 382, 1163, 2008, 748, 788, 1803, 1223, 649, 1204, 798, -116, 1105, 666, 170, 313, 359, -1110, -863, 175, -653, -1325, -387, -989, -1888, -1160, -725, -1613, -1241, -1476, -1855, -1962, -927, -1849, -2120, -705, -1387, -2220, -945, -924, -2093, -1543, -509, -1315, -1225, -75, -1311, -970, 125, -329, -708, 28, 615, -324, 57, 964, -228, 94]
4491I4J416o36r30P94J80p49P06N39j147K02N78p01R5O70q17o47R23n6j013O35
4511A36M39j300K49R47o48o54R49o88j57O42P3n82K34M04n55M15M75q71J96R32
4531F36m58l15O97Mn71O03M47o02M32P63j014K98R16o60m00Q52o8n01P3N71j024
4552F79K41M06l43m04N17p54R4O68l45j085L50N00j227K41N59r34j10M37m14n43
4572a467N36j04n88K29O48j239RR51o75l8O47l43q11J171J67o56J92N36k95J20
4592a010J326j235P1J203l62l77P94N20j207M71R42n50J61L59l89m7M36J88p07
4611E87Q28nr43Q19J31n35l59J062p89l86M43l61o73Q64K96q58J9L47j017K11
4631c19N99m30l29N36J11r41P91j49o12L57L28l08j36O15o60j97O99J31n36M03
$$ y = [94, 1510, 874, -56, 738, 918, 169, 875, 1414, 267, 469, 1047, 346, 441, 1111, 294, -353, 570, 514, -499, 136, 575, -725, -476, 471, -177, -831, 118, -570, -727, -85, -12, -594, -360, 44, -511, -96, 379, -492, -296, 636, 178, -137, 560, 564, -7, 596, 1043, 441, 873, 1636, 622, 920, 1836, 1176, 776, 1628, 1560, 1059, 1132, 1703, 679, 920, 1326, 983, 579, 1096, 342, 436, 1104, 759, -326, 24, 524, -703, -462, 97, -837, -947, -510, -924, -1467, -931, -1035, -1623, -1394, -746, -1985, -1976, -1025, -1700, -1738, -1091, -1434, -2245, -1074, -907, -1563, -1371, -835, -1130, -1010, 316, -919, -848, 355, -7, -384, 410, 930, -277, 194, 1136, 586, 747, 1106, 717, 670, 1106, 1294, 587, 1415, 1410, 467, 1286, 1417, 882, 523, 1585, 796, 410, 853, 492, -181, 683, 979, 121, 140, 487, -530, -319, 280, -150, -479, 57, 168, -773, 18, -131, -743, -386, -58, -366, -502, 113, -547, -744, -45, 86, -450, -47]
4651d7J59n58N00N24n05m1O61j57p90R08j85k84M90J24n80N8O41p41o0Q33p03
4672B47n85R30k48p98O15J58p83k24J213q78m81Q21o24n01Q35l49p21K80N22p86
4692a357L18Q34j007k74R44p33M3J80L5k40M58K40l65K93O42n19J4J029n55o05
4712f25Q08M05n50J27Q94p05j33P49l98Q3M57j19l79M68L45p72J96N41n68L6K77
4733A137n94L36J0l0n21L03J1o77O07M12p07k54K45k85j36N22k00n35L98j69o70
4754g97N49L70o72Q6N66l00o86Q93l02n82J009K89j085L14N76p09K62N67l25o66
4774f43J044l54n81N33K24p02L81M67l91k10K92k20k74R43m47p38N90M79p60J82
4794a85O17o71k41M40n71j43N79j12n63O27L5m16P8M52k80k05L68l22k44P41O0
$$ y = [-47, 112, -446, 54, 578, 73, 32, 693, 536, -254, 654, 469, 185, 675, 799, 219, 277, 918, 177, 117, 950, 247, -338, 592, 344, -454, 161, 319, -464, -688, 525, -353, -834, -13, -637, -1138, -303, -652, -1373, -1093, -571, -1357, -1039, -205, -1212, -1486, -542, -1275, -1232, -1052, -1017, -1257, -799, -559, -924, -631, 11, -508, -494, 535, -20, -625, 183, 588, 38, 165, 1059, 354, 221, 970, 572, 655, 1112, 993, 614, 1082, 1427, 655, 851, 1392, 824, 860, 1137, 543, 879, 889, 859, 338, 641, 652, -25, 582, 994, 287, 33, 278, -7, -143, 379, 179, -356, 42, -127, -797, -248, 122, -550, -464, 102, -198, -884, 9, -293, -875, 134, 423, -662, -348, 228, -481, -219, 348, 23, -643, 401, 47, -534, -1, 223, -479, -98, 369, -22, -232, 60, -160, -434, 509, 62, -676, -86, 393, -367, -185, 432, -239, -480, -40, -611, -754, -175, -287, -850, -223, -188, -604, -526, -74, -354, -559, -191, -513, -757, -16, 44]
4815D4o56O85J60l90l34Q57l24m53O44J0m37N14Q8j69K32J37l37J95N08p02k04
4836F8P56m05l15L16L61o94L72O64o26j22L91j93l59M61l68l24O22k40p22N20
4856A63K67m33M5N56p20m13L97o5m33O36n4p87L32K6l22J88P24p50k02P73N7p54
4878g69P80J24n82K54N3n87K08N59o00M1O57K00o89O95J19r69M59O66m67k68O62
4899E46k44l55K2L38k16L61l2m90J57M01n12N6O34q0p90P70k94m48K39N45m20
4920A88j21L63o10M88K44l31l27L71j7o34O03L43p84O55L75o94N9L71l98l16O19
4941D47m5p28M80N3o58M10O72q49p9O60l94k84M42j1l01Q1K3m93Q8Q25p57K16
4963b02j35O3j18K58j32k40K11M96o77l3J11j10j03N29O3r42P08k53m49P75J61
$$ y = [44, -612, 73, 233, -157, -491, 366, 42, -411, 233, 243, -194, 320, 408, 239, 471, 608, 271, 466, 974, 272, 68, 824, 419, 104, 420, 781, 87, 459, 1123, 497, 375, 766, 573, 214, 675, 307, -17, 605, 365, -357, 163, 430, -3, 42, 598, -122, -535, -138, -203, -636, 0, -54, -841, -509, -483, -805, -617, 107, -643, -845, -72, -15, -769, 11, 135, -447, -193, -140, -727, -519, 40, -560, -519, 138, 338, -351, 344, 463, -506, -47, 619, 152, -116, 546, 302, -53, -31, 307, 91, 452, 420, -70, 87, 488, -24, 32, 666, 586, -204, 566, 272, -176, 63, 608, 188, 67, 430, -180, 308, 552, 221, -106, 265, 248, -386, 217, 560, -224, 431, 806, 112, 171, 542, 144, -172, 447, 402, -326, 154, 207, -451, -41, 631, -218, -297, 363, -31, -315, 127, 116, -185, -104, -81, -574, -486, 339, -418, -202, -337, -274, -392, -134, -266, -506, -295, 201, -476, -509, -398, -508, -611, -82, -19, -961, -253, -506, -955, -180, -19]
4984a9p13K30N50m15l55L81N00n58K97J36n80K76N35o29l9P45l63rJ73J5n05N81
5006B34L18r94N26K16k82J88K70j36m55P86k72m81K68M13n95R6M35m30k44M94
5026C55j72j13L68r3k76L05Q1l05J53K47k8l49O63l44l84L04K57n00J39J11k88
5047A31r8K74N8m65M92j63j56N63o51j77L06L42o74J7M28m50N8K28k95m7K60q9
5069a08l51K64n8m75M87K2p9k57N19l20R9J14K09l53j94K32k71N41Q2l67l00L73
5091a91k76j4O90l26j59K85M58o10J99L67m33l46Q05k97p35O13K42k28J71K99
5111E14o08J50L27m97K25J61Ko02L51N1r6k21L80j22m1L57o38r0L28j52k07M56
5133B8K55k17m68R24q53M70N8k50j25O3J89j67%L70j46j94N85q80M30L69k57j64
$$ y = [-19, -732, -502, 48, -367, -722, -341, 159, -399, -102, 34, -546, -270, 265, -364, -403, 342, -21, -30, 143, 158, -347, 234, 552, -442, 84, 300, 18, 206, 476, 340, -115, 671, 399, -82, 186, 599, 4, 100, 535, 105, -139, 355, 183, 70, 438, 345, 69, 374, 455, 150, 303, 550, 522, 173, 836, 492, 108, 412, 669, 169, 308, 419, 131, 33, 307, 365, -100, 392, 229, 73, 636, -15, -192, 114, 456, -218, -201, 227, -223, -165, 63, -232, -279, -19, -108, -459, -195, -253, -728, -241, -219, -298, -555, -36, -356, -257, -143, 66, -287, -481, -249, -520, 21, 103, -264, -564, -191, -467, -481, 209, -117, -276, 9, 467, -143, 56, 423, -10, -356, 449, 152, -583, 30, 272, 44, 215, 514, -94, 56, 383, -114, 111, 272, 274, -328, 23, 74, -22, -243, 137, 15, -26, 331, -307, -397, -69, -221, -428, 28, 283, 66, -402, 522, -331, 139, 197, -53, -178, -115, 74, -93, -93, 277, 131, -63, 522, -358, 72, 441, 184, 20]
5155B0P35n97m11O07k01J6o5L67p00K69M21k62l51M34o8j77p1N04n21r5L94k10
5177C8l28M22p3P0j12J5n19K71M64o01J56N63q18j99O81j25l26L19mn29K27M75
5199F7k60J4J67k00k1J66k19q1M98j57Q6j71J57l29J32M62l8p1N0j31l53N23k2
5222B69l69L55k02l75J66O60m93J27K1k48pK89k69k74K48K26m15P3N53n05l47
5243e17Q04k52m05L20R0k0l1O4k41J76Q8l02K58K76k58l39O42j63Q3k16j09K99
5265B47Ko5J07k73L82l12j23K76J66k67K20K37n44j90M57j88l16P25j82m80M91
5286C70k68l60K66J58l23L8L65l05k63K11k72l80J047l84o03R8L79k87P1M32n74
5307e84K19M10o65J41J35J24k10M24j77M0q7K99n05N99k43K25o44O89j42k68P7
$$ y = [20, 755, 158, -253, 354, 153, 169, 104, 471, -229, 40, 461, 199, -152, 282, 214, 37, -34, 470, -51, -146, 248, 38, -290, 132, 59, 129, 17, 32, -487, -216, 248, -353, -197, 366, -452, -651, 30, -95, -421, -102, -106, -635, -408, 67, -193, -179, -12, -212, -233, -67, -286, -367, 131, -26, 60, -111, 46, -283, -151, 311, 273, 202, 252, 121, -232, 291, 269, -100, 255, 53, -322, -156, 504, 11, 138, 159, -89, -96, 193, -76, -350, -102, 124, -291, -218, 335, -170, -517, 287, 35, -370, -50, 40, 20, -11, 53, -188, -12, 76, -226, 32, 308, 50, -289, 353, 190, 273, 57, -52, 247, 249, 184, 291, 18, 400, 88, -35, 241, 407, 140, 360, 597, 53, -137, 320, 132, -184, 541, 359, -121, 370, 102, -258, 8, 166, -157, -119, 246, -59, -322, -111, -383, -763, 284, -100, -703, -605, -226, -513, -442, -10, -584, -365, 45, -620, -479, -344, -220, -430, -6, -183, -143, -230, 69, -436, 163, -80, 145, -499, 190, 48, -220, -143]
5328a43M68l91n8L77J55n9k05K83m45K70M74o58J16K5lj67K40r5k85O85m5o06
5350f7L41J75o94L84J3J46j45Q5q0l73K76m0NO3p9l10M03O5q5j26K16j30o5N41
5374E19n46j16L88R3l98K55M8k90j08N22L9n31L12j2m73O40j6l29M4n3j03k23
5396c38M91J62q44Q94k02n09M14j34P5N5J32m41r6L07J1m84J40K81l63K31J75
5417d3j67k3J29n30M05O8l80L25j50P4o8oL86m06m2M32J26k03J73l31j53N53k2
5440A47l02M12j02j72K57j16j52k1K36K6J26q0K32n55J97M19l59k6K83k62M7L4
5462B69j80L0J13K55j78j45K80nj90J26N8n43L46L2k85L73k36k2L5k24J09m9K27
5485A96k11k45L53nk80K14j13j61J94J28K80m68L83n03k90N85n7l40M22j37j0
$$ y = [-143, 325, -66, -124, 253, 408, 349, 144, 427, -18, 252, 726, 68, 184, 209, 206, 39, 279, 184, -101, 584, 539, -67, 274, 449, -245, 139, 152, 298, 153, 238, 158, -215, 61, 21, 26, 89, 10, -300, 103, 168, 83, -43, 173, 43, -22, 519, -27, -143, 245, 338, -60, 195, 243, -47, -155, 367, 406, -125, 187, 175, -298, 342, 326, -3, 41, -12, -115, -338, 153, 315, -529, 365, 163, -346, 68, -66, 9, 64, 196, -245, -341, -34, -23, -507, -367, -86, -449, -218, -43, -210, -233, -104, -634, -229, -161, -541, -216, -366, -292, -360, -366, 20, -386, -428, 4, 130, -73, 100, -231, -384, 169, 147, -155, 257, 155, -17, 240, 124, -28, -49, 187, 213, 339, 259, 491, -64, 133, 552, 193, 167, 450, 188, 235, 269, 89, 119, 232, 487, 309, 164, 444, 439, 249, 375, 433, -110, 236, 268, -17, 356, 120, 98, 133, -91, 18, -31, 196, -15, -260, 93, 88, -192, 22, -91, -252, -58, 70, 350, -118, 265, -238, -528, 57, 0, -340, 82, -55, -65]
5506f5K62j87q2J44J67m97J84L56l41J0J83J51o37M75k69N40k64J54l38n7J17
5527FQ4l98M15j13j74J75O1k38o1P94p48o3R3M35q07M99J7l08N76j78m05K93P0
5550B5k2N0k30J88m3k92J42LK34R8j35Jj64K60r0l8N34n99J51K62l35M6K04j53
5574I7p4Q4n5j52L68m12q4O6N58l98j23K90O8l42M91j99k02l10M40k01L42k19
5596C3k36j83L67K92m35k4n5o5k8J56k34K09RK8j35J53j28mP3J03l98M42P0j62
5620a52M09j66j93M27J12k80j31J96l58O9K64k50L48J46k45n3J00k08n4J74J82
5641C37p7j79J05J87l43K4K37n07K25j59J69j08J0J54O1L7l50j30J92o6p0m9M64
5664A64l8m26O9R9j6J65mk11M2L29k93L0L2P9l08L60q6K3J36j58Q1n8L94m79p2
$$ y = [-65, 197, 10, -72, 72, 239, -258, -74, 282, -59, -49, 134, 285, -352, 123, -146, 394, 130, 284, -54, -111, 6, 90, -308, 107, -6, -180, -5, 56, -182, -243, 551, -197, -260, -167, 268, -539, -40, -23, -331, 245, 67, -338, -45, 25, 3, 53, -177, 11, -32, -324, -182, -179, 55, 153, 18, 19, -145, 115, 25, -13, 521, -78, 73, 335, 0, 46, 250, 97, 23, 107, 52, -100, 268, -144, -228, -162, 396, -2, -125, 165, 233, -109, 382, 183, -19, -329, 111, -90, 252, 33, -203, -386, -19, 273, -162, -186, -241, -306, -334, -178, -412, -203, -194, -166, -301, -148, -276, -280, -207, -104, -502, -60, 10, -152, 257, 91, -102, 325, 437, 157, 26, 222, -136, -67, 197, -53, 295, 441, 196, 143, 243, 35, -19, 155, 337, 260, 81, 186, 373, 30, 54, 291, -216, 9, -150, 19, -89, -79, 75, 136, 173, -177, -307, -115, -181, -251, -300, 164, 126, -300, -231, -132, -148, 17, 13, -198, -156, 173, -120, -90, -58, 21, -287, 73, -13, 10, 146, -12, 69, 11, 405, -74, -146]
5689a46L56k03R1M09l16q3K1K76m22q9L15N6kq9J65m00O9N8l77N22K9k43j62K67
5713A02q6k47j04l3m3M4J00L30k4k07Jj12L02l4k86l6K59k07J71K40l40J22P3
5736a5k8k05L91l15O9K39n7p5K78Nm53L58j63K18j87R5m1j85J98L33l99j02Om2
5760g7L89k02j11K11k58j72L86o0J59l95j58M25j89J27Q9k21j36N7j02j77J84
5781b31J00k46L40k0p2m0K33k38l63L27J26p2N8M5Q0Pj48J79k40L11k39P0M25
5804C92l43J33m03M98m83M91o2m2l09J82O1l2O5j33p2Q6K93l88J05J07l14L2M5
5827i1J67J49j84K4l7P4N5k65j5N25p80K21j51J29N8K48j24j74P4o4k4m3K8q3
5851b83P8L06m50L52L81p9j56l97O80l89Q6K40n14J07N74o60M8J87n7M4J26j89
$$ y = [-146, 210, 7, 98, 507, 191, 108, 129, 405, -17, -106, 209, 265, 263, 174, 339, -61, 8, 66, -311, 211, 240, -3, -165, 102, 16, -231, -335, -368, -411, -367, -267, 63, 39, -168, -167, -279, 23, -11, -297, -333, -74, -281, -110, 130, -210, -88, -15, -43, -248, 143, -172, -103, 136, 79, 4, 282, 287, -166, 192, 29, 247, 60, 155, 114, -71, 127, 460, 61, -41, -35, -77, 312, 110, -1, 210, -48, -220, 166, 106, 265, -130, -288, 137, -52, 75, 164, -57, -193, -136, -238, -415, -231, -131, -377, -37, -57, -129, -169, 64, -174, -537, -210, -84, -156, -98, -53, 27, 34, -114, 65, -175, 136, -103, -33, 392, 49, 182, -221, 277, -206, 285, 223, 181, -128, 54, 115, 83, 148, 15, -57, 29, 322, -66, 39, 146, -168, -136, -91, 76, 225, 41, 65, 28, 102, 157, -108, -123, 402, -378, -157, -308, -179, -121, 127, 3, -171, -97, -161, -185, -228, -200, -283, -205, 101, -349, 3, 384, 305, 149, -248, 432, 43, 129, 369, -145, -38, 536, -124, -76, 111, 54, 98, 224, 35]
5873C5J30J6k65k8l7K40l31M37j49K31n6l99J23j38K55J8j0k38K1J56m59O62k29
5896a5j83R3J59k36J21mK8r4K54l37K41k04m5K39j18k28K84J57j54j7M6L51k54
5919H4n3K24No6Q4k78j24J87P5l77L39K03Mk34L9l4l17O08l01J88j41j47j17J54
5943EL96n26J82j89J29k13J80K07l33J22J79j25j79M73l98r7l3J3q0L0o2n6rQ5
5967b99L16p9R2q9k40K55J09k05q6J61l1N9J41m90l7N27k69K85k32L3L02P9o0
5990B42m25K59k7n8j35O57m67j0P0M3m4K71l08k04R7j1K91l31L35k61K19l7j17
6013D9P4k81M23m49J55p5j78M91l50M25n71N30k17O6l41M44n4l7k73L47l32J74
6035B0J58J17q6j06j94j29R5K30k4j12J87l62rJ31P7Kj44J56l01M10l31k89O35
$$ y = [35, 165, 181, -84, -112, -149, 91, -240, 197, 48, 279, 223, -176, -53, -191, 64, 82, 72, -166, -145, 11, -448, 214, -15, -198, -105, 54, -182, -61, -65, -37, -131, 123, -214, 27, -177, -222, 17, -101, -329, -45, 112, -42, -59, -13, 338, 84, 31, 255, 260, 194, 278, 0, -124, 63, 138, -239, 100, 303, 307, 73, 112, 78, -239, 369, 68, 256, 115, -32, -149, 5, 401, -125, 57, -132, -3, -216, -36, 171, -162, -40, 139, 14, -165, 308, -90, -187, -220, -207, -287, -257, -319, -375, -384, -299, 17, -62, 30, -59, -299, -44, 65, -140, -226, -65, -96, -37, 104, -386, -423, 104, -165, 120, -112, -79, 223, 302, 242, -183, 76, 49, -9, -144, 513, 46, 36, 106, 149, 105, 376, 68, -136, -39, -50, 241, -90, 245, -16, 203, 166, 49, 123, -158, 265, -184, -29, -104, -282, 209, -141, 284, -287, 243, 26, 92, -249, 195, 141, 104, -169, 178, -154, 20, 178, 295, 209, 103, -91, -220, -125, 105, 81, -31, 156, -206, -215, -84, -7, -5, -149, 7, -294, 116, -215, -504, 131]
6058A31k95k19J84L49n7l33K03l38k6M63m8r0o7J57k06J62lj15n7O2J35L42j81
6081A53l82J85L02J05k59Kl4j72O1J28J24J64n06L97j17J46p6L3k54J86q5K5R1
6104B17Q2l02J88j10K7J16j70M8K18m03L25o1k09q0L19l34Q2M10j88j13k66J86
6126a8L88k5n6j57l95M05l1J43n04L99j12J5N4j83J88k1K5l23K62q7N2p4R1l00
6150b64J07j17K39j1O8n65L46L95l22k45j7M17m46M06J03l52K42L84m95j15Q3
6171a59j37L43M8R4k66J93l63J90j64K14r3J32jJ62q4K63J33l66J91j89K55l84
6193A2N2J66P4j43J20k01o1L26j90K2J76m26K87LK92n26J43p8r0j17K06q6J50
6216A11J44l14j47R8J37k40R4m4K55k63L04m03m3J32j16K62m0k8k23J20J6l1O5
$$ y = [131, -164, -383, -199, 150, 93, -240, -37, -375, -401, 62, 14, -76, -143, 14, -192, -30, -33, -148, -205, -143, -8, 334, 153, -229, -44, 258, 363, 104, 106, 72, -100, -39, 89, 213, 377, -129, 268, 151, 297, 221, 254, 0, 186, 101, 126, 217, 299, -3, 185, 75, 102, 218, 48, 96, 314, -89, 236, 175, -34, -114, 205, -129, -47, 363, 175, 62, -204, -18, 370, 345, 289, 132, -263, 142, 111, 254, -250, 149, 37, 52, 106, -77, 111, 90, 115, -208, 54, -33, 19, -55, 36, -264, -157, -274, -35, -46, 22, -543, -197, 198, -124, -369, -386, 31, -415, -9, 94, -258, -16, 368, -127, -242, -159, -296, 47, 95, 189, -77, 116, -247, -57, -221, -7, -100, 32, 31, 193, 109, 372, 505, 139, 330, 141, 396, 12, 64, 230, 304, 161, 281, 80, 19, 345, 155, 177, 353, -73, 214, 217, 509, -17, 126, 48, -42, -159, 47, -39, 111, 255, -59, -206, -108, 29, -211, -117, -161, 94, -169, 135, -268, -311, -179, -295, -33, -73, -101, -324, -204, -188, -219, -154]
6239a54J18J52k14K2RL8J33k96L26r3k91J10K22Q9j47j16L16K2k53M8q2N1J39
6262A49m7j36O3o8n7m6M03j66k0J27l7j38J09r6j5k20J98P0k63K41k04L07J19
6285B73j05r7L4Q4k71l4L7N6M5o2J77K65k48L2j26j98N11O1o44K68Q7M6j4p8j24
6310b5L83j68m41K86L17m41L04k12l5K94K9l01p3O7o8P9k06J8q3J0K63j01q1J17
6334f8j72J12K79l47K12N0k23J09k29J81Q9P3l32Q4K51j99K52j63J34k14p5N65
6356C69l96J77n4M3o7K0j67L5n7L85m04J71R2O2j27N9J42j69j3P0N6j51J02q8
6380I0L0K07J31n50QM85j28k88J55l44O06l13N0pl13o0J21j13L89j92K96k21n6
6403a7Q9O5j79k91N38l1k79n0K46l5n1J22l03j0P3L6J11k12K71j00K91k82l38
$$ y = [-154, -36, 116, -98, -76, -67, -29, 104, -192, 134, 41, -250, -140, 82, 171, 24, -92, 224, 246, -7, 41, -41, 10, 149, 102, -34, 29, -39, -96, -142, 261, 95, 75, 202, 165, 27, 136, 40, 25, -195, 3, 73, -190, 51, -153, 154, 273, 168, 71, 105, 189, -82, -116, -79, -23, 22, -40, 137, 402, 154, 186, 60, -138, 373, 434, -210, 58, 145, 191, 177, 99, -25, 358, 190, -251, 35, 352, -89, 215, 3, -32, 262, 291, -10, -83, -16, -84, -5, -211, -193, -276, -266, -3, -104, -185, -68, -240, -128, 151, -196, 16, 66, -157, -48, -277, -96, -7, 66, -266, -182, 69, -130, 122, -41, 93, -121, -196, 369, -27, 150, 96, 139, 72, 92, -75, -40, -97, 288, -116, 55, 147, 209, 82, 141, 283, 114, 101, 171, 227, 76, 178, 90, 120, 327, 458, -92, -84, 401, 273, -15, 140, -204, 402, 89, 139, 132, -181, -241, -120, -233, 156, -36, 260, 39, -17, 72, 137, -42, -333, 205, 174, -105, -155, 91, 56, 5, 127, -176, -186, -113, -77, 34, -178, 93, -7, 284, 2, -336]
6426c36K52L67k62k19M02o6j96lJ58l83J50K33q9l52L52p5J67k17lk33L32K17
6448A96k40n4L4R2J4Qk90N8K2J49k00j4mM53j18j36k46J23M54j40j86M2K24k03
6472C8j57N8M4m8m3L12j43J4J75j27Q9lj26r6J18j55J29J07k41pL87m2m03K94
6496A74J39k00j81R3Qk34M61j60j48L0L0l47L18K66k13j18K20j64k37M22l81M91
6518B69l44J75l83K42n8P9o2M5M5o03M05L16l77k16L84j4J34J04k82Q9j59J56
6540e5j79P5j99N09j2m9m87L81j73N06l53K62L8l02m7L3n7K99J4o0j32m5M88n37
6564h2L2J78n6K08p9m03M61j70J56r8L28p11M96l9k00j68J99J0K30l45J54j9j16
6587c4n0J0K97R0p33M42M77n89K5o8k2k7L49k73j82L85J9l80q5L67k29J58L48
$$ y = [-336, -84, 283, 21, -198, 204, 138, -58, -61, 97, -286, -136, 97, 8, -344, 8, -67, 100, -117, -120, -353, -21, 196, -44, -98, -64, 28, 42, 50, -240, -182, -160, -11, -211, -225, -229, 224, 106, -30, -276, -153, 301, 161, -25, 17, 241, 38, -119, -61, -17, -65, -108, 204, 61, 75, 250, 123, 212, 209, 83, -13, 105, -50, 79, 186, -55, -62, 325, 283, -120, 174, 313, 113, -68, 25, 33, -201, 260, 100, -48, -18, 12, -335, -17, 249, 36, -82, 138, -26, -263, 159, -222, 269, -75, 100, -283, -41, -99, -20, -82, -37, 8, -595, -190, 126, -251, -467, -83, -97, 37, 141, -141, -52, -211, -55, -234, -159, -358, 151, 139, 90, -397, -16, -189, 317, -36, 226, 264, -38, -85, -52, -109, 190, 204, 144, 12, -33, 455, -82, -50, 128, 72, 280, 201, -202, 259, 89, 245, 147, 475, -236, 260, 221, 21, -147, 52, 62, 292, -53, 101, 82, -34, -84, -74, 223, 313, -420, 22, 499, -90, -65, -133, -155, -182, 167, -106, -288, 97, 116, -264, -349, 18, -211, -53, 295]
6610B95l7l19K42l19m9Op9J61k24K03j7j38J81k2j28l2J34k82J34M74o2k58j87
6633c23j08M91j51J05l43K66%M8j14P0K41k84N11m11l7q0k37L66J93l8l1l04J65
6656eM0P4R3l50L99Q1o9l61P4K55m2K08J2k39K9n1r1M92n31L00k67K75Q4l72L66
6681D04r6K1l6l59L17k43J15j30j9q8P9K92j00j82o9k02M75j62o0o9K12j66k22
6704b88K44J08m58J86p1k87L95n2K11j12j95j04K50j93J79J29o0Mj88N2K6l1J38
6727a17M3Mm6J44o6k5q9J90k17J53j85N1J73J39k06K67j03j77o7L35k49J82L30
6750D64j25k41J57K9l77M4K45p9j28N94o28J70K09j06r8j77L74R1l73J7j97j8
6772a53L71O3m04L47k13j29L30k07p8N7L9n0l05L91n0k95K90j5nJ27j6o04qL99
$$ y = [295, 258, -61, 181, -138, -187, -181, -260, -99, -323, -120, -137, -275, -94, -116, -244, -276, -142, -424, -290, 184, 122, -136, -323, -431, 60, -91, 14, -329, -63, -63, -15, -129, -59, 182, -102, 409, -2, -39, -119, -356, 10, 203, 165, 134, -170, -5, 35, 109, 202, -148, 251, 332, 263, -98, -24, 231, 189, 397, 409, 170, 199, 148, 57, 549, 18, 318, 51, 326, 410, 38, 404, 308, 329, 293, -66, 251, 8, 123, -7, -26, -114, -35, 257, 157, -25, -94, -296, 179, 17, -43, -112, 100, -66, -288, -44, 64, -394, -208, -279, -566, -171, -223, -12, -124, -319, -423, -173, -366, -187, -58, -118, -114, -302, -250, -224, -255, -117, -74, -70, -116, 28, -38, -63, -152, 38, -179, -26, -211, -160, 13, 152, -54, 213, 110, -67, -134, 201, -48, 134, 464, 339, 98, 255, 284, -93, -49, 196, 117, -11, 583, -45, 125, 334, 228, 130, -47, 327, 418, 45, 62, -135, -153, 218, 281, -123, 224, 11, -118, 212, 5, -73, -16, 23, -27, -332, 59, 9, -286, 4, -11, -16, 111, 95, -509, -517, -118]
6796a18N7lL95o08P4K9K04l39L73j37P7J25k22M1j51K26J28j29N0J80m10J63J05
6819A10j49K18kl20o4J94Q3j08M2N9p2K07j93k93J69Q8l4J97m44m4m2N48n2L2
6843A30q1J50l06P0k09K1J42j6L96l70q6K18l7M2K80q4k62mm1j08L91k54m0K15
6867A57Jo0Q4Q6j12k48L62J54l18Q8j85O8l31L72m2j83K87k47n0J27j4j75j11
6890b90L60j03p9j61O9k60M18J40jj34j5n4K8k15J33l4M60m43Q9j96J25K35J16
6913A88j29l22L64kl33J55Q4M39k54J1k4j75K04K3K4m82L23LO8K10k22L9J50j25
6937B17j40j87O01n89J0J44k96J04K73mL4rk88L65m42j31L30jj33j8M1J98k92
6960b13J30J44k95j98K31K59k68N63m51n2qL05k09J02r6j68N14j82J44j44J36
$$ y = [-118, -61, -64, 331, -277, -203, -174, 30, -309, 64, -73, 4, 129, -93, -52, -203, 23, 151, 22, 72, 252, -158, 5, 110, -39, 179, 177, -143, -207, -13, 70, -38, 4, 63, -9, 198, 5, -288, -119, -31, -65, 132, -312, -356, -398, 150, 98, 130, 49, 199, -107, -37, -246, -225, -83, -99, 297, -73, -159, 59, 22, 64, 344, 260, -2, -6, -47, -155, 236, -18, -58, 157, 158, 98, 182, 268, 156, -92, 270, 424, 106, 194, 9, 77, -254, 118, 76, -107, 180, -67, -117, 10, -4, -179, -290, 70, -33, -112, -273, -204, -464, -46, 94, 93, -41, -56, -110, -82, -297, -164, -198, 262, -181, -92, -288, -163, 72, 188, 59, -263, 101, 99, -234, -79, 5, 444, 190, 201, 177, 2, 206, 229, 253, -229, 94, 97, 165, 375, 153, 192, 342, 217, 77, -110, 491, -98, -88, 56, -240, -136, 137, 133, 167, 158, -130, 235, -207, -338, -8, -9, -142, -160, -119, 79, -213, -83, 61, -234, -432, -201, 58, -210, 353, -98, -150, -158, 147, -62, 40, -56, -224, 290, 108, 252, 108, 244]
6981B44l86K35Q9k1j56J91jj12j79K40j5k0K2j18r3p6K14l43J87J4j6J25l92L05
7005f2j88O2J9L5J79k63m4K35m1J11q3J35l03J11J72l0j64n0K88m08K09L66l20
7028c4l70P26L0j92K28k09j5j8p0J11P4Q3k34J7J14k10O0p8K58l2l48M58j67j32
7052E0J67j5n35L79J21j98j50K96j27q3J27j65j6K95k44Q3k83K75m53J13M59k26
7074a30J47R4Q7n63L38j38Q0J24k31M41k26J05k41l1P8Q4K54l08P3K48j59N9j72
7097A3K28k12k15m7L29k66M7J68q5o1K03k7k32j33L28l12K67l6n8j98L64k78K31
7120A8j04J69l11J18L6o9j17K75j31M1j20P6l2L19J92k09k14J14j08J9J70N3K21
7143D06l65R3j63L13k75J97J05J03m62J05rJ4j85K95j18O0k01L05n35M65N7k99
$$ y = [244, -142, 93, 182, 161, 5, 196, 195, 83, -96, 144, 129, 109, 131, 13, -80, -156, 58, -285, -98, -84, -100, 25, -367, -62, -250, -188, -169, -134, 45, -218, -262, -27, -68, 43, -40, 95, -208, -97, 75, 45, -119, -169, 119, -289, -80, 286, -34, -404, 322, 352, 160, 388, 179, 164, 146, 76, 187, 261, 344, 110, 127, 241, 31, 91, 13, 271, 239, -109, 349, 182, 50, 217, 202, -333, 46, 167, -31, -181, 115, -12, -95, 32, -133, -149, 146, -98, -15, -298, -23, -476, -363, 96, -130, 17, 111, 198, -365, -27, -165, -85, 39, -192, 249, 23, 128, -113, -144, -66, 18, 272, -36, 37, 285, 126, 185, 13, 241, 29, -186, -233, 96, -170, -123, 45, -40, -101, 102, 75, -157, -290, 38, -274, -7, -43, -101, -299, 65, -213, 18, -86, 83, -228, -110, -74, -143, -260, 15, -116, -75, -195, -119, -151, 168, 360, 151, -63, 51, -57, -38, 132, 185, 406, 41, 134, -29, 284, 9, 206, 311, 414, -48, 57, 48, 62, -123, 172, 54, 114, -87, 218, -317, 148, 205, -94]
7165i4K07k31K56l25j08J88l0k29J62k49L87k38Q5N2oL1k08K58J71j46l09K16
7187a60N2j23K78l62K83K18k20L27k61R4l28K40M94p31J56L42k50J05l4j57j17
7208a54N0L50L0J69j69j77Q7k18j26L93j19l72K99P6J29l77RL10m60j73N79O7
7230B03k92J98j31j44K28j51l3j53K08N2j02J51k19k35R8M85l71L3N14l34j00
7251i5r9K18J31M14k58n74Q47l59k83Q7k7k19K71K36K4l14O9j6j47L36j87l90
7273c35Q9J12l16K13K42l24J69l5J19j71L05q1r6j78J1j94J76J93l4P1j7N4l69
7296c96J29N4L4R9o0j44M06K48n51L54K01J18m00J06J47j83K22k08J25l85N37
7317D53l32K63J8J41k50L11m06j76N9L90q5k12j6l23K71j81j09K56j14P2j70J01
$$ y = [-94, 113, -118, 138, -187, -295, -107, -137, -366, -204, -453, -66, -304, -219, -167, -173, -142, -350, -92, 79, -67, -376, -160, -108, -231, 47, -315, -32, 186, -34, 293, 32, 126, -202, 38, 532, -199, -43, 299, 49, 154, 120, -37, -154, -104, 246, 276, 445, 276, 99, 186, -32, -158, 235, 116, -256, 43, 119, 248, -129, -120, 190, -270, -443, 136, 203, -89, 109, -22, -166, 62, -89, -122, -275, -67, -15, -117, 34, -185, -420, -322, 163, -208, -175, 339, 5, -95, -194, 24, 155, 569, 311, -263, 584, 225, -58, 29, 2, -217, 54, 290, 314, 0, 69, 53, -94, 242, 55, -335, -246, -134, -450, -237, 5, -319, -150, -185, -66, -237, 68, -13, -109, -287, -276, -470, -294, -101, -135, -64, -81, -27, -396, -267, -213, -179, -80, -140, -284, 122, 370, -181, 173, 374, 492, 92, 198, 345, 162, 384, 176, 301, -84, 453, 121, 384, 402, 543, 293, 604, 198, 22, 81, 471, 386, 174, 158, -165, 106, -75, -184, 72, -42, 30, -140, -39]
7339c9K7l09K5L13q0o79M94K43k35N0k45J0n4K37J50l63K11J91k77M2J28l59N58
7362C9k62m6N36k07O2n44K82q7J81J53k33j64M23J71k90l2J73l41k7N30l80l90
7384d53O55j12l84J65o5J27J74n6j78K0j65K37j14M86k35p5R0J37l76J18J01j32
7406c5j31L56j03L2J22j76J69K2j1m12L22J44k10K75j04J06j24K0L5k89K10j68
7428E0j65N91k78N6j31K29o6m48K21K68l24M64k06j53j72J12j85k64N52j24k27
7449b00M20k55m11N15K12n79J41J66k41P3J99J26p15J64O13o67K92J10k47K97
7469A3m1j87J91j20O2l52P44l87j62n1J56P7k65J84r0L03mo3k22J03k9k7M8K57
7493A38l61L50Q4l95j01M89j68k47N61k44j22l46M50j78j23M72l47R1J20k88K77
$$ y = [-39, -12, -321, -296, 17, -63, -742, -248, -5, -240, -190, -435, -425, -479, -242, -92, -455, -244, -53, -330, -288, -160, -519, 39, -223, -269, 267, 60, 122, -422, -140, -227, -46, 107, -126, -290, 133, 304, 14, -18, 155, -186, -213, 317, -63, -453, 202, 90, -294, -129, -194, -67, 107, 51, -127, -107, -272, -35, -149, 337, 102, 27, 117, 254, -122, -4, 97, -35, -166, 190, 87, 119, 241, 65, 234, 256, 245, -167, 155, 299, 89, 364, 260, 366, 242, 262, 297, 8, 218, 50, -115, 476, 198, 254, 123, 352, 286, -162, 59, 327, 3, 467, 261, 108, -64, 48, -137, -401, 151, 27, -200, 220, -35, -446, 69, 281, -298, -157, 9, -232, -159, 40, 166, -549, -385, 228, -439, -147, -37, -284, 13, -28, -215, -24, -144, -82, -434, 310, -77, -239, -290, -134, -57, -322, -138, -228, 75, 71, 8, -214, -111, -140, -167, -119, 138, -223, 127, 211, -184, -285, 204, 36, -211, 350, 106, -16, -362, 88, -90, -213, 259, -88, 3, 123, -165, 112]
7514A12m8Nq9K25k56j95K95K40k83k7L30k82J74L02l69m13L74M23l16k84K32l79
7536b29k4O69l94o4j0L35m43K9M99m37k34M00J80l23O6j83K7K79o7k45R7L84m41
7559a29J58K3J07l45M55k24r1o4N86p40q4K68J29j01Nj01J4oK90j49r9J38l74
7582c34r6L34J2j14L20Ll4J22n22K32Ro8K26r0L17l46l5K12j68j1qJ16J3m39L97
7607D8k7o9rqJ65K67l6l51J06J46l37J84r9J79k52M17k63k66O85k71j21K08k66
7630C0k12J62p5j9n8L64l34K96k53L20l26K99j15j43l01O98j79j74K73j71l37
7651b55N16k18k53r8M73l39jJ07j29L46j00j4l41K30J30j95K80pn7J35n3k31j72
7674b46L23K21n02M21l12k03K04J95j29j04K12K0J72l08K86l8m44O12k25j17R2
$$ y = [112, 64, 69, -20, 205, -51, -246, 49, 289, 6, -21, 309, 27, 201, 503, 134, -279, 95, 518, 202, -82, 150, -229, -253, 416, 22, -42, -52, 283, -160, -131, 368, -69, -303, 97, 277, -46, 20, -163, -136, 143, 76, -169, -72, 312, -129, 29, 52, 159, -186, 269, 45, -46, -110, 476, -264, -348, -80, 49, -52, -47, -148, -134, -140, 150, 1, -98, 40, -334, -430, -96, -84, -198, 122, 125, 91, 213, -309, -77, -68, -136, 90, 0, 317, -29, -64, 148, -20, -31, -39, 77, 90, -349, 48, 21, -48, -57, -65, 100, 367, 331, -20, 86, 232, -105, 79, -20, 159, -93, 324, 61, -205, 480, 209, 88, 296, 30, -182, -20, -95, -114, -172, 192, -142, 154, -99, 221, -105, 194, 79, -64, -365, 333, 154, -20, 253, 82, -255, 261, 43, -210, -308, 165, -174, -175, -68, -197, 149, 49, 35, -306, -76, 54, -141, 139, 132, 75, 210, 157, -74, -246, 77, 298, -204, 217, -95, -298, -94, 101, -28, -132, 80, 100, 272, -36, 250, 212, -232, 380, 155, 38, 130]
7695A30k69k8M06l58L2P1K99n61K70r7J85k44L13l31L17k9l46L94k84O0o34M90
7717b14M03j63kn9l31K14L39l59J11K3N8j06k8J51j81M73l74L68j64O1k34J62
7739A48N0l81K43j9n1L5k66P33l70N6n4J52k98K33j24j69P6J12q9M5m1l20M56
7762A57k53L86k92l1K15m11J25L5j75m7M35o76K64K61k9l81J36N68n59J40J59
7783B7j70o0n6K68J94l03Rn3L9J34J31J6J06n34M50j21j89N13k95k30K36%Q1n14
7807c21O37r8r3j61k40M45M5k12K5PJ43o2k13L81k86J35j65Q5K60p16N36k75k22
7830c65L44j14J83l1rq3j82L21j21l70O66m61j28K97Lj67L79l9j94L79k90k42
7852b24J6J98K74p23L33L82l61K48n8j69K43l04J15j11j6J68J27l99K99l36L41
$$ y = [130, -139, -167, 239, -119, -87, -16, 283, -278, -8, -105, 80, -164, 149, -182, 135, 106, -240, 154, -130, -70, -704, -214, 189, 26, 24, -35, -366, -152, 187, -172, -61, -38, 20, -86, -114, 37, -144, 329, -45, 323, 159, 220, -14, 148, 198, -183, 60, 41, -10, 25, -241, 492, 122, 178, 124, 276, -22, 211, 87, -82, -6, 106, 17, 62, 21, -299, 157, -96, 290, -2, -33, 182, -229, -104, -69, -244, -291, 144, -532, -268, -7, -36, -417, -281, 287, -272, -132, 27, -143, -203, -259, 9, 203, -100, -91, -144, -105, 29, 160, 176, 282, -252, 198, 77, -112, 401, 106, -124, 112, 112, 193, -321, 316, 218, 125, -36, -276, 169, 214, 2, 27, 34, 177, 115, -98, 283, -3, 132, -33, 52, 312, -404, 132, -143, -365, -21, -135, 48, 17, 8, -75, -257, 64, -57, -427, 239, -222, -350, -53, -50, -217, 162, 123, -71, 308, 18, -224, -208, -10, 264, -459, -126, 256, -105, 143, 85, -84, 159, -145, -30, -141, -157, 11, 138, -261, 38, -298, 43]
7873D3k25K76L9k97J1K42L15n81K36Mj5K0J90L6j63m62O33j50k37K01j17K24l04
7896h1K84j86M0j08j29Q7J84l57R6O7n5J04l7K01n45L20L31j66k16L15R7j51K25
7919C20k74k69k8M82j47k0J57o04L14j19K68R1L1k92K86n12M76j67P7j24r3j08
7941b55K61K18k75l13O54m74q8K71k81K92K60j88j5j47k15M56q9l8j5k32J88l52
7963c77L74J49k06p3N8M8j0K03k3m22K70L52n45L65J47m01M5NO3j22J47R3l1L5
7987A44k05p4pJ88j8K5n1j56N0k3K39k48K45K54l36k14L80l12O1K69k64k25L34
8010E6n1k96o0K30J59r3Q6k84K36k33j0J65J59m7k08P0q7n3M67J31j66m30M33
8033A74m10n6K22j34J07K95l24n6K24J51l24K43J98k26q7K99j58p8J31J9n1J35
$$ y = [43, -182, 94, 133, -164, -153, 89, 404, -177, 59, 63, 48, 68, 258, 294, 131, -331, 302, 152, -85, 116, -1, 223, -81, 203, 17, 57, -51, -180, -93, 91, -266, -170, -103, -158, -54, -91, 110, -435, -115, 216, 50, -166, 149, 246, 95, 320, 46, -223, -251, 231, 84, 64, 221, -383, -69, -188, 80, 171, 202, -90, 196, -316, 160, -7, 70, -54, -147, -255, 6, 224, -51, -364, 290, -184, -272, -1, -282, 10, 270, 82, 67, -80, -295, 161, 72, 34, 19, -213, -25, -377, -3, 146, -60, -133, -75, -27, -37, 166, 143, -279, -9, 343, -202, 163, 310, -91, -46, -41, 22, -100, 47, 140, 109, 144, -61, -135, -142, 46, 28, 53, 2, -154, -104, -127, 112, -136, 109, 363, 27, -187, 193, -119, -58, 211, -53, -278, 56, 5, -291, -351, -121, 38, -55, 31, -253, -17, -250, -260, -95, 64, 17, -191, -121, -208, -261, 206, 337, 171, -259, 174, -236, -292, -70, -204, -97, 198, -126, -182, 42, 193, -131, 112, 310, 84, -3, 296, 138, 60, 191, 210, 159, 294]
8055B94m16L11j03Q0L35l43K06k44k00q9J84r0J88P5j89j49M04k35R6o6R0l47
8077b08L20P4l10K27o8o5l39K38J64j12j57N4p7M2J8L75j90L95m27K32m7l8n16
8100d15K67K13k55N44l36l12K81K99o9k55K12k67K61r7j70K1Q5L5K5j4L3K64n77
8123b27K61O7l6l5J07l15r3M72J72l46N55p13J22N6K0j59k7J98L7l46M74l28L8
8146d6O5j12J77k5J78l91J98J99l90J80J24j13m0J80j30J83j81K11J73l07K42
8167C75j01k60J07J80k6m8k40j20J59L38m15L29j64J2q6M1j83N1K59k18J2P2R8
8190A72j44
$$ y = [294, -122, 189, 86, 166, 501, 158, 364, 120, -80, -169, 15, -75, 113, 188, -1, -150, 254, 19, 115, 49, 139, -208, 112, 186, -124, 103, 35, -30, -369, -131, 33, -79, -236, -182, -259, -217, -199, 176, -14, 381, -46, 186, 139, 101, -415, -148, 65, -190, 354, 18, -294, -13, 286, 217, -38, 174, -93, 168, 71, -99, -78, 7, 42, 67, 53, 86, 350, -227, 34, 101, 65, 30, 137, -178, -271, 201, 373, 27, 582, -131, -9, 47, 67, -92, -119, 79, 116, -230, 244, -84, -46, 19, -93, 84, 59, 237, -154, 44, 243, -147, 33, 157, 44, 4, 184, 54, 237, 56, 267, 440, 133, 375, 274, 14, 121, 301, 275, 227, -13, -133, 26, 364, -51, 278, 114, 126, 40, 81, -102, -51, 208, -10, 2, 74, 172, 28]
8191B8
$$ Imaginary data points
##PAGE= N=2
##DATA TABLE= (X++(I..I)), XYDATA
0@%%%%lLqJ6j6J6k4L2m0M8n6P2q8J04j23J47j73J99k30K69l09L51m02M57n18N85
30C09o57P41q32R28j035J155j285J427j583J755j942K148k379K635k922L240l597
47a894M009m481N026n672O448p397Q599j0167J2310j5439K0428k9657N2290k04876
61a70473l14113M24284J84699k59432j37345K31457M5661k33153q7285K44474
71g1226J35405j95304j44598K18124J41257k40554j66838K35981J85244j19337
81b1846r1895O9768k0992r1110N7732J66464L5874j37920r9784R1577Q9989p8829
93c0972l1820J35709J2460j50867J9773J36733q3867j47146J24806K01792o4692
104A21909k10313l9113J40062O5413q3680j844J27411m9157k19324L3929K52509
$$ y = [0, 0, 0, 0, 0, -3, 0, -8, 8, -8, 8, -16, 16, -24, 24, -32, 40, -48, 56, -67, 80, -93, 106, -124, 145, -164, 187, -215, 242, -276, 309, -348, 393, -439, 489, -546, 609, -676, 751, -832, 923, -1019, 1129, -1250, 1385, -1537, 1703, -1894, 2115, -2366, 2660, -3012, 3436, -3961, 4638, -5529, 6781, -8658, 11770, -17887, 34403, -170473, -484586, -60302, 124397, -135035, -272380, -40923, 4738, -228415, -315700, -71226, 64179, -131125, -275723, -57599, 83658, -156896, -323734, -87753, 97491, -21846, -113741, -43973, -64965, -156075, -98343, 68121, 103995, -33925, -133709, -42132, 47857, -30972, -62792, 72917, 85377, -65490, -45717, 91016, 7149, -139997, -15191, 186601, 121909, -88404, -127517, 12545, 77958, -5722, -7566, 119845, 70688, -148636, -114707, 137802]
115A37802n059k11104J8359J75693j8179j47839k2206J01865P0111k5101l7467
126C6875K7260p833r7143P108J64787N8113j16113o6828K5960J4947L1516M2384
138A21033l0391l5428L4089J3801m1636k5681L734L2517M9633j6412o4687n596
150C4976p701o2173M9270J39385m2276j80368j8880J11104J2694o2962p821L4832
162H0J840n7104m3352M7622L2490p6515j6533J19658Q557j55646m3627J07515
174g5015M5368k5989M134r205m6087j4727L6765N6152J6253n4923k3497O9409
186b1362J5210p7422J2282Q8405j3216l9818O1268K0040r5699k9315J02159Q2582
198A05114l2171q5293j6607O9558J7140o2146K9482R3205n8692j11980O8872R9160
$$ y = [137802, 132743, -78361, -60002, 115691, 97512, -50327, -72533, 29332, 99443, 74342, 36875, 64135, 56302, -40841, -33733, 131054, 189167, 73054, 6226, 32186, 47133, 78649, 121033, 90642, 55214, 89303, 103104, 61468, 35787, 39521, 72038, 121671, 105259, 40572, 34976, 27275, -34898, 14372, 153757, 111481, -68887, -87767, 23337, 36031, -26931, -34752, 80, 1920, -55184, -98536, -50914, -18424, -94939, -111472, 8186, 16743, -138903, -182530, -75015, -29647, -55636, -51502, -60707, -106794, -121521, -84756, -28604, -12351, -67274, -90771, -21362, -6152, -83574, -71292, 17113, 3897, -35921, 25347, 45387, -50312, -79627, 22532, 105114, 72943, -12350, -28957, 40601, 57741, -4405, 25077, 118282, 59590, -52390, 16482, 115642]
210A15642q0104q6644P4690Q7073m0651r0098j8956N9823K8495m7333K158O6608
222G0703m7424j15910M4464J22230l4253r1251K7507M7940l0540l2593J3086K4416
234a625N225k1199L046L9430k7346p8615L8896J06756k5246p9887K7144L1857
246A8436m5974J199O5278P153m9091k1169K5896L6279j5440n3544K2519P3951
258F5493k5922p1512K9412L8056n1304q705P2302M956o9535k4929K7271K9297
270A4880N226k8848j3009K9018q098m3002K3675L9465m1020k3829N3369P385n5338
283d0126o469L0037N227P678N052k0246p880N337m898K3472L0253l4530k9600
296c6693M2203J4768m0695J2024L7779k0760j3689L0137j375k6917N616J4710
$$ y = [115642, 35538, -51106, 23584, 110657, 70006, -20092, -39048, 20775, 49270, 1937, 4095, 70703, 23279, -92631, -48167, 74063, 39810, -51441, -23934, 24006, -6534, -39127, -26041, -1625, 3600, -17599, -14553, 24877, -2469, -81084, -42188, 64568, 39322, -40565, -13421, 18436, -27538, -26339, 38939, 46092, -2999, -24168, 1728, 38007, 22567, -30977, -8458, 65493, 39571, -31941, -2529, 35527, -15777, -24482, 47820, 52776, -16759, -41688, -14417, 14880, 20106, -8742, -21751, 7267, -831, -43833, -20158, 19307, -21713, -45542, 7827, 15212, -40126, -46595, -16558, -11331, -3653, 1399, -18847, -26727, -21390, -26288, -2816, 27437, -7093, -36693, 5510, 20278, -20417, -8393, 29386, 8626, -5063, 25074, 23699, -3218, 2398, 17108]
308A7108J1326J4054k0795k8935K4246J9550k6698Q759L1508l1873l0063L5881
320B4068J3261l2406J970J7094j0240j825K750j8290K039J6294j4586j807K3328
333B1650k3456l4497L1997K3612l2307m818K2291j6936j4942K0281Q97j1732P676
346a0284n152o483J9576o113k9353J9744K7801k7474j0904K9231r571k4440K2891
359a0531J5775j8652r8N424r159J1264J0095k0760K105K5541j6607j6460K8493
372F430L119k9464J2957K2351j7446n479J3767q846j301J7652j0765j1191K1998
385A3782l808k2343K0845J5535k7661j510K5788j0968j2159J7140l757j2125J5891
398A4650N6j6997J5063Q223k5198O384K5506j9562j4819K3224r25j8523J2603
$$ y = [17108, 28434, 42488, 21693, -7242, 17004, 36554, 9856, 18615, 50123, 18250, -11813, 24068, 37329, 4923, 6893, 23987, 13747, 11922, 14672, -3618, -1579, 14715, 129, -1678, 21650, -1806, -36303, -4306, 19306, -13001, -17819, 4472, -12464, -27406, -7125, -6228, -17960, -10284, -15436, -21919, -2343, -8456, -37809, -18065, 9736, -17738, -28642, 589, -8982, -33422, -10531, 5244, -13408, -13506, -8082, -17241, -5977, 4118, -16642, -14537, 11004, -5603, -22063, 6430, 9549, -19915, -6958, 15393, -2053, -7532, 6235, -2611, -3912, 13740, 2975, -8216, 13782, 9974, -12369, 8476, 24011, -3650, -5160, 20628, 9660, -2499, 14641, 10884, -1241, 14650, 14706, -2291, 12772, 20995, -4203, 2181, 27687, 8125, -6694, 16530, 15605, -2918, 9685]
411I685N950j6858P582P963j7005O484J5600k1431p862K7733o896k3921J7182
424D206J0597k1958L719J5660j3524l521J2179j0692l164J8924j1495j6724K1783
437E990N531k5884R175J8837j9832o977K0450o237j2629J2079k485j0548J5379
450B849k6k2045J1021J4401k1820j633K3052j3732j8172J9850L094j8337Q075
463a3423P017j5529O584J0582j8575l58J9453j1992j0029K1418m038k1921J5395
476a5416J4164j6776L552J4654j5012k066K0340p182j0206K0628R51j6601J4520
489E550R947j8147N966K1142j0219m353J4566r928q321K2671K957j7419J1649
502B6061Q218k0808M398J9899j3849q084J8027n537j5512J0581j945j4434J4756
$$ y = [9685, 15635, -1223, 6359, 14322, -2683, 3801, 19401, -2030, -9892, 17841, 10945, -12976, 4206, 14803, -7155, -3436, 12224, -1300, -4821, 7358, -3334, -6498, 12426, 931, -15793, 5990, 11521, -14363, -5188, 13649, -6183, -13160, 7290, 1053, -11576, 503, -1982, -12530, 2849, 2823, -19222, -8201, 6200, -15620, -17253, 5799, -7933, -26105, -6255, -3161, -21498, -13423, -6406, -21935, -15351, -4769, -23344, -23702, -4249, -16241, -26270, -4852, -8890, -30811, -15416, -1252, -18028, -14476, 178, -14834, -16900, 3440, -3742, -13948, 6680, 7631, -8970, 5550, 15497, -2650, 3316, 24458, 14239, 9886, 24452, 14524, 6203, 28874, 31831, 14412, 26061, 34279, 13471, 17869, 37768, 23919, 15835, 33862, 28325, 12813, 23394, 21449, 7015, 21771]
515B1771R344k3119k704J0797j6537m325K2639o197k1461Q271J865j5928P810
528g774Q199j5772L807J3117j8351r526J7322o191r504K3270L743k7997J125J5308
542i224p752N461J7096j2245j1227J3158l144o861J8501K321j5704J3836J0231
555A4447k4315l704K2636k378l293J6671j1383k4524J0773J2682o486J0280N311
568A6717k5464o068J8090p850q168J6472k150j4339R372l812k3588R177K1355
581b56p889j376P674k3683j6177K5752J4238q223N929m827k0185R417J7560j0496
595a2542K687K0566q101j2263J2925m632j3590K2536K2331r742m946l877j9038
608g686R076L4002O26j3567M331j1076j5813K0101J4587j7458K241J5377j6369
$$ y = [21771, 31115, 7996, 5292, 16089, -448, -4773, 17866, 11669, -9792, -1521, 344, -15584, -7774, 425, -15347, -11540, 1577, -16774, -26300, -8978, -15169, -24673, -1403, 2340, -25657, -24532, -9224, -16976, -11515, 5581, -6664, -17891, -4733, -7877, -14738, 3763, 6084, -9620, 4216, 14447, -9868, -13572, 9064, 6686, 3393, 20064, 8681, -15843, -5070, 7612, 1126, 11406, 16717, -8747, -14815, 3275, -4575, -12743, 3729, 1579, -12760, -3388, -7200, -30788, -21611, -256, -8145, -9521, -1847, -25530, -41707, -15955, -1717, -9940, -4011, -8838, -29023, -19606, -2046, -12542, -9855, 10711, 2610, -9653, 3272, -1360, -14950, 7586, 29917, 20175, 15229, 11352, -7686, 1390, 35392, 36018, 22451, 26782, 15706, -107, 19994, 34581, 17123, 19364, 34741, 18372]
621A8372j4669O102o513k795K3693M240k3732j1651j0885j0245K6996K5309k5042
634h20k2901P137q964j0544K1993R871j6271J416M085j5652j588P040o232J7041
648a4389L0873j8291l6407N957J5922M991K4003J3295k3429j4468O416K274J7408
661A4155K3875j2915j3940K1524J326k7234O133K5231K493O287P925k5670k3621
674E569J1794J6101J3897J4943k0732l8275K989J7655n521O044J1938k1744j7973
687c315J2689o781k3165P846J8225M10k645j8772l2843K226K7318M813K730O323
701d941l2748l5622K4710L4264p795r506L657m996k689J0j1087R262K8091j387
715a0777j2071J1703j2165l4012K1356N3475M539k6178j3120r747M397K5434R637
$$ y = [18372, 3703, 9805, 3292, 497, 24190, 28430, 4698, -6953, -17838, -28083, -1087, 24222, -820, -23721, -16584, -25548, -36092, -14099, -4228, -20499, -19083, -14998, -30650, -32238, -25198, -31430, -14389, 16484, -1807, -38214, -32257, -16335, -11344, 12659, 25954, 2525, -11943, -5527, -3253, 14155, 38030, 25115, 11175, 32699, 34025, 6791, 12924, 38155, 40648, 46935, 54860, 29190, 5569, 17363, 33464, 47361, 62304, 41572, 3297, 6286, 23941, 18420, 24464, 36402, 14658, -3315, 9374, 2593, -20572, -12726, 5499, 5909, 3264, -15508, -48351, -46125, -18807, -13994, -11264, -4941, -37689, -73311, -48601, -14337, -22132, -31638, -27981, -32977, -35666, -35656, -46743, -37481, -9390, -10777, -22848, -11145, -23310, -57322, -35966, 17509, 22048, -4130, -17250, -26997, -22600, 2834, 12471]
728A2471m122M777r743j8696J3498J3700j8435K010L2193j370k5678q379q101
741a5875j894L2857K2362k1419k3417j0115o767J9519K9076j0484j8972P098m250
754b281j3492J3461J0490j3208R761K2888j1995k4042l800L960K1989L3447p872
767C9306l4713m628Q611O01K3010K3148k0110k1567J0859N546m521Q079j71l075
781C0375J9018L527l3239j4919J5314J0700J2592J0305k4423l2391K482R598O663
794A5602J8429o822l8479n957K1471q505j7333R589N096n255K131j3780k4379
807d8192L062J4974M094J3141q17m1023k0696L1117K0871n310J644q126j7269
820e2530Q211J4752p370J351J3936j843K251J0578j8468j8863K7240K9457k588
$$ y = [12471, 8349, 13126, 3383, -15313, -1815, 11885, -6550, -4540, 27653, 26283, 605, -7774, -15875, -17769, 15088, 37450, 16031, -7386, -17501, -24268, -4749, 24327, 13843, -5129, 1969, -2281, -15773, -2312, 8178, -5030, 4731, 27619, 15624, -8418, -12218, -8258, 13731, 47178, 39306, 4593, -35, 8576, 9177, 32187, 55335, 35225, 13658, 24517, 30063, 25542, 33621, 33450, 30375, 49393, 52920, 19681, 4762, 20076, 30776, 43368, 53673, 29250, -3141, -659, 8939, 15602, 34031, 27209, -11270, -17227, 4244, -4261, -21594, -12005, -6909, -12164, -10033, -23813, -48192, -45130, -30156, -26062, -12921, -13738, -54761, -75457, -44340, -23469, -28779, -27135, -35261, -52530, -44319, -29567, -36937, -35586, -21650, -23493, -21242, -10664, -29132, -47995, -20755, 8702, 6114]
833F114l311p297k3213M582L4817J2802q311n597j0999k681K0067K297j5606J2290
847A5954J6257j3758o255P389j6262r013K9526J8836j4461j8010j6275n640K6260
860A4548K0681j6658j1727M377j3399o483K2078L650j8448N166J2483p853q406
873Io919p510J9254K6909j3450k3997J881k670l481K7701J6538k4848j6679Q602
887A340J942M488Q540q133m138J5646l548j8032L474L598o830J7465J8274k4847
901I239k6288P448R690N932J2780q338k3118N13O096m642R054O179j9444l161
915a8060K0765r496k4270P539J3507r39O529j155k2567o272J2729O520R964P419
929B213k2425j7415K0283J2630j2141N105R343j0917Q36J1845r237p414J3817
$$ y = [6114, 2803, -4494, -27707, -23125, 11692, 24494, 16183, 10586, -413, -3094, 16973, 19270, 3664, 15954, 32211, 18453, 12198, 19587, 3325, -5688, 23838, 42674, 28213, 10203, -6072, -11712, 14548, 35229, 18571, 6844, 11221, -2178, -8661, 13417, 17067, -1381, 3785, 16268, 8415, 9, -6910, -14420, 4834, 31743, 18293, -5704, -3823, -6493, -9974, 17727, 34265, 9417, -7262, 1340, 3282, 7770, 16310, 8177, 4039, 19685, 16137, -1895, 1579, 5177, -1653, 15812, 34086, 9239, -17049, -9601, 89, 6021, 18801, 10463, -12655, -12142, -6046, -10688, -1634, 4545, -14899, -18060, 2705, -6791, -31061, -23522, -10015, -10954, -4425, -5580, -28147, -34419, -21690, -15170, -5206, 2213, -20212, -37627, -17344, -4714, -16855, -11750, -2407, -13324, -12488, -643, -9880, -17294, -3477]
942c477O133R15R039j1436k1494J3695K3356l550k427L391j4998n553K0396N196
956A9186j0244M186N79p989Q455L831j6912J253J9048k614q072M213j0984j1781
970g845J9088J3873j2892m823n19j1543N466J7536q331j1859Q842m69q700Q201
984F025L24j4034P686J4271r876o784L897r491r03K1096m35j8536J925L666q424
999i593R232J0251j3770o524J1559l515o326R065m107j0611J2915P416j5958k431
1013a2397P284o974K669J4407q785j4001P893K658n123J0182J413j6331L707J3816
1027D18r120m516J0972n015o765J4185J302j3602L950P161n922O517P936j3556
1041f055m392J5224j471o401J0146j113j1940Q571J0107j0552j04P753p435N3
$$ y = [-3477, 2656, 3571, 12610, 1174, -20320, -6625, 16731, 13181, 10754, 14145, -853, -6406, 13990, 19186, 8942, 13128, 13707, 5718, 14173, 18004, 1092, 2345, 21393, 18779, 10707, 14920, 3936, -7845, 11243, 25116, 12224, 7401, 6882, -4661, 805, 18341, 10010, -1849, 6993, 6524, -2176, 6025, 6349, -7685, 1, 14272, 4396, -2388, 1509, -7982, -8885, 12211, 11776, -6760, -4835, -1169, -9593, -361, 9890, -3880, -10404, 1155, -2360, -8686, 379, -3728, -14339, -1424, 5992, -9966, -12397, -5113, -12087, -9418, 4989, -3796, -17797, -9904, -7246, -12369, -2187, -774, -17105, -13398, 418, -8702, -13218, -2246, -7261, -14026, 159, 1461, -12141, -8191, -1030, -6952, -435, 7501, -6055, -10447, 4777, 3306, -3095, 7051, 5938, -6002, 2569, 12676, 2124, 2020, 9773, 2338, 2391]
1055B391J3339q221j0838J1619L864j0541O641N285j4357Q24J3130o184n865P494
1069H581n163o490J1975M57j3660N323P227j1202J986J1401j1041o906J2486j449
1083C525q196P700N19j1315Q039Q039j1578o95J0348p570m359J3523l083j1745
1097f848Q051N002r206N406N664j1330N25J1532p663n829J1906l739j0269R852
1111C054L959j3088K518P995q398o79Q962q413o277J1085k457j0202R112L144
1125C15j4177L500J0667r769l413R688m747n886R405j461q664R278K424j0660
1139a3500O815R469j2113k614J5375l452q757J0470K125q821O685N842p372M707
1153D859O417r225J845J3233q268p953J4625J072j2666P582Q183j1111l43R181
$$ y = [2391, 15730, 7509, -3329, 8290, 12154, 1613, 8254, 13539, -818, 6, 13136, 6952, 1087, 8581, 3418, -3072, 8903, 9360, -4300, 1023, 8250, -2952, -966, 10435, -606, -7512, 4974, 3525, -4671, 3029, 3548, -7767, 272, 8311, -3267, -3962, 6386, -1184, -5543, 7980, 4897, -6848, 1203, 6205, -3001, 2405, 8069, -3261, -2736, 8796, 1133, -4696, 7210, 3471, -6798, 3054, 7013, -6075, -3557, 4438, -3960, -4639, 4323, -4090, -10367, 718, -1739, -11941, -2829, 315, -13862, -10362, 305, -9464, -12877, -3189, -7936, -13822, -4417, -5878, -14542, -5264, -2840, -13500, -6685, 2784, -9329, -11943, 3432, -20, -8777, 1693, 3818, -5003, 1682, 7524, 152, 4859, 11276, 2051, 3896, 17129, 8861, 908, 15533, 16605, 3939, 11521, 19704, 8593, 8250, 17431]
1167A7431n585l038O941o256m361J1012l829j2699R317M471j5106J756J2455j0872
1181A637q909R618j046r016N204q0q256M602J495j0679M629P606j2436k807J4199
1196d239n737j2506J0695N182j0223L348P037p921o74Q097m398Q32R428o968n609
1211a3656J3318J014j2376R744J0838j2032j137J2609n385o922J0579K101m978
1224C717N244j774q047Q373N404j0719L612J0723j2742p480J4908q32j2740P219
1238D866P049j0767j523M374o180J407P662o855k898P460r112q837J5758N098
1252G502j5296K801J0160j0923m959J2176j67m578O210j499n611N929n42p201
1266e998J3344R109j6117l281J3792n877p234J5157N205j2362P5M335n071L208
$$ y = [17431, 11846, 8808, 15749, 9493, 5132, 16144, 12315, -384, 8933, 13404, -1702, 54, 12509, 1637, -7272, 2346, 1300, -7716, -2512, -2592, -10848, -6246, -4751, -15430, -10801, -3195, -15631, -18438, -4239, -9976, -22482, -11787, -6605, -16828, -13480, -6443, -14364, -15038, -6941, -11339, -10507, -1079, -8047, -13656, -338, 676, -11700, -1956, 8882, -3150, -4287, 8322, 2937, -3985, 6594, 8695, 3717, 8961, 7187, -860, 7513, 12917, 2198, 5810, 16533, 3791, -3689, 11219, 10387, -2353, 4866, 11915, 1148, -375, 3999, -2181, -774, 6888, 33, -2865, 4595, -4517, -13354, 2404, 7502, -7794, -4993, 5167, -5756, -10715, 1461, 1294, -3284, 2926, 1427, -4184, 1745, 1203, -5998, 7346, 16455, 338, -2943, 10849, 4972, -2262, 12895, 18100, 5738, 5813, 10148, 5077, 8285]
1280H285N298n951K743O968j2625p437J3407r68j1124J1101O072j8459o343R903
1294H70o41k423N621n738o779K777n180n059J2433J601j5235M356R406j5590p592
1309b7173J5852M473p894M139j647j0225M344O351o15Q006L739j5286j557J5567
1323a926l181p116J5182N852j2828K345O746p631J734J2830Q46j532J638j0412
1337B547m186J6104M485q918O556K102j6923j80J5605m173p791Q877j92r900o58
1352C355k321m103J0457M716j1953j236K026j4807j559K1147R00j6755Q42K115
1366g176r034L048Q330l643N39M588q965l672Q239m595k827J7807M947j7452k825
1381a2691Q259m298N710J5886m046j1243K638L31k66J0256K338p731P892M184
$$ y = [8285, 13583, 7632, 10375, 17343, 4718, -2719, 10688, 9720, -1404, 9697, 15769, -2690, -9033, 870, 229, -2194, 3427, -2311, -9090, -6313, -11493, -16552, -4119, -2518, -17753, -13397, -3991, -19581, -27173, -11321, -6848, -14742, -10603, -12250, -22475, -18131, -11780, -12395, -4389, -650, -15936, -17493, -1926, -5107, -12223, 2959, 8811, -4017, -1672, 5074, -2557, -823, 12007, 12853, 11321, 12959, 2547, -1639, 14465, 18950, 10032, 16588, 18690, 1767, 1587, 17192, 13019, 5228, 14105, 13913, 4013, 3355, 1034, -3069, 7388, 12104, 151, -1085, 941, -13866, -15425, 5722, 6622, -10133, -9291, -7176, -16210, -13162, -4832, -8475, -7936, -3348, -12313, -15985, -7746, -12341, -15168, 2639, 7586, -9866, -12691, -4432, -8730, -3020, 12866, 8820, -2423, 215, 546, 280, 10536, 12874, 5143, 13035, 17219]
1395A7219j4812r75J3335l445l204J4537j702j9885j817Q611K316O445Q07j3452
1409C978l414N251p615m0J5170n048j5361P327N086j6333k634J2856K65n63K254
1424A179j1396r980Q463N006P35R218m734j8280L151J2827m282j164J1899m005
1438a363r446P151Q00q567N812J0728l00J744l220j5065K060J8320J248m970P230
1453A2162o678j6330Q072J4987n360l549M917m342k987K222p335j664J4494J836
1467A0445j1104J581l195j4955P259J9877k816j2026n93n584m249J1386M849p108
1481f233K009K136r172J465N898p775K209J7262k353j4601J494N87m409J3324
1495A841J3455r216r258N58k417O081J2945m076q029Q659J97j1896M694R187o596
$$ y = [17219, 2407, 1432, 14767, 11322, 8118, 22655, 20953, 1068, -749, 7862, 10178, 16623, 17430, 3978, 564, 5815, -1800, -1840, 13330, 8282, -7079, 248, 5334, -10999, -13633, -777, -512, -1075, 1179, -10217, -20197, -11734, -6728, -5993, 3225, -1509, -19789, -16638, -3811, -8093, -9257, 2642, -1363, -10809, -3658, -2858, -11425, -5613, 5115, 4815, 6559, 3339, -11726, -9666, 8654, 9902, 4932, 12162, 5484, -10846, -2774, 12213, 6853, 3304, 8221, 3879, 892, 3114, -4221, -5885, 8609, 10445, -659, 922, -2273, -17228, -9969, 9908, 7092, -4934, -5527, -11111, -15360, -3974, 875, -6233, -4224, -2088, -11260, -9795, -3897, -11672, -9463, 7799, 5446, -9155, -7661, -7074, -11483, 1841, 15296, 6080, -3178, -2620, -5037, 1044, 13989, 9913, 1884, 10543, 10740, -1156, 3538, 12725, 6129]
1510F129K963J1713p127j3742R04K598M171J3312k641j7579k213N417m005M960
1524D860J0707r786j0360P252q21r109M545M336m018N652K558j6062o369R929
1538f686K417L319P908r674j7053N984J0094k346M320L963j0947l005R393l522
1552e835n133Q967K223l256O170k869j5151M085J5411L10j032K559j1863p866
1566a3280J2901P373m378L134j501j0796M388Q657q142k519J0967q02n759K875
$$ y = [6129, 9092, 20805, 13678, -64, 840, 3438, 7609, 20921, 18280, 701, -1512, 3905, -100, 4860, 15567, 5781, -4579, 2673, 1852, -7257, -2712, 1624, -2394, 3258, 5816, -10246, -16615, -6686, -4269, -950, 6958, -2716, -19769, -13785, -3691, -6037, -1717, 2246, -8701, -11706, -2313, -5835, -10968, -2001, 222, -3034, 3136, 267, -14884, -10799, 4612, 4922, 3890, 6449, -5414, -13280, -379, 6994, 2616, 5750, 4249, -6547, -2159, 6498, -1644, -4163, 6804, 6002, 243, 3118]
$$ [...]
8191A50
##END NTUPLES=NMR FID
##END=
