##TITLE=1H_EC-3197x-2
 DMSO, 8 sc, 
 7.06.2021
##JCAMPDX= 6.0         $$ Bruker NMR JCAMP-DX V2.0
##DATA TYPE= NMR SPECTRUM
##DATA CLASS= NTUPLES
##ORIGIN= UXNMR, Bruker Analytische Messtechnik GmbH
##OWNER= root
$$ XWIN-NMR		Version 3.5
$$ Mon Jun  7 11:45:37 2021 Russian Standard Time (UT+4h)  she@DPX200
##.OBSERVE FREQUENCY= 200.131506
##.OBSERVE NUCLEUS= ^1H
##.ACQUISITION MODE= SIMULTANEOUS
##.ACQUISITION SCHEME= undefined
##.AVERAGES= 8
##.DIGITISER RES= 18
##SPECTROMETER/DATA SYSTEM= spect
##.PULSE SEQUENCE= zg30
##.SOLVENT NAME= DMSO
##.SHIFT REFERENCE= (INTERNAL, DMSO, 0, 17.5154)
##AUDIT TRAIL= $$ (NUMBER, WHEN, WHO, WHERE, WHAT)
$$ ##TITLE= Audit trail, XWIN-NMR		Version 3.5
$$ ##JCAMPDX= 5.01
$$ ##ORIGIN= Bruker BioSpin GmbH
$$ ##OWNER= she
$$ F:/spectra/data/she/nmr/H-F/1/pdata/1/auditp.txt
$$ ##AUDIT TRAIL=  $$ (NUMBER, WHEN, WHO, WHERE, WHAT)
(   1,<2021-06-07 11:44:25.03 +0400>,<she>,<DPX200>,
      <created by zg, POWCHK disabled, PULCHK disabled
       configuration hash MD5:
       00 E9 B6 7A A2 85 ED C7 34 08 36 98 17 FE 4E 26
       data hash MD5: 16K
       A6 FA 2B 0E 41 AE A8 6F DF CA EE 80 3D 1D 5A AF>)
(   2,<2021-06-07 11:44:27.82 +0400>,<she>,<DPX200>,
      <Start of raw data processing
       efp BC_mod = 2 LB = 0.24 FT_mod = 6 PKNL = 1 PHC0 = -11489.3 PHC1 = 16.80101 SI = 16K 
       data hash MD5: 16K
       F3 45 E2 A5 68 6D 65 5B 58 AC 99 8B B8 14 DF 6C>)
(   3,<2021-06-07 11:44:49.76 +0400>,<she>,<DPX200>,
      <pk PHC0 = 4.896476 PHC1 = -7.399999 
       data hash MD5: 16K
       3A 10 06 CE 0C F4 7A 95 EC 03 0E FE F4 99 61 16>)
(   4,<2021-06-07 11:44:53.40 +0400>,<she>,<DPX200>,
      <abs ABSG = 5 
       data hash MD5: 16K
       04 8C F6 51 13 DE 65 58 49 D6 11 3D FD E3 B1 8B>)
$$ ##END=
$$ 
$$ hash MD5
$$ 95 76 F2 1C C5 AB 25 C2 30 37 FE 35 C1 72 4A 14
##$RELAX= 
##$RELAX= 
##$RELAX= 
##$RELAX= 
##$RELAX= 
##$RELAX= 
$$ Bruker specific parameters
$$ --------------------------
##$DU= <F:/spectra>
##$EXPNO= 1
##$NAME= <H-F>
##$PROCNO= 1
##$TYPE= <nmr>
##$USER= <she>
##$AMP= (0..31)
100 100 100 100 100 100 100 100 100 100 100 100 100 100 100 100 100 100 
100 100 100 100 100 100 100 100 100 100 100 100 100 100 
##$AQSEQ= 0
##$AQ_mod= 1
##$AUNM= <au_zg>
##$AUTOPOS= <>
##$BF1= 200.13
##$BF2= 200.13
##$BF3= 200.13
##$BF4= 200.13
##$BF5= 200.13
##$BF6= 200.13
##$BF7= 200.13
##$BF8= 200.13
##$BYTORDA= 1
##$CFDGTYP= 0
##$CFRGTYP= 5
##$CHEMSTR= <none>
##$CNST= (0..31)
1 1 145 1 1 1 1 1 1 1 1 1 1 1 1 1 1 1 1 1 1 1 1 1 1 1 1 1 1 1 1 1 
##$CPDPRG= <>
##$CPDPRG1= <>
##$CPDPRG2= <>
##$CPDPRG3= <>
##$CPDPRG4= <mlev>
##$CPDPRG5= <mlev>
##$CPDPRG6= <mlev>
##$CPDPRG7= <mlev>
##$CPDPRG8= <mlev>
##$CPDPRGB= <>
##$CPDPRGT= <>
##$D= (0..31)
0 1.2 0 0 0 0 0 0 0 0.06 0 0.03 0 0 0 0 0.0002 0 0 0 0 0 0 0 0 0 0 0 0 
0 0 0 
##$DATE= 1623051864
##$DBL= (0..7)
120 120 120 120 120 120 120 120 
##$DBP= (0..7)
150 150 150 150 150 150 150 150 
##$DBP07= 0
##$DBPNAM0= <>
##$DBPNAM1= <>
##$DBPNAM2= <>
##$DBPNAM3= <>
##$DBPNAM4= <>
$$ [...]
##$SUBNAM3= <"">
##$SUBNAM4= <"">
##$SUBNAM5= <"">
##$SUBNAM6= <"">
##$SUBNAM7= <"">
##$SUBNAM8= <"">
##$SUBNAM9= <"">
##$SW= 20.0188882624521
##$SWIBOX= (0..15)
0 0 2 0 0 0 0 0 0 0 0 0 0 0 0 0 
##$SW_h= 4006.41025641026
##$TD= 16384
##$TD0= 1
##$TE= 0
##$TE2= 300
##$TE3= 300
##$TEG= 300
##$TL= (0..7)
0 120 120 120 120 120 120 120 
##$TP= (0..7)
150 150 150 150 150 150 150 150 
##$TP07= 0
##$TPNAME0= <>
##$TPNAME1= <>
##$TPNAME2= <>
##$TPNAME3= <>
##$TPNAME4= <>
##$TPNAME5= <>
##$TPNAME6= <>
##$TPNAME7= <>
##$TPOAL= (0..7)
0.5 0.5 0.5 0.5 0.5 0.5 0.5 0.5 
##$TPOFFS= (0..7)
0 0 0 0 0 0 0 0 
##$TUNHIN= 0
##$TUNHOUT= 0
##$TUNXOUT= 0
##$USERA1= <user>
##$USERA2= <user>
##$USERA3= <user>
##$USERA4= <user>
##$USERA5= <user>
##$V9= 5
##$VALIST= <valist>
##$VCLIST= <CCCCCCCCCCCCCCC>
##$VD= 0
##$VDLIST= <DDDDDDDDDDDDDDD>
##$VPLIST= <PPPPPPPPPPPPPPP>
##$VTLIST= <TTTTTTTTTTTTTTT>
##$WBST= 1024
##$WBSW= 4
##$XGAIN= (0..3)
0 0 0 0 
##$XL= 0
##$YL= 0
##$YMAX_a= 267369
##$YMIN_a= -175612
##$ZGOPTNS= <>
##$ZL1= 120
##$ZL2= 120
##$ZL3= 120
##$ZL4= 120
##$ABSF1= 17.5191
##$ABSF2= -2.499939
##$ABSG= 5
##$ABSL= 3
##$ALPHA= 0
##$AQORDER= 0
##$ASSFAC= 0
##$ASSFACI= 0
##$ASSFACX= 0
##$ASSWID= 0
##$AUNMP= <proc_1d>
##$AZFE= 0.1
##$AZFW= 0.1
##$BCFW= 0
##$BC_mod= 2
##$BYTORDP= 0
##$COROFFS= 0
##$CY= -3
##$DATMOD= 1
##$DC= 0
##$DFILT= <>
##$DTYPP= 0
##$F1P= 0
##$F2P= 0
##$FCOR= 1
##$FTSIZE= 16384
##$FT_mod= 6
##$GAMMA= 0
##$GB= 0
##$INTBC= 1
##$INTSCL= 1.334414e-10
##$ISEN= 128
##$LB= 0.24
##$LEV0= 0
##$LPBIN= 0
##$MAXI= 10000
##$MC2= 0
##$MEAN= 0
##$ME_mod= 0
##$MI= 1.114404
##$NCOEF= 0
##$NC_proc= -7
##$NLEV= 6
##$NOISF1= 3.799351
##$NOISF2= 2.8
##$NSP= 0
##$NTH_PI= 0
##$NZP= 0
##$OFFSET= 17.51544
##$PC= 1
##$PHC0= -11484.4
##$PHC1= 9.401011
##$PH_mod= 1
##$PKNL= yes
##$PPARMOD= 0
##$PSCAL= 0
##$PSIGN= 0
##$REVERSE= no
##$SF= 200.130003840367
##$SI= 16384
##$SIGF1= 3
##$SIGF2= 2
##$SINO= 5.538805
##$SIOLD= 16384
##$SREGLST= <1H.CDCl3>
##$SSB= 0
##$STSI= 16384
##$STSR= 0
##$SW_p= 4006.41025641026
##$SYMM= 0
##$S_DEV= 0
##$TDeff= 16384
##$TDoff= 0
##$TI= <>
##$TILT= no
##$TM1= 0
##$TM2= 0
##$TOPLEV= 0
##$USERP1= <user>
##$USERP2= <user>
##$USERP3= <user>
##$USERP4= <user>
##$USERP5= <user>
##$WDW= 1
##$XDIM= 16384
##$YMAX_p= 297554271
##$YMIN_p= -549370
$$ End of Bruker specific parameters
$$ ---------------------------------
##NTUPLES= NMR SPECTRUM
##VAR_NAME=  FREQUENCY,     SPECTRUM/REAL,   SPECTRUM/IMAG
##SYMBOL=    X,             R,               I
##VAR_TYPE=  INDEPENDENT,   DEPENDENT,       DEPENDENT
##VAR_FORM=  AFFN,          ASDF,            ASDF
##VAR_DIM=   16384,         16384,           16384
##UNITS=     HZ,            ARBITRARY UNITS, ARBITRARY UNITS
##FACTOR=    0.24454680195387, 1,            1
##FIRST=     3505.36507190058, 0,            0
##LAST=      -501.045184509685, 0,           0
##MIN=       -501.045184509685, -549370,     0
##MAX=       3505.36507190058, 297554271,    0
$$ Real data points
##PAGE= N=1
##DATA TABLE= (X++(R..R)), XYDATA
$$ [...]
7825G610689o28201j55201m03008j85174p5666j93681o4203m81286k07419n2906
$$ 7610689 6982488 6827287 6424279 6239105 6163439 5969758 5905555 5424269 5216850 5163944
7815E163944k34389n1505j10043j14538r7128k69193p8242j8331o2355m6965j12947
$$ 5163944 4929555 4878050 4768007 4653469 4556341 4287148 4208906 4190575 4128220 4081255 3968308
7804C968308n2558J62186k60110k03909j31286K2400Q918k886m5942k72763J43212
$$ 3968308 3915750 4077936 3817826 3613917 3482631 3505031 3513949 3511063 3465121 3192358 3335570
7793C335570M0915K48755J0443k29757j13048Q0212j64109j11522m2300j29353
$$ 3335570 3376485 3625240 3635683 3405926 3292878 3373090 3208981 3097459 3055159 2925806
7783B925806K94828l7308k97639L4122K10737o72j35134J98048j80123P3052J95297
$$ 2925806 3220634 3183326 2885687 2919809 3130546 3129874 2994740 3192788 3012665 3085717 3281014
7772C281014j97484r991k1233o0745q4759P9909J55663K4711j50950K97559J43450
$$ 3281014 3083530 3073539 3052306 2991561 2906802 2986711 3142374 3167085 3016135 3313694 3457144
7761C457144k34891M8719o9606O3668J10481Q4561J57515j05371K5549K45366
$$ 3457144 3222253 3270972 3201366 3265034 3375515 3460076 3617591 3512220 3537769 3783135
7751C783135L19693J17230N6810j80033J30964L33769j2438J88605K15333L43597
$$ 3783135 4102828 4220058 4276868 4096835 4227799 4561568 4549130 4737735 4953068 5296665
7741E296665K84854K10540L09517K24975M15746N35311L11991N57400P58298N66391
$$ 5296665 5581519 5792059 6101576 6326551 6742297 7277608 7589599 8146999 8905297 9471688
7731I471688O58745P47795J145386J116633J344742J399309J156163J153506O40891
$$ 9471688 10130433 10878228 12023614 13140247 14484989 15884298 17040461 18193967 18834858
7722A8834858J84767n44095o91692k13270m01901j48103L83139L34873L24375
$$ 18834858 19019625 18475530 17783838 17570568 17168667 17020564 17403703 17738576 18062951
7713A8062951K07144k16689p68970j167736r52196j020383q56781n04668m15349
$$ 18062951 18270095 18053406 17284436 16116700 15164504 14144121 13287340 12782672 12367323
7704A2367323r3876l2489m4794o5555L32676N21635N31309N78402J057455Q78183
$$ 12367323 12273447 12240958 12196164 12130609 12463285 12984920 13516229 14094631 15152086 16030269
7694A6030269J110443J286359J502282J705400J870854K102481K185296J845598
$$ 16030269 17140712 18427071 19929353 21634753 23505607 25608088 27793384 29638982
7686B9638982J247629Q25717o9015m27997r64296o98726m76640k14331O2970j58483
$$ 29638982 30886611 31712328 31643313 31215316 30251020 29552294 29075654 28861323 28924293 28765810
7676B8765810j47905n13675j117322j519103j890628k251122k297233j670904
$$ 28765810 28617905 28104230 26986908 25467805 23577177 21326055 19028822 17357918
7668A7357918j336712j204263r38125m37219q58371l74713j11302m60719k20209
$$ 17357918 16021206 14816943 13878818 13441599 12583228 12208515 12097213 11636494 11416285
7659A1416285K07897J12413M14104K43996L31551N90251M34651R63586O87938
$$ 11416285 11624182 11736595 12150699 12394695 12726246 13316497 13751148 14714734 15402672
7650A5402672Q36929Q84839P06410P8709o10542r35429q55659m65624j31455Q05
$$ 15402672 16239601 17124440 17830850 17909559 17299017 16363588 15507929 15042305 14910850 14911655
7640A4911655K57651o6774l29856n25362q16925j054899j285355j116464r12057
$$ 14911655 15169306 15102532 14772676 14247314 13430389 12375490 11090135 9973671 9061614
7631I061614r92552p11552n24917p37981k97827l25617l30775k37774l99458j49082
$$ 9061614 8069062 7357510 6832593 6094612 5796785 5471168 5140393 4902619 4503161 4354079
7621D354079j20755k08661k65261j06775r8565j66530l9609j8966k70855j58983
$$ 4354079 4233324 4024663 3759402 3652627 3554062 3387532 3347923 3328957 3058102 2899119
7611B899119j05658j71035O2413J42082j21970j55151j2996j28922k1924j8864
$$ 2899119 2793461 2622426 2684839 2826921 2704951 2549800 2536804 2407882 2385958 2367094
7601B367094k19589j05829r0581J2797j94217J34578k2334p8149j29418k62308
$$ 2367094 2147505 2041676 1951095 1963892 1769675 1904253 1881919 1803770 1674352 1412044
7591A412044K6733K61429k45608K43405J36639r7896j13559K5617K04663k43481
$$ 1412044 1438777 1700206 1454598 1698003 1834642 1736746 1623187 1648804 1853467 1609986
7581A609986j85434l17147M0155P3530j45693J18537l2940j9151Q1127o2608L3
$$ 1609986 1424552 1107405 1147560 1221090 1075397 1193934 1160994 1141843 1222970 1160362 1160395
7570A160395j91971K3665l4360R3894k04880N2536Q1803L1921K2229j2110q3617
$$ 1160395 968424 992089 957729 1051623 846743 899279 981082 1013003 1035232 1023122 939505
7559I39505k02080J34338J91919j80089m974j29068O7738k2104o9050R9590L2224
$$ 939505 737425 871763 1063682 883593 878619 749551 817289 795185 726135 825725 857949
7548H57949j52072p0098o7954k7666O0918l4736N3017J63271l42946j04985K68655
$$ 857949 705877 635779 567825 540159 601077 566341 619358 782629 439683 334698 603353
7537F03353r6299j82996j87943M3834O2753l2144O8820J05057J09966J03909j96960
$$ 603353 507054 324058 136115 179949 242702 210558 279378 384435 494401 598310 401350
7526D01350O2587J16785q5227j6156Q2816r3173J06163j6562k8665n0589L3189
$$ 401350 463937 580722 495495 479339 562155 468982 575145 558583 529918 479329 512518
7515E12518r1142R3051R9054j40748k7333j94984J97905q5072p7345j81048J11499
$$ 512518 421376 514427 613481 472733 445400 250416 448321 363249 285904 104856 216355
7504B16355m3851m4165k7096k15220J03590J29710R9082j01811j06897P347K5422
$$ 216355 172504 128339 101243 -113977 -10387 119323 218405 116594 9697 17044 42466
7493D2466P28K17157p6385Q612J60140j16094R3613j46851n6698J13379P3546
$$ 42466 43194 260351 183966 192578 352718 236624 330237 183386 126688 240067 313613
7482C13613q7913j84581k6822o4851j51941J20021Q7217q7794J79070O6533k20526
$$ 313613 225700 41119 14297 -50554 -202495 -82474 4743 -83051 96019 162552 -57974
7471e7974l2783R9547K78588o4456K1498o0865l00562K99546k9320L3243j65157
$$ -57974 -90757 8790 287378 222922 244420 183555 -117007 182539 153219 186462 21305
7460B1305R4033k8731j15972k3768J97657j29830J21394j9208n5847j26441Q0122
$$ 21305 115338 86607 -29365 -53133 144524 14694 136088 116880 61033 -65408 14714
7449A4714J00607O0272k02755l7451q3266Q6454K29655k47931N0279j26042M9945
$$ 14714 115321 175593 -27162 -64613 -147879 -61425 168230 -79701 -29422 -155464 -105519
7438a05519J50111m0630k1894k07707j4635J85303O4970K37423P9340j36798r8956
$$ -105519 44592 3962 -17932 -225639 -240274 -54971 9999 247422 326762 189964 91008
7427I1008L3110n3118P8837m3804K3200k28819J47477j7705l68426J26655K14147
$$ 91008 124118 71000 149837 106033 129233 -99586 47891 30186 -338240 -211585 2562
7416B562j04035K29649M0556l1192o532k243j10635j54015j2471J30866n9925
$$ 2562 -101473 128176 168732 137540 131008 128765 18130 -135885 -148356 -17490 -77415
7405g7415K34496J23325k64092j03528K00018J98645l12805R3820K10720k24077
$$ -77415 157081 280406 16314 -87214 112804 311449 -1356 92464 303184 79107
7395G9107k02342j13499K12252J93392j72388J03109q4034j12192J14197J80143
$$ 79107 -123235 -236734 -24482 168910 -3478 99631 15597 -96595 17602 197745
7385A97745j41370J28267k09255R6824O9627k16557J58297k3558P8395q4226j19158
$$ 197745 56375 184642 -24613 72211 141838 -74719 83578 60020 138415 54189 -64969
7374f4969K9791l7545J47775k49680m851K21512k03755L87960k3370j42710j19166
$$ -64969 -35178 -72723 75052 -174628 -179479 42033 -161722 226238 202868 60158 -59008
7363e9008j4513Q1785K67397l46435P1942K26481k66690K20266j05295J74873
$$ -59008 -73521 8264 275661 -70774 1168 227649 -39041 181225 75930 250803
7353B50803P1562k32404N1211k7519j25126O7411j52694k0431k71139N4223K76120
$$ 250803 322365 89961 141172 113653 -11473 55938 -96756 -117187 -388326 -334103 -57983
7342e7983M7459O8974l7130q8107q2866K49479k70431N5459J41890J09302j16402
$$ -57983 -10524 58450 21320 -66787 -149653 99826 -170605 -115146 26744 136046 19644
7331A9644K8774j1062p2454R6641l26670J4907J1361J30960l112L4925J32243
$$ 19644 48418 37356 -35098 61543 -265127 -250220 -238859 -107899 -111011 -76086 56157
7320E6157J51131j81505P3329j88263p6038O2050k46450K33529K06524q1164J023
$$ 56157 207288 25783 99112 -89151 -165189 -103139 -349589 -116060 90464 9300 10323
7309A0323K7897J24940P4778j92616M1211j37875J74926j37785r0058K36430j19247
$$ 10323 38220 163160 237938 45322 86533 -51342 123584 -14201 -104259 132171 12924
7298A2924p6124q0170p8516J90733N2565j27190R1497k5937j73024Q5193o9268
$$ 12924 -63200 -143370 -221886 -31153 21412 -105778 -14281 -40218 -213242 -128049 -197317
7287a97317K00344J9318Q0492p4160j39789J74336j20849J28953K10959l09018
$$ -197317 3027 22345 102837 28677 -111112 63224 -57625 71328 282287 -26731
7277b6731j51801J9348O3263K70669q2699q9350k65984K06092j24104k57440J22593
$$ -26731 -178532 -159184 -95921 174748 92049 2699 -263285 -57193 -181297 -438737 -316144
7266c16144M18672k08177P5987r4652J6185N7054k50689J59731k25658K5723J52913
$$ -316144 102528 -105649 -29662 -124314 -108129 -51075 -301764 -142033 -367691 -341968 -189055
7255a89055O6599J07379q7831j48726K66176k18724J35662q5506l0872m8191J31018
$$ -189055 -122456 -15077 -102908 -251634 14542 -204182 -68520 -154026 -184898 -233089 -102071
7244a02071J94239k23510q2400J12941p8883K9616K9837j72535J95013r9722O7612
$$ -102071 92168 -131342 -213742 -100801 -179684 -150068 -120231 -292766 -97753 -197475 -129863
7233a29863O6636j73168J05109R6726j9610l2061j90247K71890J05076j87697
$$ -129863 -63227 -236395 -131286 -34560 -54170 -86231 -276478 -4588 100488 -87209
7223h7209K23346Q9397k67330k8453o23K14765o1048k56894j8366m2933L5063
$$ -87209 136137 225534 -41796 -70249 -70872 143893 82845 -174049 -192415 -235348 -200285
7212b00285k91283K12021M04816j99065p5760q988O5824r3196J52844P9947j58713
$$ -200285 -491568 -279547 125269 -73796 -149556 -158544 -92720 -185916 -33072 46875 -111838
7201a11838N0618p5227J94587p1323J10787q7088J85231k42778p1917K04619k30899
$$ -111838 -61220 -136447 58140 -13183 97604 10516 195747 -47031 -118948 85671 -145228
7190a45228J99413P8447L114n5553M7086M258j39280k48597K09967j04279J38681
$$ -145228 54185 132632 135746 80193 127279 131537 -7743 -256340 -46373 -150652 -11971
7179a1971J72616q3025k63068N2738N2236K35414l07894K85549P1262n1546L07849
$$ -11971 160645 77620 -185448 -132710 -80474 154940 -152954 132595 203857 152311 460160
7168D60160k98530P0493p535l1564k14940j79481J80492J06016m829O0523l54009
$$ 460160 161630 232123 224588 193024 -21916 -201397 -20905 85111 80282 140805 -213204
7157b13204Q0426J44986j16531j61102J42558K2577P8434k9439r5362J37201p0166
$$ -213204 -132778 12208 -104323 -265425 -122867 -100290 -21856 -51295 -146657 -9456 -79622
7146g9622J1824K24600K57367k12979k19793J72863O0549L5996r5445l87685L83464
$$ -79622 -67798 156802 414169 201190 -18603 154260 214809 250805 155360 -232325 151139
7135A51139j2565L1786J56982k51083R8836k14282q2724K65560k53290k941J53788
$$ 151139 138574 170360 327342 76259 175095 -39187 -121911 143649 -109641 -112582 41206
7124D1206k60393L46616n1504N8475K7064j96240J59471M4399p8488J39526k11411
$$ 41206 -219187 127429 75925 134400 161464 -34776 124695 169094 90606 230132 18721
7113A8721K78094j95526j50171L6885k9402Q3090r2363J7167K95695k53565o5696
$$ 18721 296815 101289 -48882 -11997 -41399 41691 -50672 -33505 262190 8625 -57071
7102e7071j812p3552K35097q361r611j15249r2317Q5584J1190l4763L7014k33258
$$ -57071 -58883 -132435 102662 94301 84690 -30559 -122876 -37292 -26102 -60865 -23851 -257109
7090b57109J82889J43462m2705Q251r1519J39588r528m409R7726j33957m0506
$$ -257109 -74220 69242 26537 34788 -56731 82857 73329 68920 166646 32689 -7817
7079g817J22658J39175j19882j27905P3150n6731L2047L14312k34583m1704J00867
$$ -7817 114841 254016 134134 6229 79379 22648 54695 369007 134424 92720 193587
7068A93587l4195L5834j89602k3336J8116j95880J25082J40012p0365K11714Q2688
$$ 193587 159392 195226 5624 -17712 404 -195476 -70394 69618 -747 210967 293655
7057B93655Q3705j50115j95435L20877Q6997O0311n9169k39162M1057p2658p3083
$$ 293655 377360 227245 31810 352687 439684 499995 440826 201664 242721 170063 96980
7046I6980J25335n0320L68407j48187m98604J30578j9032j09933M38487j19942
$$ 96980 222315 171995 540402 392215 -106389 24189 5157 -104776 333711 213769
7036B13769N9872o6783N3747p3287k76409L47018j36267Q579J35471j53118m1100
$$ 213769 273641 206858 260605 187318 -89091 257927 121660 130239 265710 112592 71492
7025G1492L5260J49306r766j78369r0730J17311L22665n2286k31442R4648O1258
$$ 71492 106752 256058 246292 67923 -22807 94504 417169 364883 133441 228089 289347
7014B89347n6444J5541J24005j38197j04906k69771L07467j05283J87754M6452
$$ 289347 232903 248444 372449 234252 129346 -140425 167042 61759 249513 295965
7004B95965k07757K74304j20258J46239J06054k70277P9920m3967j62030N3603
$$ 295965 88208 362512 242254 388493 494547 224270 304190 260223 98193 151796
6994A51796R7009J87077q6971M2972J48975K19313k60068j02634j28158K54232
$$ 151796 248805 435882 348911 391883 540858 760171 500103 397469 269311 523543
6984E23543p4446o7289k26100m0221Q8015K98806j81777J00699n6818l088J53838
$$ 523543 449097 381808 155708 115487 203502 502308 320531 421230 364412 361324 515162
6973E15162k03153J90967l29982J49838K42965j12725n8711J00092L4571K3644
$$ 515162 312009 502976 172994 322832 565797 453072 394361 494453 529024 552668
6963E52668L8131M2223r5384j02652P3307j06878J10528J99016j58206K42507
$$ 552668 590799 633022 537638 434986 508293 401415 511943 710959 552753 795260
6953G95260j56076l44818J91204r9553n0930L49407K26924J45105k00425q2412
$$ 795260 639184 294366 485570 386017 335087 684494 911418 1056523 856098 773686
6943G73686j00933M920N5949l3895J02657l03539K04237L1247r1012q3883N857
$$ 773686 672753 677673 733622 699727 802384 498845 703082 734329 643317 559434 565291
6932E65291J62411K1935l7825R8357J62251n7145m3230n1849J51044K41885j45161
$$ 565291 727702 749637 711812 810169 972420 915275 872045 820196 971240 1213125 1067964
6921A067964r2280J33946j32174K46437M5202L9463P9746j38468j33674q3537
$$ 1067964 975684 1109630 977456 1223893 1269095 1308558 1388304 1249836 1116162 1032625
6911A032625O8069l4404l3994Q8947k9745K70580n9031j29250J55234J55663k41042
$$ 1032625 1100694 1066290 1032296 1121243 1091498 1362078 1303047 1173797 1329031 1484694 1243652
6900A243652J42170J26308j8251Q4329P431J4740j35693N2698o6127K74368J45756
$$ 1243652 1385822 1512130 1493879 1578208 1585639 1600379 1464686 1517384 1451257 1725625 1871381
6889A871381k1056J46132m370j36896K09789L8045k0814J66121J45583q3026J18675
$$ 1871381 1850325 1996457 1992087 1855191 2064980 2103025 2082211 2248332 2393915 2310889 2429564
6878B429564j02585j75J59182r0083k15110K42002K69716M8554J42107p2213j55911
$$ 2429564 2326979 2326804 2485986 2395903 2180793 2422795 2692511 2741065 2883172 2810959 2655048
6867B655048O8721N0031J22742o1903N5753M05346J29822l8785K46178M9337K73838
$$ 2655048 2723769 2773800 2896542 2834639 2890392 3295738 3425560 3386775 3632953 3682290 3956128
6856C956128J60385k57115L00070K39244J69030j0720R8532J41317J76247J58006
$$ 3956128 4116513 3859398 4159468 4398712 4567742 4557022 4655554 4796871 4973118 5131124
6846E131124K02215K58561M91249O0085J08710M52338J61406L63582J70541K87735
$$ 5131124 5333339 5591900 6083149 6143234 6251944 6704282 6865688 7229270 7399811 7687546
6836G687546N96706O76343O24715L58020N67280O01532M65988P23375J013278
$$ 7687546 8284252 8960595 9585310 9943330 10510610 11112142 11578130 12301505 13314783
6827A3314783Q14429J145848J053136J149112J276149J543987J717297J334256
$$ 13314783 14129212 15275060 16328196 17477308 18753457 20297444 22014741 23348997
6819B3348997J592484J932161J762772J681321J302818J229030R94294N76633
$$ 23348997 24941481 26873642 28636414 30317735 31620553 32849583 33843877 34420510
6811C4420510P88459L56577K92815J68484k09560j140m334J16137J64658Q2537
$$ 34420510 35208969 35565546 35858361 36026845 35817285 35816145 35811811 35927948 36092606 36175143
6801C6175143j20166J47617j65278L5561J68638l12883n16912q83940r85661j123162
$$ 36175143 36054977 36202594 36037316 36072877 36241515 35928632 35411720 34527780 33542119 32418957
6791C2418957j691860k059395j896888k058196j808292j674106j486621j523937
$$ 32418957 30727097 28667702 26770814 24712618 22904326 21230220 19743599 18219662
6783A8219662j310138j202065q95578j021346q31880q08105r65561n33215n66678
$$ 18219662 16909524 15707459 14811881 13790535 12958655 12150550 11184989 10651774 10085096
6774A0085096k08827n65186o38185k68089o26089o8318l77265n00421l67111j72423
$$ 10085096 9876269 9311083 8672898 8404809 7778720 7710402 7333137 6832716 6465605 6293182
6764F293182j79295j28530k88790j41608k45594l35595j4953k51281r8792j25164
$$ 6293182 6113887 5985357 5696567 5554959 5309365 4973770 4958817 4707536 4608744 4483580
6754D483580j3985m122k85738Q8204j96424k71355k4949k06510k45411p1184J08289
$$ 4483580 4469595 4465473 4179735 4267939 4071515 3800160 3775211 3568701 3323290 3252106 3360395
6743C360395k96479j36579j4688J10509k30722n7904n1314O0504M2603p1013k28474
$$ 3360395 3063916 2927337 2912649 3023158 2792436 2734532 2683218 2743722 2786325 2715312 2486838
6732B486838k16018k5577K8197o4095l04745M292L27556j07513k01560l9488J77609
$$ 2486838 2270820 2245243 2273440 2209345 1904600 1908892 2236448 2128935 1927375 1887887 2065496
6721B065496k33285j15930O0931r2919J20207k11151k48945K1087J07763q9041
$$ 2065496 1832211 1716281 1777212 1684293 1804500 1593349 1344404 1365491 1473254 1384213
6711A384213j3579J96318L8262N7092o8502k38225k3941M2353l023r0201q6892
$$ 1384213 1370634 1566952 1605214 1662306 1593804 1355579 1331638 1373991 1370968 1280767 1193875
6700A193875j28792Q6961j07762O4529m25j82303M7920O9161R2581m9899J57914
$$ 1193875 1065083 1152044 1044282 1108811 1108386 926083 974003 1043164 1135745 1085846 1243760
6689A243760q9085k4290q3943r4097j87681j0283O4350j21938J00075r4280N1723
$$ 1243760 1154675 1130385 1046442 952345 764664 754381 818731 696793 796868 702588 754311
6678G54311o2449R1163P6032p9506M5689j70846r4371K22207O2181k30137k6427
$$ 754311 691862 783025 859057 779551 825240 654394 560023 782230 844411 614274 587847
6667E87847k3418k69198K10900n1930j1727p5479J34311j10152J78708j35521
$$ 587847 564429 295231 506131 454201 442474 366995 501306 391154 569862 434341
6657D34341j16018n233r3995K15502R9388j91497j31406R4629j779J36312q702
$$ 434341 318323 313090 219095 434597 533985 342488 211082 305711 303932 440244 431542
6646D31542p6964N9532J33531j21943O0738j57143J13238l8301q5972J7852k12803
$$ 431542 354578 414110 547641 425698 486436 329293 442531 404230 318258 336110 123307
6635A23307J1771J75132p193o7110J09230P9322k79902Q6278R0296J69062K3398
$$ 123307 135078 310210 303017 235907 345137 424459 144557 230835 321131 490193 513591
6624E13591j4525j85085j40088N557l0192J29191J79394n0929j84187k9933L1401
$$ 513591 499066 313981 173893 179450 149258 278449 457843 406914 222727 192794 224195
6613B24195k67387J44261J94259M2213j10211n7895K64283l60136j44621J99094
$$ 224195 -43192 101069 295328 337541 227330 169435 433718 73582 -71039 128055
6603A28055j63649L92443r7517j39504K43035j96379r4461j75030J84335K14074
$$ 128055 -35594 356849 259332 119828 362863 166484 72023 -103007 81328 295402
6593B95402r53k23063N4553k9518m8026j56383M0347Q7312j26131j1536j3055
$$ 295402 294449 71386 125939 96421 48395 -107988 -67641 19671 -106460 -117996 -131051
6582a31051O8753J38250L0977R0891K8227n9162N4670j27454j74913N8237J65368
$$ -131051 -62298 75952 106929 197820 226047 166885 221555 94101 -80812 -22575 142793
6571A42793K3378j62371R0138R7040O7919J2315o8088o8310J93899j50326m6075
$$ 142793 166171 3800 93938 190978 258897 271212 203124 134814 328713 178387 132312
6560A32312L3848k45264k6986R323R913M9439m8980O1709J09308o020r091Q4082
$$ 132312 166160 -79104 -106090 -96767 -86854 -37415 -86395 -24686 84622 78602 69511 153593
6548A53593J95278k39035l04517R8395j04216Q3165L66119l1484j33461L4301
$$ 153593 348871 109836 -194681 -96286 -200502 -117337 248782 217298 83837 118138
6538A18138J22950M5326J7277R4347j61778k76158K97164K631k03167o7341K53059
$$ 118138 241088 286414 303691 398038 236260 -39898 257266 259897 56730 -10611 242448
6527B42448J85215j23429j41348m04186J34645l5072M3622K49575Q3418j59577
$$ 242448 427663 304234 162886 -241300 -106655 -141727 -98105 151470 234888 75311
6517G5311J03996j23969o9606Q8525q0970k1601j40125J19846P3802j03167l1796
$$ 75311 179307 55338 -14268 74257 -6713 -28314 -168439 -48593 25209 -77958 -109754
6506a09754K2664M7159J15580j18243J81431k8767p8756N3804j93010j41343N0459
$$ -109754 -87090 -39931 75649 -42594 138837 110070 31314 85118 -107892 -249235 -198776
6495a98776j28891L98620K0633M2986j65862j77693J22328j64985K11273K3j61217
$$ -198776 -327667 70953 91586 134572 -31290 -208983 -86655 -251640 -40367 -40344 -201561
6484b01561N1051j4616O73J80219K224o6328n1176k45471J81716K11455j19328
$$ -201561 -150510 -165126 -164453 15766 17990 -48338 -99514 -344985 -163269 48186 -71142
6473g1142j19588J97626N7740j30625R3789J622j32781k4079j1821J46901J59023
$$ -71142 -190730 6896 64636 -65989 27800 29422 -103359 -127438 -139259 7642 166665
6462A66665o3592N3526L195j48312n1887j26106J12205J60981k74076O6629r29
$$ 166665 103073 156599 159794 11482 -40405 -166511 -54306 106675 -167401 -100772 -101701
6451a01701p7992K35739n8180q501p2370m1041J55454R0816J35440k56580j8511
$$ -101701 -179693 56046 -2134 -10635 -83005 -124046 31408 122224 257664 1084 -17427
6440a7427J03410l56825J53979o524m2104r1162j52322J38592R9216O8228P2750
$$ -17427 85983 -270842 -116863 -123387 -165491 -256653 -408975 -270383 -171167 -102939 -30189
6429c0189j29018m6689R7637n4800Q2166O7205J04423j01417n5415k6661o6490
$$ -30189 -159207 -205896 -108259 -163059 -80893 -13688 90735 -10682 -66097 -92758 -159248
6418a59248l9409K01413j61005J93655j2306k32573o0402j02899J40519J40170
$$ -159248 -198657 2756 -158249 35406 23100 -209473 -269875 -372774 -232255 -92085
6408i2085J13272J55395k12666r1992R4954J26549P8494j13444p1538R0073j89498
$$ -92085 21187 176582 -36084 -128076 -33122 93427 171921 58477 -13061 77012 -112486
6397a12486J25413L9887J95653J6918k72901K12738o4547k80000J38734j57169
$$ -112486 12927 52814 248467 265385 -7516 205222 140675 -139325 -591 -157760
6387a57760J42984J10802L9562L6901n7412p3407r9O3265l09969O0021l256O4537
$$ -157760 -14776 96026 135588 172489 115077 41670 41571 104836 -205133 -145112 -148368 -83831
6375h3831q9747J86919j12926p9859J73278m1988j97433L9433Q2959J81374l02674
$$ -83831 -173578 13341 -99585 -179444 -6166 -48154 -245587 -206154 -123195 58179 -244495
6364b44495N2728J13848r5086P5086Q5993k08013K07417J07637m1860j32035k28743
$$ -244495 -191767 -77919 -173005 -97919 -11926 -219939 -12522 95115 53255 -78780 -307523
6353c07523J87747P7547J23882j35403l0747j3443Q6080P9187l8598j58266J61415
$$ -307523 -119776 -42229 81653 -53750 -84497 -97940 -11860 67327 28729 -129537 31878
6342C1878j0779l2734Q6732j99093J22121J09331K0143n2504j98840J56914r1045
$$ 31878 21099 -11635 75097 -123996 -1875 107456 127599 75095 -123745 33169 -57876
6331e7876j1764J56533k33505Q1581J59726j10759K18336K0067j12937q6559k6115
$$ -57876 -69640 86893 -146612 -65031 94695 -16064 202272 222339 109402 22843 -3272
6320c272p7028J79598j807K1610r0220j22889j36434M4189J25331j87590J63508
$$ -3272 -80300 99298 97491 119101 28881 -94008 -230442 -186253 -60922 -248512 -85004
6309h5004p4989l4798J17796n4540j11468L1163L2987j02612n2706L15452m5021
$$ -85004 -159993 -194791 -76995 -131535 -243003 -211840 -178853 -281465 -334171 -18719 -63740
6298f3740J34590J13667k29590k8691J29669Q5515O4168j82533k46599J60317
$$ -63740 70850 184517 -45073 -73764 55905 141420 205588 23055 -223544 -63227
6288f3227o7036K415J62464o6472K15126N2031r7905k08332K01176K01940m10547
$$ -63227 -130263 -127848 34616 -31856 183270 235301 137396 -70936 130240 332180 -78367
6277g8367J14139M0392k4442L3422N503j97805K12608M1208k55276M1793m7685
$$ -78367 35772 76164 51722 85144 90647 -107158 105450 146658 -108618 -66825 -114510
6266a14510J32226k24685O7594K10309j24801K2841J92718l4223l9652k16567
$$ -114510 17716 -206969 -139375 70934 -53867 -31026 161692 127469 87817 -128750
6256a28750M9636k6151J6531k42733J13896J21278J14927L645k84069J36549K02211
$$ -128750 -79114 -105265 -88734 -331467 -217571 -96293 18634 22279 -261790 -125241 76970
6245G6970K01336r472j27163q6336j61143J92277P2598K83024k20362l29590N944
$$ 76970 278306 268834 141671 55335 -105808 86469 159067 442091 221729 -107861 -101917
6234a01917r0705L71871p6268N3215l18722k02073n738K40653p8423J1660J22515
$$ -101917 -192622 179249 102981 156196 -162526 -364599 -370337 -129684 -208107 -196447 -73932
6223g3932J487l8960j55456Q9416m150m9889L8376l9189J01486J69272j53163
$$ -73932 -72445 -111405 -266861 -177445 -181595 -231484 -193108 -232297 -130811 38461 -114702
6212a14702R4601J08466l42015L7202J8211k8241j3521L16388J08994j74627J13476
$$ -114702 -20101 88365 -253650 -216448 -198237 -226478 -239999 76389 185383 10756 124232
6201A24232Q1444l00389Q435k36097N5259P889J34252L25199j11761o7143o2027
$$ 124232 205676 -94713 -86278 -322375 -267116 -259227 -124975 200224 88463 21320 -40707
6190d0707L9298L8779Q8543r1940N2064r3757j8008N1635J09845o6478k6879k9697
$$ -40707 -1409 37370 125913 33973 86037 -7720 -25728 25907 135752 69274 42395 12698
6178A2698j2314l3114O1661j08426L4097K650J45360J99639q1727L2475k90314
$$ 12698 384 -32730 28931 -79495 -45398 -42748 102612 302251 220524 252999 -37315
6167c7315J48926J18322p8199j78452p8007J69705j68029J73503j17772m7003
$$ -37315 111611 229933 151734 -26718 -104725 64980 -103049 70454 -47318 -94321
6157i4321J92107r704j74732P6919J92720p0830n0665K9746r8604J50763J033
$$ -94321 97786 88082 -86650 -9731 182989 112159 61494 91240 -7364 143399 144432
6146A44432k6521L28846k61704r2548l7222q8809r6004n0452R9816j8873J32647
$$ 144432 117911 446757 185053 92505 55283 -33526 -129530 -179982 -80166 -99039 33608
6135C3608M2766m2839N779J27893O2193l4745j88917j97078K14092n6251P6701
$$ 33608 76374 33535 39314 167207 229400 194655 5738 -191340 22752 -33499 43202
6124D3202r7383M8604k50345J38562J80371j24933J17341p9680j33965J779K42824
$$ 43202 -54181 -5577 -255922 -117360 63011 -61922 55419 -24261 -158226 -156447 86377
6113H6377j17905J70934n3506M0040N5578l798M0695J01145n7917j18364p2403
$$ 86377 -31528 139406 85900 125940 181518 177720 218415 319560 261643 143279 70876
6102G0876K59511j47247j00303K31005k75470K2116R1171K7457k4324l38939K80757
$$ 70876 330387 183140 82837 313842 38372 60488 151659 179116 154792 -184147 96610
6091I6610K49711q2505j77082j30192M3351J62987J73678p2767j35907q8754L77482
$$ 96610 346321 263816 86734 -43458 -107 162880 336558 263791 127884 39130 416612
6080D16612n991n4230j9910R500N124k49834n5246o9237j89169K63981K8666j9608
$$ 416612 410621 356391 336481 345981 351105 101271 46025 -23212 -212381 51600 80266 60658
6068F0658J99714k58101J44057r2169n8271j28914j45113K88809j68396K63903
$$ 60658 260372 2271 146328 54159 -4112 -133026 -278139 10670 -157726 106177
6058A06177K11245j22128j42109J63957r9139j29975O5643K21921J0491N9360
$$ 106177 317422 195294 53185 217142 118003 -11972 53671 275592 286083 345443
6048C45443j09005R2123k368k0157q8307j95668k5336J1076J58389k3706P2389
$$ 345443 236438 328561 326193 306036 217729 22061 -3275 7801 166190 142484 214873
6037B14873m157O481r862n5738j97670J60353r0698j42191j21216N6747K60577
$$ 214873 210716 217197 207335 151597 -46073 114280 23582 -118609 -239825 -183078 77499
6026G7499J3918q9815J0527K6440M8181J37259j7727l54270Q793L4631J14084
$$ 77499 91417 1602 12129 38569 86750 224009 206282 -147988 -139195 -104564 9520
6015I520P263N6150j15991J79546M4714k49899j8110K47701J93356j37795j05746
$$ 9520 16783 72933 -43058 136488 181202 -68697 -86807 160894 354250 216455 110709
6004A10709k556O3867J57159j88778j66191Q6827j01349Q334L48393J02822j22830
$$ 110709 108153 172020 329179 140401 -25790 61037 -40312 -31978 316415 419237 296407
5993B96407j74914K6837L2778p3903o2995P3576N1051J47592j036j43134N9738
$$ 296407 121493 148330 181108 107205 44210 117786 168837 316429 315393 172259 231997
5982B31997L6819k26712p2865K66841J18563K8974q8374J06801m5665n8058R9314
$$ 231997 268816 42104 -30761 236080 354643 383617 295243 402044 356379 298321 397635
5971C97635j72657M8975L36695k27159m06447O429K43654j8365N3070k23655J78328
$$ 397635 224978 273953 610648 383489 -22958 -16529 227125 208760 261830 38175 216503
5960B16503n7439J57850j46294k38251K28953J6708P1257J20410R1230j84859
$$ 216503 159064 316914 170620 -67631 161322 178030 249287 369697 460927 276068
5950B76068k28749J62040Q5784k00603M1394o8188p7292K65202j47465K08408
$$ 276068 47319 209359 295143 94540 135934 67746 -9546 255656 108191 316599
5940C16599j23550M813K247J27608K19954O7742k00842k05551L77o2548j28238
$$ 316599 193049 197862 200109 327717 547671 615413 414571 209020 209397 146849 18611
5929A8611m4577J71170N8059P0378O4342k0729n9685R8729j80932j7515p9020
$$ 18611 -25966 145204 203263 273641 337983 317254 257569 356298 175366 157851 78831
5918G8831j02950K71147n7265k2297J08370P009j65209K0113L36638j72302R5360
$$ 78831 -24119 247028 189763 167466 275836 282845 117636 137749 474387 302085 397445
5907C97445J14963l6998q9921j4284m0575J13098J56430j44191j15315j20201
$$ 397445 512408 475410 385489 371205 330630 443728 600158 455967 340652 220451
5897B20451j15895J91885O9776j13860P938N5270j30015J58414M0665k85112n2662
$$ 220451 104556 296441 366217 252357 260295 315565 185550 343964 384629 99517 46855
5886D6855L96892n3266k79388K1862J94699K5785n6730Q0564o0434k36235P3546
$$ 46855 443747 390481 111093 132955 327654 353439 296709 377273 316839 80604 154150
5875A54150J75458o0994P9217N2604J16396J96104l07843j61375K4451J04442
$$ 154150 329608 268614 347831 400435 516831 712935 405092 243717 268168 372610
5865C72610K34695p939j41002J36958K6640j66401M9485j25359P3488J00718L6458
$$ 372610 607305 599366 458364 595322 621962 455561 505046 379687 453175 553893 590351
5854E90351J1731J72462k15858k13367J84000p63J22434m8399j68055J09370P8161
$$ 590351 602082 774544 558686 345319 529319 528556 650990 602591 434536 543906 622067
5843F22067j29923j12869J5069L8977j4796M9556J04218J3988j5750P7089p6722
$$ 622067 492144 379275 394344 433321 418525 468081 572299 586287 570537 647626 570904
5832E70904j15991K9039J50102k19232M6604N7550r300K1521n3964K22806j28885
$$ 570904 454913 483952 634054 414822 461426 518976 509676 531197 477233 700039 571154
5821E71154m9674Q336j6977J76823J51542N2147k00116R100j21607j43166K16599
$$ 571154 521480 529816 512839 689662 841204 893351 693235 702335 580728 437562 654161
5810F54161j38618j41438J77267l0055p9470P7768J07120k2872N7650O2145L3536
$$ 654161 515543 374105 551372 521317 441847 519615 626735 603863 661513 723658 757194
5799G57194k3069N4585O2115J5598r8359O1026j65300J17774J46638j90011K5523
$$ 757194 734125 788710 850825 866423 768064 829090 663790 781564 928202 738191 763714
5788G63714N1629j08723K55271L8604k19711J6733j26523J67584J39713K23353
$$ 763714 815343 706620 961891 1000495 780784 797517 670994 838578 978291 1201644
5778A201644k03779o1791m4029J68756j27760k3014J24404J16097Q801k40216
$$ 1201644 997865 936074 892045 1060801 933041 910027 1034431 1150528 1159329 919113
5768I19113j12907J65925N5873m7245L1198J8096R1044J47663k18238L6530L02294
$$ 919113 806206 972131 1028004 980759 1011957 1030053 1121097 1268760 1050522 1087052 1389346
5757A389346j63090q08K2008q2014j13009j70235K34388N839j7658L41272r4090
$$ 1389346 1226256 1225448 1247456 1165442 1052433 882198 1116586 1122425 1104767 1446039 1351949
5746A351949j61832M9935P6514l1531J25283l1725j53227J830M2867K05796O2041
$$ 1351949 1190117 1240052 1316566 1285035 1410318 1378593 1225366 1227196 1270063 1475859 1537900
5735A537900j1804j60337J21092j14331l48711N6360J88515l2932J81839P1057
$$ 1537900 1526096 1365759 1486851 1372520 1023809 1080169 1268684 1235752 1417591 1488648
5725A488648r1879L1201m1572J1630j37773J41397J62770j83764j1809J48634
$$ 1488648 1396769 1427970 1386398 1398028 1260255 1401652 1564422 1380658 1368849 1517483
5715A517483L5838N6595j18605L9277J42776l2976k50485j1030M3893Q090M08237
$$ 1517483 1553321 1609916 1491311 1530588 1673364 1640388 1389903 1378873 1422766 1430856 1839093
5704A839093l72111l7712K13833O9893N5711O8448j7128o7348Q3129J90741j48621
$$ 1839093 1466982 1429270 1643103 1712996 1768707 1837155 1820027 1752679 1835808 2026549 1877928
5693A877928k80782L03132o5195o5231J0386Q0368J43325K46729r4516J05435
$$ 1877928 1597146 1900278 1835083 1769852 1780238 1860606 2003931 2250660 2156144 2261579
5683B261579m87462J78112N9463p7468n2470K42020P3799r7083K2075j04118R8557
$$ 2261579 1774117 1952229 2011692 1934224 1881754 2123774 2197573 2100490 2122565 2018447 2117004
5672B117004j45911k1199n6397K14413j75739q1361L00169L4466j13418j13349
$$ 2117004 1971093 1949894 1893497 2107910 1932171 1850810 2150979 2185445 2072027 1958678
5662A958678K68601J13978r3333j54804r2878Q1537K15356Q921n9914K93952Q810
$$ 1958678 2227279 2341257 2247924 2093120 2000242 2081779 2297135 2306056 2246142 2540094 2548904
5651B548904l1325j50797o130j12812O7012J5288n2804m3822K33096q6668L3548
$$ 2548904 2517579 2366782 2360652 2247840 2314852 2330140 2277336 2233514 2466610 2379942 2413490
5640B413490R4329o7148R379K5681J1109K29251P2110l39795K03240L9142p4867
$$ 2413490 2507819 2440671 2450050 2475731 2486840 2716091 2788201 2448406 2651646 2690788 2615921
5629B615921N9576N985n6603N6551R6123M2248R2707L15223j32095k10024P6290
$$ 2615921 2675497 2681482 2624879 2681430 2777553 2819801 2912508 3227731 3095636 2885612 2961902
5618B961902J86318j74277j24780J73109m2775m4315m0479J15706J18931K14511
$$ 2961902 3148220 2973943 2849163 3022272 2979497 2935182 2894703 3010409 3129340 3343851
5608C343851k37234J27955J38219j11769L31218K1587l3577P556k50271J74711
$$ 3343851 3106617 3234572 3372791 3261022 3592240 3613827 3580250 3587806 3337535 3512246
5598C512246j37239n4682K49070j59116M9684J42751m5491K78745J13095j36280
$$ 3512246 3375007 3320325 3569395 3410279 3459963 3602714 3557223 3835968 3949063 3812783
5588C812783j07108O1009K15788j10188K11637K20395n3185n9911J32081j5693
$$ 3812783 3705675 3766684 3982472 3872284 4083921 4304316 4251131 4191220 4323301 4307608
5578D307608P7308K72720N7620J71719k7775l4383P2128K22617L2877l3149J29388
$$ 4307608 4384916 4657636 4715256 4886975 4859200 4824817 4896945 5119562 5152439 5119290 5248678
5567E248678N2494Q6011O7967K14656O8393J20337n1977L02497Q5914Q6977J13013
$$ 5248678 5301172 5387183 5455150 5669806 5738199 5858536 5806559 6109056 6194970 6281947 6394960
5556F394960N2379L30363P0750J69690K86523M03821L27846J94522N34209J11807
$$ 6394960 6447339 6777702 6848452 7018142 7304665 7708486 8036332 8230854 8765063 8876870
5546H876870J58214L04459L77601P32935N47751M15867L23546N67820O97309N41104
$$ 8876870 9035084 9339543 9717144 10450079 10997830 11413697 11737243 12305063 13002372 13543476
5536A3543476P44093Q54775P88432N41414M57142M88948P17535M44953L50877
$$ 13543476 14287569 15142344 15930776 16472190 16929332 17418280 18135815 18580768 18931645
5527A8931645M12685L59100L03529k2927K59407l3686n331l20886q45135n83223
$$ 18931645 19344330 19703430 20006959 19984032 20243439 20209753 20204422 19883536 19038401 18455178
5517A8455178o30023p18992o47680o62382n52762j08649k74941n72361l03063
$$ 18455178 17825155 17106163 16458483 15796101 15243339 15134690 14859749 14287388 13984325
5508A3984325k8875N0108P0395L94553O9684j18126P3390O19161L99303M02054
$$ 13984325 13955450 14005558 14075953 14470506 14540190 14422064 14495454 15114615 15513918 15915972
5498A5915972K66019M80334N42937P16870Q86993Q66369Q98206P02859R03967
$$ 15915972 16181991 16662325 17205262 17922132 18809125 19675494 20573700 21276559 22180526
5489B2180526J235775J037452J334816J226897J132598J499483J385966J287699
$$ 22180526 23416301 24453753 25788569 27015466 28148064 29647547 31033513 32321212
5481C2321212R58832J259228J177312R03488Q15943O22048P28959P04729L20100
$$ 32321212 33280044 34539272 35716584 36620072 37436015 38058063 38787022 39491751 39811851
5472C9811851J37947N9803j5254k6181k04886l30958m48082m76763l64520k42013
$$ 39811851 39949798 40009601 39994347 39968166 39763280 39432322 38984240 38507477 38142957 37900944
5462C7900944m50164k89042o7653k38766l47907m09394j06620j28094j31984L55
$$ 37900944 37450780 37161738 37094085 36855319 36507412 36098018 35991398 35863304 35731320 35731675
5452C5731675k32346k15979M574l84915j51669K17467J76686J20572l2845j5923
$$ 35731675 35499329 35283350 35287924 34903009 34751340 34968807 35145493 35266065 35233220 35217297
5442C5217297M10613L0240Q9131J41329R5485J06632L47078K61854L49482K12450
$$ 35217297 35627910 35658150 35747281 35888610 35984095 36090727 36437805 36699659 37049141 37261591
5432C7261591J3343J25451J94349l304j12259J88346K92413R7942l3254l4413
$$ 37261591 37274934 37400385 37594734 37591430 37479171 37667517 37959930 38057872 38024618 37990205
5422C7990205J35436L41860J64931N3536J37848J39336P5297j9417K09944J15004
$$ 37990205 38125641 38467501 38632432 38685968 38823816 38963152 39038449 39019032 39228976 39343980
5412C9343980m9269q4046m0099K12483J51114r6733m7226N0502j89937L7064j0505
$$ 39343980 39294711 39210665 39170566 39383049 39534163 39437430 39390204 39440706 39250769 39287833 39277328
5401C9277328j34249j92772j02955k40626J40842k50043j60360k43916l97733
$$ 39277328 39143079 38950307 38847352 38606726 38747568 38497525 38337165 38093249 37695516
5392C7695516l72350n25541q37709q28581r09801j222048j252548j031648j314786
$$ 37695516 37323166 36797625 35959916 35131335 34221534 32999486 31746938 30715290 29400504
5383B9400504j149717j104096r97454j292913j039527n40514q08149p31183q35308
$$ 29400504 28250787 27146691 26149237 24856324 23816797 23276283 22468134 21736951 20901643
5374B0901643l74583l67228j50168r6779j1257n43482j86089j37979j84992j15433
$$ 20901643 20527060 20159832 20009664 19912885 19901628 19358146 19172057 19034078 18849086 18733653
5364A8733653k25896O1860r6176o36298n98183l77123j27329l81462j08841K2500
$$ 18733653 18507757 18569617 18473441 17837143 17238960 16861837 16734508 16353046 16244205 16266705
5354A6266705j27568K4769j53981J66545J81111Q3035O26609L65094N83595M60428
$$ 16266705 16139137 16163906 16009925 16176470 16357581 16440616 17067225 17432319 18015914 18476342
5344A8476342Q8641K75646K53029j14529l48016m21105q58737q21544p82467m85790
$$ 18476342 18564983 18840629 19093658 18979129 18631113 18210008 17351271 16529727 15747260 15261470
5334A5261470p66693o39770n80246n52325n20358l12866k76819q9137m51376n03829
$$ 15261470 14494777 13855007 13274761 12722436 12202078 11889212 11612393 11523256 11071880 10568051
5324A0568051J74625K2536j28608j00861o2984j9462l36219k45510J98377J1097
$$ 10568051 10742676 10765212 10636604 10535743 10472759 10453297 10117078 9871568 10069945 10081042
5314A0081042m40457j53561k1106k14012r9609o4281k52856l13788k53990o13960
$$ 10081042 9640585 9487024 9465918 9251906 9152297 9088016 8835160 8521372 8267382 7653422
5304G653422j25018p4894j63116k87730j26684j36758q6957j53260j98115l21279
$$ 7653422 7528404 7453510 7290394 7002664 6875980 6739222 6652265 6499005 6300890 5979611
5294E979611n16315o9632P361j17390k00092k96647k48376l781O8831M0558l35944
$$ 5979611 5463296 5393664 5401025 5283635 5083543 4786896 4538520 4534739 4603570 4644128 4308184
5283D308184l6658l8993k23243o2633l8331k8554q2648j89044k40942j76989n1004
$$ 4308184 4271526 4232533 4009290 3946657 3908326 3879772 3797124 3608080 3367138 3190149 3139145
5272C139145K11903j56015l2147L6973l48806l6877o5187l35769J58106K97143
$$ 3139145 3351048 3195033 3162886 3199859 2851053 2814176 2748989 2413220 2571326 2868469
5262B868469j07377k7475k30389j67251J41324J28634q5798N8459J8584q8706
$$ 2868469 2761092 2733617 2503228 2335977 2477301 2605935 2520137 2578596 2597180 2508474
5252B508474k82203k3355K20055j10361j45607J43581Q2179j54948j03520J05477
$$ 2508474 2226271 2202916 2422971 2312610 2167003 2310584 2392763 2237815 2134295 2239772
5242B239772j42837R4713n1788l6707O243P1670j29082j69627J23278j69199k00320
$$ 2239772 2096935 2191648 2139860 2103153 2109396 2181066 2051984 1882357 2005635 1836436 1636116
5231A636116j78768P5231J22493K83746K03297j35169k12198j51173J66913L44281
$$ 1636116 1457348 1532579 1655072 1938818 2142115 2006946 1794748 1643575 1810488 2154769
5221B154769j49845j55848r04J01963k3875m06620L62551j34049l30003J42197
$$ 2154769 2004924 1849076 1848172 1950135 1926260 1519640 1882191 1748142 1418139 1560336
5211A560336j16987J70549K25415K5361J6273j26867j14967m6722q916j0058n4062
$$ 1560336 1443349 1613898 1839313 1864674 1880947 1754080 1639113 1592391 1583475 1573417 1519355
5200A519355J24272J75783o0023m15919N2792J31490l4640J98528k60700o5574
$$ 1519355 1643627 1819410 1759387 1343468 1396260 1527750 1493110 1691638 1430938 1365364
5190A365364J66963O130J36618j84149r2034m9740K55273m3209j74574K5639r1932
$$ 1365364 1532327 1538457 1675075 1490926 1398892 1349152 1604425 1561216 1386642 1412281 1320349
5179A320349J88145O3941l39815K24999O5245j74655N0684O8036K13049N4171
$$ 1320349 1508494 1572435 1232620 1457619 1522864 1348209 1398893 1466929 1679978 1734149
5169A734149l61917l8286J87182k1257j13300N9726K45101K0522j85635j34311
$$ 1734149 1372232 1333946 1521128 1499871 1386571 1446297 1691398 1711920 1526285 1391974
5159A391974J90442M4208k68297K68706j30003j25535k144R5909L38075n5642
$$ 1391974 1582416 1626624 1358327 1627033 1497030 1371495 1369351 1465260 1803335 1747693
5149A747693p8625O09k11843N29p9960j09561j24617L41679Q3135j43682J5062
$$ 1747693 1669068 1669677 1457834 1458363 1378403 1268842 1144225 1485904 1569039 1425357 1440419
5138A440419J65957J51825j44918J08441k79793j68140K98676p9053j2573q5231
$$ 1440419 1606376 1758201 1613283 1721724 1441931 1273791 1572467 1493414 1480841 1395610
5128A395610J31639K12327j2835j65571k01294L30254m4072j47714J62621j01625
$$ 1395610 1527249 1739576 1726741 1561170 1359876 1690130 1646058 1498344 1660965 1559340
5118A559340K2306J44602R3816k38447k08069k0143J94592L1818l73141K52505
$$ 1559340 1581646 1726248 1820064 1581617 1373548 1353405 1547997 1579815 1206674 1459179
5108A459179K09959J01539K7515J01234p9608J59578j76065J52468n3712k52646
$$ 1459179 1669138 1770677 1798192 1899426 1819818 1979396 1803331 1955799 1902087 1649441
5098A649441l7224K16480p8022k37367N1846J23073j9068k1573n1681L61908K3458
$$ 1649441 1612217 1828697 1750675 1513308 1565154 1688227 1669159 1647586 1595905 1957813 1981271
5087A981271k44849o4575J92955j0206Q6286O1137o8460O1703k36970r514P4287
$$ 1981271 1736422 1671847 1864802 1854596 1940882 2002019 1933559 1995262 1758292 1748778 1823065
5076A823065J45066p610J6254k8298J0799K2668K167M7437j92948n7422M1061
$$ 1823065 1968131 1960521 1976775 1948477 1959276 1981944 1984111 2031548 1838600 1781178 1822239
5065A822239j53271L929K94539r9775m3006j416k754J80994Q9575O9510j52909
$$ 1822239 1668968 1672897 1967436 1867661 1824655 1823239 1820485 2001479 2091054 2160564 2007655
5054B007655k72666R1396J49886K11477j40623k52862J85577o7075o3416R7427
$$ 2007655 1734989 1826385 1976271 2187748 2047125 1794263 1979840 1912765 1849349 1946776
5044A946776j44717J48086L19673J0683q5054l43057J57090K22336n6094J43356
$$ 1946776 1802059 1950145 2269818 2280501 2195447 1852390 2009480 2231816 2175722 2319078
5034B319078p560J50970R869k67520m9863K97677J0458j65160R5710J37983J3222
$$ 2319078 2311518 2462488 2472357 2204837 2154974 2452651 2463109 2297949 2393659 2531642 2544864
5023B544864k66397K09062P6695L19760R7714l61702Q6581p7232k0285K41180
$$ 2544864 2278467 2487529 2564224 2883984 2981698 2619996 2706577 2629345 2609060 2850240
5013B850240k83106K8055l29434p1916K36906K38972m4651j08184L1135J47245
$$ 2850240 2567134 2595189 2265755 2193839 2430745 2669717 2625066 2516882 2548017 2695262
5003B695262n4606L02035M449j67276J00370J7580j2454J54446o1227P911j310
$$ 2695262 2640656 2942691 2947140 2779864 2880234 2897814 2885360 3039806 2978579 2986490 2985180
4992B985180j91024J2415q7277J35785J85726N9366j30979k26147K28580M8008
$$ 2985180 2794156 2806571 2719294 2855079 3040805 3100171 2969192 2743045 2971625 3019633
4982C019633J540M04078j24524J42451J55957k18855k68761L32717K33279m410
$$ 3019633 3021173 3425251 3300727 3443178 3599135 3380280 3111519 3444236 3677515 3673105
4972C673105Q1585N0180J3525k60460L8396O8792Q4697P627j05851J84697M4583
$$ 3673105 3754690 3804870 3818395 3557935 3596331 3665123 3749820 3757447 3651596 3836293 3880876
4961C880876J37513J20814m6312K49673K819j11953J90874J99311j10521J43732
$$ 3880876 4018389 4139203 4092891 4342564 4345383 4233430 4424304 4623615 4513094 4656826
4951D656826J71761k99633J50439J37758j88528n7270M0538J40847J75885K77032
$$ 4656826 4828587 4528954 4679393 4817151 4628623 4571353 4611891 4752738 4928623 5205655
4941E205655j83400p2308O1906K10071K07355j62976L65254q8498J40260R4768
$$ 5205655 5022255 4949947 5011853 5221924 5429279 5266303 5631557 5543059 5683319 5778087
4931E778087K16916J65039o4911k94127K68780J16175L1866Q0976J75682M78392
$$ 5778087 5995003 6160042 6095131 5801004 6069784 6185959 6217825 6298801 6474483 6952875
4921F952875J05024O7066M2599R5030M18530J01016K18105J35099J79766K15139
$$ 6952875 7057899 7124965 7167564 7262594 7681124 7782140 8000245 8135344 8315110 8530249
4911H530249L05271L57744L70336k2206j49142K62750M5517J39817L7257J8833
$$ 8530249 8835520 9193264 9563600 9541394 9392252 9655002 9700519 9840336 9877593 9896426
4901I896426p8223Q909J47753J7250J47665L09124j07003L10066K45108J87026
$$ 9896426 9818203 9827112 9974865 9992115 10139780 10448904 10341901 10651967 10897075 11084101
4891A1084101L06444J51661L82715M30096N12451K36726K93267O66850O35961
$$ 11084101 11390545 11542206 11924921 12355017 12867468 13104194 13397461 14064311 14700272
4882A4700272O75172L39802K58759J61621J52714o7466J02622j75288j23615J67639
$$ 14700272 15375444 15715246 15974005 16135626 16288340 16220874 16323496 16148208 16024593 16192232
4872A6192232M9718J54374P1313J25726L97959J99112L07372M30656N84392N51883
$$ 16192232 16241950 16396324 16467637 16593363 16991322 17190434 17497806 17928462 18512854 19064737
4862A9064737P90091O28133O37468O27840P67037Q87962R45342J230143R48009
$$ 19064737 19854828 20482961 21120429 21748269 22515306 23403268 24348610 25578753 26526762
4853B6526762J338278J131006J303423J015480R57127J214500R88562J559347
$$ 26526762 27865040 28996046 30299469 31314949 32272076 33486576 34475138 36034485
4845C6034485J880005J964871J889320K091806K118780K667107K840181L068895
$$ 36034485 37914490 39879361 41768681 43860487 45979267 48646374 51486555 54555450
4837E4555450L590352L932990M857030N662982O229786P079307Q148615R154899
$$ 54555450 58145802 62078792 66935822 72598804 78828590 85907897 94056512 103211411
4829A03211411J0480412J1775718J3186840J4725902J6592255J8877175K0802803
$$ 103211411 113691823 125467541 138654381 153380283 169972538 188849713 209652516
4822B09652516K2184395K2620115K0991959J5761783O343503o782642j8907287
$$ 209652516 231836911 254457026 275448985 291210768 297554271 290771629 271864342
4815B71864342k6086258k8185879k6719007k3957187k0706573j7460974j4194905
$$ 271864342 245778084 217592205 190873198 166916011 146209438 128748464 114553559
4808A14553559j2076517j0172553q464563p175318o130895n362343m741818m056319
$$ 114553559 102477042 92304489 83839926 76664608 70533713 65171370 60429552 56373233
4800E6373233l801339l232860l113987k783185k278035k247187j818288j612773
$$ 56373233 52571894 49339034 46225047 43441862 41163827 38916640 37098352 35485579
4792C5485579j758432j286779j420301j294344r65194j179230j238415p84874
$$ 35485579 33727147 32440368 31020067 29725723 28760529 27581299 26342884 25558010
4784B5558010p20065p04160r11610p74525n67632o95855l63253o17481o23402
$$ 25558010 24837945 24133785 23222175 22447650 21880018 21184163 20820910 20203429 19580027
4775A9580027n39783o73473n45781m28116k32775l94412k75911o17478n19161
$$ 19580027 19040244 18366771 17820990 17392874 17160099 16765687 16489776 15872298 15353137
4766A5353137m14711m39797l51394m02143j75169l88280j49711k59606k28160
$$ 15353137 14938426 14498629 14147235 13745092 13569923 13181643 13031932 12772326 12544166
4757A2544166p2428l94222n02857j99161k55529j0680l23932L9136l18212l06132
$$ 12544166 12471738 12077516 11574659 11375498 11119969 11109289 10785357 10824493 10506281 10200149
4747A0200149j12483j90552j21649p7846p4951p4616j85784j51315j40278l81776
$$ 10200149 10087666 9897114 9775465 9697619 9622668 9548052 9362268 9210953 9070675 8688899
4737H688899j59040J0960j33871j84939q1339j22995m04345J79763Q5765k78418
$$ 8688899 8529859 8540819 8406948 8222009 8140670 8017675 7613330 7793093 7878858 7600440
4727G600440M142k30576n2093O5804j60929o2016L14002m75971j23421J69220
$$ 7600440 7604582 7374006 7321913 7387717 7226788 7164772 7478774 7002803 6879382 7048602
4717G048602r7970j99376q0053p4411j16250N9443q6796j86203l4126l04415r6727
$$ 7048602 6950632 6751256 6671203 6596792 6480542 6539985 6453189 6266986 6232860 5928445 5831718
4706E831718K06195k56829N5173P1210j57025n416J3677j2648j92061J44793J19254
$$ 5831718 6037913 5781084 5836257 5907467 5750442 5745026 5758703 5746055 5553994 5698787 5818041
4695E818041k50559j09943P7398L4178m0024k76137J08137J57329j67324Q3700
$$ 5818041 5567482 5457539 5534937 5569115 5529091 5252954 5361091 5518420 5351096 5434796
4685E434796j98156q6633L5539M9257J08396N5314j68766R013j12783J86851L65124
$$ 5434796 5236640 5150007 5185546 5234803 5343199 5398513 5229747 5238760 5125977 5312828 5677952
4674E677952p7113J39125j18429j14667K08358l2900M6451j68411N8758J6140
$$ 5677952 5600839 5739964 5621535 5506868 5715226 5682326 5728777 5560366 5619124 5635264
4664E635264K9096P8646J91553L27192j5464O621J31128r451k6780K51013j38528
$$ 5635264 5664360 5743006 5934559 6261751 6246287 6252908 6384036 6374585 6347805 6598818 6460290
4653F460290P8362J27272j03467M25265K87330o0445J82258L64984K42753M3954
$$ 6460290 6538652 6665924 6562457 6987722 7275052 7214607 7396865 7761849 8004602 8048556
4643H048556J42369K03561K7927J75703N9566L94127M57708K33426K62021L06036
$$ 8048556 8190925 8394486 8422413 8598116 8657682 9051809 9509517 9742943 10004964 10311000
4633A0311000J77589K03390J90115K53118L11773J64909L02081K54740J46342
$$ 10311000 10488589 10691979 10882094 11135212 11446985 11611894 11913975 12168715 12315057
4624A2315057K61087l6629Q456K90498J52895J47451K18000J3908r6294J33424
$$ 12315057 12576144 12539515 12547971 12838469 12991364 13138815 13356815 13370723 13274429 13407853
4614A3407853R0218O6659P1838j15718j63572K46396J60491L19662j48793n2331
$$ 13407853 13498071 13564730 13636568 13520850 13357278 13603674 13764165 14083827 13935034 13882703
4604A3882703L67073J12454K53065M91752N4320L90434L18790L72469L00801J77691
$$ 13882703 14249776 14362230 14615295 15107047 15161367 15551801 15870591 16243060 16543861 16721552
4594A6721552O20754M28170K29149K77728L28549O04967L15351L26916L30553
$$ 16721552 17342306 17770476 17999625 18277353 18605902 19210869 19526220 19853136 20183689
4585B0183689K70584K57667M35593J44788L44926J95325j50247J34679L093L00309
$$ 20183689 20454273 20711940 21147533 21292321 21637247 21832572 21682325 21817004 21820097 22120406
4575B2120406J78550j42412Q6704j28751P7021n2632k61132q7383k32534k83903
$$ 22120406 22298956 22156544 22243248 22114497 22191518 22138886 21877754 21790371 21557837 21273934
4565B1273934q072j83239m21474l36373j33468Q070O3188l7481l93944l60692
$$ 21273934 21265862 21082623 20661149 20324776 20191308 20199378 20262566 20225085 19831141 19470449
4555A9470449k1346R3930k06990N3518J28065J80097Q4058R7059l4249j9677J96287
$$ 19470449 19449103 19543033 19336043 19389561 19517626 19697723 19781781 19878840 19844591 19824914 20021201
4544B0021201K7276P0232o840l29705K71553q6191l08616j5648k04791p4129k60570
$$ 20021201 20048477 20118709 20111869 19782164 20053717 19967526 19658910 19643262 19438471 19364342 19103772
4533A9103772l67401q1287k41972k62911m80704j24858l35235l41163l39738k37337
$$ 19103772 18736371 18655084 18413112 18150201 17669497 17544639 17209404 16868241 16528503 16291166
4523A6291166m41543m59402j83899k45479k84149k5921m33820m03964k68002j56117
$$ 16291166 15849623 15390221 15206322 14960843 14676694 14650773 14216953 13812989 13544987 13388870
4513A3388870k65468p7262m046m0206J2439J26194Q7810j82177k16760j9394J39357
$$ 13388870 13123402 13046140 13042094 13001888 13014327 13140521 13228331 13046154 12829394 12810000 12949357
4502A2949357J60887K71272K8810j53727J33313L83957O4066J10631K42859K16878
$$ 12949357 13110244 13381516 13410326 13256599 13389912 13773869 13837935 13948566 14191425 14408303
4492A4408303L36161J7975K34686P9981J02648J97251L66972J00899K78505K27163
$$ 14408303 14744464 14762439 14997125 15077106 15179754 15377005 15743977 15844876 16123381 16350544
4482A6350544n0027L39167j37586R8338K38859J83538J90606K15061o2822K49098
$$ 16350544 16300517 16639684 16502098 16600436 16839295 17022833 17213439 17428500 17365678 17614776
4472A7614776J91861K27644K75675j11561L0440L62116L18603O5303J41446L50267
$$ 17614776 17806637 18034281 18309956 18198395 18228835 18590951 18909554 18974857 19116303 19466570
4462A9466570K52278L83797L19327K70702R1478N77195K90180L96997K31592J69186
$$ 19466570 19718848 20102645 20421972 20692674 20784152 21361347 21651527 22048524 22280116 22449302
4452B2449302K42962O3633n327K78680L91651K07040j82055J33586M2733J9867
$$ 22449302 22692264 22755897 22750570 23029250 23420901 23627941 23445886 23579472 23622205 23642072
4442B3642072j74570j86967j54747J50093K0510k0676l9204j7559O4333j87236
$$ 23642072 23467502 23280535 23125788 23275881 23296391 23275715 23236511 23218952 23283285 23096049
4432B3096049j9949O9694J41797L09395J00346J3222l2292j01876K60815J29281
$$ 23096049 23076100 23145794 23287591 23596986 23697332 23710554 23678262 23576386 23837201 23966482
4422B3966482L26844J29778K3650l1700Q8752k32975l2882J69185P8627J82557
$$ 23966482 24293326 24423104 24446754 24415054 24503806 24270831 24237949 24407134 24485761 24668318
4412B4668318O9509L77169j22418K0591J40177k2939J82766k15512J52178O1536
$$ 24668318 24737827 25114996 24992578 25013169 25153346 25130407 25313173 25097661 25249839 25311375
4402B5311375O1519n3262l01193q5427j83285r9106m20975j24724L1729m58698
$$ 25311375 25372894 25319632 25018439 24933012 24749727 24650621 24229646 24104922 24136651 23677953
4392B3677953n63377k38518l74672m28904q1715j71719m8834l32863r5676M2723
$$ 23677953 23114576 22876058 22501386 22072482 21990767 21819048 21770214 21437351 21341675 21384398
4382B1384398k28299q6090Q2215j34450Q1093r7273q3880j0995L22032J83100
$$ 21384398 21156099 21070009 21152224 21017774 21098867 21001594 20917714 20906719 21228751 21411851
4372B1411851k1697J69338K35888j9081L87998j2629J06499k5474L53406L81467
$$ 21411851 21390154 21559492 21795380 21776299 22164297 22151668 22258167 22232693 22586099 22967566
4362B2967566L39265N09824n1300N3228L71076N73686K09841L64388L89284L62974
$$ 22967566 23306831 23816655 23765355 23818583 24189659 24763345 24973186 25337574 25726858 26089832
4352B6089832Q1189Q7642K81026L64904K24829K26892K70613M94360K21522J75451
$$ 26089832 26171021 26258663 26539689 26904593 27129422 27356314 27626927 28121287 28342809 28518260
4342B8518260M33963N10466N61177P56201M69077Q01267N57654L81056N99379
$$ 28518260 28952223 29462689 30023866 30780067 31249144 32050411 32608065 32989121 33588500
4333C3588500L77654N24033K68864J45872j41392J73010j33387l54176n74588
$$ 33588500 33966154 34490187 34759051 34904923 34763531 34936541 34803154 34448978 33874390
4324C3874390j33773l6671k85005o12742l15034N9727j63997l5164K41187J96902
$$ 33874390 33740617 33703946 33418941 32806199 32491165 32550892 32386895 32351731 32592918 32789820
4314C2789820J25390J46502L00560J73551J76434L86649J88157K16372j34993
$$ 32789820 32915210 33061712 33362272 33535823 33712257 34098906 34287063 34503435 34368442
4305C4368442L9567j88398L92474J62312k71933N5570J01972o936k65373J82324
$$ 34368442 34408009 34219611 34612085 34774397 34502464 34558034 34660006 34653070 34387697 34570021
4295C4570021J30852o6443P7775J36942K63162J21667J7491J43052K51736Q5237
$$ 34570021 34700873 34634430 34712205 34849147 35112309 35233976 35251467 35394519 35646255 35731492
4285C5731492L3184n7443l2860m37476o78312o79283q22767n93268n06368q08064
$$ 35731492 35764676 35707233 35674373 35236897 34558585 33879302 33056535 32463267 31956899 31148835
4275C1148835m00933p77524n94626n37783j72190l99294r48655l51910r7341k32598
$$ 31148835 30747902 29970378 29375752 28837969 28665779 28266485 27317830 26965920 26868579 26635981
4265B6635981j81368k28761j34908m66066n76650l10265r2440k13389l41858l89631
$$ 26635981 26454613 26225852 26090944 25624878 25048228 24737963 24645523 24432134 24090276 23700645
4255B3700645l43076k90415n87238l12000k81922k74022l5699l14604k00229l27632
$$ 23700645 23357569 23067154 22479916 22167916 21885994 21611972 21576273 21261669 21061440 20733808
4245B0733808l64333J77202o8624j46751Q1750j96019k8197J15862j81511K73280
$$ 20733808 20369475 20546677 20478053 20331302 20413052 20217033 20188836 20304698 20123187 20396467
4235B0396467L964L7768K45810K35076k1009K18444R2483K73329L66008L97409
$$ 20396467 20400431 20438199 20684009 20919085 20898076 21116520 21209003 21482332 21848340 22245749
4225B2245749M59767L21451L17993P33076N17755N60637N82632O25022P76750
$$ 22245749 22705516 23026967 23344960 24078036 24595791 25156428 25739060 26364082 27140832
4216B7140832O33367O02199O31700O72720Q38919Q10142K71312Q28277R56600
$$ 27140832 27774199 28376398 29008098 29680818 30519737 31329879 31601191 32429468 33386068
4207C3386068Q37665R76298P84930J256562J116550R76181J025545J185529J128758
$$ 33386068 34223733 35200031 35984961 37241523 38358073 39334254 40359799 41545328 42674086
4198D2674086J018626J092646J071234Q89940O79829R34367Q46446R34601N44494
$$ 42674086 43692712 44785358 45856592 46746532 47426361 48360728 49207174 50141775 50686269
4189E0686269P53859Q00096J076516J057476Q24561J194336J252695J304367J339802
$$ 50686269 51440128 52240224 53316740 54374216 55198777 56393113 57645808 58950175 60289977
4180F0289977J161985J109027J411676J213607J154354P75917N41697M71844L09298
$$ 60289977 61451962 62560989 63972665 65186272 66340626 67116543 67658240 68130084 68439382
4171F8439382r9866m57694q16406q47024r33548j430087j025923j464377j297881
$$ 68439382 68339516 67881822 67065416 66218392 65284844 63854757 62828834 61364457 60066576
4162F0066576r87506r97675j189442j022044r02706j177904p49669p70645j041060
$$ 60066576 59079070 58081395 56891953 55869909 54967203 53789299 53039630 52268985 51227925
4153E1227925r23966j019592j045924q49658j182821j156994r97799j307268j443235
$$ 51227925 50303959 49284367 48238443 47388785 46205964 45048970 44051171 42743903 41300668
4144D1300668j314879j011518q92169j144904j029366j261443r97406p58220o98878
$$ 41300668 39985789 38974271 38082102 36937198 35907832 34646389 33648983 32890763 32191885
4135C2191885p91732m23043n29334q4752m1322k09549J0291K67168L86512N43944
$$ 32191885 31400153 30977110 30447776 30363024 30321702 30112153 30122444 30389612 30776124 31320068
4125C1320068O25730O78836J350533J296225J355600J794402K198532K747922
$$ 31320068 31945798 32624634 33975167 35271392 36626992 38421394 40619926 43367848
4117D3367848L123457L477882L786800L851271L786667L103552K946767L136306
$$ 43367848 46491305 49969187 53755987 57607258 61393925 64497477 67444244 70580550
4109G0580550L739844M296107M594630M459200L191126J594681R05140O28142
$$ 70580550 74320394 78616501 83211131 87670331 90861457 92456138 93361278 93989420
4101I3989420J778849K603629K534375J508967j285268l683833m282878l592239
$$ 93989420 95768269 98371898 100906273 102415240 101129972 97446139 93163261 89571022
4093H9571022k700117k028344j480424k806715m441343n599963n419329m627763
$$ 89571022 86870905 84842561 83362137 80555422 76114079 70514116 65094787 60467024
4085F0467024l677910l558903l020773l434725l677380l957077l652910l170260
$$ 60467024 56789114 53230211 50209438 46774713 43097333 39140256 35487346 32317086
4077C2317086k519689k349880j842862j616084j377595r21229j251726r48220
$$ 32317086 29797397 27447517 25604655 23988571 22610976 21689747 20438021 19489801
4069A9489801q24276m55034q41419m93248l04953m24074n59822o19606l13430
$$ 19489801 18665525 18210491 17369072 16875824 16570871 16146797 15586975 14967369 14653939
4060A4653939k10679m28755l89637l49110J16677n31081m75037q8384j38052l75741
$$ 14653939 14443260 14014505 13624868 13275758 13392435 12861354 12386317 12297933 12159881 11784140
4050A1784140m970k46448l15370k16174k71618k06016k77017K2907j26740l37136
$$ 11784140 11779170 11532722 11217352 11001178 10729560 10523544 10246527 10269434 10142694 9805558
4040I805558k1978m02936P1766j37384l52465o793K1583k64500k94929k04477
$$ 9805558 9783580 9380644 9452410 9315026 8962561 8955768 8977351 8712851 8417922 8213445
4030H213445k3257n4267m7648j52736o0000j29050r274p380l08683P438j68087
$$ 8213445 8190188 8135921 8088273 7935537 7875537 7746487 7737213 7729833 7421150 7428588 7260501
4019G260501J6020K01814j68231k64284k02499l8935N2466k76849k03565J79148
$$ 7260501 7276521 7478335 7310104 7045820 6843321 6804386 6856852 6580003 6376438 6555586
4009F555586r8106j27198K4812R1722k44672o0165J14534M7480j78231n2036j04379
$$ 6555586 6457480 6330282 6355094 6446816 6202144 6141979 6256513 6303993 6125762 6073726 5969347
3998E969347k30772j64325K5507R9777J34274P5377l40493k61770L49422N0922
$$ 5969347 5738575 5574250 5599757 5699534 5833808 5909185 5568692 5306922 5656344 5707266
3988E707266p0545j29508m9698L04583k54879n6195M605o9575k28572P2955K20904
$$ 5707266 5636721 5507213 5457515 5762098 5507219 5451024 5455629 5386054 5157482 5230437 5451341
3977E451341K5092j42166N173O5801k94304k17658J51225j73556Q3188N5658P0241
$$ 5451341 5476433 5334267 5339440 5405241 5110937 4893279 5044504 4870948 4954136 5009794 5080035
3966E080035n6416n7960j85169m8634M893M5461K0549L09466k66504J69561J45334
$$ 5080035 5023619 4965659 4780490 4731856 4736749 4782210 4802759 5112225 4845721 5015282 5160616
3955E160616O6295q0619k361p5585M3863M6258j23517N1330J32945k0176j3616
$$ 5160616 5226911 5146292 5143931 5068346 5112209 5158467 5034950 5086280 5219225 5199049 5185433
3944E185433O3973o2374J06079O8074J0553K153p5703L7453j76364J56573P2918
$$ 5185433 5249406 5187032 5293111 5361185 5371738 5373891 5298188 5335641 5159277 5315850 5388768
3933E388768j569J75660j59937M3484P7540l84886J71301K02782o3836Q18n0097
$$ 5388768 5387199 5562859 5402922 5446406 5523946 5139060 5310361 5513143 5449307 5450125 5400028
3922E400028L73946k6391J01173J52029K33242j4680m6286j89818K25384j37173
$$ 5400028 5773974 5747583 5848756 6000785 6234027 6219347 6173061 5983243 6208627 6071454
3912F071454O6992j05583P4565J42745n7484k98412P4035L11746R6718N7952J01296
$$ 6071454 6138446 6032863 6107428 6250173 6192689 5894277 5968312 6280058 6376776 6434728 6536024
3901F536024J12120p3807K14869J01351l3762J00182L9005j00512J9825p2714
$$ 6536024 6648144 6574337 6789206 6890557 6856795 6956977 6995982 6895470 6915295 6842581
3891F842581Q3981k8004J80819Q252M1433m6829J20025M03324J37057j47104P7335
$$ 6842581 6926562 6898558 7079377 7087629 7129062 7082233 7202258 7605582 7742639 7595535 7672870
3880G672870J54216P200J77376L672R8503Q0984P0558P2781J38570J88744J98345
$$ 7672870 7827086 7834286 8011662 8015334 8113837 8194821 8265379 8338160 8476730 8665474 8863819
3869H863819R656K93508K37201Q1044K2721M3184J90310p1932M3763L88402M689
$$ 8863819 8873475 9166983 9404184 9485228 9507949 9551133 9741443 9669511 9713274 10101676 10106365
3858A0106365M5048J36679L17902J93191J86146J78332J35186J47447J53334L0695
$$ 10106365 10151413 10288092 10605994 10799185 10985331 11163663 11298849 11446296 11599630 11630325
3848A1630325J32424J49011J59731J61727J30026K31087N48006K10044K5697J59530
$$ 11630325 11762749 11911760 12071491 12233218 12363244 12594331 13142337 13352381 13378078 13537608
3838A3537608K90886L98286L52003M10597J13813J02421L52756M96779J60970
$$ 13537608 13828494 14226780 14578783 14989380 15103193 15205614 15558370 16055149 16216119
3829A6216119L05067N74442K92937N86524N85033M11573O12369O11429O25619
$$ 16216119 16521186 17095628 17388565 17975089 18560122 18971695 19584064 20195493 20821112
3820B0821112O34238R09812P43844O28287N99588J121061R43115J014075J321856
$$ 20821112 21455350 22365162 23109006 23737293 24336881 25457942 26401057 27415132 28736988
3811B8736988J238409J338912J233603J536380J612110J640486J884619J880790
$$ 28736988 29975397 31314309 32547912 34084292 35696402 37336888 39221507 41102297
3803D1102297J942963K345720K075965K238317K237751K417878K766833K561357
$$ 41102297 43045260 45390980 47466945 49705262 51943013 54360891 57127724 59689081
3795E9689081K520332K862194K943560K927610K752977K820875L073100K714547
$$ 59689081 62209413 65071607 68015167 70942777 73695754 76516629 79589729 82304276
3787H2304276K596482K319787K709955K404041K202383K224764K005920J654673
$$ 82304276 84900758 87220545 89930500 92334541 94536924 96761688 98767608 100422281
3779A00422281J357594J374270J261852R30818P49224N72435K00871l05913n45023
$$ 100422281 101779875 103154145 104415997 105346815 106096039 106668474 106869345 106563432 106018409
3770A06018409n36008q34777r91089j549346j510899j483258j871282j885239
$$ 106018409 105482401 104647624 103656535 102107189 100596290 99113032 97241750 95356511
3762I5356511k127935k353306k405246k389284k821511k587103k642680k727865
$$ 95356511 93228576 90875270 88470024 86080740 83259229 80672126 78029446 75301581
3754G5301581k852371k712925k674729k354789k503193k531565k447098k272038
$$ 75301581 72449210 69736285 67061556 64706767 62203574 59672009 57224911 54952873
3746E4952873j939125k121594k201478j940004k095516j625866j858272j682611
$$ 54952873 53013748 50892154 48690676 46750672 44655156 43029290 41171018 39488407
3738C9488407j345119j404474j255709j086220j106056r94215r91807r42584q88330
$$ 39488407 38143288 36738814 35483105 34396885 33290829 32296614 31304807 30362223 29473893
3729B9473893q76717o97730q82738o16188l15696l55266n94547n52905m83506
$$ 29473893 28597176 27899446 27016708 26400520 26084824 25729558 25135011 24582106 24098600
3720B4098600m39694l30077k84884m19838l69075l08857n4677n9178k87780j66580
$$ 24098600 23658906 23328829 23043945 22624107 22255032 21946175 21891498 21832320 21544540 21377960
3710B1377960j0006j63346j32621j3743l34091j04277J25913J3368J91997j64048
$$ 21377960 21367954 21204608 21071987 21058244 20724153 20619876 20745789 20759157 20951154 20787106
3700B0787106L0216j01982j6496l3968J58374J31165o9251K18007m9276J73701
$$ 20787106 20817322 20715340 20698844 20664876 20823250 20954415 20885164 21103171 21053895 21227596
3690B1227596K18126K122J50079J67776J16073L6272K81778P1291L54753J95559
$$ 21227596 21445722 21447844 21597923 21765699 21881772 21918044 22199822 22271113 22625866 22821425
3680B2821425M1311L55269L23029J87248L21565M25690K77195N42449N18055L40889
$$ 22821425 22862736 23218005 23541034 23728282 24049847 24475537 24752732 25295181 25813236 26154125
3670B6154125O86754N25892M80417M30298P23376O99795O57449N48486O52791
$$ 26154125 26840879 27366771 27847188 28277486 29000862 29700657 30358106 30906592 31559383
3661C1559383P68480J150373R41020R38136R14089R41178J093402J174577Q58675
$$ 31559383 32327863 33478236 34419256 35357392 36271481 37212659 38306061 39480638 40339313
3652D0339313R00060R74763J185099R35731Q54671J016002O46090R05536P48624
$$ 40339313 41239373 42214136 43399235 44334966 45189637 46205639 46851729 47757265 48505889
3643D8505889M50834N77042O40885N28092M50602O95792O99097N68927M03654
$$ 48505889 48956723 49533765 50174650 50702742 51153344 51849136 52548233 53117160 53520814
3634E3520814N78774N26538M73180Q70463O46017Q30940J171023Q87715J314864
$$ 53520814 54099588 54626126 55099306 55969769 56615786 57446726 58617749 59505464 60820328
3625F0820328J120564J565305J802369J489155J809905K180340K553882K452997
$$ 60820328 61940892 63506197 65308566 66797721 68607626 70787966 73341848 75794845
3617G5794845K712627L164992L685803L381005L909193L967914M111842M619402
$$ 75794845 78507472 81672464 85358267 88739272 92648465 96616379 100728221 105347623
3609A05347623N011048M973353M981122N167963N318782N348318N612434N219459
$$ 105347623 110358671 115332024 120313146 125481109 130799891 136148209 141760643 146980102
3601A46980102N085711N092179N226520M768229M682519M399815M143088L765450
$$ 146980102 152065813 157157992 162384512 167152741 171835260 176235075 180378163 184143613
3593A84143613L775111L430629L183089K944883K379997K274422J904405J543308
$$ 184143613 187918724 191349353 194532442 197477325 199857322 202131744 204036149 205579457
3585B05579457Q04476N90952M7642m76011o11081r87944j455158j717110k232808
$$ 205579457 206383933 206974885 207022527 206546516 205935435 204947491 203492333 201775223 199542415
3576A99542415k696395k363428k734959l032022k994780l315204l062028l248177
$$ 199542415 196846020 194482592 191747633 188715611 185720831 182405627 179343599 176095422
3568A76095422l516472l355993l437611l448553l571210l480229l490622l335408
$$ 176095422 172578950 169222957 165785346 162336793 158765583 155285354 151794732 148459324
3560A48459324l055963k699801k671827k507287k314054k121096j667367j710893
$$ 148459324 145403361 142703560 140031733 137524446 135210392 133089296 131421929 129711036
3552A29711036j444898j203130j204389r02762q59958p08536p20476o99556n52050
$$ 129711036 128266138 127063008 125858619 124955857 124095899 123387363 122666887 121967331 121415281
3543A21415281n41401l74811J1403j46386k00951k91061n2052j76397k15495j45481
$$ 121415281 120873880 120499069 120510472 120364086 120163135 119872074 119820022 119643625 119428130 119282649
3533A19282649k58414j75422n12868m96477m42129p20797n58492q66367r06895
$$ 119282649 119024235 118848813 118335945 117839468 117397339 116676542 116118050 115251683 114344788
3524A14344788q60573r74394j103480j092989j059292j140251j274515j313648
$$ 114344788 113484215 112509821 111406341 110313352 109254060 108113809 106839294 105525646
3516A05525646j523804k050903j475315j820523j816431j894318j888258k285995
$$ 105525646 104001842 101950939 100475624 98655101 96838670 94944352 93056094 90770099
3508I0770099k206906j880326j853296j890943j582006j485005j654226j336982
$$ 90770099 88563193 86682867 84829571 82938628 81356622 79871617 78217391 76880409
3500G6880409j195602j302048j275968j189878j007399r53709r85373p99706r53196
$$ 76880409 75684807 74382759 73106791 71916913 70909514 69955805 68970432 68170726 67217530
3491F7217530p75227o18127q88999o44193q13408n68220r34988j068322o16757
$$ 67217530 66442303 65824176 64935177 64290984 63477576 62909356 61974368 60906046 60289289
3482F0289289j132861r56409q63913j052514q01401q38899q75811o50021p74185
$$ 60289289 59156428 58200019 57336106 56283592 55482191 54643292 53767481 53117460 52343275
3473E2343275o34442o94978o39388n99736n47022L104l94934m74673m79483k82061
$$ 52343275 51708833 51013855 50374467 49774731 49227709 49230813 48835879 48361206 47881723 47599662
3463D7599662k93373l93316J79485K82779l01248j77167J2241K40031l2811J85295
$$ 47599662 47306289 46912973 47092458 47375237 47073989 46896822 46909063 47149094 47116283 47301578
3453D7301578K60097J94237L03264O23334M31179N79487M63681L87191L76494
$$ 47301578 47561675 47755912 48059176 48682510 49113689 49693176 50156857 50544048 50920542
3444E0920542K00390J44837L65312L52865K46793L58019J07105K34206o1036L9687
$$ 50920542 51120932 51265769 51631081 51983946 52230739 52588758 52695863 52930069 52869033 52908720
3434E2908720p4915j88806j55382k18840j53860l08065k15509k37024k83862l27923
$$ 52908720 52833805 52644999 52489617 52270777 52116917 51808852 51593343 51356319 51072457 50744534
3424E0744534j88178j05106R498k71784J51444K42987M1513M49026L98330O29338
$$ 50744534 50556356 50451250 50460748 50188964 50340408 50583395 50624908 51073934 51472264 52101602
3414E2101602P12299J058848J030763J427748J470846J625560J772376K160324
$$ 52101602 52813901 53872749 54903512 56331260 57802106 59427666 61200042 63360366
3406F3360366K177667K189324K419270K967280K765755K996017L074473L277031
$$ 63360366 65538033 67727357 70146627 73113907 75879662 78875679 81950152 85227183
3398H5227183L233080L277876L290145L135031L368165L312085K805711K676574
$$ 85227183 88460263 91738139 95028284 98163315 101531480 104843565 107649276 110325850
3390A10325850K905332K276596K157532K153023J747455J668283J311025J104815
$$ 110325850 113231182 115507778 117665310 119818333 121565788 123234071 124545096 125649911
3382A25649911P66403M49214N22033N13081K53921j8629j35793N4596j62413K40393
$$ 125649911 126416314 126865528 127387561 127900642 128154563 128135934 128000141 128054737 127892324 128132717
3372A28132717l51631m3048N8492l66102k8481J8217j66057l59953k50855l30655
$$ 128132717 127781086 127738038 127796530 127430428 127401947 127420164 127254107 126894154 126643299 126312644
3362A26312644j05879j77063k34636m47797l15447o23640r40278j069433j278428
$$ 126312644 126206765 126029702 125795066 125347269 125031822 124408182 123467904 122398471 121120043
3353A21120043j342122j740896k009606j988437k419039k732092k691092k955708
$$ 121120043 119777921 118037025 116027419 114038982 111619943 108887851 106196759 103241051
3345A03241051l091343k976901l287062k906878l043861k881784l163589l625734
$$ 103241051 100149708 97172807 93885745 90978867 87935006 85053222 81889633 78263899
3337G8263899k852447l118998l220368k811633k795544k582752k363021j813936
$$ 78263899 75411452 72292454 69072086 66260453 63464909 60882157 58519136 56705200
3329E6705200j802624j755771j552179j375153j152708r42334j005326o49197
$$ 56705200 54902576 53146805 51594626 50219473 49066765 48124431 47119105 46469908
3321D6469908l90293l33807j73118k45407k08382l33893j11511k86877m37373
$$ 46469908 46079615 45745808 45572690 45327283 45118901 44785008 44673497 44386620 43949247
3312D3949247j21355q3330p3048m560j62083l16941l15279n54624k72637o63636
$$ 43949247 43827892 43744562 43671514 43666954 43504871 43187930 42872651 42318027 42045390 41381754
3302D1381754q26336m51391p52763q52977q97526p25199r39063q63092j259222
$$ 41381754 40555418 40104027 39351264 38498287 37600761 36875562 35936499 35073407 33814185
3293C3814185j048599j112241r96649r93517r15256o40142j054842j140101q92484
$$ 33814185 32765586 31653345 30656696 29663179 28747923 28107781 27052939 25912838 25020354
3284B5020354j030571q49977q90454q45143p89218j044546m72983n26026m04773
$$ 25020354 23989783 23139806 22249352 21404209 20614991 19570445 19097462 18571436 18166663
3275A8166663p67972o55649n03504l24759n68881l46756m36799k24562j55360
$$ 18166663 17398691 16743042 16239538 15914779 15345898 14999142 14562343 14337781 14182421
3266A4182421l05260k90273k49972l90336o93256k55449j00277j53461j02964
$$ 14182421 13877161 13586888 13336916 12946580 12253324 11997875 11897598 11744137 11641173
3257A1641173k64401l73301k61723k13432k74893r6105j31264k37762k00679j95195
$$ 11641173 11376772 11003471 10741748 10528316 10253423 10157318 10026054 9788292 9587613 9392418
3247I392418p9537k21667k74923l58726j67637j15518m5707l5016j06257j52199
$$ 9392418 9312881 9091214 8816291 8457565 8289928 8174410 8128703 8093687 7987430 7835231
3237G835231l5844l23754P2798o2597l51002m6342l58951J17999j98238r6011
$$ 7835231 7799387 7475633 7548431 7485834 7134832 7088490 6729539 6847538 6649300 6553289
3227F553289P7668P1091n18052j56541J35484J4564j87718k37617m2666j69305
$$ 6553289 6630957 6702048 6183996 6027455 6162939 6177503 5989785 5752168 5709502 5540197
3217E540197L1760n6661j82752k9964p4057j47634p4461j01119n7045r6337L8762
$$ 5540197 5571957 5515296 5332544 5302580 5228523 5080889 5006428 4905309 4848264 4751927 4790689
3206D790689n0053J15032j55259p3760r7722L4k9719n9040q1552o224j2786l45931
$$ 4790689 4740636 4855668 4700409 4626649 4528927 4528961 4499242 4440202 4358650 4352426 4339640 3993709
3194C993709q8868j94483l4329K10162j92311J10112l3580j48748K28089n3461
$$ 3993709 3904841 3710358 3676029 3886191 3693880 3803992 3770412 3621664 3849753 3796292
3184C796292r080p9542k21779n605o7303j1351r4020j46332j16899M1485J70523
$$ 3796292 3787212 3707670 3485891 3480286 3412983 3401632 3307612 3161280 3044381 3085866 3256389
3173C256389j23814q633K353k75123J8280J10513L1278q1970J64285k37202j05772
$$ 3256389 3132575 3123942 3126295 2851172 2869452 2979965 3011243 2929273 3093558 2856356 2750584
3162B750584L7568j60063p4902P622J83865p8337j94771K73925n1118k05043o5825
$$ 2750584 2788152 2628089 2553187 2560809 2744674 2666337 2471566 2745491 2694373 2489330 2423505
3151B423505L3037J74623p096l95552n12L6801K45652j36381M6791k38165M2333
$$ 2423505 2456542 2631165 2624069 2228517 2228005 2264806 2510458 2374077 2420868 2182703 2225036
3140B225036K03388N8424n0438k00697L4951N0262J016j31130M8395p6023L60665
$$ 2225036 2428424 2486848 2436410 2235713 2270664 2320926 2321942 2190812 2239207 2163184 2523849
3129B523849J19445k28963k8854J18236j68357j38301J2207R216k7166J36982
$$ 2523849 2643294 2414331 2385477 2503713 2335356 2197055 2209262 2218478 2191312 2328294
3119B328294J5271j60703o8332o8782k18345J75226J6712N9501j76144J37709
$$ 2328294 2343565 2182862 2114530 2045748 1827403 2002629 2019341 2078842 1902698 2040407
3109B040407j48513J15144k27012k30709J80945J07463k6247K1585j8642J77629
$$ 2040407 1891894 2007038 1780026 1549317 1730262 1837725 1811478 1833063 1814421 1992050
3099A992050m6123j06882J32995p4899m4825O9583m8046J12899j21690k33585
$$ 1992050 1945927 1839045 1972040 1897141 1852316 1921899 1873853 1986752 1865062 1631477
3089A631477K36700p7078P3234n8063r8141J13697n2869k23759j04463J88895
$$ 1631477 1868177 1791099 1864333 1806270 1708129 1821826 1768957 1545198 1440735 1629630
3079A629630j15801p6270N6477j48357M7462Q0513p3523j50328k5007R9625O3895
$$ 1629630 1513829 1437559 1494036 1345679 1393141 1473654 1400131 1249803 1224796 1324421 1388316
3068A388316J46610r007l51780J19350n3757R7283J23632r6335L7433k31232j65093
$$ 1388316 1534926 1525919 1174139 1293489 1239732 1337015 1460647 1364312 1401745 1170513 1005420
3057A005420J18929P9340K2323k1493J84192M9057k6418J45460j56749j65424
$$ 1005420 1124349 1203689 1226012 1204519 1388711 1437768 1411350 1556810 1400061 1234637
3047A234637m4317o3169N3370m3886k5650o8200Q3510M1948j78709j089R8459
$$ 1234637 1190320 1127151 1180521 1136635 1110985 1042785 1126295 1168243 989534 988445 1086904
3036A086904k0814K49447j24410n8399r5401M4143K52984j18876K0215J16134
$$ 1086904 1066090 1315537 1191127 1132728 1037327 1081470 1334454 1215578 1235793 1351927
3026A351927k14349l2885p0626K8472r9087j08726K60393o5295k28511m906j2748
$$ 1351927 1137578 1104693 1034067 1062539 963452 854726 1115119 1049824 821313 816407 803659
3015H03659O7449J09675k19177J48857J86219M3945j31882j32910l4050J35162
$$ 803659 871108 980783 761606 910463 1096682 1140627 1008745 875835 841785 976947
3005I76947l4523L12362p1402j84061K49350j03483o8875l6373k9382R2099N4734
$$ 976947 942424 1254786 1183384 999323 1248673 1145190 1076315 1039942 1010560 1102659 1157393
2994A157393k5867m3073M655Q6642J943k45145K26292J55176k45395k6238J21124
$$ 1157393 1131526 1088453 1093108 1179750 1181693 936548 1162840 1318016 1072621 1046383 1167507
2983A167507p5396r4265Q9405J5015L01397M5104k60166o906k82932J87132M3628
$$ 1167507 1092111 997846 1087251 1102266 1403663 1448767 1188601 1181695 898763 1085895 1129523
2972A129523j5537j8421j5331k30163J5434P8706J29334Q0003K0668J94660k09161
$$ 1129523 1113986 1095565 1080234 850071 865505 944211 1073545 1153548 1174216 1368876 1159715
2961A159715o1940K36845M09320j75668j5494J31161L80402J75150k4627R4288
$$ 1159715 1097775 1334620 1743940 1568272 1552778 1683939 2064341 2239491 2214864 2309152
2951B309152J38889L31981J92184K93949O34696L20448M22263O97910M49348N94530
$$ 2309152 2448041 2780022 2972206 3266155 3900851 4221299 4643562 5341472 5790820 6385350
2941F385350l25858r10907p48313n36131l46825l08484k66670m0889l5018q434
$$ 6385350 6059492 5148585 4400272 3864141 3517316 3208832 2942162 2901273 2866255 2857821
2931B857821j74747j29656K21128Q6873J53070J36751J98438O2237J25987N02424
$$ 2857821 2683074 2553418 2774546 2861419 3014489 3151240 3349678 3411915 3537902 4040326
2921D040326M32706N84501P02167O11322J401220Q67042Q19255J041937M17483
$$ 4040326 4473032 5057533 5759700 6371022 7772242 8639284 9458539 10500476 10917959
2912A0917959j232570j421155j329197j091242q54559o20586m93864n26535k52655
$$ 10917959 9685389 8264234 6935037 5843795 4989236 4368650 3874786 3348251 3095596
2903C095596k81259M031k9749m3941m2561r321j07344K4842Q0732J90619q9017
$$ 3095596 2814337 2818368 2788619 2744678 2702117 2692796 2585452 2610294 2691026 2881645 2792628
2892B792628J39677M27120M33925L33995J97248O72143L78071M32951p5954r24723
$$ 2792628 2932305 3359425 3793350 4127345 4324593 4996736 5374807 5807758 5731804 4807081
2882D807081o67097l74080o33864m41006k52668k21183j24082k60985l17074m7773
$$ 4807081 4139984 3765904 3132040 2691034 2438366 2217183 2093101 1832116 1515042 1467269
2872A467269r658k52008q3235j74067J76881J15653l0126j41800l9639J3326k74156
$$ 1467269 1457611 1205603 1122368 948301 1125182 1240835 1210709 1068909 1029270 1042596 768440
2861G68440n5435J57933j80836K10458N056j65500R0114O6490j03444p2666k18395
$$ 768440 713005 870938 690102 900560 905616 740116 830230 896720 793276 720610 502215
2850E02215j81936L71243J35451k56249r890J66716j37242k08838j5927J28090
$$ 502215 320279 691522 826973 570724 560834 727550 590308 381470 365543 493633
2840D93633J46204J08438j07949j22004n2343K87269n6971j01031j39506K1006
$$ 493633 639837 748275 640326 518322 465979 753248 696277 595246 455740 476746
2830D76746j1930j56616M5428O0027k528j12910N1462M5604J17311k48890J72545
$$ 476746 464816 308200 353628 413655 411127 298217 349679 395283 512594 263704 436249
2819D36249L6488N082Q2105m8930j57950p0625J29862j34025m1177k1641m2188
$$ 436249 472737 477819 559924 510994 353044 282419 412281 278256 237079 215438 173250
2808A73250M7594J35944J44090K0373K93194k82877j47173K2427l8291M3757q7599
$$ 173250 220844 356788 500878 521251 814445 531568 384395 406822 368531 412288 324689
2797C24689L9133L38546k07912k49421J68435J62958k2166m6936P3899j18144
$$ 324689 363822 702368 494456 245035 413470 576428 554262 507326 581225 463081
2787D63081j73370j06510k9667J9538l7716r4033n2686N8389J21131K6128J20917
$$ 463081 289711 183201 153534 173072 135356 41323 -11363 47026 168157 194285 315202
2776C15202J0411L3580O4076o1387l5070M0233j23244n7574J99008P4832m5553
$$ 315202 325613 359193 423269 361882 326812 367045 243801 186227 385235 460067 414514
2765D14514j74868j84059k8183o4654J89968K4154r6815j01892J42556Q6451n2873
$$ 414514 239646 55587 27404 -37250 152718 176872 80057 -21835 120721 207172 154299
2754A54299j11224N4055j20504M7666J7594j5787J74392j40779p7748J63112m5402
$$ 154299 43075 97130 -23374 24292 41886 26099 200491 59712 -18036 145076 99674
2743I9674N2877K05243L2051J4318k15152K64422N4463p36k07987N0846m2386
$$ 99674 152551 357794 389845 404163 189011 453433 507896 507160 299173 350019 307633
2732C07633j49113r8199q1764K16440n4539L94460j33224l2532l71377j04577
$$ 307633 158520 60321 -21443 194997 140458 534918 401694 369162 -2215 -106792
2722a06792J36039M6780K49605p7706k12773j09464J00681J18623L4840k4563
$$ -106792 29247 76027 325632 247926 35153 -74311 26370 144993 179833 155270
2712A55270j27106K60699m448k6154j3246j16230n6603J99311m4897j35410J2638
$$ 155270 28164 288863 284415 258261 245015 128785 72182 271493 226596 91186 103824
2701A03824J65276l2336L82j24100j13840J26716j80478L12216K25437k8511k57754
$$ 103824 269100 236764 237146 113046 -794 125922 -54556 257660 483097 454586 196832
2690A96832m706j73130J8047J62418j40950R7560n3455N0295J93593j24003k71071
$$ 196832 192126 18996 37043 199461 58511 156071 102616 152911 346504 222501 -48570
2679d8570J4884O6216Q1801N3557j49836q3718k12359J57798K41870P3414o3521
$$ -48570 -33686 32530 114331 167888 18052 -65666 -278025 -120227 121643 195057 131536
2668A31536J33448k44116k51202O6724K28840P401j21860k0570j0780k5310J28531
$$ 131536 264984 20868 -230334 -163610 65230 72631 -49229 -69799 -80579 -105889 22642
2657B2642L2292J16288K09893k21694M4725q2031J948K76224j19173p7785k20277
$$ 22642 54934 171222 381115 159421 204146 122115 124063 400287 281114 203329 -16948
2646a6948J05474k3745N3428J48334k23130L4018L77o863J26853n165k62829m7404
$$ -16948 88526 64781 118209 266543 43413 77431 77808 70945 197798 192633 -70196 -117600
2634a17600R5192Q7353J02244q3963O2785j46252K70723K16806p2721k20253j01069
$$ -117600 -22408 64945 167189 83226 146011 -241 270482 487288 414567 194314 93245
2623I3245m019J47494R5228k20358j16322M9050J94516k19104k2665q8511M2164
$$ 93245 89226 236720 331948 111590 -4732 44318 238834 19730 -2935 -91446 -49282
2612d9282r9845J27026p6428q8047j9208J71830K40533J32233k41969o594P8328
$$ -49282 -149127 -22101 -98529 -186576 -205784 -33954 206579 338812 96843 90249 168577
2601A68577j73351o3233M703j289K9816J4983q865P1670j51140R7662K1037j38133
$$ 168577 -4774 -68007 -63304 -64593 -34777 -19794 -28659 43011 -108129 -10467 10570 -127563
2589a27563P0902J86968j00656o768Q2901n8013J22616n8350k0878r4654J13754
$$ -127563 -56661 130307 29651 22883 105784 47771 170387 112037 91159 -3495 110259
2578A10259r3592K22707L2327l22612J18846j47269J43911j95480J53370O591
$$ 110259 16667 239374 271701 -50911 67935 -79334 64577 -130903 22467 29058
2568B9058j06633O6181O9615j43867M9130J02096j0662Q1679k70463J03372J19078
$$ 29058 -77575 -11394 58221 -85646 -36516 65580 54918 136597 -133866 -30494 88584
2557H8584r7331p6457J15546L9183k6916n1715L121o0698O7392Q6206O1376p375
$$ 88584 -8747 -85204 30342 69525 42609 -9106 -5985 -66683 709 86915 148291 140916
2545A40916o263Q5121j06161k6838J1224Q9780M240j19422R9976j41305j00823
$$ 140916 134653 219774 113613 86775 97999 187779 192019 72597 172573 31268 -69555
2534f9555K47062Q714k84107K4647J25795k46065L8473j98618K48150K32860m4867
$$ -69555 177507 186221 -97886 -73239 52556 -193509 -155036 -353654 -105504 127356 82489
2523H2489j72149K0890l5890q6180K27345J86539p7231q0246l5225R1722J23865
$$ 82489 -89660 -68770 -104660 -190840 36505 223044 145813 65567 30342 122064 245929
2512B45929k05583l9535J91087j02794j85216K7822K03456j16078J06681j24304
$$ 245929 40346 811 191898 89104 -96112 -68290 135166 19088 125769 1465
2502A465k40382K34067m8618j68398K7471P0912l492K51467p1201j75256J47282
$$ 1465 -238917 -4850 -53468 -221866 -194395 -123483 -126975 124492 53291 -121965 25317
2491B5317P1819K5349L6384O1304k25638j41085J75569o3975J28990J32164j02892
$$ 25317 97136 122485 158869 220173 -5465 -146550 29019 -34956 94034 226198 123306
2480A23306k93212J32927p7239O5745K09890K4759l28140j69936L48762j5826
$$ 123306 -169906 -36979 -114218 -48473 161417 186176 -141964 -311900 36862 21036
2470B1036m8390K37846m1211j86282l4269k0197l7267M3207j29821J848K49732
$$ 21036 -27354 210492 169281 -17001 -51270 -71467 -108734 -65527 -195348 -193500 56232
2459E6232J06465k3197j94162j08686j59801J27277L34188q5988K4337k29537
$$ 56232 162697 139500 -54662 -163348 -323149 -195872 138316 52328 76665 -152872
2449a52872k0321K14139k32808P7016J78038K8367o8445k56988Q110N3029J95144
$$ -152872 -173193 40946 -191862 -114846 63192 91559 23114 -233874 -225764 -172735 22409
2438B2409J59919J0521j58236j62123m1374J14851k36589J57448K97567j28455
$$ 22409 182328 192849 34613 -127510 -168884 -54033 -290622 -133174 164393 35938
2428C5938r3941J0565p7074J44165N7931q5674K02912M8055j27670j07350L2513
$$ 35938 -58003 -47438 -124512 19653 77584 -8090 194822 242877 115207 7857 40370
2417D0370L23972k60965k6575m1875j9001J78924N9536j45449n1528j14391n1404
$$ 40370 364342 103377 76802 34927 15926 194850 254386 108937 57409 -56982 -108386
2406a08386J93472j59819Q6810J40972k36727J7761j18497K0781J50769j38718
$$ -108386 85086 -74733 12077 153049 -83678 -65917 -184414 -163633 -12864 -151582
2396a51582k6306J48820L3446j94221K80628k3677j13351n8562P0977q0244J96833
$$ -151582 -177888 -29068 4378 -189843 90785 67108 -46243 -104805 -33828 -114072 82761
2385H2761k40805J8310J89634M735J18754j5923j26950k8933j36213J77618r3153
$$ 82761 -158044 -139734 49900 54635 173389 157466 30516 1583 -134630 42988 -50165
2374e0165J24096k7099j84451P4311K1576j87284J00506j0529J19824L4583l4563
$$ -50165 73931 46832 -137619 -63308 -41732 -229016 -128510 -139039 -19215 15368 -19195
2363a9195j9013L1051p1632p9564J22527m4384J1119J42805j28599K8864k91014
$$ -19195 -38208 -7157 -78789 -158353 -35826 -80210 -69091 73714 -54885 -26021 -317035
2352c17035J54366J89473J08950O0590j31229L6930j56167l0556P5120J7011J42449
$$ -317035 -162669 26804 135754 196344 65115 102045 -54122 -84678 -9558 7453 149902
2341A49902m1273j59192J68734N8762m5299o8955R4704q5225k37647q4406K18534
$$ 149902 108629 -50563 118171 176933 131634 62679 157383 72158 -165489 -249895 -31361
2330c1361l9341j53385J18278R972m3742j77152O2327J52356k83666J44014J31390
$$ -31361 -70702 -224087 -105809 -95837 -139579 -316731 -254404 -102048 -385714 -241700 -110310
2319a10310R7173j49371L99107q4319j75586j4920L26276l02532r534J36732J78912
$$ -110310 -13137 -162508 236599 152280 -23306 -38226 288050 -14482 -24016 112716 291628
2308B91628p1648r4306J0734k72714J1541P590K7483j31793j0690J72492o6882
$$ 291628 219980 125674 136408 -136306 -124765 -117175 -89692 -221485 -232175 -59683 -126565
2297a26565r9281K02343q1316K9391O9037Q5494j06818K5738J57494l0757r0078
$$ -126565 -225846 -23503 -104819 -75428 -6391 79103 -27715 -1977 155517 124760 34682
2286C4682m3982K1502j09723J68272J28479j44359j9063J4970j43588O8571Q2269
$$ 34682 -9300 12202 -97521 70751 199230 54871 35808 50778 -92810 -24239 58030
2275E8030j67771J39597M6970m7431L7188j83562l1732o4369K40731J79216l252
$$ 58030 -109741 29856 76826 29395 66583 -116979 -148711 -213080 27651 206867 203615
2264B03615L0855l7517p4236J85943p0815j03003j46609j33623Q0782j15801J83613
$$ 203615 234470 196953 122717 308660 237845 134842 -11767 -145390 -64608 -180409 3204
2253C204j06600J03636J37642L438j53581K87527j08821P3016k08290J28140L85270
$$ 3204 -103396 240 137882 141320 -12261 275266 166445 239461 31171 159311 544581
2242E44581k86561j41837l15799L1808M4841Q915j44593J65346K14394l3682k06455
$$ 544581 258020 116183 -199616 -167808 -122967 -114052 -258645 -93299 121095 87413 -119042
2231a19042J66218k46916J54890K21337k48561J42031q1573l8131m2980K75997
$$ -119042 47176 -199740 -44850 176487 -72074 69957 -11616 -49747 -92727 183270
2221A83270Q8332k90920M2207j38324j13996L4137r112J6330O5294R7821K60830
$$ 183270 271602 -19318 22889 -115435 -229431 -195294 -204406 -188076 -122782 -24961 235869
2210B35869o2295K1036n485q7662J47719l74398R5538J82515n2895j89330j0637
$$ 235869 173574 194610 189125 101463 249182 -125216 -29678 152837 99942 -89388 -100025
2199a00025J7728j53935L0795L05805J4923K0215l1201j9865j39628L5260L57827
$$ -100025 -82297 -236232 -205437 100368 115291 135506 104305 84440 -55188 -19928 337899
2188C37899P2926l09254k55155J04532K22833k8193j48973k6648O7137K8533l6316
$$ 337899 410825 101571 -153584 -49052 173781 145588 -3385 -30033 37104 65637 29321
2177B9321j41244O1363m3565J14096O1600n0623Q3796j22551R9601o6143q6702
$$ 29321 -111923 -50560 -94125 19971 81571 30948 114744 -7807 91794 25651 -61051
2166f1051K02040j20642j913p4291m3334Q7871j84323m9057o1453K22279j40467
$$ -61051 140989 20347 18434 -55857 -99191 -11320 -195643 -244700 -306153 -83874 -224341
2155b24341N8673K11832n3568J18570j41968k77491J16247J20273J88133l3722
$$ -224341 -165668 46164 -7404 111166 -30802 -308293 -192046 -71773 116360 82638
2145H2638j66829K04325o1371r2857R7440j76888O13L6719Q291o0991J665J10337
$$ 82638 -84191 120134 58763 -34094 63346 -113542 -112929 -76210 -67919 -128910 -127245 -16908
2133a6908k3344J69592n2113j53258L9392M3095K3280j7391k50774J51694l6522
$$ -16908 -40252 129340 77227 -76031 -36639 6456 29736 12345 -238429 -86735 -123257
2122a23257N7493J31391m294k8323N2304R8362l05786j6794K53635l0050K00870
$$ -123257 -65764 65627 61333 33010 85314 183676 -122110 -138904 114731 84681 285551
2111B85551k07802q9223J8718k3784K19526k51805J14727L3631j35453m2908R0756
$$ 285551 77749 -11474 7244 -16540 202986 -48819 65908 99539 -35914 -78822 11934
2100A1934o0124L58396j00579k9714L7781k68765R1124k2073n8392N3763r2088
$$ 11934 -48190 310206 209627 179913 217694 -51071 40053 17980 -40412 13351 -78737
2089g8737M9634K3824J17698o5103j10777K34600K02986k57640n498J75771J3979
$$ -78737 -29103 -5279 112419 47316 -63461 171139 374125 116485 110987 286758 300737
2078C00737j28660J7948J91678K5202k27333j0439K06533o460O0384J27369Q1331
$$ 300737 172077 190025 381703 406905 179572 169133 375666 369206 429590 556959 638290
2067F38290j7124k40787k33379M13934Q1162M1723J4394J1298N1184M7655R3881
$$ 638290 621166 380379 147000 560934 642096 683819 698213 709511 760695 808350 902231
2056I02231K95673L11384J85441L58135J79370L29893N68943N34174M1134o34979
$$ 902231 1197904 1509288 1694729 2052864 2232234 2562127 3131070 3665244 3706378 3071399
2046C071399o04910m31197l74539k89356k00023j31995j17702l06440L3622R4940
$$ 3071399 2466489 2035292 1660753 1371397 1171374 1039379 921677 615237 648859 743799
2036G43799j01485N5373j20849R7603j67147L2574R125q8423j5828n6591j64664
$$ 743799 642314 697687 576838 674441 507294 539868 548993 460570 444742 388151 223487
2025B23487j61449k9177R7329J80159O343j23934j03718L0176m2849K38417P8167
$$ 223487 62038 32861 130190 310349 316692 192758 89040 119216 76367 314784 392951
2014C92951l23854M3703J08126q3990K39379N9514j73704k12121Q45J5336J22610
$$ 392951 69097 112800 220926 136936 376315 435829 262125 50004 50849 66185 188795
2003A88795q3418j43052j15137R2415L15195o1934j8534r4063l68756J87770k32655
$$ 188795 105377 -37675 -152812 -60397 254798 192864 174330 80267 -288489 -100719 -333374
1992c33374J21171N4809J79639P2866j40088j63694N1900J93231m7657j65457
$$ -333374 -212203 -157394 22245 95111 -44977 -208671 -156771 36460 -11197 -176654
1982a76654K26396j0104J13025J30696O914k96453p0679K15943j35995m4694k20158
$$ -176654 49742 39638 152663 283359 290273 -6180 -76859 139084 3089 -41605 -261763
1971b61763K57335m2515L3589o3034J35536q5563k12597Q5003J22626Q3878J97504
$$ -261763 -4428 -46943 -13354 -76388 59148 -26415 -239012 -154009 -31383 52495 249999
1960B49999j31789L2657j10443r0855O7257j75782L5966J87539k688q5723j729
$$ 249999 118210 150867 40424 -50431 16826 -158956 -122990 64549 61861 -23862 -25591
1949b5591K1237Q6334N8786j33041Q3003o387j88729q6416J16392J07851j3572
$$ -25591 -4354 81980 140766 7725 90728 84341 -104388 -190804 -74412 33439 19867
1938A9867j84860J52385O491m5788r544o6030j96662L04426K44157J00614N4624
$$ 19867 -164993 -12608 -6117 -51905 -61449 -127479 -324141 -19715 224442 325056 379680
$$ [...]
##END NTUPLES=NMR SPECTRUM
##END=
