##TITLE=1H_EC-3197
 CDCl3, 8 sc, 
 5.7.2019
##JCAMPDX= 6.0         $$ Bruker NMR JCAMP-DX V2.0
##DATA TYPE= NMR FID
##DATA CLASS= NTUPLES
##ORIGIN= UXNMR, Bruker Analytische Messtechnik GmbH
##OWNER= root
$$ XWIN-NMR		Version 3.5
$$ Fri Jul  5 14:06:28 2019 Russian Standard Time (UT+4h)  she@DPX200
##.OBSERVE FREQUENCY= 200.13155
##.OBSERVE NUCLEUS= ^1H
##.DELAY= (6, 6)
##.ACQUISITION MODE= SIMULTANEOUS
##.ACQUISITION SCHEME= undefined
##.AVERAGES= 8
##.DIGITISER RES= 18
##SPECTROMETER/DATA SYSTEM= spect
##.PULSE SEQUENCE= zg30
##.SOLVENT NAME= CDCl3
##.SHIFT REFERENCE= (INTERNAL, CDCl3, 0, 15.7039)
##AUDIT TRAIL= $$ (NUMBER, WHEN, WHO, WHERE, WHAT)
$$ ##TITLE= Audit trail, XWIN-NMR		Version 3.5
$$ ##JCAMPDX= 5.01
$$ ##ORIGIN= Bruker BioSpin GmbH
$$ ##OWNER= she
$$ F:/spectra/data/she/nmr/H-F/1/audita.txt
$$ ##AUDIT TRAIL=  $$ (NUMBER, WHEN, WHO, WHERE, WHAT)
(   1,<2019-07-05 14:05:16.65 +0400>,<she>,<DPX200>,
      <created by zg, POWCHK disabled, PULCHK disabled
       configuration hash MD5:
       00 E9 B6 7A A2 85 ED C7 34 08 36 98 17 FE 4E 26
       data hash MD5: 16K
       68 D7 DE 65 D9 6C 8B 60 40 99 07 E5 29 F8 4C 5B>)
$$ ##END=
$$ 
$$ hash MD5
$$ 2B 14 68 EB CF 6B DB 8F 13 EF 25 27 32 42 BE 19
##$RELAX= 
##$RELAX= 
##$RELAX= 
##$RELAX= 
##$RELAX= 
##$RELAX= 
$$ Bruker specific parameters
$$ --------------------------
##$DU= <F:/spectra>
##$EXPNO= 1
##$NAME= <H-F>
##$PROCNO= 1
##$TYPE= <nmr>
##$USER= <she>
##$AMP= (0..31)
100 100 100 100 100 100 100 100 100 100 100 100 100 100 100 100 100 100 
100 100 100 100 100 100 100 100 100 100 100 100 100 100 
##$AQSEQ= 0
##$AQ_mod= 1
##$AUNM= <au_zg>
##$AUTOPOS= <>
##$BF1= 200.13
##$BF2= 200.13
##$BF3= 200.13
##$BF4= 200.13
##$BF5= 200.13
##$BF6= 200.13
##$BF7= 200.13
##$BF8= 200.13
##$BYTORDA= 1
##$CFDGTYP= 0
##$CFRGTYP= 5
##$CHEMSTR= <none>
##$CNST= (0..31)
1 1 145 1 1 1 1 1 1 1 1 1 1 1 1 1 1 1 1 1 1 1 1 1 1 1 1 1 1 1 1 1 
##$CPDPRG= <>
##$CPDPRG1= <>
##$CPDPRG2= <>
##$CPDPRG3= <>
##$CPDPRG4= <mlev>
##$CPDPRG5= <mlev>
##$CPDPRG6= <mlev>
##$CPDPRG7= <mlev>
##$CPDPRG8= <mlev>
##$CPDPRGB= <>
##$CPDPRGT= <>
##$D= (0..31)
0 1.2 0 0 0 0 0 0 0 0 0 0.03 0 0 0 0 0 0 0 0 0 0 0 0 0 0 0 0 0 0 0 0 
##$DATE= 1562321116
##$DBL= (0..7)
120 120 120 120 120 120 120 120 
##$DBP= (0..7)
150 150 150 150 150 150 150 150 
##$DBP07= 0
##$DBPNAM0= <>
##$DBPNAM1= <>
##$DBPNAM2= <>
##$DBPNAM3= <>
##$DBPNAM4= <>
##$DBPNAM5= <>
##$DBPNAM6= <>
##$DBPNAM7= <>
##$DBPOAL= (0..7)
0.5 0.5 0.5 0.5 0.5 0.5 0.5 0.5 
##$DBPOFFS= (0..7)
0 0 0 0 0 0 0 0 
##$DE= 6
##$DECBNUC= <off>
##$DECIM= 24
##$DECNUC= <off>
##$DECSTAT= 4
##$DIGMOD= 1
##$DIGTYP= 9
##$DL= (0..7)
0 120 120 120 120 120 120 120 
##$DP= (0..7)
150 150 150 150 150 150 150 150 
##$DP07= 0
##$DPNAME0= <>
##$DPNAME1= <>
##$DPNAME2= <>
##$DPNAME3= <>
##$DPNAME4= <>
##$DPNAME5= <>
##$DPNAME6= <>
##$DPNAME7= <>
##$DPOAL= (0..7)
0.5 0.5 0.5 0.5 0.5 0.5 0.5 0.5 
##$DPOFFS= (0..7)
0 0 0 0 0 0 0 0 
##$DQDMODE= 0
##$DR= 18
##$DS= 0
##$DSLIST= <SSSSSSSSSSSSSSS>
##$DSPFIRM= 0
$$ [...]
##$SUBNAM2= <"">
##$SUBNAM3= <"">
##$SUBNAM4= <"">
##$SUBNAM5= <"">
##$SUBNAM6= <"">
##$SUBNAM7= <"">
##$SUBNAM8= <"">
##$SUBNAM9= <"">
##$SW= 24.9336996594482
##$SWIBOX= (0..15)
0 0 2 0 0 0 0 0 0 0 0 0 0 0 0 0 
##$SW_h= 4990.01996007984
##$TD= 16384
##$TD0= 1
##$TE= 0
##$TE2= 300
##$TE3= 300
##$TEG= 300
##$TL= (0..7)
0 120 120 120 120 120 120 120 
##$TP= (0..7)
150 150 150 150 150 150 150 150 
##$TP07= 0
##$TPNAME0= <>
##$TPNAME1= <>
##$TPNAME2= <>
##$TPNAME3= <>
##$TPNAME4= <>
##$TPNAME5= <>
##$TPNAME6= <>
##$TPNAME7= <>
##$TPOAL= (0..7)
0.5 0.5 0.5 0.5 0.5 0.5 0.5 0.5 
##$TPOFFS= (0..7)
0 0 0 0 0 0 0 0 
##$TUNHIN= 0
##$TUNHOUT= 0
##$TUNXOUT= 0
##$USERA1= <user>
##$USERA2= <user>
##$USERA3= <user>
##$USERA4= <user>
##$USERA5= <user>
##$V9= 5
##$VALIST= <valist>
##$VCLIST= <CCCCCCCCCCCCCCC>
##$VD= 0
##$VDLIST= <DDDDDDDDDDDDDDD>
##$VPLIST= <PPPPPPPPPPPPPPP>
##$VTLIST= <TTTTTTTTTTTTTTT>
##$WBST= 1024
##$WBSW= 4
##$XGAIN= (0..3)
0 0 0 0 
##$XL= 0
##$YL= 0
##$YMAX_a= 151977
##$YMIN_a= -215972
##$ZGOPTNS= <>
##$ZL1= 120
##$ZL2= 120
##$ZL3= 120
##$ZL4= 120
##$ABSF1= 10
##$ABSF2= 0
##$ABSG= 5
##$ABSL= 3
##$ALPHA= 0
##$AQORDER= 0
##$ASSFAC= 0
##$ASSFACI= 0
##$ASSFACX= 0
##$ASSWID= 0
##$AUNMP= <proc_1d>
##$AZFE= 0.1
##$AZFW= 0.1
##$BCFW= 1
##$BC_mod= 2
##$BYTORDP= 1
##$COROFFS= 0
##$CY= 11.3945322036743
##$DATMOD= 1
##$DC= 2
##$DFILT= <>
##$DTYPP= 0
##$F1P= 18.9103706918063
##$F2P= -1.10871071338519
##$FCOR= 0.5
##$FTSIZE= 0
##$FT_mod= 4
##$GAMMA= 1
##$GB= 0.15
##$INTBC= 1
##$INTSCL= 1
##$ISEN= 128
##$LB= 0.24
##$LEV0= 0
##$LPBIN= 0
##$MAXI= 10000
##$MC2= 0
##$MEAN= 0
##$ME_mod= 0
##$MI= 1.114404
##$NCOEF= 0
##$NC_proc= 0
##$NLEV= 6
##$NOISF1= 3.799351
##$NOISF2= 2.8
##$NSP= 1
##$NTH_PI= 0
##$NZP= 0
##$OFFSET= 15.70392
##$PC= 1
##$PHC0= -8854.335
##$PHC1= 7.800961
##$PH_mod= 1
##$PKNL= yes
##$PPARMOD= 0
##$PSCAL= 0
##$PSIGN= 0
##$REVERSE= no
##$SF= 200.130013532006
##$SI= 16384
##$SIGF1= 3
##$SIGF2= 2
##$SINO= 400
##$SIOLD= 16384
##$SREGLST= <1H.CDCl3>
##$SSB= 0
##$STSI= 0
##$STSR= 0
##$SW_p= 3612.71676300578
##$SYMM= 0
##$S_DEV= 0
##$TDeff= 0
##$TDoff= 0
##$TI= <>
##$TILT= no
##$TM1= 0
##$TM2= 0
##$TOPLEV= 0
##$USERP1= <user>
##$USERP2= <user>
##$USERP3= <user>
##$USERP4= <user>
##$USERP5= <user>
##$WDW= 1
##$XDIM= 8192
##$YMAX_p= 0
##$YMIN_p= 0
$$ End of Bruker specific parameters
$$ ---------------------------------
##NTUPLES= NMR FID
##VAR_NAME=  TIME,          FID/REAL,        FID/IMAG
##SYMBOL=    X,             R,               I
##VAR_TYPE=  INDEPENDENT,   DEPENDENT,       DEPENDENT
##VAR_FORM=  AFFN,          ASDF,            ASDF
##VAR_DIM=   8192,          8192,            8192
##UNITS=     SECONDS,       ARBITRARY UNITS, ARBITRARY UNITS
##FACTOR=    0.0002004,     1,               1
##FIRST=     0,             0,               0
##LAST=      1.6414764,     0,               0
##MIN=       0,             -215972,         0
##MAX=       1.6414764,     151977,          0
$$ Real data points
##PAGE= N=1
##DATA TABLE= (X++(R..R)), XYDATA
$$ [...]
1475e3j1k6L13p3l20K39k10O3K40K96k21k08J46o5J9K79k24R2k12J18l55K88M66
1498E81n35M2j02k95K64J76o9l60L04j2n4j00J40L7q5J34l48J31mK1JK23rk60
1522a79K60J17l1l99L99J2l21J57j9K34j59M7o5k31J17o6J76r9k61J73K74k42
1544a06k14K74J29j16j44J52P6j03J65r6Q5n6J87j70J39Pl32L00n8j72J91K98
1566D36m92J05J18k71J12P0Q2m04K29j38R5K09j66l00K05N9J6q4jq9J02R0M4j96
1590a69J16J05r7oQ2k63j4K12PJ32N4l10J62J10L24l47J42J16m27L6j1L32r4j59
1614C3J46o4m7k2k19RK31j98N2j48m5P5M0J07k95j06L93n8KJ05l07J07L93J7o6
1639A35p1j00P3L13r8k46O5K99l20o5J11J48j53J2L4k94l6M73m12M9n0j54P9J12
$$ plain form
1475 -53 -64 -90 223 150 -170 69 -141 -78 162 458 237 29 175 110 129 408 184 276 64 182 -173 115 581
1498 581 46 88 -14 -309 -45 131 62 -298 6 -6 -60 -160 -20 17 -68 66 -282 -151 -155 -134 -133 90 81 -179
1522 -179 81 198 167 -232 167 179 -142 15 -4 230 71 118 53 -178 -61 -127 49 -50 -311 -138 136 -106
1544 -106 -320 -46 83 -33 -177 -25 51 -52 113 17 102 46 233 63 202 209 -123 177 119 -53 138 436
1566 436 -56 49 167 -104 8 78 160 -244 -15 -153 -58 151 -15 -315 -110 -51 -35 -119 -120 -209 -107 -17 27 -169
1590 -169 -53 52 -45 -51 31 -232 -246 -34 -27 105 159 -151 11 121 445 98 240 356 -71 -35 -46 286 192 33
1614 33 179 115 68 46 -173 -164 67 -131 -79 -227 -272 -197 -157 -50 -345 -451 -58 -116 -114 -9 -316 -209 184 201 135
1639 135 64 -36 37 350 252 6 71 370 50 -15 96 244 91 103 137 -157 -193 280 -132 -83 -133 -287 -208 -96
1663i6k44J22L03p7k45J42K12k0m0m8j71J1L77j03j06o3P2J56j06Lk21K55Qk25
1687a04J85k64R9K27j51kK6P3M3j42j36%J25n4J41n9J5N3n0j68J81j18n4j19K91
1712C8k02J57p9N5P0j23M7L9J85j96O8J38k38J51j43L05l01M18j3k87M4P0J25
1735C28m27K39n3p4j19J92j08k63J06j71J29J26n5l91L84K17k18J2l4K62r7P8
1757F3l1k01L16M8k92j99K88K16p1j49O9m8m4J69j35J30k75K11q0r6J9J1K8K06
1781A53k71J20J8Q6Pj74J45o5K55j93j39j42J23o0K47r7K8o7q2P7j57Q7J41M1
1805H1k6j60Q5J09j43O7K6K0J17k75J7Q8J40j69n4n4K12L7qr8K1j81J47L5j12
1830g8m1J68oJJ04k43L15k74J91j53m5J4P7j32R9n2qj6O2O8Qn7J64L5k59j9J33
$$ plain form
1663 -96 -340 -218 85 8 -237 -95 117 97 57 9 -162 -151 226 123 17 -46 26 182 76 79 -142 113 121 -104
1687 -104 81 -183 -84 143 -8 -10 16 89 132 -10 -146 -146 -21 -75 66 7 22 75 25 -143 38 -80 -134 -253 38
1712 38 -164 -7 -86 -31 39 -84 -37 2 187 -9 59 197 -41 110 -33 272 -29 389 376 89 133 203 328
1735 328 -99 140 87 13 -106 86 -22 -285 -179 -350 -221 -95 -150 -541 -157 60 -158 -146 -180 82 -15 63
1757 63 32 -169 147 195 -97 -296 -8 208 137 -12 57 9 -35 134 -1 129 -146 65 -15 -111 -92 -81 -53 153
1781 153 -118 2 20 106 113 -61 84 19 274 81 -58 -200 -77 -137 110 13 41 -26 -108 -31 -188 -101 40 81
1805 81 55 -105 -20 89 -54 13 39 59 176 -99 -82 6 146 -23 -77 -131 81 118 110 12 33 -148 -1 34 -78
1830 -78 -119 49 43 44 148 -95 220 -54 137 -16 -61 -47 30 -102 -3 -55 -63 -79 -17 51 59 2 166 201 -58 -77 56
1857E6O4j94J50O9j43P6p3mR5Q5m2j88J44j14J02m6p8N4P6k01K15j65O4Q5j1j55
1883g9J37K2j75K24j8r6j66M1J99j37J4P5l4J13l1P7k67J73k24J1K27j37q7L0
1907a08J34qm2RJ5J61l32O3J61J74k38J88j74J0L6j32J37J67n4k91K57j36J3N2
1931F2j07K86k11n7P6R9k53J79r2M7r8l8K57j81p8J49j13Ln1J23K0j98J14J11
1955D9j40J17J44j96K8n4q2P6J26o9k5RmjJ04K1m5q1J18j14J52j78j9K61j25J26
1981A98k18o1J51k3j5J9l48L17m7P8P0k04P5J52k51M2J95k21n3K42j23R7k20K37
2005H9M7k73J78j29OJ53l6J2k40L41k36K31j46jJ41k17Q2N3l8J75j77j39J74k59
2029b09J67p2J39j60P3j20k0J00J40r3K11k08Q2q1K73j57o4J60k39K6J8J94k33
$$ plain form
1857 56 120 -74 76 145 2 78 5 1 96 181 139 -49 95 -19 83 37 -41 13 89 -112 103 -62 2 87 76 -79
1883 -79 58 80 -95 129 111 15 -151 -110 89 -48 -34 41 7 120 89 166 -101 72 -152 -141 86 -51 -138 -108
1907 -108 26 18 -24 -15 0 161 -171 -108 53 227 -11 177 3 13 49 -83 54 221 167 -124 133 -3 10 62
1931 62 -45 241 30 -27 49 148 -105 74 -18 29 -69 -107 150 -31 -109 40 -73 -70 -121 2 22 -176 -62 49
1955 49 -91 26 170 -26 2 -52 -134 -58 68 -1 -26 -17 -21 -22 82 103 58 -23 95 -19 133 -45 -64 197 72 198
1981 198 -20 -81 70 47 32 51 -297 20 -27 51 121 -83 -8 144 -107 -65 130 -91 -144 98 -25 72 -148 89
2005 89 136 -137 41 -88 -82 71 35 47 -193 148 -88 143 -3 -4 137 -80 2 55 17 192 15 -124 50 -209
2029 -209 -42 -114 25 -135 -62 -182 -202 -102 38 -55 156 -52 30 -51 222 65 1 161 -78 -52 -34 160 -73
2052g3J30k11J49NM5j33L51k03q5o6J64j73%L1J06j12N1r1k7K50j46J08l05J71
2076f4M7j61K1k2J47p0OP0O1Pk7M6p6k7n5K79j49o2J66p1J52l5j29O1l5l3J97
2103B44k88M6J92k50q2O5Q4n9j16K05n8j08J14j44L4O4MJ18q3rN4nk08J53J41
2128A08j6J9M5jk54QJ46j92Q1L6J24k63K90j5k60L19k33J63J1j63J91j75J00k18
2152a49P6J10j13J62K4j02j08M41l66j37K13O2j84J65r2j70p2J08K90l01J23M6
2174B6q0J09l1M0j84N4K5Mp0J89r2q1Q1j34r5J17J22M8n3j10K02l3j81J61k5L5
2200D4l6J24K44k45p6l2N6K2m6J00o0l0L0Pj59P5k4j61L98k00K6j57K03q9j37
2225a23J7j07K01k33N5K10j53O9l1O2Nr3n4RK38j56K45o6p8J56j20o4J47M8j43
$$ plain form
2052 -73 57 -154 -5 0 45 -88 263 60 -25 -91 73 -100 -100 -69 37 -75 -24 -115 -142 108 -38 70 -235 -64
2076 -64 -17 -178 -157 -179 -32 -102 -96 -26 35 42 15 61 -15 -42 -97 182 33 -29 137 66 218 183 54 115 80 47 244
2103 244 -44 2 194 -56 -138 -73 11 -48 -164 41 -17 -125 -11 -155 -121 -57 -53 65 -18 -27 27 22 -186 -33 108
2128 108 92 111 156 155 -99 -91 55 -137 -56 -20 104 -159 131 116 -144 175 -58 105 116 -47 144 -31 69 -149
2152 -149 -73 37 -76 86 110 8 -100 341 -25 -162 51 113 -71 94 2 -168 -240 -132 158 -143 -20 26
2174 26 -54 55 24 64 -120 -66 -41 -37 -107 82 -10 -91 -10 -144 -239 -122 0 48 -5 -115 87 54 -127 34 9 44
2200 44 8 132 376 131 55 23 79 101 55 155 95 65 95 102 -57 18 -6 -167 231 31 57 -100 103 14 -123
2225 -123 -106 -213 -12 -245 -190 20 -133 -64 -95 -33 -28 -121 -175 -166 72 -84 161 95 17 173 53 -11 136 184 41
2250D1P3Qj6j1nj24Q9N8j6j35J70k55L5K78k96P6j18J89j99J6J16rk76L07J51
2275A47j91pR7r0O6J8O2j88J00q0K66k58P0qj7k0r7J55j72J58K0M2j80K19J4p3
2301E3P9Km7j72Q5J02L1k27P9o0N4J20k39K46k05n0k0J21k4q0J97r9j05K61q3
2326A9L0L7N1k7j46r9K75k9j00O4q3m7K25j33J38j77K06m27K97N8j00n2r8J97
2350G9k14R9j04J76L30l86J41j08K6m2n6krl0j12L05j89R5M9m3l7kj89L90q5p0
2376A2nK8j14R3J62k87qj1K18q3N0k5P8l4j1j39N1On8J11p8O8k8J61j45M3j57
2403a02L61k93K2M3M9j36J0J17J3j27k17P6J63qnJ00l3j1j04J8J34M3j60lJ04
2428E4j2r6R6j00J15JNm8p3L4k1K01o1j57n1J73J1r9ol1ON2rj24R6j22K58l91
$$ plain form
2250 41 114 122 106 95 90 -34 55 113 97 -38 132 -123 -88 190 -106 -30 -148 41 -158 -142 -26 -35 -311 -4 147
2275 147 -44 -51 46 -44 22 40 102 -86 14 -66 200 -58 12 4 -13 -33 -130 25 -147 11 31 73 -107 112 126 53
2301 53 132 134 87 -85 0 102 133 -94 -15 -75 -21 99 -140 106 -99 -149 -169 -48 -72 -152 45 -54 -159 102 19
2326 19 49 86 137 110 -36 -135 140 111 11 75 -8 -55 170 37 175 -2 204 -223 74 132 32 -20 -118 79
2350 79 -135 -36 -140 36 366 -20 121 13 39 -3 -59 -61 -70 -100 -212 93 -96 -1 48 5 -32 -34 -223 167 82 12
2376 12 7 35 -79 14 176 -111 -119 -130 88 5 55 30 108 74 63 -76 -25 -19 -77 34 -44 24 -4 157 12 55 -102
2403 -102 259 -34 -12 31 80 -56 -46 71 84 -43 -260 -184 -21 -29 -34 66 33 22 -82 -64 70 113 -47 -50 54
2428 54 42 -54 42 -58 57 58 63 15 -58 -24 -45 156 95 -62 -113 60 71 -28 -34 -65 -59 -7 -16 -140 -44 -166 92 -299
2456b99K44O2m0n9j7R8O8P1k41j7J09q3L6j04K37J4j35K3K4J61m8n8q2J33J19
2481B16l06J19MQ2J12k31j01K90j98L4j8p9N3Q1p1o3J39j24K72k92J19j18J35
2504E5N6j61r3J20J52j48j23L59j03j97L8m9J92k8m0j2k2l6QJ39m0p8K84k07j99
2529a33R7oJ23r2p9J37j18r7K23L0j54l5J62P3j29Kj5j44J81O4Q2k66K36k32l
2554i3p5o3K95j50J57k18j02J46J31P8j47L3j51K7j41j3L35j07J27j80L74k32
2576C1RRK16m30P2J54Nn2l1J35j6j15J36N2j66O4K0j46j4lP9J0J01j52J02k38
2602a68K90j30L6p9l6K58l98J68m7R7J44j64q9J89k9j18K18j52J5n0oj64K17J19
2626A21k3j09N4j69K0J88l5j70N7MK07j98J46q9K3Q4l2k72K02j04O0N0J20j45
$$ plain form
2456 -299 -55 7 -33 -92 -109 -11 57 128 -113 -130 -21 -104 -68 -172 65 79 -56 -33 -9 152 104 46 -36 97 216
2481 216 -90 29 33 115 227 -4 -105 185 -13 21 3 -76 -23 58 -13 -76 63 -61 211 -81 38 -80 55
2504 55 111 -50 -143 -23 129 -19 -142 217 114 -83 -45 -94 98 70 30 18 -4 -40 -32 107 67 -11 273 66 -133
2529 -133 -36 -42 81 -11 -90 47 -71 -168 55 85 -69 -104 58 131 2 4 -11 -155 26 90 172 -94 142 -90 -93
2554 -93 -168 -231 64 -86 71 -147 -249 -103 28 106 -41 -8 -159 -132 -273 -286 49 -58 69 -111 263 31
2576 31 40 49 265 -165 -93 61 66 14 -17 118 102 -13 123 175 9 73 93 -53 -67 -70 9 19 120 -32 70 -168
2602 -168 122 -8 28 -51 -87 171 -227 -59 -106 -9 135 -29 -118 71 42 -76 142 -10 5 -45 -51 -215 2 121
2626 121 98 -11 43 -126 -106 82 47 -123 -66 -62 145 -53 93 4 27 111 79 -193 9 -95 -35 15 135 -10
2650a0j5J05k06M0Mn0K87n6k8l19K78j1r4pLj3k5K77K6j49J07k24R1Q1k16K8J66
2677G0J27j99r5K43n6k40J99N1m8j64J14k09L30k15l9K55k2k27J44M1l8l3J03
2700I2n8j70R9P5p4P0r7N4K1k8L1J42j62j50J85%j14J5R4j65P2J05j8j69p0K11
2726iL6r3R2l8J56k32J87r9Q7J3k01J67k10J13J08j04O0j26N7J69j08K4J22j13
2750E8j12J90kr5l2N5Mj38L5k18K34K7r5J12k1p3K6K55qj63k85J80M4r0K01r4
2776er8j8J41K1mj17J3J36P4K4q8j7P8k90R9K18q1K8J1N0j98J6j4K3m8L5J34J67
2804B90l30m2J24k6q0K41p0j30o2J5O9j51K23j19O5Mj4P7R0j11k09R9M9j82J45
2829c5L3j10J18J51j29k34M45k02j11J06j75J75k5K9k6j8J86k22n3J2J29k21R0
$$ plain form
2650 -10 -25 80 -126 -86 -82 -132 155 99 71 -248 30 19 -75 -82 -79 -92 -117 160 186 37 144 -80 11 92 -124 -96 70
2677 70 197 -2 -97 146 90 -150 49 100 52 -112 2 -207 123 -92 -131 124 102 -125 19 60 22 -11 92
2700 92 34 -136 -37 38 -36 34 -63 -9 12 -16 15 157 -5 -155 30 30 -84 -69 25 -140 -68 37 19 -150 -220 -9
2726 -9 27 -66 26 -12 144 -88 99 0 87 100 -101 66 -144 -31 77 -27 33 -93 -36 133 25 49 171 58
2750 58 -54 136 134 39 7 62 66 -72 -37 -255 -21 6 -89 23 2 -71 -45 210 202 39 -246 -66 -22 -112 89 -5
2776 -5 -103 -121 20 41 37 -80 -67 69 143 167 79 62 140 -150 -51 167 86 114 125 175 -23 -7 -21 2 -46 -11 123 290
2804 290 -40 -82 42 16 -64 177 107 -23 -85 -70 -1 -152 71 -48 17 21 7 84 174 63 -146 -47 2 -180 -35
2829 -35 -2 -112 6 157 28 -206 239 37 -74 32 -143 32 7 36 10 -8 178 -44 -97 -85 44 -177 -87
2852h7J16m1K02k61J38j94J67J73j90J62k94K02j72M6J46l18Q3J38J14K6k40O5
2874a9K4J07k4k44J17R9R8j03j53R3k7p4k05K74J73m42L01r1nJ84j95J96r5k2
2898c3j8q2J79K44j54j11N1j72K02k46P2j41J55M7j00L6j4K49j46R3k23J86k96
2921b22K89l8J00j99o4J53Q3j55J13M8j91l9J56j44R3M2j1J7j18J63l6K08k00
2944D8pq6Q4mr7q2K13l38J53O7k08L52r5L8j91K14M6J31k36p7K07j82j50J60l3
2969g3K38k13Ok5L7m3K32mk55J97R1j28j19K17N9k26J31l32J97N8M4o5L1j37N0
2994c2Q6j43jJ80k77k27N37j38K4j12J59n2j96M19k20q5J98M3q4k4J23j92L9J06
3018A31j70J27r0k20K69j0%j05j21K05J54k26J86m14L65q1J63j46j6jk38N81k55
$$ plain form
2852 -87 29 -12 190 -71 67 -127 40 213 23 185 -109 93 -79 -33 113 -205 -122 16 130 156 -84 -19
2874 -19 5 112 88 -156 -39 60 158 55 -98 -5 -32 -106 -311 -37 136 -306 -5 -96 -101 83 -112 84 -11 -33
2898 -33 -51 -133 46 290 136 25 76 -96 106 -140 -68 -209 -54 -7 -107 -71 -85 164 18 111 -112 74 -222
2921 -222 67 29 129 -70 -134 19 102 -53 60 108 -83 -122 34 -110 -17 25 14 31 -87 76 40 248 48
2944 48 41 -45 39 35 -62 -144 69 -269 -116 -49 -257 95 0 38 -153 61 107 238 2 -75 132 -50 -200 -40 -73
2969 -73 165 -48 -42 -67 -30 -73 159 155 -100 97 188 60 -59 158 217 -9 122 -210 -13 45 89 24 55 -82 -32
2994 -32 54 -89 -90 90 -187 -414 123 -15 9 -103 56 4 -192 227 7 -78 120 163 79 55 178 -14 25 131
3018 131 -39 88 -2 -222 47 37 37 -68 -189 16 170 -56 130 -284 81 0 163 17 1 0 -238 343 88
3041H8r4L4n6L4l3pK31k75l6L0K73k20J47l1O2p0k73J51J34j90K51q6m4l7j20
3066a37J33k03J88L1K9K0o0M6L9m6K4R7qj98n0K1M8M9Q7K6m62K72l2kR6l3J96
3093A71l3p3L6l6J25k76K0j18P4P1J41j28L9m36L76%J19k83K88p0j17k8P4m4j5
3118a23K36m7k9r1J4O3oj05N7J25k5j62K1J73Lj48Q8k4J2m5%n5j39J93m0m5N6
3145d3R7P1q5J3rj19P8j67P6K29j00k16R1J5L2K72j51p9j0j15l5P4J70j99m1K73
3171A22j69J34n3j74q3L61k11J49k42J58j16j25L66j17O9l26P7K17L0j90K22l7
3193F2K4j29J53p3j44L5J07l5L7m7j42J56q6J16J4K0J48n3N1k64J15k21K98j21
3217B1k60K38r6Q5j69J98o8J33n2KNNj02q8K15r4j08J15m2J43r3P4p9n5K11q0
$$ plain form
3041 88 -6 28 -28 6 -27 -34 197 -78 -114 -84 189 -31 116 85 147 77 -196 -45 89 -101 150 64 20 -17 -137
3066 -137 -4 -207 -19 12 41 61 1 47 86 40 64 161 153 -45 -95 -74 -26 23 110 136 -326 -54 -86 -88 8 -25 171
3093 171 138 65 101 65 190 -86 -66 -184 -110 -39 102 -26 13 -423 -47 -47 72 -211 77 7 -110 -138 -64 -108 -123
3118 -123 113 66 37 -54 -40 23 17 -88 -31 94 69 -93 -72 101 104 -44 44 20 32 -13 -13 -68 -207 -14 -54 -99 -43
3145 -43 54 125 40 53 44 -75 3 -164 -88 141 41 -175 -84 -69 -37 235 84 5 -5 -120 -155 -81 89 -110 -151 122
3171 122 -47 87 34 -140 -223 138 -73 76 -166 -8 -124 -249 117 0 69 -257 -180 37 67 -123 99 62
3193 62 86 -43 110 37 -107 -72 35 0 37 -10 -152 4 -82 34 48 68 216 163 214 -50 65 -156 142 21
3217 21 -239 -1 -97 -12 -181 17 -51 82 30 32 37 42 -60 -148 67 -27 -135 -20 -62 81 -12 62 -17 -72 139 59
3243E9k23P6J65p1J16k42J62p6J87j18L7R1k11o7K47p4mk3k14K86p4P9j01O2l1
3268C8m1J5R1k98L39L0r1N5q8J53k65L6J43j63J9nL3j01N1Q5J3j05k0j65K06m
3294c9j8J23j77J88k09r6J66j05R7j26J04J29k0j61N3N3L4L7j33K26j34O3j8M0
3318G7k51J82j51n8L34l24K25j70Q3J82k15R2o7K33p4k23K16k6j07p8J59r6P5
3341A8k40K39N9Ol4l3K6N2k6j96j9M8K11k47J92j35J24k6n4L2K9r3J27n4M7r0
3367c7p4K82qq4n3p1L3j27J29o7J90o2L2Km0rP2J50k74k9J38L9j13j28J44pR0
3394A18k66n1L02j42j22J92J33m7q2k15J77j21jJ7J67k6p8J12j41rm9K30j64L2
3418c4K3M8p9O8K0p8J23l1o8j7n6J15p4R9k2j39J93m9k52J11K23j44J63k1l2r5
$$ plain form
3243 59 -164 -88 77 6 122 -120 42 -34 153 35 72 163 -48 -115 132 58 54 31 -183 103 29 108 7 69 38
3268 38 -3 12 103 -195 144 174 83 138 50 203 -62 -26 117 -46 -27 -32 1 -100 -49 36 49 -56 -76 -241 -35 -39
3294 -39 -57 66 -111 77 -132 -228 -62 -167 -70 -196 -92 37 17 -144 -91 -38 -4 33 -100 126 -8 55 37 77
3318 77 -174 8 -143 -201 133 -191 34 -136 -53 129 -86 6 -61 172 98 -125 91 65 -42 -120 39 -57 18
3341 18 -222 17 76 82 48 15 41 93 67 -129 -148 -100 111 -136 56 -79 45 19 -35 -3 26 -67 60 6 53 -37
3367 -37 -111 171 163 79 26 -45 -12 -139 -10 -77 113 51 83 85 45 36 108 258 -16 -45 93 132 19 -109 35 28 118
3394 118 -148 -199 103 -39 -161 31 164 117 35 -180 -3 -124 -125 -108 59 33 -45 67 -74 -83 -132 98 -66 -34
3418 -34 -11 37 -42 26 46 -32 91 60 -8 -25 -81 34 -40 59 37 -102 91 42 -210 -99 124 -20 143 122 90 -5
3444eK6n5J00p4p4J1J67k40J71K01l53J28J42k88L19o0j85j0m6j6L60l00J32j36
3468h5R6k8K15j04k13J90n2j5j63J95j94K22q2MQJ31l1j85J11k7Q1K5j74N3Q4
3493F2n7j06pJ37J71l00K0Jo3R7j01L23j73K25m74K34J1M7Q8k46PP0q5K5L3j50
3519b11o7J69J17J7K06l39j1j1J79m9J22O8p4k6l59L39p1P2k65oJ49q0K77j37
3543IL2R7j43q5K90k66J5o3kJ27r5N3K10m12K73K19l25Q3N7O6j03o6J10q2P1k17
3569a47Q1R2l1Q5Q4j79l5m3K7Q6k09K69j81Q9K43k51R2p6J87k29J3P5m0O1mJ06
3595A65j33O1N5o8j8j2n6j22R4p6K49j60l3M7L6QJ04N8l29J01R0P9j33o1n3J47
3621D0J06l09K49j65J88k23J94j57j6nJ71j5N7J4k0O7k48K44k55K04K1j16m8K02
$$ plain form
3444 -5 21 -34 66 -8 -82 -71 96 -144 27 228 -125 3 145 -143 176 116 -69 -79 -125 -141 219 -81 51 -85
3468 -85 11 -17 198 94 -119 71 19 4 -159 36 -158 64 -18 -14 -6 125 94 -91 20 -7 74 99 -75 -22 62
3493 62 5 -101 -108 29 200 -100 -80 -79 -142 -45 -146 177 4 229 -245 -11 0 47 135 -111 -104 -34 -119 -94 -61 -211
3519 -211 -278 -109 8 25 231 -108 -119 -130 49 0 122 190 116 90 -269 70 -1 71 -194 -200 -51 -131 146 9
3543 9 41 138 -5 -90 200 -66 -51 -114 -116 11 -84 -31 179 -233 40 259 -66 17 74 140 37 -29 81 -1 70 -147
3569 -147 -66 26 -5 80 164 -15 -50 -93 -66 20 -189 80 -101 -12 231 -20 72 -4 183 -46 -33 42 2 63 59 165
3595 165 32 93 148 80 62 50 -6 -128 -34 -110 139 -21 -54 -7 29 37 141 199 -130 -29 61 140 7 -54 -107 40
3621 40 146 -163 86 -79 109 -114 80 -77 -93 -98 73 58 115 129 109 176 -72 172 -83 121 142 26 -22 180
3645A80j69j06K39j29p9K15k86P2m8K4J18j18K37j90M2Q2j07Ok12J63K0n3J97
3668I8j64p6K69k72P7N8j33R2J07O5j2j08J07k01M6K10l1k35J88r3%R8rq9j7Q5
3694F0n1j9J10j01oJ71n7m4k59J84p6J31j08j21K50Nn2J57j77n4J32j21P9j22
3718h9J48m9J36l04K54j36m8J01O1k50K47K23j86l5J11j83k2K6j76P0N6J40l58
3741b63L39j12J65K3j35k8J54k62J75N9l8M8o4j14N8j0K03j68J43k65J69j09J21
3764H9m2j20k5J1K19j54K2k40K90j89J20k11K22o0R2k38K28j80K95j83q8K58K
3787A18p9L2o6J17j44l3Q7j22J32k12J11kJ16n1P3k30L54k60Q4m8k8k1O9m4J36
3812H9n8J30k13N1O2j45J38n1M3J08k02n0K27j06r0L3k17J18K50k48J07J02j19
$$ plain form
3645 180 11 -95 144 15 -64 151 -135 -63 -111 -87 31 -87 150 -40 2 84 -23 -17 -229 -66 -46 -99 98
3668 98 -66 -142 127 -145 -68 -10 -143 -51 56 121 109 1 108 -93 -47 163 132 -103 85 -8 -8 90 81 -8 -25 60
3694 60 9 -10 100 -1 -7 164 107 63 -196 -12 -88 43 -65 -186 64 69 17 174 -3 -57 75 -46 33 -89
3718 -89 59 10 146 -158 96 -40 -88 13 74 -176 71 294 108 73 184 1 -21 5 -171 -101 -45 95 -263
3741 -263 76 -36 129 152 17 -11 143 -119 56 115 77 125 61 -53 5 -5 198 30 173 -92 77 -32 89
3764 89 47 -73 -98 -87 132 -22 0 -240 50 -139 -19 -230 -8 -68 24 -214 14 -166 129 -54 -142 116 118
3787 118 39 71 5 122 -22 -55 32 -90 42 -170 -59 -61 55 4 77 -153 201 -59 25 -23 -51 -72 -3 -47 89
3812 89 31 161 -52 -1 61 -84 54 3 46 154 -48 -98 129 23 -67 -34 -251 -133 117 -131 -24 78 -41
3835d1J19k26j5J22J05p5j02J32k38K27L9j01o6J01K5J25J46j33j94M6R9n8k14
3858a77K17o0M2K5L3j37P9l9R0M8m0j14j9K31q9j09J30m2p1j85K62k40J54J07
3882I6k90K61q6l54K72J27l2j64R7L2r5R0q1k5J77K45k34j45L4q3J67j3J76k22
3906e0J65j13k08J95J28j59Rl3J24j78L00J7j53P8j10j9J68k41K6Q6J17j78j13
3929a42K03P8k30J73n1j69j8J66J32k80K81j82m6J50l1j22K69q0M1q6j71NJ24
3952A4O8k04k44K40J10m5j04Q4P6p2P8Q5l0l6L5n0q9J34Q4O3o8j22L5J03k8j47
3978c0J63n5l85K02J25n3j03K03o9m0J78j98n0J62k24K5J81r9o9J17J47q3O3j11
4002cJ9j56K62p3k99J70l3J0K38p4j11Q2K10m33K97k6M0k10J79L3k29O1Q8n9J19
$$ plain form
3835 -41 78 -148 -163 -41 64 -11 -113 19 -219 8 47 -54 -120 -19 6 131 277 144 -50 -4 95 37 -177
3858 -177 40 -20 22 47 80 -57 22 -17 73 121 81 -33 -52 179 90 -19 111 69 -2 -187 75 -165 -11 96
3882 96 -194 67 -19 -373 -101 26 -6 -170 -73 -41 -136 -46 -127 -152 25 270 36 -109 -75 -158 9 -4 172 -50
3906 -50 115 2 -206 -11 117 -42 -33 -66 58 -120 180 197 44 122 12 -7 161 -80 -54 32 149 -29 -142
3929 -142 61 139 -91 82 31 -138 -156 10 142 -138 143 -39 -85 65 34 -88 181 101 142 56 -115 -110 14
3952 14 82 -122 -366 -126 -16 -61 -165 -81 -5 -77 1 86 56 20 55 5 -84 50 134 197 129 7 42 145 117 -30
3978 -30 133 78 -307 -105 20 -33 -136 67 -2 -42 136 -62 -112 50 -174 -149 32 -67 -136 -19 128 45 108 -3
4002 -3 16 -140 122 49 -250 -80 -113 -103 135 61 -50 32 242 -191 106 80 120 -90 89 122 -107 -46 42 -17 102
4027A02Q4k51K54j54j05OL23j69k87L61k45j86K14l1j7K04l13K54k55J98J07k64
4049a70J83N4j08l0P9P0k7n5m0MJ00o4n9lJ04j94J85Q4j23PP9j07J35j47k50M32
4075A39p4p5o7k8K00j19M0P5j3Nn2O3J14o1j73R7j15K24j78J58r3N5Kk3j44q1
4101a24K11j4l07K2K22J06Lr7O0j96o7K35k9q8j2n3J51o8r0J15J29j30O6J21j68
4126bj54K26o6n2J13k0nL5j19K16o8n5j54K23jk55O2K14j29RO1O4k28J93j31j18
4152a41K6p4L10k38J05j64J52p8P7j36J16Q6r9J05O2j94k8J30j68q9K22J65j17
4175C0j66J58n5J54j45l1p7K12j59l4J64m3j40J19N9j49kK36O8q2k22j5O0K18
4199A58j81R5p1M9l4j0N5o4j42K89j06p6r3k9L36j02k9j1j05J90k17R5j29J11
$$ plain form
4027 102 186 -65 189 35 -70 -64 259 90 -197 164 -81 -267 -53 -84 -101 103 -210 44 -211 -13 94 -170
4049 -170 13 67 -41 -71 8 78 51 -4 -44 -40 60 -4 -63 -66 38 -156 29 113 -10 -3 76 -31 104 -43 -293 139
4075 139 65 -10 -77 -105 95 -24 16 91 78 83 31 94 208 147 -26 71 -44 180 2 160 67 122 124 101 -43 -124
4101 -124 87 73 -234 -212 10 116 119 22 82 -114 -181 54 25 -63 -75 -128 23 -45 -135 -20 109 -21 45 166 -2
4126 -2 -156 70 4 -48 65 45 40 75 -44 172 104 49 -105 118 117 -138 -76 138 9 18 79 143 -85 108 -23 -141
4152 -141 -115 -189 121 -117 -12 -176 -24 -102 -25 -161 -45 41 -58 47 109 -85 -113 17 -151 -240 -18 147 30
4175 30 -136 22 -33 121 -24 -55 -132 80 -79 -113 51 8 -132 -13 46 -103 -105 131 199 117 -105 -120 -60 158
4199 158 -23 72 1 50 16 6 61 -3 -145 144 38 -38 -131 -160 176 74 45 34 -71 119 -98 -3 -132 -21
4223b1m1L2m5M3o0K25k03M0K49k35Qn6K17j70L9m1j05Q3p4M0K48j79j10Q5J50
4248A19n7J45O9k93K6N5K51k23m9r4N7K41j97j3m8L42k08l05M26k17j05k8J40
4271C4k16L1J23K5l4J42k09P8r9J6Q8O7m0o5Q7R0j82j01K00p0j44P3K16j78J1
4296e7j9Q3j09m3K16n5n8J11l14K79j8p1O0R1q6K7N7k3j35K53j42j19j6J66k26
4321a48J43O0R0k37K19j50r1P9R4r7K00J7k8j14p6j38R5P6q3o9l6J12O2K04k12
4346b8o1K79n5q8k34L64k74lJ91Pj47k8J71j51N9o2j8R3m2n5l1J61j2K3k2O3m6
4373E4Q6m1k20K58q8m5j62J61n3m2K23O8j43K01m6k28j50L91j73j49J97j95M2
4396e4L1j9p1R0N7j09l6J24o0K8k28M5J71m7P7P7m8j40L9l4J78j65m2J51m7M6
$$ plain form
4223 -21 -62 -30 -75 -32 -92 133 -70 -30 219 -16 -8 -64 153 -17 22 -19 -124 -41 -115 -75 173 -6 -116 -31 119
4248 119 62 207 276 -17 9 64 315 92 43 -51 6 247 50 37 -11 331 123 -182 244 27 -78 -106 34
4271 34 -182 -151 -28 -3 -37 105 -104 -26 -125 -109 -21 46 6 -59 28 118 -64 -165 35 -35 -179 -106 110 -68 -57
4296 -57 -76 7 -102 -145 71 16 -42 69 -245 34 16 -55 5 96 10 37 94 71 -64 189 47 -72 -88 78 -148
4321 -148 -5 55 145 -92 127 -23 -114 -35 59 -38 162 179 151 37 -39 -177 -82 -6 -89 -158 -194 -82 -20 184 -28
4346 -28 -89 190 135 47 -187 177 -97 -100 91 98 -49 -77 94 -57 2 -60 -78 15 -27 -82 -113 48 36 59 37 100 54
4373 54 140 99 -121 137 49 4 -158 3 -50 -92 131 199 56 257 211 -17 -167 224 51 -98 99 -96 -54
4396 -54 -23 -42 -113 -23 34 -75 -111 13 -47 -19 -247 -202 -31 -78 -1 76 28 -112 -73 -107 71 -94 -136 15 -32 14
4422A4M7L2J43l21K08n5R9N7j82J8o0r4Q2R2j73J91j17J58q5j17l3J58n2J7n2
4447b5J28R5k30j75K63n6j99J40R6k16L13j11j38J35m7q6J42j84o9K51J03j40
4469a0j50K00j53L6p2K08k7j06nJ76j46J9R2k3r5K35Pk63J38j08R6j4J3K3k45
4494a74K06j7k68M76k70Q3O4J30q4j53M6j51o9L47l31L71k26J40j80J22n5r9J21
4517B9O2p7J0O8k51J72p9K31k54J24q2Q2o2QK4M1n8K06k09p9J6K97j89J4m9K1
4543A6O4j50N0j81J23J93Jj70K94j48kL3j12j6Q5j10Nl4K41j97p5K52j38j01j3
4568i0J42j56Q3M8j6rP7p5M8M8k18K4J79OK1k94L32k31j3K26j00o3QJ46k03J72
4594I2j62N0k23K37r0R6J33j71N0l23L57r3J81n7P4l18Q0Q7J34j81N8j21K06n4
$$ plain form
4422 14 61 93 236 -85 123 68 167 224 42 60 0 -94 -12 80 -93 98 -19 139 54 -63 -96 62 10 27 -25
4447 -25 103 198 -32 -207 56 0 -199 -59 37 -179 134 23 -115 20 -27 -113 29 -155 -224 27 130 -10
4469 -10 -160 40 -113 -77 -149 59 32 -74 -79 97 -49 -30 62 39 -56 179 186 -77 61 -47 49 35 48 71 -174
4494 -174 32 15 -253 223 -47 36 100 230 146 -7 39 -112 -181 166 -165 206 -20 120 -60 62 7 -92 29
4517 29 91 14 24 92 -159 13 -66 165 -89 35 -47 35 -27 -19 5 46 -12 194 -15 -94 -78 219 30 44 -5 16
4543 16 80 -70 -20 -201 -78 115 116 -54 240 92 90 123 11 -5 80 -30 -25 -59 182 -15 -90 162 24 -77 -90
4568 -90 52 -104 -21 27 11 2 79 4 52 100 -118 -94 85 91 112 -182 150 -81 -94 132 32 -31 -23 123 -80 92
4594 92 -70 -20 -243 -6 -96 0 133 -38 12 -311 46 -47 134 77 151 -167 -87 0 134 -47 11 -110 96 42
4618D2J08j31k64L36q8O4p0p3J52O6j20j29K98j75k36K20K02m4k97K95k54RN0
4641c9Q8N9o8L0k73M1j08J85L11n34L80K9p7R1J24P9l80O1p9J90r9J8K3J2k26
4666a62O0K4J69q4j95R5K26j40oj21J56o2n9R2J86l38K39l14M47q5j89K16k59
4689a04Mn2J35P7j92K5L3O8j53K01j61K53k7k58J55o5o9J6r9M67j63OJ87l10l70
4714c96M57j57L1J71rj33K9l6LJ09j23J17k13J42m4R3R2j02j37L44j30j24j58
4737a74M4J11p3J44n6j44J46M0m6r0k3J39j8j0R7j10R3k14J25P2q4P6j56Q5J7
4762ikr4J28R0k5k07J66p6n3q5J56l6j27J46R0j54J67Mj08P9k05Q0k7J20j6j13
4788a11n4J46N0m9j62P7O5R5K6j80p0K31j36p2K04P3k77J13k3j67L94j94Q7o2
$$ plain form
4618 42 150 19 -245 91 3 67 -3 -76 76 142 22 -107 191 16 -220 0 202 158 -139 156 -98 -89 -39
4641 -39 49 108 40 70 -203 -162 -270 -85 226 -308 72 101 24 115 239 318 -62 -1 -80 110 11 29 52 64 -162
4666 -162 -102 -78 91 7 -188 -93 133 -7 -13 -134 22 -40 -99 -7 179 -159 80 -234 213 128 -61 155 -104
4689 -104 -100 -152 -17 60 -132 -107 -74 -6 -159 42 -119 134 107 -151 4 -61 -130 -114 -213 254 91 97 284 -26 -396
4714 -396 61 -96 -65 106 97 -36 -7 -43 -40 69 -54 63 -150 -8 -52 41 133 31 -106 238 108 -16 -174
4737 -174 -130 -19 -92 52 -4 -148 -2 38 -8 -98 -121 18 0 -10 87 -23 70 -144 -19 53 -31 45 -111 -26 -9
4762 -9 -11 -105 23 113 88 -119 47 -29 -82 -167 -11 -47 -174 -28 62 -92 75 79 -29 50 -155 -75 -102 18 2 -111
4788 -111 -165 -19 31 -18 -180 -103 -38 57 83 -97 -167 64 -72 -144 60 133 -144 -31 -54 -221 173 -21 66 4
4812Dj76K61j3K5p3J6m9R4k47L77r3k27J45J24k00r0K9K58k8k67J38p5J37L4l9
4837F5O4l2j9R7j71j3L0m1nj46K49j05R5K51k30q3J62j80j44K20l1N6m3p5J79
4862A50l47K52R1j82p2J97j50j9j3J21j59J02J9PJ81%j89PpJ09L1m8j81kJ92l2
4888E8L0k22K84j30j96K78jr8Q4o4o5K6RL8o9N6P8k16J82pk02J49R7K3q0j39J95
4915I8o7j69L37k25O9p6j5o8J5r3K68P8j74J56j04q4O5O3k7n2k61K93j26M9K0
4940c0J68O2j36j46J41o2j59K98l1o2j49J88j54P1P0o9O4j57J36P9o2k4J5m1P5
4965H5j07j42K08Q9j49k3J5n5O0l27K22QPJ96N0j39j19K2q4K56k73P6j3M1J44
4990D8P9m9j31n3K05k30J84k09K30J70k36J4l7J57j65jm6J68l2j05R2l7j31k9
$$ plain form
4812 4 -172 89 76 101 28 44 -5 89 -158 219 126 -101 44 168 -32 -122 -93 165 137 -130 8 -67 70 104 65
4837 65 129 97 78 175 4 -9 21 -20 -25 -171 78 -27 68 319 89 6 168 -12 -156 64 33 89 46 -29 150
4862 150 -197 55 146 -36 -108 89 -61 -80 -93 28 -131 -29 -10 -3 178 178 -11 -4 -11 98 129 81 -100 -102 90 58
4888 58 88 -134 150 20 -176 102 101 3 87 23 -42 -16 -7 31 -38 18 96 -120 62 55 -147 2 99 122 42 -97 98
4915 98 31 -138 199 -26 43 -33 -48 -116 -101 -194 74 152 -22 134 30 -54 11 74 47 -5 -266 27 -99 -50 -30
4940 -30 138 200 64 -82 59 -3 -162 136 105 43 -106 82 -72 -1 69 0 64 -93 43 122 60 36 51 10 85
4965 85 -22 -164 44 133 -16 -39 -24 -79 -19 -346 -124 -116 -109 87 137 -2 -121 -99 -183 73 -200 -124 -137 -96 48
4990 48 127 78 -53 -106 99 -131 53 -156 74 244 8 22 -15 142 -23 -24 -70 98 66 -39 53 16 -115 -144
5014a44K06j2o9R0j88K55m1o6P4l5j45K30k12l5O5L8k2p7J01j9j67M8K09M4k05
5039g7m6L26j16j0p7k02j0J51J16m4p2kL49j15m09K11J56j97L66k71j20J49o9
5062a3l0Q3j09R6N9j30N0k04L70j38oO7j30J22L6k05J65j94l8L64k68j10J24N
5086c4j7K38j44j0j1j26n3J50J8n9k32K64P9j75m3R3Pp9kN2J80J1l31K67J07l04
5112a54L37q8j50o5K20j24j77J62J65J20l65Q0N4P5j49K28j41j2l1j36J65N6j41
5135g1P5O0k13J4mK88l24K31Jj25j07J36M9l2N4m9j1N8q6n3L27k77k39N52l53
5160i9R8j51J30j4m1R7l8K2J5j97K52M4l7j49Q4j75K42J13k57J27R7j12M5j58
5184f2L7P0j6kpk6o1k3R5l8K87l06j05K80K7k88K84k68K2N6J24k31pN9J38lr5
$$ plain form
5014 -144 62 50 -19 71 -117 138 97 31 105 70 -75 155 -57 -92 -27 11 -11 -88 13 -6 -173 -125 84 128 -77
5039 -77 -123 203 87 77 0 -202 -212 -61 55 11 -61 -63 286 171 -238 -27 129 -68 298 27 -93 56 -13
5062 -13 -43 40 -69 27 86 -44 6 -198 172 34 28 95 -35 87 123 -82 83 -111 -149 215 -53 -163 -39 -34
5086 -34 -51 187 43 33 22 -104 -157 -7 11 -48 -280 -16 63 -112 -155 -62 -55 -134 -136 -84 96 107 -224 43 150 -154
5112 -154 183 95 -55 -120 100 -24 -201 -39 126 246 -119 -39 15 90 -59 169 28 16 -15 -151 14 70 -71
5135 -71 4 64 -149 -135 -139 149 -175 56 57 -68 -175 -39 10 -22 32 -17 -28 30 -56 -109 218 -59 -298 254 -99
5160 -99 -1 -152 -22 -36 -77 20 -18 4 19 -178 74 118 81 -68 16 -159 83 196 -61 66 163 51 96 -62
5184 -62 -25 45 29 27 20 -6 -67 -90 5 -33 254 -52 -157 123 150 -138 146 -122 -100 -44 80 -151 -158 -99 39 36 -59
5211e9K02k2p5m5M5j26j9O1m6K26j16p2J78M2k66K35m6j47L8oq0J03J0J0q5K9
5237c1K31l48K24m0j05N6j48J94r0m8J84m1P8j04J10j82J11k8J03n0n4n2J31l09
5261b08K47N6j46J38n4Q1j15l2J4L8J85l07P9j9OM3j99J40J4J48j25K3j30J63
5285D0J30k63J17j17J75N6L6j95q2J90r5P4lj67M7O7n5M3o1J07M9k79J51Oj36
5310a65K90m6k98J26KK47j16N6j70P3J69l24J15J56j10j60O4N4o5n2O8J90j19
5333a5K02m0j31j96K28j36n4J05K34k60m6K0J56j16j41J25J50rj6r5P3K6N9M0
5357A63l32R1J34l0Q3j54J01Q4l48J52J7J07k32K16j24J31m6J4k00K89n3k25K57
5380I5l1J35j30j13J40j60J37k07J67j03P8o8J44k62J49k0L4l6Q7K44m20K35m3
$$ plain form
5211 -59 143 121 46 1 46 -80 -99 -38 -84 142 26 -46 132 174 -92 143 97 -50 -12 -18 -98 5 15 25 -60 -31
5237 -31 200 -148 76 36 -69 -13 -161 33 -57 -105 79 38 116 12 122 -60 51 23 126 76 22 -30 101 -208
5261 -208 39 95 -51 87 33 114 -1 -33 -19 19 204 -103 -24 -43 -37 6 -193 -53 -39 109 -16 7 -123 40
5285 40 170 -93 24 -93 82 138 174 -21 -103 87 -8 66 63 -104 -57 10 -45 -2 -63 44 93 -186 -35 -29 -165
5310 -165 125 79 -219 -93 -91 156 40 96 -74 -1 168 -156 -41 115 5 -155 -91 -37 -102 -154 -86 104 -15
5333 -15 187 147 16 -180 48 -88 -142 -37 197 -63 -109 -89 67 -49 -190 -65 85 76 60 -35 38 64 123 163
5357 163 -169 -78 56 26 109 -45 56 140 -208 -56 -39 68 -164 52 -72 59 13 27 -173 116 63 -162 95
5380 95 64 199 69 -44 96 -64 73 -134 33 -70 8 -60 84 -178 -29 -49 -15 -51 36 280 -140 95 52
5403E2j80K04k14J5n3K18l00J85k9P2J13j47O8J06M3j88j43K21k7J69j68j06N3
5426c6k2O2P9k04N9J89nj82J49j5n8l3qm2m2J6k6p7J96Q7q5Q1k62K23l6J40j58
5453a0l9p3K8J04M3j62J11n1j12J1K95m1j76J25q8j12J60r0K6j59L63n2r1J62
5477A72j49QO5j23p1Q5k0J39j19J61j38j23J27p9K9k6j17J42K1j01J26k9R5J40
5501B15k71k4o2L39l71J34J24j67L07j36k41J65N8k06K37M6j01j23J5j80P6Q5
5523h1N1J69j99Q9n2J51k2r3p9N0K90K6k26q7m2j1P3J10P0k65r5m3J34J28j03
5548e7QN4m7R1jm6m5l1L0j49L53k31LJ28j58Q5J3O4q1K54k50p2N6P5o8M3j34N9
5576e4n7J14J00p6LJ27k43K1J09j08J00n5m0L6l3P9j20M6M9j8Q2o1m3o8M4n2J84
$$ plain form
5403 52 -128 76 -138 -123 -176 42 -258 -73 -102 -30 83 -64 4 110 153 -35 -178 43 16 185 17 -89 -36
5426 -36 -58 4 83 -121 -62 127 122 -60 89 74 16 -17 -25 -67 -109 -93 -119 -196 0 87 2 83 -179 44 8 148 -10
5453 -10 -49 -122 -94 10 53 -109 2 -49 -161 -150 145 104 -72 53 -35 -147 13 -77 -51 -210 153 101 10 172
5477 172 23 31 96 -27 -98 -13 -33 106 -13 148 10 -113 14 -65 -36 -62 -179 -37 -16 -117 9 -20 75 215
5501 215 -56 -80 -142 197 -174 -40 84 -83 224 88 -153 12 70 -136 101 147 46 -77 -62 -242 -166 -81
5523 -81 -30 139 -60 29 -23 128 106 13 -66 -16 274 300 74 -13 -55 -66 7 117 187 -78 -173 -216 -82 46 -57
5548 -57 -49 5 -42 49 48 2 -43 -74 -44 -193 160 -71 -68 60 -98 -13 0 64 -17 237 -13 -85 -29 46 -22 21 -113 -54
5576 -54 -111 3 103 27 30 157 -86 -65 44 -64 36 -19 -59 -23 -56 23 -97 -51 -2 -20 62 1 -42 -110 -66 -118 66
5603F6o7o1M1J10j76K74k24P8n3K6J30n0J7j70J23K7q7o9L4Q8m2j12J16r6J36
5628E9R8k2q4L9q2K7j02J05P4p5O1k14K44j76J46q0J15j63L7Q7j22%J8j63K53
5653H0Oj33o0K77l50J90j39Q5J53j11K6q2j31J17J50m7R9k13J42r6j7j40K73q2
5677cp9P1J00l4l7Q4L6J0j24n5J46k9lk15L32j00q8j51k8JJ33M0j30J6r1K88L2
5704A22k62Q7j0J00O4l0j12j47J80J02m5j46J99Nj39L8K1j90P9L1J38o8K3O2k05
5729a03N8j05J81P3q6p4m0k1K28j19K4n1J8K61k85O1o3r7N3K2k0K89k26L6L8k8
5755B4k7M7k2L9p7pj26J28r8Q9L4p2J36R5k12P7L6k4L8n6j5q8J44j7j91J59j20
5782a06P1M7Q8J3j97K04j31L3M3Q9k07J88l8j51r1J20M4j20L5l5J53j89J27J35
$$ plain form
5603 66 -1 -62 -21 89 -87 187 -37 41 -12 14 144 94 111 -59 64 91 4 -65 -31 57 15 -97 19 -77 59
5628 59 157 135 51 90 8 35 -67 38 112 37 98 -116 128 -48 98 18 133 -30 7 94 -28 -28 -10 -173 80
5653 80 86 -47 -107 170 -180 10 -129 -44 109 -2 24 -58 -189 -72 78 31 130 -83 59 -37 -54 -194 79 -3
5677 -3 -82 -11 89 55 18 102 138 148 24 -31 115 86 83 -132 200 100 12 -139 -167 -166 -33 7 -123 -107 -198 90 122
5704 122 -140 -53 -63 37 101 71 -41 -188 -8 94 49 -97 102 107 -32 6 27 -163 -84 -53 85 17 40 102 -103
5729 -103 -45 -150 31 104 18 -56 -96 -117 111 -8 16 -35 -17 244 -41 20 -43 -140 -87 -65 -85 204 -22 14 52 24
5755 24 -3 44 22 61 -16 -23 -149 -21 -119 -30 4 -68 68 163 -49 28 64 40 78 22 7 -81 63 46 -145 14 -106
5782 -106 -35 12 100 113 -84 120 -11 22 65 154 -53 135 97 -54 -145 -25 19 -101 -66 -101 52 -137 -10 125
5806A25n1Q1j49j08L9M2Pj8J51o3k95L16j96L14k47N6Nj87J21N4j75oJ65K6m4
5831c7j8J47l9l7N6j67J18n5O3J3Q2p3q2Mm7J2J67m3J5j74M2K74k45K78k96j6
5857e8K29k19k3J83j13R2q8k07K05J40k95n0K06K18k63m4o7L10j12Q0l8p2P3j94
5881a07J45k41K42m5J7J72k71J36j55K44j16k7p3q1K60j02R6j4p6o8P2l7Q3k82
5905b28J60oR5J8q6M5J48k57N0Q3J30j19n6K04m2p9J8k24J39P4n4K7QJn2R2o9
5932B0Q6j83L2j05L67l18q7p2K66p2R0K3j93J90j14R6k6kl7L4J01k21J36n0k34
5957b73L76r7n5q7P0K50k91k0j52K00J1Q7K6j64J54J3R4l30O1j3J56j38J7K9J26
5982E0k27K55k4j7k25L20Lj89O9j26J78n8J60k67J76r5K21k61J53q4L1k0n3J11
$$ plain form
5806 125 74 155 6 -102 -63 -21 -14 -32 119 56 -239 77 -119 195 -52 4 9 -178 -57 -3 -178 -184 -19 7 -37
5831 -37 -55 92 53 16 72 -95 23 -32 31 44 126 53 -29 -25 -72 -60 107 64 79 -95 -53 221 -24 254 -42 -58
5857 -58 171 -48 -71 112 -1 91 3 -204 1 141 -154 -204 2 220 -43 -87 -154 156 44 124 86 14 87 -107
5881 -107 38 -203 39 -6 11 183 -88 48 -107 137 21 -6 -79 -160 100 -2 94 80 4 -64 8 -29 54 -228
5905 -228 -68 -74 21 39 -47 -2 146 -111 -61 22 152 33 -23 181 139 60 78 -146 -7 67 13 40 48 49 -3 89 20
5932 20 106 -77 -45 -150 217 -101 -188 -260 6 -66 24 47 -146 44 -70 26 0 -2 -39 -5 96 -125 11 -39 -273
5957 -273 103 6 -49 -136 -66 184 -107 -127 -279 -79 -68 19 45 -119 35 48 142 -188 -127 -140 16 -122 -105 -76 50
5982 50 -177 78 54 37 -188 132 135 -54 15 -111 67 9 169 -98 78 -17 204 -57 96 12 43 23 -30 81
6006H1L0j5Kp7j1J2j35J13J7k0P5k5P8J29q7l22J2N6L93m57R3l3J7J50j6R2k33
6033h1J60j63J42m5m6L2k15K77p1L8j19m0K20n9l8L7j4MO2L1o5p2J19K6q5j74
6059a39M3N9J00j67L55j70l4o7P9r5lj97L99j14mn6m2OL0J67k13J38l7QJ0l1J29
6086A54j50Or6lN6o7P4NJ49p5j77R2l7J16Q7r7j12J90j90J24N2j84n9J23j98J93
6112b4j83J02K17k32P3J24r0L9j7J27l2j26m6k13K79M5%r7q2M2J7RQ1O4O3k2j05
6139A3j02J41J8j41Q4n8j2J71n1m2n3J32m7K72k05r5j35R4m6j5q9J26r0N9j36
6164b07J36m6J65l7R9j01l1J11R5k31P6n8o1K93l70n8K83O8k00k0J70q5Q3j9J2
6189F7L9r8r7L05j56j25J43k50m7K35m5KJ55K5k75J64J08l38K45l7j19J68L9k95
$$ plain form
6006 81 111 96 98 21 10 22 -113 0 17 -3 72 47 125 254 167 -155 -143 -87 306 -151 -58 -91 -74 76 60 152 -81
6033 -81 79 -84 58 13 -33 -1 -216 61 -10 28 -91 -131 89 30 -8 29 15 19 81 112 47 -25 94 120 35 -139
6059 -139 -96 -37 63 -104 251 81 47 -20 59 -36 -39 -236 163 49 45 -11 -53 -47 -17 150 -63 75 38 46 56 25 154
6086 154 4 10 -86 -89 -33 -100 -26 -21 128 53 -124 -32 -69 47 134 37 -75 115 -75 49 101 -83 -142 -19 -217 -24
6112 -24 -207 -105 112 -120 -47 77 -13 26 9 136 104 -22 -68 -281 -2 43 43 -54 -136 -94 -77 -68 13 77 140 118 13
6139 13 -89 52 70 -71 13 -45 -57 114 63 21 -32 100 53 325 120 25 -110 -16 -62 -77 -166 -40 -130 -71 -207
6164 -207 -71 -117 48 11 110 9 -22 89 184 -47 29 -29 -90 203 -167 -225 58 126 -74 -94 76 -9 74 55 67
6189 67 106 8 -89 216 60 -65 78 -172 -219 16 -29 -27 128 153 -122 42 150 -188 57 20 -99 69 108 -187
6213a87J71k0j13J05J17O3j01L5n7j52J02m4J60j52P8J3j33K1Q7L9r1l86J96O9
6237a80J21j2N9J17j92j67L08k3k12J28n0Q5R9Oj58j51J43J8L1K3q1J91j87j9
6261a03K05j67mj16Q8OJ13m0Q1n4m2M1J44j35j22L35k44l25L20j6J27j44L6R5
6285G9O5k06J48j8k20J46l9j4j9R4r4J02P0J17j78lj84m8L21p8j21J49j35L3P
6310b6lJ78k35J67J5o0P7k55J53o0n5j9J19P3r4o0J83km42L87J2L4k89K8K03j26
6336i7P2rLN1j02K42k08k4L9n5J07O3k07J85j11ok7Q1QJ3q6J78r6J15Q8k62j08
6363a53J68%J5N3j90M8J77p8j23on0J39J11N3l49K99k45K11k34Q9K11J4j56j7
6387a3K09j16j02n1l0K48l46L22j74j36J20J09J20k87K17r6Q5j44NM1J74q1kk17
$$ plain form
6213 -187 -16 -36 -149 -44 73 136 35 70 13 -139 -37 -81 79 -73 5 18 -115 -94 -7 32 -59 -445 -249 -180
6237 -180 -59 -71 -12 105 -87 -254 54 31 -181 -53 -103 -18 81 87 -71 -222 -79 -61 -30 -7 -88 103 -84 -103
6261 -103 102 -65 -69 -185 -97 -91 22 -18 63 9 -33 8 152 17 -105 230 -14 -339 -19 -35 92 -52 -16 79
6285 79 144 -62 86 68 -152 -6 -45 -59 -78 16 -78 24 94 211 33 30 -154 -202 119 41 -80 69 -66 -33 -26
6310 -26 -29 149 -86 81 96 36 113 -142 11 -49 -104 -123 -4 69 -25 -85 98 96 -346 41 53 87 -202 -174 29 -97
6336 -97 -25 -34 -31 20 -82 160 -48 -72 -33 -88 19 82 -125 60 -51 -57 -84 -3 5 18 -68 110 14 129 217 -45 -153
6363 -153 15 15 30 83 -107 -59 118 40 -83 -89 -139 0 111 164 -185 114 -131 80 -154 -65 146 160 4 -13
6387 -13 196 80 -22 -73 -103 145 -201 121 -53 -189 -69 40 160 -127 90 -6 79 -65 -60 -19 155 74 72 -145
6411a45J75j54J35K3o3O0j5R3n5m5q8J32o1J10k40J87J55j68o6j9qp0L28j98m9
6436d6O3K77k80j58L74j19j29L8j05J51j30K02j78N8j38J9J59o2l3M1l7n5L9j26
6460a75L77k46q9J30j28L1nJ55J28j71P3q3m2L4R7k73R8O0j4J63q4K6%R2j26m5
6486a7q3J6j31K07k0Q6M1j96P6J18p4kk0m5J12k79L00m5M8k07M6J79j33K10j96
6511ip1J75k5k8k8j60J20n5J84o0j24K37j40k9r7J28j48J59q6L22j65L7j37r3
6535i3Q1K9j9K6k7L7M5j03R2J10j17P4o5k46K38j25N1K6Q9j55j47K82K4j15k1
6560b9j42J32K09J6l82K13j46J43o5J38k03J8Oq1K16n0k65K21j7K96j37j68M4
6583c3j07L26l04K8L50l50L14k30jm6k11K38j66J31K26l89K58M1o9K13k43P1q8
$$ plain form
6411 -145 30 -124 11 34 -29 31 16 109 54 9 -79 53 -8 102 -138 49 204 36 -30 -49 -57 -127 201 3 -46
6436 -46 17 294 14 -144 230 111 -18 20 -85 66 -64 138 -40 18 -120 -101 58 -4 -37 4 -33 -88 -49 -175
6460 -175 202 -44 -133 -3 -131 -100 -105 50 178 7 80 -3 -45 -11 86 -187 -89 -29 -43 120 36 62 62 154 28 -17
6486 -17 -100 -84 -215 -8 -28 58 99 -97 -21 97 23 21 1 -44 68 -211 89 44 92 -115 -69 110 -23 187 -9
6511 -9 -80 95 70 42 14 -146 -26 -81 103 43 -81 156 16 -13 -110 18 -130 29 -57 265 100 137 0 -93
6535 -93 -12 17 -2 24 -3 34 79 -24 68 178 61 135 70 -176 62 -63 -12 14 103 -52 -199 83 107 -8 -29
6560 -29 -171 -39 170 186 -196 17 -129 14 -51 87 -116 -98 -92 -173 43 -7 -272 -51 -68 228 91 -77 -33
6583 -33 -140 186 -118 -90 260 -90 224 -6 -7 -53 -264 -26 -192 -61 165 -224 34 75 6 219 -24 47 -41
6606d1M0J6j54q8L61q6n1Q4Q8k07J31m0j25J82l6n8N8k64J35M1m7j9k3P9q7K25
6632A14r8P8j88L0r2L8q2K68r3l9j12R9J63j34J01j49R7M2q9J34r6p7K12k66K39
6657A00qj04p0l9J54M5P4n3j66J11j57l3P7L7o0K39K8j25o3jj12J65m4J88l24
6682a41L34m40L50n2r4l4j13J59J73l69J12J13j36K43M8p8k56J52j5K80q8o9m2
6705C7MM4k74L02k98j2R6p0J37p9K36j00J00j46r0J26k0K46j46K7k03J20j7J9
6729C9Q5l14K29j52L6K8K54j75j38K23lj86j28J22N4j4J70P5m27L32K7k34K7J17
6753D7j18N9j41J13l1L7n4J53j15j8J77k46K23j15K09l2j10l5j46J80q8J7P0J44
6777A80r3J16j82J65j39r8L8p7PR2Q0j40J84j56j07O3K3p3K99j55k37O8J70q2
$$ plain form
6606 -41 -1 15 -139 -227 134 48 -3 81 169 -38 93 53 -72 110 74 16 74 -190 -55 -14 -61 -80 -103 -24 -111 114
6632 114 16 94 -94 -64 -156 -118 -200 68 -25 -64 -176 -77 86 -48 53 -96 1 43 -46 88 -8 -85 127 -139 100
6657 100 92 -12 -82 -121 33 78 152 99 -67 44 -113 -146 -69 -32 -92 147 175 50 -13 -14 -126 39 -5 183 -141
6682 -141 193 -247 103 51 -43 -77 -190 -31 142 -227 -115 -2 -138 105 153 75 -181 -29 -44 236 148 79 37
6705 37 41 85 -189 113 -185 -197 -101 -171 -34 -113 123 23 123 -23 -113 13 -7 239 93 120 -83 37 20 39
6729 39 124 -190 39 -113 -77 -49 205 30 -108 115 112 -74 -202 -80 -26 -40 130 205 -222 110 137 -97 -70 47
6753 47 -71 -12 -153 -40 -71 -34 -88 65 -50 -68 109 -137 86 -29 180 148 38 3 -143 37 -51 -34 36 180
6777 180 87 203 21 186 47 -51 -13 -90 -83 9 89 -51 133 -23 -130 -67 -44 -117 182 27 -210 -142 28 -54
6801e4J28j17Kr1J88O2r3jJ25j84L6Jl9o1l3J46j13P6j19K37O3l91K05m5O8M1
6827C7k68M7J68J03p8J18j96j1q3K58j26J6J14j82Q0k3l8nJ22q6J27K1K2k48Q2
6852b9m7J96p0l5j07M2J20k19J32k2L2r4R2lJ85k05J9P7J8o7K2q7J35L8k0j11
6878h%r9NJ90N5n2k2k8J0p2j46p7R6J24l8K05k47M2K08l42K12L2J02k27K51l36
6904a62p3K91r7J29k6k2m6p9J76j28K3J71l7j85O0l3J0L1L8p2N0j4q5K10k32K32
6930A30j21M2M3K9n3j10J73N4k03m0K79k30L6j1J36j29n8Nkj27O3K21lk91L32
6955A65K4j8j55r8J08J01l26K03n0Lj2N6q6M3O3Qp0j40K83k7j21m9J72k44J24
6980d3P2J6k0j65K97r3Nr9K3l1J98j41j5j5J17p6j60O8P2j1j55J82k6m0J32l5
$$ plain form
6801 -54 74 -43 -41 -132 56 118 25 24 149 -35 1 2 -37 -98 -131 15 -98 -22 -141 96 159 -232 -27 -72 -4 37
6827 37 -231 -184 -16 87 9 127 -69 -80 -163 95 -31 -15 99 -83 -3 -26 -64 -69 53 -33 94 115 137 -111 -29
6852 -29 -76 120 50 15 -92 -50 70 -149 -17 -39 -7 -101 -9 -12 173 -32 -13 64 82 15 37 -50 85 123 103 -8
6878 -8 -8 -107 -102 88 143 91 69 41 51 -21 -167 -244 -148 -24 -62 143 -104 -62 146 -196 16 48 150 -77 174 -162
6904 -162 -235 56 -41 88 62 40 -6 -85 91 -37 -14 157 120 -65 -5 -38 -28 3 41 -31 19 5 -80 130 -102 130
6930 130 9 51 94 123 70 -40 133 187 -16 -56 223 -7 29 18 154 25 -33 -28 -30 -157 -94 127 124 -167 165
6955 165 189 171 16 -82 26 127 -199 4 -46 -43 -55 1 -85 -42 21 29 -41 -181 102 75 -46 -95 77 -167 -43
6980 -43 29 45 25 -140 157 64 69 -30 -7 -38 160 19 4 -11 106 30 -130 -62 10 -1 -156 26 0 -40 92 57
7006E7Q1k16J34J4m1p8K8j17J76J87k34j12K49K0l42J55J48j21j02J59j9j73k6
7029a73K45k5j79J06P5K7qm2L1J12k24J06k3j09R3J17l7l0l7k3k06L06M4j83K08
7054A71J0j36K00k60MJ3J29j70M2m7n5J82j47j01J17qr1P4P5O9j22J78j8j68M1
7079a8k0J36j23oK26k16QK7N2J5j64K5o1J05N5l1K2Q5m6j69J26j07k9K69k67J24
7105A8Q5j14R1k72J95J4N5o3m4K81m10P1J88k1j41J11o6p0J8J11j92K86j50j42
7129a61J19j13J20j80K04j50J83o1n5j76K42j4n2J10j61L1O9rj74L15k44K53r0
7152FQ8N0k32J09qj44k5J01J21j24K7q1K00q6J38m3j08j18K78k82j4R9j9R1j46
7177a22J45P3m1P1k17K5J4qK2Q6J55j24Q3j25M3o4j0M9P0j47Mo8R1o6k8K61j89
$$ plain form
7006 57 138 -78 56 70 29 -49 -21 -138 38 225 -9 -121 128 148 -194 -39 109 -12 -114 45 26 -147 -173
7029 -173 72 47 -132 -26 49 76 68 26 57 169 -55 51 28 -81 12 129 92 62 25 2 -204 102 146 -37 171
7054 171 181 45 245 -15 -11 2 131 -39 3 -44 -99 83 -64 -165 -48 -56 -147 -73 2 71 -51 127 109 -59 -18
7079 -18 -38 98 -25 -31 195 -21 -13 14 66 81 -83 -58 -119 -14 41 10 32 117 71 -98 28 -79 -108 161 -106 18
7105 18 103 -11 80 -192 3 17 72 9 -35 246 -164 -93 95 74 -67 44 -22 -92 -74 37 -155 131 -19 -161
7129 -161 -42 -155 -35 -215 -11 -161 22 -39 -94 -270 -28 -42 -94 16 -145 -114 -45 -54 -228 87 -157 96 6
7152 6 94 144 -88 21 13 -131 -156 -55 66 -58 -31 -112 88 2 140 97 -11 -129 149 -133 -147 -48 -67 24 -122
7177 -122 23 96 55 126 -91 -66 -52 -60 -38 48 203 79 162 37 80 16 6 55 125 -22 -18 -86 5 -61 -89 172 -17
7204a7l6O9j60R8R1L5Q4m6pq9j3j11J46K7j74J72j31J29J75l48K9R1Oj91m7L40
7230A22k35J77l3J5n6k8q0j6L0L05j52k02L86k15J39j81N8K46j34j67J6r3K12
7253A14o4nK04k13m1J99k65N8p3j07J29j64P8K69j52j8J42j35m6R5q1n3J52k06
7277a83J86j05R3n1R2j85k8K67l5Q1j44l8Q1J2M6r5R1j93O8j33L3J43P7l52K03
7302f9j35K96K8q4j06o1L04k30%k2r1J72k4k7M2O1j88J89j39J47q7Q9k86L40j36
7327a7J7q8J24j53J04K1m5n6J59l9R8j46k7N3m9KJ31r3J14j02k3M8j13J30o8J44
7353A26K0m8l14K51P6j89L8J35k38J3Q3k0J76j69J37j46J29j44L76l14J32j04
7375FJ70j73j17J05K3PK5O8J30n74M47j02n9m8N0L0M3j7k29K52J0l0N4J5j72J87
$$ plain form
7204 -17 -53 16 -144 -46 45 80 164 118 111 22 9 -102 44 71 -103 69 -62 67 242 -106 -77 14 20 -171 -218 122
7230 122 -113 64 31 46 -10 -38 -118 -134 -104 201 49 -153 233 18 157 -24 34 280 146 -21 -5 -98 114
7253 114 50 45 249 36 -5 194 -71 -13 -86 -193 -64 -228 -150 119 -33 -51 91 -44 -90 5 -76 -129 23 -183
7277 -183 3 -102 -9 -60 32 -153 -181 86 51 132 -12 -50 31 43 89 -6 85 -108 -40 -173 -140 3 80 -272 -69
7302 -69 -204 92 120 36 -70 -131 173 -57 -57 -79 -170 2 -22 -49 -7 54 -134 55 -84 63 -24 65 -221 119 -17
7327 -17 0 -88 36 -117 -13 8 -37 -93 66 27 125 -21 -48 5 -44 -42 89 -4 110 8 -15 33 -80 50 -18 126
7353 126 146 98 -216 35 111 -78 -40 95 -143 -130 -47 -67 109 -60 77 -69 60 -84 292 -22 110 6
7375 6 176 3 -114 -9 14 21 46 114 244 -330 117 15 -44 -92 -42 -12 31 14 -215 37 47 17 71 86 -86 101
7401A01k58P5J4K15Rk53J69k17K3J10K3j9L19k53J71j25j61n6N7k8J35j28J59
7424H2j59J05l6m9j16N0R2q0r9K12Q3j28N0m1j00R8J34n4j16nQJ28j00j13K85
7449A31j42M4l5N6p4l0j0J10j8J1J1l3J0o7Q2n8j5r2K60N9l92K99j88M3J71K7
7475A60k49J44K2k34J80r4M5j41K68k21J59O4p4l8R1RJ36l25K24k09L8K4K7J82
7499A88k13j1L1j21R4K3l3J68k90K00j48J16J36q7j19l1O4j54L17j04M7m7p7K83
7523B32j67j28n5J20p0K5p9J54j24J97j76N5J97j56j02k8O7k61K19J28k35K32
7545D5j02J09j54Q3l5k2J79o4n2J11O4k61K35p5p5l28L37Q6j30J10Jo2m9%K83
7570B34j81j56J64pj19J75j55M5K01l47L08j05J0k13J09O8J67k64J14j56K60l09
$$ plain form
7401 101 -157 -82 -68 147 156 -97 72 -145 -122 -12 11 -8 311 58 229 104 -57 -113 -56 -84 51 -77 82
7424 82 -77 28 -8 -57 -173 -123 -31 -111 -210 2 85 -43 7 -34 -134 -36 98 44 -72 -77 -69 59 -41 -154 131
7449 131 -11 33 -2 54 -20 -50 -60 50 32 43 54 21 31 -36 46 -12 -27 -119 141 200 -192 107 -81 -38 133 160
7475 160 -89 55 77 -157 23 -71 -26 -167 101 -120 39 103 29 -9 82 91 227 -98 126 -83 -45 -21 6 188
7499 188 -25 -36 -5 -126 -32 -9 -42 126 -164 36 -112 4 140 53 -66 -97 -33 -187 130 26 73 26 -51 232
7523 232 65 -63 -118 2 -68 -43 -122 32 -92 105 -71 -16 181 25 -77 -105 -38 -299 -80 48 -187 45
7545 45 -57 52 -102 -19 -54 -76 103 39 -13 98 162 -99 136 61 -14 -342 -5 81 -49 61 62 0 -49 -49 234
7570 234 53 -103 61 54 -65 110 -45 0 201 -146 162 57 67 -146 -37 31 198 -66 48 -108 152 -157
7592a57KJ81j94L59j28O0n8j04l4L8K6o3R6j16R3L9n3J15j36J23p1L4n1j04K7
7617g6J47K1J4k36j2L50j03m6N7j52L5m7k4R2j12K06j05J49n3j92P5J3M8j5m2
7642hN4j28L6J39n3Qnj24j1J2l6L37k22l81L82P6nk51J90J10k07q8L00j39L5p8
7668e7K09j01J26j31j01R7J16j98j13J05K05Qk39Q6j04J96k8k32o4J11J17l2N2
7691B8O4j19j27N3L33k68n4p8J76m1l4Q0j91K08j41J11N3j43J05k84L97j51R1
7714F8k09Q6J45k84K77k9j6j41j8m2J49K28k44q3q9J98j22J46m5l7K7j48J61j9
7738d1M8qo4l0J20pMN7q2j76M18l37J93k80J92j10L29j91q6M0r2R4J09j37OL8
7764GP5p1k89J39K27m7Jp3k3J63Jm8k05J74j23jK07o4K3j41L4j77K46K5mj84q8
$$ plain form
7592 -157 -155 26 -168 191 63 123 65 -39 -73 -35 -9 -72 24 -92 1 40 -13 102 -34 89 18 52 1 -103 -76
7617 -76 71 92 106 -130 -142 208 105 59 116 -36 -1 -48 -72 20 -92 114 9 158 105 -87 -12 1 49 34 -8
7642 -8 46 -82 -46 93 40 48 43 -81 -92 -80 -116 221 -1 -382 0 76 71 -180 10 120 -87 -175 125 -14 21 -57
7668 -57 152 51 177 46 -55 42 158 -40 -153 -48 157 165 -74 12 -92 104 76 -156 -220 -109 8 -24 28
7691 28 92 -27 -154 -101 232 -36 -90 -168 8 -33 -67 13 -178 30 -111 0 53 -90 15 -269 128 -23 68
7714 68 -141 -55 90 -194 83 54 38 -103 -121 -163 -14 214 -30 -113 -202 -4 -126 20 -25 -62 -35 -183 -22 -41
7738 -41 7 -1 -65 -95 25 18 22 79 -3 -179 239 -98 95 -185 7 -103 226 35 -51 -11 -103 -9 100 -37 -31 7
7764 7 82 11 -278 -139 88 41 42 -31 -54 109 110 62 -143 31 -92 -93 114 50 73 -68 -34 -211 35 60 56 -128 -216
7791b16L13K9j35J63p6j31J06j35J37q3R2n4j90K4L54j17j57P4j35k9J09p6K87
7814A54j02p6q0J36m7O5k8N0o0O4J86j96N1j35M6M9j19L1n4J3J14k01K7L9l9J86
7840G4k29J60j32L49j89q1J83q4k0l0J04l3j71J05J2q0J81n0J6k79K13O2k9r8
7864d6J06m2n7o7P1N4j65J32j62K22k41J79k3NN9m5j11J32q4J23O4m7m0J27l8
7889A06m8k51K50m8P7l5N5K4l04O6K00j02o7qL27k58n2J27K2J76k14j79K40o9
7913C5J24j81J53k54K54k21QK4J44k1k49J43j10J05J0O2o4J74k31M0O1J93k67
7936f8j3J2J80k78J87K5j7pq7j59J69K36n3j91Q6L6j31j13K93J1p2L2k59J11k5
7961i5j67K39k00J05K88k25K00j33k1l1N1NK4k19K87k00J06p2J1O9J31j20l3n2
$$ plain form
7791 -216 97 126 -9 154 78 -53 53 -82 55 -28 64 10 -180 -156 198 81 -76 -2 -137 -166 -57 -133 154
7814 154 52 -24 -104 32 -15 50 22 72 12 76 262 66 117 -18 28 77 -42 -11 -65 -52 62 -139 -112 -73 -112 74
7840 74 -155 5 -127 222 33 -48 135 51 31 1 105 72 -99 6 18 -62 119 69 85 -194 19 81 52 -46
7864 -46 60 18 -39 -106 -35 19 -146 -14 -176 46 -195 -16 -39 -34 25 -20 -131 1 -83 40 104 57 17 144 106
7889 106 58 -193 57 9 86 51 106 130 -174 -108 92 -10 -77 -85 242 -16 -68 59 81 257 43 -136 104 35
7913 35 159 -22 131 -123 131 -90 -82 -58 86 65 -184 -41 -151 -46 -36 26 -38 136 -95 -55 6 199 -68
7936 -68 -81 -69 111 -167 20 45 28 21 -66 -225 -56 180 127 -64 22 58 -73 -186 107 118 46 78 -181 -70 -95
7961 -95 -262 -23 -223 -118 170 -55 145 12 -9 -40 11 16 40 -179 108 -92 14 -58 -47 22 153 33 0 -52
7985e2j43J83mO1l6J77l90K98q3J90k21l5Pr5N9J60q9l6L0j80K35j13J49j59J78
8010I1j02K8J20j98J47k46J31o8K06Jj71K53k69k27L48Q5J00k36N4J01j98J7L7
8033Dj40J80j3K31j90K3Mn4jn0K6l9m9n9J78j42P7J3J78l0j63k2R4j39j2L18j38
8060H5p1K3K5K1j21Q9j62K41j20n2l7nj0k9J01mq3J77k5nJJ3O8l35K73j22K34
8087A70j56l2K7Q1o6L1j86RJ44j88l0M53j07j9q9j86R4K30k61l6N3K34k33K69
8111B06j62j19J38o5J24j11P8j41K34k36O6j39J28q8l1J17L6k83M27k62K5J54
8133I6j11Jp9J77o6P4k73J06M1K8J0j01o8N9M1P5J26k7j46l0J84k89K18%N5l19
8159b18K09N8o1j57K09J54j47r9J71j44L1P1j7j8j46P6K9j00K8J94k40M4J93j43
$$ plain form
7985 -52 -195 -12 -16 45 9 186 -204 94 11 201 -20 -55 -48 -143 -84 76 -13 -49 -19 -199 36 -77 72 -87 91
8010 91 -11 17 137 -61 86 -160 -29 -97 109 110 -61 192 -77 -304 44 129 229 -7 47 148 -50 -33 4
8033 4 -136 44 31 262 72 95 99 45 44 -6 20 -19 -68 -127 51 -91 -14 -1 177 147 -16 -38 56 -83 -95 223 85
8060 85 14 37 62 83 -38 51 -111 130 10 -42 -79 -84 -94 -123 -22 -26 -109 68 43 38 39 52 120 -215 58 -64 170
8087 170 14 -18 9 90 24 55 -131 -122 22 -166 -196 257 150 131 42 -144 -50 180 -81 -117 -64 170 -63 206
8111 206 44 -75 63 -2 122 11 89 -52 182 -54 12 -127 1 -87 -118 -1 35 -248 179 -83 -58 96
8133 96 -15 -14 -93 84 18 92 -181 -75 -34 -6 4 -97 -165 -106 -65 10 136 109 -37 -67 117 -172 46 46 101 -218
8159 -218 -9 49 -12 -169 40 194 47 -52 119 -25 6 77 60 42 -104 -28 1 -99 -71 123 -117 -73 120 -23
8183b3q1J90M5k92R4m3L10j1
$$ plain form
8183 -23 -104 86 131 -161 -67 -110 200 189
8191A89
$$ Imaginary data points
##PAGE= N=2
##DATA TABLE= (X++(I..I)), XYDATA
0@%%%%%%%%%%qJ6j6J6k4L2l2M0m8N6p1P9q8J04j20J36j55J79k01K25k55K87l21
33a69L59m02M48m98N53o13O78p51Q31r20J020j130J252j391J553j736J948k200
51a168K504k879L351l971M824o076Q092j1859K1226q4143j45873K21404J46545
64A51977j42666j58484J00906J27878p3054j18962O7192J12234m1210r3947L8847
75b9289O6830m5433m6198Q1491O2837q6548r0411O6692J05192k4385q8898Q10
87b7310O0134j100m4105O449L2142r984j7292J3809j0944m0573K2187P6103p436
100E2080r9342k8760R2673N5070p1399o1048N7598N6551n8891n8404N9045O3082
112E8255n2434o1291M3128M8512m7917m4851N9492N9135o2168q3977M6579R9520
$$ plain form
0 0 0 0 0 0 0 0 0 0 0 0 -8 8 -8 8 -16 16 -16 24 -24 32 -39 40 -48 56 -64 72 -83 96 -105 120 -135 152 -169
33 -169 190 -212 236 -262 291 -322 356 -395 436 -484 536 -594 658 -733 820 -916 1032 -1168
51 -1168 1336 -1543 1808 -2163 2661 -3415 4677 -7182 14044 -70099 -215972 5432 151977
64 151977 9311 -149173 -48267 79611 6557 -112405 -45213 67021 25811 -68136 -29289
75 -29289 37541 -7892 -54090 27401 90238 3690 -86721 -20029 85163 60778 -28120 -27310
87 -27310 32824 31724 -12381 -5932 26210 16226 -1066 12743 1799 -38774 -16587 59516 52080
100 52080 -47262 -76022 16651 71721 322 -60726 -3128 53423 -5468 -63872 -4827 58255
112 58255 5821 -55470 -12342 36170 -11747 -56598 2894 62029 -139 -84116 -37537 61983
124F1983k0339r2563N341Q0427K704o5164l773N6360J3341l8003j3568K0831L778
137A1355j1805J4038J9083k6298l4608K2415L9131j7168l7611J0483K7488j1397
149E106k4773O391J7033k487p955N013j108j7242J530L4094J1078l8351k1609
162c3280L5853K8068k6576k5213K1208K5024j2788k4775R28J7953P448n183p289
175A378r754q188J3089K1485j0126k9458N056K9071m870l0379M267L4142M597
188B0310l2048j3720K5277J7758j5080r145J7492J599k6231r19L4947P993l3794
201e561j3308K7417J2721k6391j5805K8102K3376k6656l5378J5348L5055l668
213A5252k4659k86J1317m957o147Q593P562n502n288K374j195o665N957J8372
$$ plain form
124 61983 41644 -50919 -45578 34849 37553 -27611 -31384 24976 38317 314 -13254 7577 11355
137 11355 -450 13588 32671 6373 -28235 -5820 33311 16143 -21468 -10985 16503 5106
149 5106 -19667 -13276 3757 1270 -6685 -1672 -2780 -20022 -18492 15602 26680 -11671 -33280
162 -33280 2573 30641 4065 -21148 60 25084 12296 -12479 -11551 6402 13850 8667 1378
175 1378 -8376 -16564 -3475 18010 7884 -21574 -16518 12553 7683 -22696 -18429 15713 20310
188 20310 -11738 -25458 -181 17577 2497 -6648 10844 12443 -13788 -14707 20240 28233 -5561
201 -5561 -18869 8548 21269 -5122 -20927 7175 30551 3895 -31483 -16135 18920 15252
213 15252 -9407 -9693 1624 -3333 -9480 -887 6675 1173 -4115 -1741 -2936 -9601 -3644 14728
227A4728j364k5578o327K3780Q175j8498j018J9141m954k5569K507K9882N252
240B0157k7137r351K4196P206k7246n992L5174J2118l7989k1185L1227K4270k0727
253D721k0888J5072J6653j5555j8752J3975K1902q396k0471K902J1974m801m871
266f535J1270M191j4077p285J0407Q290n316l618N759J495j0026l065J3281O632
280A1403j1626m583J0386q19j4236M036K0517n32k3754p042K0627J1587j7252
293a288j2985J6087J4208j8446j8101J6808K0143j1165j7797O131J1776n702q170
306h501Q239J0430r034j3608O501J4962m371j2099N946J0303p851j0277P138J0067
320G845k916o481J004J244l388Q07Q345J854j1601n669J1885O724j2510n453J3885
$$ plain form
227 14728 13364 -12214 -18541 5239 13414 -5084 -6102 13039 8085 -17484 -14977 14905 20157
240 20157 -6980 -16331 7865 15071 -12175 -18167 17007 29125 -8864 -30049 1178 25448 4721
253 4721 -16167 -1095 15558 3 -18749 -4774 17128 8732 -11739 -8837 3137 -1664 -6535
266 -6535 4735 8926 -5151 -12436 -2029 6261 945 -2673 3086 4581 -5445 -8510 4771 11403
280 11403 -223 -4806 5580 4761 -9475 -5439 15078 14546 -9208 -16250 4377 15964 -1288
293 -1288 -14273 1814 16022 -2424 -20525 -3717 16426 5261 -12536 -6405 5371 -331 -8501
306 -8501 -262 10168 1134 -12474 -5973 8989 4618 -7481 -1535 8768 917 -9360 -2222 7845
320 7845 4929 -1552 -548 696 -2692 -1885 6460 8314 -3287 -8956 2929 9653 -2857 -8310 5575
335E575N627j5140q251J2303J0167q003q876N053O160o712n767J0029P837j1302
349a300r496J0040Q310q477o415Q763O100q405p849N807R075k822o827J726L954
364B184m606k365Q514K873r902l587R499K954q871k396J0065L932j0687p067R471
379A1R572p264r123P306O606q830n822J0683P135j0333q467Q027Q220o371q441
394g091O746R815p412j2069N950J2655m272j0890L585P607m588o638N871O863
408F132n647p652M025Q035m019q152N297R609o259j1089N855J1496l708r431K887
423b621P660k724p028L635Q597l267r603K478J0182k721j0340L405J1025m043
437D635j1846J411J1931R21j0506l277Q114L224p564l090P942K701p846k940O819
$$ plain form
335 5575 11202 -3938 -12189 114 10281 2278 -6598 -1545 4615 -2097 -7864 2165 10002 -1300
349 -1300 -10796 -756 7554 -923 -7338 1425 7525 -880 -8729 -2922 6153 3331 -3496 -1770 2184
364 2184 -2422 -4787 3727 6600 -3302 -6889 2610 5564 -3307 -5703 4362 8294 -2393 -9460 11
379 11 9583 2319 -6804 502 7108 -1722 -7544 3139 10274 -59 -8526 -499 7721 1350 -7091
394 -7091 -345 9470 2058 -10011 -4061 8594 4322 -6568 -2983 4624 36 -6602 -731 6132
408 6132 485 -7167 -3142 4893 874 -7278 -1981 7628 1369 -9720 -3865 7631 3923 -5508 -2621
423 -2621 5039 2315 -4713 -1078 7519 4252 -5351 -2873 7309 4588 -5752 -2347 8678 4635
437 4635 -7211 -5800 6131 7052 -3454 -6731 1383 4607 -2957 -6047 1895 4596 -3250 -6190 629
452F29K347n379p37N557N37n819j521O611L509n520m069M461M066m653k967N041
468B093K475m483l098L215K381k440j322J593J174l241k043L549L113l393l400
483c827L149K620l316j457L198J999k745k616J277L485j40l056J51K920o91l092
499b141J021L362l64k317o72J015O22O24n16J07M5n75l79J156N41j061L42Q16
517A626j036j169Q54J224J20r95j422n17J458L49q63q72J49J64k32m83n67P14
535a498J492p44k080L74J787O03K4m13n68N68J331j1j29N16N2J67J38o84l71J852
555B406J122k144k238J201J695p80j113l71M42J04j341l68J305M57j289m98O89
572g21l75p39J827P72j618j135J277J154O8r83NJ113J57j816j63K149P01j601
$$ plain form
452 629 2976 -2403 -3140 2417 2954 -2865 -4386 2225 5734 214 -3855 606 4672 19 -2948 2093
468 2093 4568 85 -3013 202 2583 143 -1179 414 1588 -1653 -3696 -147 2966 -427 -3827
483 -3827 -678 1942 -1374 -2831 367 2366 -379 -2995 -1718 1767 1627 -1429 -1278 1642 951 -2141
499 -2141 -1120 2242 1878 -439 -1111 -96 526 1150 634 741 786 211 -168 988 1529 468 810 1626
517 1626 590 -579 275 1499 1619 624 -798 -1315 143 492 -371 -1243 -1094 -930 -1162 -1645 -2212 -1498
535 -1498 -6 -750 -2830 -2456 -669 -66 -42 -455 -1023 -455 876 865 736 1252 1304 1471 1609 925 554 2406
555 2406 3528 1384 -854 347 2042 1262 149 -222 220 324 -1017 -1385 -80 377 -912 -1410 -721
572 -721 -1096 -1835 -8 764 -854 -1989 -712 442 510 -473 -468 645 802 -1014 -1177 972 1673 72
590G2p58K86J22J80L51J03j83l03l58K18O53j38k45M95K4j365L75J536J00q42
610C23m63KL32L25k51o2P80q27j160L47J205m68m60P17m73j014j3J129O13m15
630A67o52k96P34K18o25Q16J165j141j386R78J130k19o78K15K60l91r06L0J127
649E46L26j332m82L78j22n09J019N86j342p08N93O17J00q3K78J03j35p67L26J449
669H41K78n60k25j58j0L33J196l17r05k23J35j02KJ18L00K71j158q79M28J058
689D23K02n60j45o75k11L87P71j63q5k97n48J41R39k35N7Q03p01j298N2J398N48
710H03j98r38m14L07L48m1J58O47m92j312M90Q95j47M78L18o07r43j0J129O68
730A139j58q54j45J87o6m1R06J01j002o54O17k54j4J107J45j485q45Q59P14J22
$$ plain form
590 72 -686 -400 -278 -98 253 356 173 -130 -488 -270 383 245 0 495 519 -846 -471 1065 1165 323
610 323 -140 -138 194 519 268 206 986 159 -1001 -654 551 83 -377 340 -133 -1147 -1160 -31 582 167
630 167 -485 -781 -47 171 -454 362 1527 386 -1000 -22 1108 889 211 426 686 295 -611 -581 546
649 546 872 -460 -942 -564 -686 -1195 -176 410 -932 -1640 -1047 -430 -330 -413 -135 -32 -167 -934 -608 841
669 841 1119 559 334 176 166 499 1695 1378 473 250 385 283 285 403 703 974 -184 -1063 -635 423
689 423 625 65 -80 -755 -966 -579 192 29 -56 -353 -901 -760 179 -56 1 804 103 -1195 -1143 255 803
710 803 605 -333 -747 -440 -92 -133 25 672 180 -1132 -642 253 106 584 902 295 -648 -658 471 1139
730 1139 981 127 -18 169 103 62 968 1069 67 -587 30 -224 -238 869 1014 -471 -1316 -457 257 379
750C79o51R1L26l17j274O46J775o9j257l14K76j40L38R28l12p44l16Q6N16R3q1
771b1J28K46n71j000N97J348J90p20o30m37L78J279m1r42J59N85m23m53N41O86
791H99K51m04j043k30O49J015j70m47q51l30Q99L82q36l5J107p71j095M29L88
810a93L44K58n16q18k65M92P78M64o24j062L31R82m32n38J026Q85j439p10P25
829c12O15M07j38j31o39l29J6Q28J034r07r49N83M91r29N03P52j03p74l7j41j67
850c27P70P54p34q17m83L60J072K61q43m27L72j67o4O27k6l75K07l4p84k05J001
871A38P51m07j056n64M74J259J1p62l20K52k95M34l7n97R85P40j291r84O35J166
891E32M55n72p12m45M73R23q1k34n65P7O13j3p80KJ725j43j490q74J289O59P5
$$ plain form
750 379 -272 -181 145 -172 -1446 -800 975 906 -351 -665 -389 -529 -191 737 425 -319 -635 -549 -33 60 -21
771 -21 107 353 -218 -1218 -621 727 917 197 -433 -870 -492 787 746 -196 -37 548 125 -328 213 899
791 899 1150 746 -297 -527 122 1137 967 520 -331 -661 238 620 -216 -251 856 85 -1010 -581 -193
810 -193 151 409 -107 -925 -1190 -698 80 544 -80 -1142 -811 171 -261 -799 227 1112 -327 -1037 -312
829 -312 303 710 572 441 -198 -527 -511 317 1351 444 -505 78 569 -360 143 895 792 18 -19 -160 -327
850 -327 443 1197 463 -354 -837 -477 595 856 13 -414 -42 -209 -273 354 328 -47 160 126 -658 -863 138
871 138 889 482 -574 -1138 -664 595 606 -156 -476 -224 -519 -85 -122 -719 266 1006 -285 -1269 -634 532
891 532 987 415 -297 -742 -269 654 573 339 -226 -149 464 451 -329 -327 1398 1255 -235 -1109 180 839 914
912I14k22r32n66Q04O39j3m57l27R9O15o09j000Q54J429n10j454k10O67K21O32
932E74j83r98m18N32P01l66l24l5N87R8r44k27J373M63n94n57k38R1N67J115p18
953D99j164K40P65nj99j14L91K93k59j056L68J055K13k35n25j036L78J527N3j110
973G9n00N05Jl97J49K31O6Rm44p58L15O69O29j37j209j092J247J254o35p97M83
994c32L24n00l18M27L97N61n09o09l03M01O87Q64l50j212k48J194P09j129L20
1013C74M46m07l86L3J1K43M98q7p57m90K8J100P10j002j329O31N11Q3m21M61l01
1034e1o09Q9J38j16M26L44l76p97j25L20R25L18o71n95L49J22J0P11o6o87M43
1055A02L49o12M8O97M48m76l79m37K92R45r5n16l37m5j57O78L81q46j26M15l53
$$ plain form
912 914 692 -240 -806 -2 637 624 167 -160 -61 554 -55 -1055 -201 1228 718 -736 -946 -279 -58 574
932 574 391 -607 -1025 -493 208 -158 -482 -517 70 168 -776 -1003 370 833 239 -318 -556 -465 102 1217 499
953 499 -665 -425 340 335 136 22 413 706 447 -609 -241 814 1027 792 267 -769 -391 1136 1189 79
973 79 -421 84 85 -312 -163 68 134 143 -301 -1059 -744 -75 554 417 -792 -1884 -637 617 -18 -815 -332
994 -332 -8 -508 -826 -399 -2 559 50 -559 -862 -461 226 1090 740 -472 -720 474 1183 54 374
1013 374 820 413 27 60 71 314 812 725 -32 -522 -494 606 1316 314 -1015 -384 127 210 -211 250 -51
1034 -51 -660 -571 -433 -549 -123 221 -155 -952 -1077 -757 168 486 -185 -780 -431 -309 -299 412 346 -341 102
1055 102 451 -161 -113 584 1032 556 177 -260 32 977 882 366 29 -16 -173 505 886 40 -86 329 -24
1076b4p34M26P23j67k50k44p94J85J073N6k04n05n35P23M96k43n66M46O66p61
1096b33l95O62L37K35R9o17n00K87Q19l2k76k97p4L60K35p11J71O18m62n13N5
1117b32RJ74M88J54j000l11P71J02J13m21j63J05N3k10k25O85L30o76k64J72l96
1138g42N99P53k78j061J09N20J03L24k65j33K37l4m26K00R01Q1j64n29m92L05
1158HJ022J08o61m61L03nj55N6K8m2J80o01n57M24M43Jk06k72q70L43J019j41
1180c6n14jN3k66K42P7J59L48J63p97k41M85P68J73k46n84k14O66K48k85K73M73
1202I44o99o4m7J25K38M48k79n79k01J14M77M50k17j007J17J01M8j31P56l27o82
1223d15l10J96K4M50J40n53l76J15j13j5Q13j83l56l11j54K85Q36N49q67j20L83
$$ plain form
1076 -24 -758 -332 391 224 -26 -270 -1064 -879 194 250 46 -459 -994 -271 225 -18 -584 -138 528 -233
1096 -233 -628 34 371 606 705 88 -412 -125 694 662 386 89 15 375 610 -101 70 688 226 -287 -232
1117 -232 -223 -49 439 593 -407 -718 53 155 268 -153 -316 -211 -158 -368 -593 92 422 -254 -518 -346 -742
1138 -742 -143 610 332 -729 -620 -100 3 327 62 -71 166 132 -294 -94 807 888 724 195 -297 8
1158 8 1030 1138 477 16 319 314 159 215 243 201 381 -220 -777 -353 90 91 -115 -387 -1257 -914 105 -36
1180 -36 -550 -551 -498 -764 -522 -445 -286 62 225 -572 -813 -328 440 613 367 -217 -431 235 483 198 471 944
1202 944 245 181 134 259 497 945 666 87 -114 0 477 927 710 -297 -180 -79 -31 -162 594 267 -415
1223 -415 -725 -529 -505 -55 85 -468 -844 -729 -842 -857 -44 -227 -583 -894 -1048 -763 73 622 -245 -365 18
1244A8Oj8N91j2Q1j93m44%Q02N80m44n43j37l67M67L97O2o29n8j45k24L85j68
1267Gl5L54l73r55j82J039N72n21p11j31L62N43l1o02K67M86m33l17K13K36M73
1288B61K04p20n93N33P55J53l42k13l76O03P4j70JL07K41m38l76L13K06L92o3
1309G52o44m47M69M69O0m14k57j41L12Q5p02K83N72j79o13j94K63L14R1m28q8
1330d37K07k54LL32K31m33j43L89r2k85O44J78k30j46n6K0J74j31J55K23j13n07
1352b71j7P63j6k46K6k83L6K34J43j47K59q3l19k56Q4J22L23L03m95o55L89L75
1374B69k66j03O1j66J3J16k82P1N04Q4p61j33L86L62J60m8o44J1K45Q0j47N12
1396C24j91k30J86j83j99N42L52K0q42k26L17K35M14m46j55pM6j86K61J73r8N5
$$ plain form
1244 18 24 6 597 585 666 473 29 29 831 1411 967 424 287 -80 387 784 846 217 159 14 -210 175 7
1267 7 -28 326 -47 -1002 -1184 -145 427 -94 -805 -936 -574 -31 -62 -664 -397 89 -344 -661 -448 -212 261
1288 261 465 -255 -848 -315 440 593 251 38 -338 265 339 169 170 477 718 280 -96 217 423 815 752
1309 752 108 -339 130 599 659 245 -12 -153 159 244 -458 -175 397 218 -395 -589 -326 -12 79 -349 -437
1330 -437 -230 -484 -481 -149 82 -351 -494 -105 -197 -482 162 340 110 -36 -92 -72 102 -29 126 349 236 -271
1352 -271 -288 475 459 213 239 -44 -8 226 369 222 481 398 79 -177 -93 29 352 655 160 -495 -106 269
1374 269 3 -100 -39 -205 -192 -76 -358 -287 217 301 -460 -593 -207 155 315 267 -377 -366 -121 -41 -188 324
1396 324 133 -97 89 -94 -293 249 601 621 -221 -447 -130 105 519 73 -82 -89 -43 -229 32 205 107 162
1418A62j04l97k30Q63J54l27k44k6J02L21L9j72J03p1k19j13L70k8j53L47l73
1439Dm01L89L29J65l45j86J0j96L56Lj3j21k07j29J18k0K7Q8L70l71m98M54J74
1462@p3J02j89o1K6L59Q5j38O1j67K2J26j15O4O50o74k91L34l0RJ42J77l02l28
1486b11J32J65j08Q6N6j05n4l70J6L38J27k62n4L1k13K93M40j77k74n4L06k57
1508a49n0J47R8j66J20j34oK29k2m9K70l25k43M49Q8k04j54K25j90O3k17L47j93
1531f6J52Pp2k5Q2j9J85N6n02J85J98j06l63O37k60k42N6K74j69L9Q7r6Q1j85
1555f6K96k38L4j24M3J65p4j35J75J9o8k1K2k27P5Q5O3r0p9OL2K29k24Q6N1J43
1581A78l31OL04n2j96J72J1r2N1J65j37o6j01J10J4RK36l95L56j02rk10K59o4
$$ plain form
1418 162 58 -339 -569 294 448 121 -123 -149 -47 274 313 141 244 173 -46 -159 211 183 30 377 4
1439 4 -397 -8 321 486 141 -45 -35 -231 125 128 115 -6 -213 -342 -224 -244 -217 -129 241 -130 -628 -174 0
1462 0 -73 29 -160 -221 -195 164 249 111 172 5 27 153 38 102 752 78 -213 121 91 100 242 419 117 -211
1486 -211 -79 86 -22 64 120 15 -39 -409 -393 -55 72 -190 -244 -213 -426 -133 307 130 -144 -198 108 -149
1508 -149 -199 -52 46 -120 0 -134 -140 89 67 18 288 -37 -280 169 257 53 -101 124 -66 -3 -220 127 -66
1531 -66 86 93 21 -4 78 59 244 300 -202 -17 181 75 -288 349 89 -153 -97 177 8 47 134 38 119 -66
1555 -66 230 -8 26 -98 -55 110 36 -99 76 95 27 6 28 -199 -124 -39 24 -66 -145 -139 -107 122 -102 -16 35 178
1581 178 -153 -147 157 105 -91 81 92 0 51 216 79 13 -88 22 36 45 281 -114 242 140 131 -79 180 116
1605A16r8K34j63j95L7K08k34k9K20j66O4k24J16k07N1O4M7K3j03J81R1M1k51
1628a77J03K39j33K9K06l41K24J55j25O3k42K81j0k46K5k89L24L12m58k48K76
1649c2K2j70J41j17K0j14K43L4j10L8kJ80J03l34OL33R8k26j00L0P9q3J25j01
1673F3k47K24K59l63q8K04m6n9M4j77K32J11l00j1M4L11n01N98m26K0K82j53k17
1696a96K5J26J93j41o4o9J97K68m80L27l84K47l14J62N8J46j63K01L1k96M38j65
1718A47j7q3J15j35J38n9j17O6K09l04m3K34k6j83J80l8l92J52N7j67J94j%j0
1742h3JL5J71k29O4J23KJ17l08J91R9k21K25K7j43j73l5K41j39J94j53j28J45
1765B3j83Q5j6O6L4k3P3j87R4N9p3m6J01O9L3j43o8J12q6K51j86MJ49K8p9j37
$$ plain form
1605 116 18 252 89 -106 -69 139 -95 -124 96 -70 -6 -230 -114 -321 -270 -206 -159 -136 -239 -58 33 74 -177
1628 -177 -74 165 32 61 267 -74 150 305 180 243 1 282 272 26 51 -238 86 398 -60 -308 -32
1649 -32 -10 -180 -39 -156 -136 -250 -7 27 -83 -45 -47 133 236 -98 -92 241 339 113 13 43 122 39 164 63
1673 63 -184 40 299 -64 -152 52 6 -53 -9 -186 46 157 -143 -154 -110 201 -300 298 -128 -108 174 21 -196
1696 -196 -171 -45 148 7 -57 -126 71 339 -141 186 -198 49 -265 -103 -45 101 -62 139 170 -126 312 147
1718 147 130 47 162 27 165 106 -11 55 264 -40 -83 151 125 -58 122 84 -308 -156 -99 -266 -72 -73 -73 -83
1742 -83 -82 -47 124 -105 -41 82 84 201 -107 84 183 -38 187 214 71 -102 -137 104 -35 159 6 -122 23
1765 23 -160 -75 -91 -25 9 -14 59 -128 -34 25 -48 -94 7 76 109 -34 -102 10 -76 175 -11 -7 142 170 91 -46
1791d6Q7j90L09j89l4O8M2j5p0l0K3O7n2J45k55L37k14l0j47K9J79k95L35p9K10
1816A85k57J95j65O9j61K52j86r4J44k14K45p3J6Q1k04J52J30o1r6K4j0n2j39
1839b19K16J10r9P4J39m74J33K52j48J68j14j49m7J67N0o2R8k06J10L70m71K40
1861A38r4m8k0m3K6P1J37j41l5j02J02j8J20j19j10R6K43p3j54j59J44J35o4j43
1885a11j40L20j12K57j66j02j39J61K40j23j4N3J4k45q4P2N1J7K9j28M0J9K09
1908A18k60J69k19K40l4j81P2K63k52L39j24j26K73k98J82J13l30Q8j48J37Q2
1929A04r2%j50J95j59O0R1j33j07J72K4J33j01k36J43j74R9L61k64O3r2N6M6O7
1953A06k74K8J18P4j94J34m5l4L90j66J9j21Lj23K95J3l78J72J08l7Jk94K85j27
$$ plain form
1791 -46 41 -149 160 -29 -63 5 47 32 -38 -68 -45 22 -30 115 -140 197 -17 -47 -194 -165 14 -281 54 -25 185
1816 185 -72 123 -42 27 -134 118 -68 -162 -18 -232 13 -60 -44 37 -167 -15 115 54 -42 -18 -28 -80 -219
1839 -219 -3 107 8 82 221 -253 -120 132 -16 152 38 -111 -158 9 59 -3 95 -111 -1 369 -102 138
1861 138 44 -4 -24 -67 -41 30 167 26 -9 -111 -9 -27 93 -26 -136 -40 203 130 -24 -183 -39 96 32 -111
1885 -111 -251 69 -43 214 48 -54 -193 -32 208 85 71 124 138 -107 -191 -119 -68 -51 -22 -150 -110 -91 118
1908 118 -142 27 -192 48 14 -167 -95 168 -84 255 131 5 278 -20 162 275 -55 33 -115 22 104
1929 104 12 12 -138 57 -102 -42 49 -84 -191 -19 5 138 37 -199 -56 -230 -131 230 -34 29 -63 -7 39 106
1953 106 -168 -140 -22 52 -142 -8 -53 -87 303 137 156 35 38 -85 210 223 -155 17 125 88 89 -205 80 -47
1977d7J04j0j5l3R1j55j44Q1m9R0n6J52l6j77pR5J67j40J54j68L4J0j27L46k17
2002e7OJ45j32m5m3L29K2l42L32l38K4Q0n5nK56k03K4j08K2n4J39rk02K54Nk02
2028a57JL44j87q4j07J13O8p8L8J65j70J03k8%M4J21k77J8J40L1r7m1j41K6m4
2053a99J78r0J34N8k29J39k64J72J18J9k42N3p4l0J95m5n8K17JK8j74J11J5j93
2077a60R4J67k3k14J92J15M3r9J0k20K12k15KK63j55l4J21o7J82k80N3N4j48m0
2101a47R5N7O6k27r6J09J07j4Nj82J37k9Q6K06j56J00j08M6k18L16k09Q2L2J07
2125A65k67J15K13k25J17q1P8q2J09k05N8R2j86l1j46J90J5R1N8m4p7kJ81j94
2149e8R3K8K8j09r4Q7M6J14j74J74J4k21O5q3K04l02K32j57j72K24j30o0K80j07
$$ plain form
1977 -47 57 47 32 -1 90 -65 -209 -128 -177 -87 -143 9 -27 -204 -211 -116 51 -89 65 -103 -69 -59 -186 160 -57
2002 -57 -51 94 -38 -83 -126 203 225 -117 215 -123 -99 -19 -74 -79 177 -26 -2 -110 -88 -142 -3 -12 -214 40 45 -157
2028 -157 -156 188 1 -83 -190 -77 -9 -87 -49 116 -54 49 21 21 65 186 -91 -73 67 98 1 -40 -181 -155 -199
2053 -199 -21 -111 23 81 -148 -9 -273 -101 17 36 -206 -153 -227 -257 -62 -107 -165 52 53 81 -93 18 33 -160
2077 -160 -66 101 78 -136 56 171 214 115 125 -95 117 -98 -96 167 12 -22 99 32 214 -66 -13 41 -107 -147
2101 -147 -52 5 71 -156 -252 -143 -36 -50 -45 -227 -90 -119 -33 173 17 117 9 55 -163 153 -56 26 58 165
2125 165 -102 13 226 1 118 37 115 33 142 -63 -5 87 -99 -130 -276 -86 -71 20 78 34 -43 -45 136 -58
2149 -58 35 63 91 -18 -112 -25 21 135 -39 135 149 -72 -7 -90 114 -188 44 -113 -285 -61 -191 -251 29 -78
2173g8K3P5J6r2K07j69j42J39R9j20q7J37o9J19J34k74J17R8l67J64mJ91r2l5
2197a0J70j01o9J35Q4r1P9l67K00Q0J0j46o6Q8j05J42R6j84L2r4J39o5q8Q5J4
2222c2p6P5j72K10R0j28k07O2K57j85O6J2J64j38J23k02L81l22K86l3J2kj68k9
2246D4N7r0m0n6M2l0j63J26p2J56q6k3J44m1j91L76j94Q6j02M3Kk2n6J48K7o6
2272A9k96O9K54kj24K4J54k25N6K00l40L31l0J25q9j46r6K29k97K85J37k00n0
2295a2N0N1j54K60p8j61J26j03J4L5r0j28O5J82l43J32R4k0n4k3J15M0k5o6J57
2320F4n4K00k45jM5L4Q0O9k70JJ40M3j56k3K68l34P1n0L2P2O8j78J0J30n5J20
2346H1kM0l89K81J62k35M1m0J55O7k11L1N3p2O7rQ4r2J67j30r3K81j37k4N5k02
$$ plain form
2173 -78 -55 20 36 -56 151 -18 -160 -21 78 -42 -129 8 -61 58 192 -82 35 133 -234 -70 -74 117 25 -10
2197 -10 160 59 -10 125 209 118 197 -170 30 110 120 -26 -92 -4 -109 33 129 -55 -23 -117 22 -43 -131 -46 -32
2222 -32 -108 -33 -205 5 95 -33 -240 -178 79 -106 -40 -28 136 -2 121 -81 300 -22 264 231 243 241 73 44
2246 44 101 11 -29 -85 -43 -73 -236 -110 -182 -26 -112 -135 9 -32 -223 153 -41 45 -57 -14 -12 -34 -90 58 85 19
2272 19 -277 -208 46 44 -80 -56 98 -127 -71 129 -211 120 90 215 126 -20 -116 113 -184 101 238 38 -12
2295 -12 38 89 -65 195 117 -44 82 -21 -7 28 -62 -190 -125 57 -286 -154 -60 -80 -134 -157 -42 -2 -27 -93 64
2320 64 10 210 -35 -36 9 43 123 192 -78 -77 63 106 -50 -73 195 -139 -68 -118 -86 -14 54 -124 -114 16 -39 81
2346 81 79 119 -270 11 173 -62 -21 -61 94 161 -50 -19 34 -38 29 20 104 12 179 49 -44 237 100 76 131 -71
2372g1pk2M3J38n2p4O8J19q9J56q6j66J72j48p8J93Q8j42m3j81J28n0j4K44j66
2397d0n3L2J13m4j49J62K61k89N1j2o7qPnJ30m5j0oK01k56J84k58L2J11P2o0j90
2424a36J24j29K89j51O6qQ6j73m9k92L52j67P7r9M50k91m3N9K01k71J27p0jJ10
2448F1l4k0M7n5p3J07J11j37J42n2K9j78rJ66o6j42K85k43J22l7L9j57J07K3n0
2473a4J21j58j2K37n0k40J43q8J53q0j91J15J30q2j94K11j34N2K35j23M6l8k9
2496A0j32L0k9k7J01J54l27O5j9P3r3K66j25jJ5J07Q0r8J05j26J21j05j3qJ19
2521A43o6Jj42j64K84j34j15K10J53j58k5R1nJ45k24O6j88J30j53K00o4J91j13
2544F3q7l6J88j52N4o2j1R5j96j9l3L36j30q3n0k1K31j32j2J46j63J05MP5q4J23
$$ plain form
2372 -71 -78 -100 -57 81 29 -45 23 142 53 209 123 -43 129 -19 -97 96 184 42 -1 -182 -54 -104 -118 126 -40
2397 -40 -93 -61 52 8 -141 21 282 -7 44 32 -35 -43 -36 -41 89 44 34 28 229 -27 157 -101 -69 42 114 54 -136
2424 -136 -12 -141 148 -3 63 55 141 -32 -81 -373 -21 -188 -111 -210 240 -51 -94 -35 166 -105 22 -48 -49 61
2448 61 27 7 54 -1 -74 33 144 7 149 97 126 -52 -61 105 39 -103 182 -61 61 24 63 -94 13 36 -14
2473 -14 107 -51 -63 174 124 -116 27 -61 92 12 -179 -64 66 -16 -210 1 -133 -81 154 31 77 39 10
2496 10 -122 -92 -121 -148 -47 107 -220 -155 -174 -101 -194 72 -53 -54 -39 68 148 50 155 29 150 45 32 24 143
2521 143 77 78 -64 -228 56 -78 -193 17 170 12 -13 78 73 218 -6 60 -128 2 -151 49 -15 176 63
2544 63 -24 -60 128 -24 30 -32 -43 52 -144 -163 -196 140 10 -73 -123 -144 87 -45 -57 89 -74 31 35 110 26 149
2570A49r0n9o8J60k74K17j7Q8O7n2j94O5k4Qk6o1P4rK6k6J30j07Lr6j04M16q0
2597A16j48o5o8K36m12L66jm3n7JL9rK72j80Q7j78j3o3K70p8k47K22j72J15p7
2622h7J08l5r4K3J61l69J01Q6K34%Oj81q7r9J95N7J14o4j36O0m0k4J30N2k56J56
2648A1No2K06k13q0J07J13j08L15k99j41J70K2N1l04L92j12k16L8k1J91j06o3
2671a04K02Qk14Q6L7j3Pj02L1j15P3K08j18r7J12J28Oj71n8P9K65j70k9q9O6r6
2697f8J1K28j10Kj03J72k34K7J12k2q2Mj57J96j55J36K9j92K16j20N2P7j7k45
2721b43M29j57l2m6J63Q3j92K17k5j90J34R4k48L03n01K78J56j33m8k21J98k7
2743hK5l6Ml6n2J30j88Q3J19j25J31K0L5k59L6K92n7r2j13P5J26j11k58L26j28
$$ plain form
2570 149 59 0 -68 92 -182 35 18 106 173 121 -73 -8 -32 -24 -50 -111 -37 -46 -20 -46 84 -23 -20 -116 -220 196 116
2597 116 -32 -97 -165 71 -341 25 24 -19 -76 -75 -36 -45 227 47 134 -44 -57 -120 150 72 -175 47 -125 -10 -87
2622 -87 21 -14 -108 -85 76 -293 -192 -106 128 128 134 -47 -134 -233 -38 19 133 69 -67 -7 -47 -71 59 111 -145 11
2648 11 16 -46 160 -53 -133 -26 87 -21 294 -5 -146 24 46 97 -207 185 73 -143 -105 -126 65 -41 -104
2671 -104 98 106 -108 -22 15 2 9 -93 -62 -177 -104 104 -14 -111 1 129 135 -36 -94 -15 250 80 51 -38 28 -68
2697 -68 -57 171 61 63 -40 132 -102 -75 37 15 -67 -63 -220 -24 -179 -43 -14 -206 10 -110 -58 19 2 -243
2721 -243 186 29 -3 -49 114 197 5 222 197 7 141 235 -13 290 -211 67 223 90 42 -179 19 -8
2743 -8 17 -19 -15 -51 -103 27 -161 -78 41 -84 47 67 102 -157 -121 171 114 22 -91 -16 110 -1 -259 67 -61
2768f1n3o6J98M6q7p9K8M5J55j44j39J70j41k5P8P1K3J66q7K7r6K89l63o9PJ24
2794A7R4j42o8J03Ql8k9k1J72p7j28K08j38R0j31J57k19J36J06J4l47J89K0m4
2818f8P0M4Rj22J27j08J51L3j71j33J47K77k99j19K90j01j99O8J32O0m2R1k68
2841a31J95Nr6j0N9J50j73K58p5M8j83p4P3RK9j04m3J45k50K45Nj63P7kj04pN5
2868f2R0q5j44J93M6L5l2l58J68J57J3J8j22M9J25l9j18R2L9j5K2j60J6o1J34
2893AJ46l64J49K28k33OK41l51K81nl5L3j87K1K22o6k6q9Q5m9j4J5Q2q4k0k5j01
2920a39J76j11o0Q2k3J11K2K5j50R4l2o1Oj12K35O7j65P5Q8k77j52K01Q5j08N1
2945g2J76j59JN1k1M1J61k73J90J06L1j45j87R7n0L9N5m5L3K04k26o3J83J2j44
$$ plain form
2768 -61 -114 -180 18 64 -23 -102 -74 -29 126 -18 -157 13 -128 -153 -75 -4 19 185 98 125 29 318 -45 -114 -107 17
2794 17 111 -31 -99 4 12 -26 -55 -76 96 19 -109 99 -39 51 -80 77 -142 -6 100 114 -233 -44 -24 -68
2818 -68 2 46 55 -67 60 -48 103 136 -35 -168 -21 256 -43 -162 128 27 -172 -104 28 88 46 137 -131
2841 -131 64 69 -27 -37 22 172 -1 257 182 230 47 -27 46 55 84 -20 -63 82 -168 77 82 -81 -4 -6 -110 -117 -62
2868 -62 28 -57 -201 -8 38 73 41 -317 -149 8 21 39 -83 -34 91 52 -66 26 65 50 72 -88 -72 -133 1
2893 1 147 -217 -68 160 -73 -67 174 -177 104 99 64 97 -90 -69 153 87 61 -28 57 8 -6 9 91 7 -13 -38 -139
2920 -139 37 -74 -134 -52 -75 36 58 83 -67 27 -5 -66 -60 -172 63 130 -35 40 128 -149 -301 -100 -15 -123 -72
2945 -72 104 -55 -54 -3 -24 17 178 -95 95 201 232 87 -100 -3 -53 -14 41 -4 29 233 7 -56 127 139 -5
2970eJ35n3k23J27L6j69K35j41n7p0J58J39l04J50jR9o2j69K14j8j84J62R6j16
2994b1j0j6oL9J99j13n9k59K4M87l59Q4k02L06p2Q1K1n0q9o7J52J21j1k80K87
3019A87j88O2K5k6p7R5J0K2p2m2Q7Or4p2O7m7k3M13j77j34m5j33M76k94O8m1j05
3046e2j9J76k49J06q4k7K57j36J06j10J57j65J60j60R3j6j37R1K8r8J53m4j16
3069h6J4J24R8j0k48P6J52p4Q4k53J32k1j16J69r7J12K9k94L07J01l52K41j27
3092c9J43m5j53J06k45J37P8J69p8j72j05L74q8q5k5J0j68K09m8M8N1j00l5P8
3116A7n4j2nm6K95l05K12m8j47J8K6l0P4o0k4J91j49L35j51k33J02j2K41k78m5
3141h8J37m5k0LJ8j82J34Q9J2J6n7KL5j81rJ92p6J03l12L04k1J20k17J31j51p4
$$ plain form
2970 -5 130 77 -146 -19 17 -152 83 -58 -115 -185 -27 112 -192 -42 -43 56 -6 -175 39 21 -163 -1 95 -21
2994 -21 -31 -47 -53 -14 185 72 13 -246 -222 265 -94 -10 -212 94 22 103 124 74 -15 -82 70 191 180 -100 187
3019 187 -1 61 86 60 -17 78 88 110 38 -4 83 89 -5 -77 -10 -57 -80 333 156 22 -23 -156 320 26 94 53 -52
3046 -52 -71 105 -144 -38 -122 -149 108 -28 78 -32 125 -40 120 -40 53 37 -100 -9 19 -79 74 30 -86
3069 -86 -72 52 150 140 -108 -32 120 46 130 -123 9 -12 -128 41 -56 56 85 -209 98 199 -153 88 -39
3092 -39 104 59 -94 12 -233 -96 -18 151 73 -99 -204 170 82 -3 -28 -18 -186 23 -25 23 74 -26 -61 17
3116 17 -37 -49 -54 -100 195 -110 102 54 -93 -75 -49 -79 -5 -65 -89 102 -47 288 137 -96 6 -6 235 -43 -88
3141 -88 49 4 -16 -13 5 -177 -43 46 58 74 17 19 54 -127 -136 56 -20 83 -229 75 54 174 -43 88 -63 -137
3167a37O4J08k4J24p6Rj02L7J56k0Nk37J69k02J94q8R6j1P0k13J83p5J6O3j24
3192a5k04K78J28k14J01l0P5k15j43L49j01j4L3j99K38J8P0j01J15P8k51n1K2
3215c3j38L57j55K8J59j32p0j06L29r9k27m7M3P1J53j13p1q2L53m10K08J9oj39
3239a08j63M06j9k39r6K65m5K1r5J55j52J7k5P0P3j2r4P8r0q2K61l03J11P7p1
3264f0L8jL8q9J30M7k03J3R1Q5L7l6n7m6j38K4J42N7j29K55k07l4O7L0q5Q7l2
3291B4n0M4O2j21L6l7L7O6n6r3K37m6j02j9P3o7K5m7O8J03j18Lr2J21N4J19l50
3318a26J51r0K57k9k80J08J07j3m3J42Pl1j10J48j15J08j26J5L5J62l63O0J59
3341A33k39K31Qp5jJ0r8L5L5j68m7J40L8j9q7K37j43P4k0Q5L0j90n5k1N3M1J12
$$ plain form
3167 -137 -73 35 11 135 59 68 -34 3 159 139 144 -93 76 -126 68 -20 76 65 135 -78 105 30 46 109 -15
3192 -15 -219 59 187 -27 74 44 119 -96 -239 110 9 -5 28 -171 67 85 155 54 169 247 -4 -55 -33
3215 -33 -171 186 31 59 218 86 16 -90 239 140 -87 -134 -91 -20 133 20 -51 -133 220 -190 18 37 31 -108
3239 -108 -271 135 116 -123 -219 46 1 22 -73 82 -70 -53 -78 -8 65 53 -41 37 -53 -135 126 -177 -66 11 -60
3264 -60 -22 -23 15 -74 56 103 -100 -87 4 89 126 90 33 -13 -151 -127 15 72 -57 198 -9 -43 24 54 -31 56 24
3291 24 -26 18 80 -41 -5 -42 -5 61 5 -88 149 103 1 -18 55 -12 13 -34 34 137 19 22 -70 51 105 224 -126
3318 -126 25 -65 192 163 -117 -9 98 85 42 184 191 160 50 198 83 191 65 80 115 277 -86 -26 133
3341 133 -106 125 133 58 57 67 -31 4 39 -129 -176 -36 2 -17 -104 133 -10 64 44 129 159 -31 -86 -107 -54 -13 99
3368I9j09n2p2M1J84j35j02K57p3M4j13Q1l3O1j12p8J6J64k32J92p1J4P0n9k2
3393d0j09K68j95p1J56m2M0m2O8p0RR8o5L8k16J58k1j59K73Qq6R1j63r9j52L28
3419EO8m7k17M3J96j61J55l00L61j07J67j4j46p2K65k21O2Km4M6rJ17j64N4QL4
3445H1j17J4r4K70j60K9L7j27K3l9N8L5J2N0j28k21L17k1J46q5k3R0j69Lj98J60
3471e7R8K9j51M2J6L5l3M1K18k49J3L6j78J03L1NrJ45o3j60J37q3moQ1J0o9K08
3499A86j77j8K59j70j37Q5j55Q4O1JJ4P0J46l25k0R2n6p0O6Q1P9j49J7K55j57
3524F2n5r2K67j58Q8q9k14K07o6MM7j06J65m2l4J00J0j08p2J57j36J24q5J71l03
3549a58J72Ml2J18l3j89j36K50n0J8M9N0j68J65k6J8k18K02o9q5K34j62MJ9q3
$$ plain form
3368 99 -10 -62 -134 -93 91 -44 -146 111 38 82 -31 50 17 78 -34 -112 -96 68 -164 28 -43 -29 41 -18 -40
3393 -40 -149 119 -76 -147 9 -33 7 -35 33 -37 -28 70 5 43 -173 -15 -36 -195 78 86 0 91 -72 -171 -323 5
3419 5 73 26 -191 -148 48 -113 42 -258 103 -4 163 149 3 -69 196 -25 37 39 -5 41 32 149 -15 39 47 81
3445 81 -36 -22 -116 154 -6 23 60 -67 -44 -83 -25 10 22 72 -56 -277 40 19 165 80 57 147 -22 -19 -217 -57
3471 -57 41 70 -81 -39 -23 12 -21 20 238 -11 2 38 -140 -37 -6 -1 -10 135 72 -88 49 -34 -38 -44 37 47 -22 186
3499 186 9 -9 250 80 -57 28 -127 -43 18 19 33 103 249 -76 -96 -4 -60 -130 -64 17 96 -53 -36 219 62
3524 62 7 -85 182 24 112 23 -191 16 -50 -46 1 -105 60 18 -16 84 94 -14 -86 71 -65 59 -26 145 -158
3549 -158 14 18 -14 104 71 -118 -254 -4 -54 -36 13 63 -105 60 34 52 -166 36 -33 -118 116 -46 -42 -23 -106
3574a06P5J29j38Q0j19K8R0m7k03K74J39k79R2j0K5r6K18j99J6p9J32K8N8n4j6
3599C8m2J8J44m6q3J18j97P7L8p7j3l2J57j13k93L27l3m4K09j0k7j17N9o7q4J42
3625D9P0j42JK15j74r8P8J40j90j99L20j28J49k64O9J05l3Q1j45j16L86j68Km6
3649c8K9J14p7l7J35Q5l55N5K42j34q7J8j22J93j8J41o0j11J6J6J89q5o1L9j64
3674g7K06k76R5n2j59K61jJ51l00J04J35L9k36N4R0k3N2k51J58O2j10J67q4L0
3698C5q1R3r9j37K03l3jQ1l83N30j69j3rJ38j85P6nJ26r0j29O8Mn7L85l97Q9O1
3725A01j02J4J25k61K98k51J82j12J94j53M6J9j12r0Q6M4J5J55k27O1n9J16l03
3748b14J85j4q2N4K6j0k6J00R6j96m7J14j64J47O5J12q2j25K17j57L9n3J70j99
$$ plain form
3574 -106 -31 98 -40 40 -79 -51 39 -8 -211 63 202 -77 15 5 30 -66 152 -47 -31 -110 22 50 108 54 38
3599 38 -4 14 158 112 29 147 -50 27 65 -12 -25 -57 100 -13 -306 21 -12 -56 153 143 116 -1 58 -9 -93 49
3625 49 119 -23 -22 193 19 -79 -1 139 -51 -250 70 -58 91 -173 -104 1 -32 49 -96 -212 174 6 8 -38
3649 -38 -9 105 28 -9 126 211 -144 -89 153 19 -68 -50 -172 21 3 144 84 -27 -11 5 194 109 48 87 -77
3674 -77 129 -147 -52 -104 -263 -2 -3 148 -152 -48 87 126 -110 -56 34 11 63 -188 -30 32 -78 89 5 35
3698 35 -46 47 -52 -189 14 -19 -20 61 -322 208 39 26 17 155 -30 46 41 167 77 -52 16 20 -37 348 -49 40 101
3725 101 -1 13 138 -123 175 -76 106 -6 188 35 81 100 -12 -102 -16 28 43 198 -29 32 -27 89 -214
3748 -214 -29 -43 -125 -71 -45 -55 -81 19 115 -81 -128 -14 -178 -31 34 146 64 -61 156 -1 38 -15 155 -44
3772d4J67j75Q5L5Oj05J05j59J10o6P0or3j4J59j18J28J67j39r6k89J72R9n8K2
3797c7R6k72J93p0L3Q8O0j27K1j31n6J17J69k19L3O5M8O1m9k8J3L17l86j23J91
3822Grj69K67q4R7k46J15Q4j86O4n7k3K48Q1k41J77n9o7k1O7J50k05k1J36q2N1
3848G4k5j07q9K87k3l0q7M3j49O8J72k32n8m1L20j65p3o0J30K3j86J06P1K96k71
3873fO0j21jm8K95j55J50k26p3j47K31M0j1L5j57J37J48j39o0J56l77K12J47K1
3897A11j56J13m6o3J02J52J4k88J30N2Q1j47j02J58k5l2J60k24P6M7j19oj05j1
3921a28O1J10j56q1J90j85J70KJ3l4P6p5K6O8J35l3l02j4J83O8j40j18K03J23
3945A62j83K5J01M7k46m6L05k83L34n9n2l12P2R2K4j64J14J91m0m3k48K43Q0j39
$$ plain form
3772 -44 123 -52 33 68 74 -31 74 -85 25 -41 29 23 -70 -84 75 -43 85 252 113 17 -272 -100 -1 -59 -37
3797 -37 59 -213 -20 -90 -57 31 91 -36 -15 -146 -202 -85 84 -135 -102 -37 11 72 23 -5 8 325 -61 -184 7
3822 7 -2 -171 96 12 109 -137 -22 62 -124 -60 -117 -140 108 189 -52 125 66 -1 -22 45 195 -10 -31 105 23 74
3848 74 49 -58 -147 140 117 87 0 43 -106 -38 134 -98 -156 -197 123 -42 -115 -175 -45 -22 -208 -102 -31 265 -6
3873 -6 54 -67 -68 -116 179 24 174 -52 -125 -272 -41 -1 -12 23 -134 3 151 12 -48 108 -269 -57 90 111
3897 111 -45 68 22 -41 61 213 227 -61 69 121 202 55 -47 111 86 54 214 -10 66 113 -6 -12 -117 -128
3921 -128 -67 43 -113 -194 -4 -189 -19 -17 -4 -38 38 -37 -11 57 192 159 -143 -157 26 94 -46 -164 39 162
3945 162 -21 4 105 152 -94 -140 165 -118 216 157 105 -207 -135 -43 -19 -183 -69 122 82 39 -209 34 114 -25
3969b5NJ93j92J7P4r4k34L8K94r8R1k28J97j12j66O3J45j93MJ98M4K0k01J60R1
3994I1k27J24n8K64k38J42Jq7J05J10k49J47J15m06J66LK12l13J31O6j06Q7O6
4017A46j67J21m5L0k81L42Jj89M3J0J65j26J43l54J1J58j81K2J09L02k93k6L22
4040B63k38l6r7P4J15p8K6j44N7J30o3m8l5J51J07n8j38m6J82p0j13R6Q2k52Q5
4065d8K28jj32m25L94J2j7J86r1j19j4p5J22k7N2l16L86j87P2K3J35j84j33L55
4089A96n4j43MK8j36J41j06K4J11q1J7L0j83J49L6K2r2j69l3J37k9Q1Q8k48M57
4114B47k56j06L52k04j15J61j19N5K03Rj85j65K30k7o4J53j70m8J68j40Q2k65
4136b04K51J2L9Mq6j76J83J16j56r5J36o9PL4j22n8K78q6j06j96L24LR4k69q9
$$ plain form
3969 -25 -20 173 -19 -2 72 -22 -256 -218 76 -22 69 -159 38 -74 -240 -177 -32 -225 -221 -23 21 41 -160 0 91
3994 91 -136 -12 -70 194 -44 98 99 12 117 227 -22 125 240 -166 0 3 215 -98 33 99 -7 80 146
4017 146 -21 100 55 85 -196 146 147 -42 1 11 176 50 193 -161 -150 8 -173 -151 -42 260 -33 -59 263
4040 263 25 -11 -108 -34 81 3 29 -115 -58 72 9 -39 -74 77 184 126 -12 -58 124 54 -59 37 119 -133 -48
4065 -48 180 179 47 -378 16 28 11 197 106 -13 -27 -102 20 -7 45 -271 115 -72 0 23 158 -26 -159 196
4089 196 142 -1 3 31 -105 36 -70 -46 65 -16 1 31 -152 -3 33 55 -37 -206 -239 -102 -131 -50 38 -210 247
4114 247 -9 -115 237 33 -82 79 -40 15 218 227 42 -123 107 80 16 169 -1 -49 119 -21 61 -204
4136 -204 47 59 98 102 16 -160 23 139 -17 -112 24 -45 -38 -4 -126 -184 94 8 -98 -294 30 33 127 -142 -231
4161b31L89L1q5o0j7p7J5p6J74n3M2m1J63l27J73J1J05Q1k83J03n0j1j06K98r4
4186G4j63K12N0j99q7K3j2O8J98pj25J95q7r3N2p9J7N8r7k97L25k9n4P4q6jj70
4213b40K74oo9p6k8P6r6l4J94N0o7q9J82K9L7l15J25K22k82PN9K09j24qr1J73
4239A12j61K8oL7J68l03K8R4P2j95K13M9j36P1J82l12J37J4l1p4R6m5l1J15k37
4264a15m8K15Q9r7K8L2K0j33q3q6P2K2O7l4J6J2Mn3J27N7k38n2M6p2L75n9j04
4291Hp5K03j28k02K53J64k62l3K10l5k74M9m6J30J40j93Q2J37o0j70J47j7m2l6
4315e0O7L9k1N4n7j09j31K63M3J1k58QK30k42N8J31J53k64j39L83j26j30J35P6
4339A24k33M7P6Q0Rj98j31J85j61L14n4m6k7m2O4j02j49L08N9l86L76P1j90R5
$$ plain form
4161 -231 158 189 104 44 27 -50 -35 -111 63 10 52 11 174 -153 20 31 136 217 -66 37 -13 -24 -130 168 74
4186 74 -89 123 173 -26 -113 -90 -102 -34 164 157 32 227 140 47 99 20 37 95 -2 -299 26 -3 -57 17 -69 -70 -240
4213 -240 34 28 -41 -117 -145 -69 -165 -199 -5 45 -22 -111 71 100 137 -178 -53 169 -113 -106 -47 162 38 30 -61 112
4239 112 -49 -21 -27 10 178 -125 -97 -3 69 -126 87 136 0 71 253 -59 78 92 61 -13 83 38 7 122 -115
4264 -115 -163 52 141 44 72 104 124 -9 -92 -178 -106 -84 -17 -51 -35 -23 -19 -72 55 112 -126 -178 -132 -204 171 112 8
4291 8 -67 136 8 -194 59 223 -39 -72 138 103 -171 -122 -168 -38 102 -91 -9 128 68 -102 45 28 -14 -50
4315 -50 17 56 35 89 32 -77 -208 55 98 109 -149 -141 89 -153 -95 36 189 -75 -214 169 43 -87 48 124
4339 124 -109 -62 14 94 103 -95 -226 -41 -202 112 58 12 -15 -57 7 -95 -244 64 123 -263 113 184 -6 89
4363H9r3PJ50j61or3P5J75l46J78L8L6N8p1K4l1j30O5M5j01j0n8J33l5J66j94
4389i0p4K72k11P4P9l8OJ5k20L7J79j62J07J6o1N1jk26K00OM1oP3j33j0J6j44
4416b04L0J65Q1o1j56J61N8q4p9j0J93j59o3Q0J79K1k38P1m0p5K1J9J4L6O3PK3
4443E3j70K31J3k24K23j43Q6j85OJ4O9K42k88m2J51J18j25J5p4K24k58k8J19j31
4467a04J06r3J41q6R0l7j77K63j41J36J46k91J1kk7K8K16n3k94K74j32m0r1Q6
4491g1K7J77j70N7J05p6k45J63K1J58k65O9L5R7j72O4j33J36J72m7n4kn4M7K2
4516F1J28j00p3j09J55p8J80j99r8J83l5Jj84J4M16j01q6lq4L7o9l3J64R9k20
4541c4K04j02j40Q3j2q4J07J61p2l68K96O1j40L7J5R6j55N8k31K85j36Q6j11L9
$$ plain form
4363 89 -4 3 153 -8 -14 -107 -32 143 -203 -25 13 49 107 36 60 29 -101 -36 9 -92 -102 -160 -27 -62 104 -90
4389 -90 -164 108 -103 -29 50 12 18 33 -187 -150 29 -133 -26 -10 -71 -20 -21 -247 -47 -41 0 -6 67 -66 -76 -60 -204
4416 -204 -174 -9 72 11 -145 16 74 -10 -89 -99 94 -65 -128 -48 131 152 -86 -15 -55 -130 -109 -90 -76 -40 23 30 53
4443 53 -117 114 127 -97 126 -17 69 -116 -110 -96 -27 215 -73 -115 36 154 29 44 -30 194 -64 -92 27 -104
4467 -104 2 -91 50 -36 54 17 -160 103 -38 98 244 -47 -36 -38 -65 -37 179 126 -168 106 -26 -66 -157 -71
4491 -71 -44 133 -37 20 125 49 -196 -33 -12 146 -119 -50 -15 82 -90 -26 -159 -23 149 102 48 46 -8 39 61
4516 61 189 89 16 -93 62 -16 164 -35 -133 50 15 16 -168 -154 262 161 75 72 -12 25 -44 -77 87 186 -34
4541 -34 170 68 -72 11 -1 -85 22 183 111 -257 39 100 -40 -3 12 108 -47 11 -220 65 -71 15 -96 -57
4565e7J41j49P0L2L0r2J26j65J11j39J50L2r8J48j74O5Q5p0J22k21ql3K10j11
4589Ej28P8J00RM9j92K23m1%j24j90K86n5m0J50q7J52k32K49k33k04J13J79K0
4613H7k73J42n6J28m5j0K3P3j68J03j34r6L02j23J04ln8q2j66L15j21J97j41O6
4637F4j48J55Q2j43N0j12K23j08j68j04R6o1J24L35k20k0p7O3o8J57r8j19J02
4660Eo4P8k70K12j8R6k6o8O6n2J39k69J08j6J70n5q7J6K57k28m5j7m3O7o0P7Q
4687a9n0N1J28j07P8j26N8K04k47L3pK5j2N3j9j01Q0J51j13m6p4R3r0R8L7j64
4713h6M1M8mm0J60J9j33r2O6L2M7k5p2R6N3j46M2j7J13j50l1j27J88j0O9k37J53
4740d3j62J43PMQ9r5J5oR5J1l7p0p4K10j67J27j7R8l32K13J65k04J38m2j06J06
$$ plain form
4565 -57 84 -65 5 37 67 -25 101 -64 47 -92 58 90 -8 140 -34 31 116 46 168 -53 -61 -94 116 5
4589 5 -123 -45 55 64 113 -79 144 103 103 -21 -211 75 20 -20 130 43 195 -37 212 -21 -225 -112 67 87
4613 87 -186 -44 -100 28 -17 -27 -4 69 -99 4 -130 -226 76 -47 57 54 -4 -86 -252 63 -58 139 -2 64
4637 64 -84 71 153 10 60 -52 171 63 -105 -209 -113 -174 -50 285 65 45 -32 31 -37 120 22 -97 5
4660 5 -59 19 -251 -39 -57 39 13 -55 11 -41 98 -171 -63 -79 91 36 -51 -35 222 -6 -51 -68 -111 -44 -104 -27 -19
4687 -19 -69 -18 110 3 81 -45 13 217 -30 3 -4 21 9 62 43 -58 22 173 60 14 -60 33 -57 41 78 -86
4713 -86 -45 3 -1 -41 119 138 5 -87 -21 11 58 33 -39 57 110 -36 6 -11 102 -48 -79 -206 -18 -28 41 -196 -43
4740 -43 -205 -62 -55 -51 38 -57 -42 -48 47 58 21 -49 -123 87 -80 47 30 128 -204 9 174 -30 108 66 -40 66
4766F6J26k08M0K9Lo7J69k0j18L9Mj26J63o6l8j35J76K14l24n1J8k9pK49n1j48
4792i2K6J16K7r8P5O1n0k3k03J38j35N1k1K88l41J03P4J04m8L4n1j45K93l36K09
4817E6M4k49R4Q4J74k56j44J03O0J29o1pq1M9r2mK36j67m0J14N0l08L52j65Q3
4842E4o2K16j77K7m7K07k27l8n0k0J22K7N2j83K8n1L07l66J64qP4j40q0J02r9
4867a68J52j53J59P9J57l06J68R8j45J31k49l3J90q5N6n8p0k8K06K19k16j81O8
4890io5K76k27K08j36J1o1o2J39J1p9m2O1l4M7j8o2j27K97K9j93l4K86k79j0L
4916g0P4j37M5J80k34L40k17j81K62j25Q1J11J02j01q1k7q8j9P7kj10J69K08j52
4940A05j92k1J48l0J8j71K85Oj58m4M7N8j7j14o1K30q2j48J25l9N2L5j53q0K44
$$ plain form
4766 66 192 -16 24 53 56 -11 158 138 20 59 63 -63 100 34 -4 -139 37 251 -73 -124 -106 -135 -142 107 56 -92
4792 -92 -66 50 77 -21 54 115 65 42 -161 -23 -158 -107 -128 160 -181 -78 -4 100 52 86 35 -110 183 -153 56
4817 56 100 -149 -55 29 203 -53 -197 -94 -34 95 34 27 -54 -5 -97 -101 135 -32 -72 42 92 -216 136 -29 54
4842 54 -8 208 31 58 11 218 -9 -47 -97 -117 5 32 84 -99 -71 -122 185 -181 -17 -25 49 -91 -171 -69 -168
4867 -168 -16 -169 -10 69 226 -80 88 186 41 172 -77 -110 80 -5 51 -7 -77 -105 101 320 104 -77 -9
4890 -9 -74 202 -25 183 47 58 -3 -65 74 85 6 -36 25 -9 38 20 -42 -169 128 157 -36 -70 216 -63 -73 -70
4916 -70 4 -133 -88 92 -142 198 -19 -200 62 -63 18 129 231 130 49 22 -66 -85 -8 -10 -120 49 257 105
4940 105 -87 -108 40 10 28 -143 142 148 -10 -54 -7 51 34 -80 -141 89 7 -141 -16 -55 -3 32 -121 -201 43
4965D3l7pJ29j77J12n8j05j48J87J64j17k3r1J48NN5k15J67p8L58j12k55n8J20
4989GM3j13Q2L2L8j2N1P1r3j36m7R8M3l6j3J00J0j45p6J61J16k41l7L07k40j93
5015b23J71Q5M5j87n7Q1K5J05r7r2J64k4Q2P2O0k33J33J5j54m6Nm9M0N3o0pJ11
5042A8j85J10J21p5L19j90n0j60j90N64m75J35J63l3j72J40k7J8j35J78m07K65
5064f8M1j8j28J27L23l12J43Kj51J36q8O1Ml6k57J97N1L0j01L5j18K36j42JPJ27
5090A02J0k25j1J89q2j48K24J7j08l0N5J18j54J51M9k10m2J48j05J07j22PL13
5113B53j46K7j44J19M6l05K31r6J6j28K00k1J26q6k13R1P1M2J1p7pk9M7O0k14
5138a26J37j48J93k48K03R0j54n9Q4K18k95J05m7M4j44K2K4L07j20k07J55o7q8
$$ plain form
4965 43 6 -1 128 -49 63 5 -100 -248 -61 103 -14 -37 -128 20 25 80 -135 32 -46 312 200 -55 -113 7
4989 7 50 -63 19 51 89 77 128 199 106 -30 -77 21 64 28 15 115 125 -20 -96 65 181 -60 -97 210 -30 -223
5015 -223 -52 33 78 -109 -166 -85 -60 45 -52 -144 20 -4 78 150 210 -23 110 125 -29 -75 -70 -119 -79 -26 -86 -93 18
5042 18 -167 -57 64 -11 308 118 68 -92 -282 282 -193 -58 105 72 -100 40 13 31 -104 74 -333 -68
5064 -68 -27 -45 -173 -46 277 -35 108 110 -41 95 7 68 72 36 -221 -24 27 57 -44 -9 -127 109 -33 -32 -25 102
5090 102 112 -113 -124 65 -17 -165 59 76 -32 -62 -7 111 -43 108 157 -53 -95 53 -52 55 -67 -60 253
5113 253 107 134 -10 109 155 -150 81 -15 1 -127 73 52 178 92 -121 -30 41 83 94 17 10 -19 28 88 -126
5138 -126 11 -137 56 -192 11 101 -53 -112 -28 190 -105 0 -47 -3 -147 -125 -101 206 86 -121 34 -33 -121
5161a21K57r4j31K38q1m1l6o7o9L00L4k40j05N5l2J24J49j14J49k25k9J86j84
5184g7J16j37J19P0l52J04j2J43J01j01K18k71j44K18j52J71j71J37j38O6j21
5205b13J07J85J57j58l17K20J22l04%L31k23K50j77OK2n5k5J46R2j10%r0k41K26
5229d9p9J74L6J09r4j8l0k5J22k68R6j14J18N2j59J22jk04J74J28j16j9l4n4l5
5254a68jJ36M6J22j78N7J21k18K07k43l7K10k56M23j72j9j22M12l50J9j9j10J05
5277c5q0J89q4j99R9J13O0L6K9J9j90J66j67n8J17j11k9M1j02N6J45o5N3L62l69
5302dj58J42J31j33l19M63l7k33J31p8J65o7q8J17l4R8j84J20L9k11J76o2p3N6
5326d3N5j16N2Q8j1Q0Q2j70j07J93l3o4P6j83N3j68l0K62M7nm4q7J3k7k2K54k74
$$ plain form
5161 -121 136 42 -89 149 68 27 -9 -76 -145 155 189 -51 -156 -101 -133 -9 140 26 175 -50 -79 107 -77
5184 -77 39 -98 21 91 -261 -157 -169 -26 75 -26 192 -79 -223 -5 -157 14 -157 -20 -158 -92 -213
5205 -213 -106 79 236 78 -239 -19 103 -201 -201 130 -93 157 -20 -14 8 -47 -72 74 166 56 56 -34 -275 -49
5229 -49 -128 46 82 191 97 79 49 24 146 -122 -26 -140 -22 30 -129 -7 -8 -212 -38 90 -26 -45 -79 -133 -168
5254 -168 -169 -33 13 135 -43 14 135 -83 124 -119 -156 54 -202 221 49 30 -92 320 -30 -11 -30 -140 -35
5277 -35 -115 74 -10 -209 -110 3 63 99 128 147 -43 123 -44 -102 15 -96 -125 -84 -186 -130 15 -50 3 365 -4
5302 -4 -162 -20 111 -22 -341 122 85 -148 -17 -95 70 3 -85 32 -2 96 -88 32 71 -140 36 -26 -99 -43
5326 -43 12 -104 -52 36 25 105 187 17 -90 103 70 6 82 -101 -48 -216 -246 16 63 58 14 -73 -60 -87 -109 145 -129
5353a29J09J4j21K75n6j30L8M4m7J74r2nP9l44Q4K49j86J57l8l1O7o9j58K5j2
5378a03J44m5j9l1L04k57k8R8L9k32J44K5j58R4m7O5J4L7m2p5Q2k91K78m0Q0r4
5404e8M0M3j8K62k78M1J3l9k5J52k2p6l3p5p6N1J62k24R2K40j86J22k20jp1R8
5430h6J71j13M5k89J75J29k41K60m1k02K01M5jo9J13Q6l19J34J05oj6qj95J99
5454G7j94K60j01j76J72k00K12k54K83k68J64R1O3j66J66Q7k11q4J46k41M7N2
5476g5L6J29j59L8n8J19o2J49n1J9j63KQ6j7J84j93k6j15J42P2j66J19O4j07N1
5501A8K4Q7j68J02qJ08j86Q4j17R0j3j63n4K61n2K6n6nm3j86L89j59j20R9J39
5526I7j09Q9k00Q3oJ25k72K51L4k18j07J56kJ6K56mj63J63k37Q7j1J08j36r4j8
$$ plain form
5353 -129 -20 -6 -127 148 92 -38 0 44 -3 171 79 74 153 -191 -107 142 -44 113 75 44 111 42 -116 -91 -103
5378 -103 41 -4 -23 -54 250 -7 -35 63 102 -130 14 39 -119 -25 -72 -7 7 44 2 -73 9 -282 -4 -44 36 -58
5404 -58 -18 25 7 269 -9 32 45 6 -19 133 111 35 2 -73 -149 -98 64 -160 -68 172 -14 108 -112 -113 -184 -86
5430 -86 85 -28 17 -272 -97 32 -209 51 10 -192 9 54 53 -16 97 183 -136 -2 103 97 81 73 -122 77
5454 77 -117 143 42 -134 38 -162 50 -204 79 -189 -25 66 129 -37 129 216 5 -79 67 -174 -127 -75
5476 -75 -39 90 -69 -31 -89 30 -32 117 66 85 -78 -76 10 -7 177 -16 -42 -157 -15 57 -109 10 74 -33 18
5501 18 42 129 -39 63 55 163 -23 61 -56 34 21 -142 -196 65 13 39 -17 -22 -65 -251 138 -21 -141 -42 97
5526 97 -12 77 -123 -40 -46 79 -193 58 92 -126 -233 -77 -79 -63 193 189 26 189 -48 39 28 136 0 -94 -112
5551a12M5J30j21j04P1k3J04R4l00J68J58o2N7k0j40K5N2j62K48k09J39k28J88
5574bq7K7N1N7j87N2P3L3M0O5k46J94k0o2p4M5R7Q0k36Q8qqJ14m3j26R1M2r8P2
5603B4O0j01O2J7j5P0k64K96J02j96j4j09Q5m8J36R8l11P1J62l3kk80K05N2k05
5628a38K18n5l3j47P0K80j88P9j21j35J60j45K38J0j02K2p1N8J01L6r1J44j22
5651F8Lk44J40j38J89J75l55J93l8Q7K8j37M8m5J63k42J50J2j91K25RK3n4k2Q8
5676A35Q9k67J33q2J72q0m2J5j1q2J57l36J66p5P8J4m2Kp3k0J71j65J08k8J28
5701F5MK01k92K9Ok45R7O6RL2L4k2rJ55j70P5m5L9m5l2J41mj21J58j48L9J11r
5729A19r1j1J7Q8j28J34mk18R1p6J27m6N3Q1k22l7J4J17j0J56k22R0Q2M8k87K6
$$ plain form
5551 -112 -67 63 -58 -162 -91 -114 -10 84 -216 -48 110 48 105 85 -55 -30 22 -140 108 -101 38 -190 -2
5574 -2 -89 -62 -11 46 -141 -89 -16 17 57 122 -124 70 50 -12 -86 -41 56 136 -100 -12 -20 -28 86 43 -83 8 50 -48 24
5603 24 84 -17 45 62 47 117 -147 149 251 55 41 -68 17 -31 105 203 -108 -37 125 92 90 -190 15 67 -138
5628 -138 80 25 -8 -155 -85 195 7 86 -35 -170 -10 -155 83 93 -9 13 -58 0 101 137 46 190 68
5651 68 71 -173 -33 -171 18 193 -162 31 -7 80 108 -29 19 -26 137 -105 45 57 -134 91 100 123 69 47 135
5676 135 224 -43 90 8 180 100 58 73 62 -20 137 -199 -33 -108 -30 -16 -58 -56 -129 -149 22 -143 -35 -63 65
5701 65 69 270 -22 7 13 -232 -135 -69 -60 -28 6 -16 -25 130 -40 35 -10 29 -16 -48 93 89 -32 126 -22 17 128 119
5729 119 28 17 34 122 -6 128 124 -94 -3 -79 48 2 55 136 -86 -123 -109 8 -2 154 -68 22 104 152 -135 -109
5755a09K6j59J91J5Q2j11Q9K3j88K71j01L8J66k74Q8j23J7P1k7k4l4J34J6j23
5779d6J22j15q5J93m9j00l6J79q5K11k2J5j14l1j55K32p8j58K3K40j07o4J52j02
5803B0L0J1k76Q5RJ13q4j4O1J09m6N4j05J46j65J20j43Q0N0j41K85j35o3l3j00
5828a32K7K72l43J74k5Oj16K37j37M5N6m1k6kkm7O8k11P1R9m2J07J26j02q1p1
5854i0P8j9l5n6R6j0l9P8j4j50K98j35P4KL9KN5Qj99J6j05O4m2K46m4j22K8k5
5882aJ03k47M3K7k8J36J3K8QP0j87J61l29K95Q7m12K07o7J07j07R0J05j47kRM1
5908CJ8mJ67k66L9r3KJ66lj07K12J8k30L0R2j51K19Q2l67L02r3q2l1R7qJ82k74
5935h0M2J46k30kM6Q2J34q7j45J23m4pJ70r1p6P7K2M2j76J4j5n5K33m1K8kj89
$$ plain form
5755 -109 -83 -242 -51 -36 46 -65 24 47 -141 130 29 67 233 -41 47 -76 -59 12 -15 -39 -73 61 77 -46
5779 -46 76 -39 -124 69 20 -80 -116 63 -22 189 167 182 68 37 -118 114 36 -122 -99 141 34 -30 122 20
5803 20 50 61 -215 -130 -121 -8 -92 -106 -45 64 18 72 -33 113 -52 68 -75 5 55 -86 199 64 1 -32 -132
5828 -132 -105 167 -176 -2 -27 -21 -137 100 -37 8 64 23 -3 -5 -7 -54 14 -197 -126 -27 -69 38 164 62 -19 -90
5854 -90 -12 -31 -66 -122 -26 -36 -75 3 -11 -161 137 2 76 78 117 119 174 182 -17 -1 -106 -42 -84 162 118 -4 24 -1
5882 -1 102 -145 -102 -75 -103 33 46 74 82 152 -35 126 -203 92 179 -233 -26 -93 14 -93 -3 102 -45 -47 -38 3
5908 3 21 17 184 -82 -43 -136 -134 32 29 -78 134 152 -78 -48 44 -107 112 194 -173 129 36 -46 -77 20 12 194 -80
5935 -80 -38 108 -122 -124 -78 4 138 51 -94 29 -15 -22 148 57 -19 58 80 122 -54 -40 -55 -110 123 82 110 108 -81
5962h1J90j16Q6j9K6k14K80j99j8K4o1K06p8k9J28j19N4j02J21N7j64m1J01m2
5986a0l9k0K44l32K27qr2O0m6j89J05J37j36R5k0K4j50J79rJ05k3j10j30L60k93
6011g1L2J5l5J55j89M7R2j5j18l2P9L73l45rQ3j07j88K20J35m8j93K64m0k53K31
6036H3J12l74J01K47l89J91J98j22m2J8p0L1r2J02M8j54lJ94q0q0n3L96k18j65
6060a21P1Ol2J58m4k36K72pJ06l03K07k94K78j18N5R0n3k95R6K38L1j45k3J32
6084F9K5q8k00K7N1J63j91L26l88J54J92j78oq1j0J00K2M4K08m01J91o8K69j95
6108C5j59Q3L5J14j69%O9L8j37KM8O4k5k3j32K44l17L58j33M8j93P2m1l3K95j35
6134HK1N1L9j61J92j60J2N2K2j4L0Q6j98k03L3J69NJ24k43J89K3m3j69M6J5J14
$$ plain form
5962 -81 109 -7 79 60 86 -128 152 -47 -65 -41 -102 104 26 -3 125 6 60 -42 79 136 -28 -69 32 -10
5986 -10 -49 -69 175 -157 70 62 -30 30 -16 -205 -100 37 -99 -4 -24 0 -150 29 20 125 102 -8 -138 222 -71
6011 -71 -39 -24 -59 96 -93 -46 46 31 -87 -119 -40 333 -12 -21 62 -45 -233 -13 122 74 -119 145 105 -148 83
6036 83 195 -179 -78 169 -220 -29 169 47 5 23 -47 -16 -108 -6 42 -112 -115 79 -1 -81 -134 262 44 -121
6060 -121 -50 -44 -76 82 38 -198 74 67 173 -130 77 -217 61 -57 -2 88 35 -260 -164 74 105 -40 -63 69
6084 69 94 6 -194 -167 -116 47 -144 182 -206 -52 140 -38 -44 -125 -135 -35 -13 31 239 -162 29 -39 230 35
6108 35 -124 -41 -6 108 -61 -61 8 46 -91 -89 -41 23 -2 -25 -157 87 -230 128 -5 43 -150 -78 -119 -152 143 8
6134 8 29 80 119 -42 150 -10 2 54 76 62 92 178 -20 -223 -190 -21 -16 108 -135 54 77 34 -135 -89 -74 40
6160D0j4O3p7RK4o0j08J75k06J52l2l2J39j55J80j17K03o4r8QO4R5j11j06j4J15
6186G3N6m4q5j1K1o1Q2Oj37J49k67K38J45j64q0N1o7J56j25J4J02j07Mp8k1J49
6212ak15L29j08ok7j18J01k4J26R3j31m9q2L9q9J45q9J00l6R7j90J23m0O4N0j26
6238f4l3Q9j85K64q3j79J20J37k0r0k47K51j6j19K7l9K77j54K00m1j6k59K3K9
6262a28J27K13k98K67j77J5J2j95M0L8q5K92p2n1J16j00j59J14P0j92n6K12l5
6285c2N1p1k0O3K50j07l07K48n2J5k17K87k09J49J2m5r8J66q8l3K42r1j38L9j05
6310i1J55N0j62j8K01k43N9L9J70q2k09L16l31P9JJ25j68j13M21k74k7J56J09
6333A63l5l02N5K63jr6nP8l57L87j36k7p4R5j37K07O0k08J49p1j6j34L48k30r2
$$ plain form
6160 40 26 89 12 21 45 -15 -123 52 -154 -2 -34 -66 73 -82 98 -19 184 120 22 30 94 189 78 -28 -42 73
6186 73 129 85 0 -11 10 -51 31 37 -100 49 -218 20 165 1 -79 -28 -95 61 -64 -50 52 -55 -51 -129 -150 -1
6212 -1 -216 113 5 -1 -28 -146 -45 -69 57 150 19 -30 -112 -73 -162 -17 -106 -6 -42 55 -135 -12 -52 12 62 -64
6238 -64 -97 -8 -193 71 -12 -191 -71 66 46 -44 -291 -40 -56 -175 -148 -187 90 -64 136 95 79 -180 -157 -128
6262 -128 -1 212 -86 181 4 19 31 -164 -124 -86 -171 121 49 -2 114 14 -145 -31 39 -153 -209 3 -32
6285 -32 19 -52 -72 -9 241 134 -173 75 23 38 -179 108 -101 48 60 15 -83 83 -5 -38 204 113 -25 14 -91
6310 -91 64 114 -48 -66 135 -108 -49 -10 160 78 -131 185 -146 -67 -66 59 -109 -222 199 -75 -102 54 163
6333 163 128 -174 -119 144 143 47 42 120 -237 150 14 -13 -87 8 -129 78 138 -70 79 8 -8 -142 206 -24 -116
6358a16R5j34K38k31L19K2k52O7k7K4J52k43j20L67k56K00j50P1oqj5p5R0p1j27
6383a86J80j41P5K12j91j72Q7K41Kp2n8M2O4N3Q1m4j74J31q2j5K5R1r1j1r7MP3
6410B7k0Mj05RQ3J09l1o2O4K4n1J7j85J4K60j75n4J44l26K16M3j08L31j36r9j19
6436a26L5J01j43J08J9J8O2M8k13N1K00k37k3K53l28Q0Po6K67j12j10m0K53k49
$$ plain form
6358 -116 -21 -155 83 -148 171 193 -59 8 -19 5 157 -86 -206 161 -95 105 -45 26 20 12 -3 -78 12 -59 -186
6383 -186 -6 -147 -72 140 -51 -223 -136 105 107 35 -23 19 83 136 217 173 -1 130 48 33 58 149 58 47 -50 -46 27
6410 27 7 11 -94 -85 -2 107 76 14 78 102 51 68 -117 -103 157 -18 -72 72 -254 -38 5 -103 228 92 -7 -126
6436 -126 -91 10 -133 -25 -6 12 74 122 -91 -40 160 -77 -100 153 -175 -95 -88 -154 113 1 -109 -149 104 -145
$$ [...]
8191a39
##END NTUPLES=NMR FID
##END=
