##TITLE=1H_EC-3197(2)
 CDCl3, 8 sc, 
 7.06.2021
##JCAMPDX= 6.0         $$ Bruker NMR JCAMP-DX V2.0
##DATA TYPE= NMR SPECTRUM
##DATA CLASS= NTUPLES
##ORIGIN= UXNMR, Bruker Analytische Messtechnik GmbH
##OWNER= root
$$ XWIN-NMR		Version 3.5
$$ Mon Jun  7 11:12:08 2021 Russian Standard Time (UT+4h)  she@DPX200
##.OBSERVE FREQUENCY= 200.131506
##.OBSERVE NUCLEUS= ^1H
##.ACQUISITION MODE= SIMULTANEOUS
##.ACQUISITION SCHEME= undefined
##.AVERAGES= 8
##.DIGITISER RES= 18
##SPECTROMETER/DATA SYSTEM= spect
##.PULSE SEQUENCE= zg30
##.SOLVENT NAME= DMSO
##.SHIFT REFERENCE= (INTERNAL, DMSO, 0, 17.4837)
##AUDIT TRAIL= $$ (NUMBER, WHEN, WHO, WHERE, WHAT)
$$ ##TITLE= Audit trail, XWIN-NMR		Version 3.5
$$ ##JCAMPDX= 5.01
$$ ##ORIGIN= Bruker BioSpin GmbH
$$ ##OWNER= she
$$ F:/spectra/data/she/nmr/H-F/1/pdata/1/auditp.txt
$$ ##AUDIT TRAIL=  $$ (NUMBER, WHEN, WHO, WHERE, WHAT)
(   1,<2021-06-07 11:10:42.12 +0400>,<she>,<DPX200>,
      <created by zg, POWCHK disabled, PULCHK disabled
       configuration hash MD5:
       00 E9 B6 7A A2 85 ED C7 34 08 36 98 17 FE 4E 26
       data hash MD5: 16K
       B3 C5 E4 32 86 A1 08 FD CD 4D 14 6F 46 EF 53 FE>)
(   2,<2021-06-07 11:10:55.95 +0400>,<she>,<DPX200>,
      <Start of raw data processing
       efp BC_mod = 2 LB = 0.24 FT_mod = 6 PKNL = 1 PHC0 = -11279.04 PHC1 = 8.201011 SI = 16K 
       data hash MD5: 16K
       0F 05 ED FD E1 C2 0E BC 25 B7 B6 AB D1 B8 AA B5>)
(   3,<2021-06-07 11:11:18.84 +0400>,<she>,<DPX200>,
      <pk PHC0 = -205.8486 PHC1 = 5 
       data hash MD5: 16K
       B9 07 7E 27 3A A2 0B B9 E5 3E 75 F7 65 6F 40 A8>)
(   4,<2021-06-07 11:11:22.79 +0400>,<she>,<DPX200>,
      <abs ABSG = 5 
       data hash MD5: 16K
       1B A1 30 55 78 4F AE 38 51 03 E8 0D FA 3D DF DA>)
(   5,<2021-06-07 11:11:43.14 +0400>,<she>,<DPX200>,
      <abs ABSG = 5 
       data hash MD5: 16K
       EC 65 0D 59 75 27 60 6B 78 FF 4D CA 43 E8 B0 21>)
$$ ##END=
$$ 
$$ hash MD5
$$ BC F6 65 51 26 0F 9B 67 5E 8D E4 78 A1 F5 EA 2D
##$RELAX= 
##$RELAX= 
##$RELAX= 
##$RELAX= 
##$RELAX= 
##$RELAX= 
$$ Bruker specific parameters
$$ --------------------------
##$DU= <F:/spectra>
##$EXPNO= 1
##$NAME= <H-F>
##$PROCNO= 1
##$TYPE= <nmr>
##$USER= <she>
##$AMP= (0..31)
100 100 100 100 100 100 100 100 100 100 100 100 100 100 100 100 100 100 
100 100 100 100 100 100 100 100 100 100 100 100 100 100 
##$AQSEQ= 0
##$AQ_mod= 1
##$AUNM= <au_zg>
##$AUTOPOS= <>
##$BF1= 200.13
##$BF2= 200.13
##$BF3= 200.13
##$BF4= 200.13
##$BF5= 200.13
##$BF6= 200.13
##$BF7= 200.13
##$BF8= 200.13
##$BYTORDA= 1
##$CFDGTYP= 0
##$CFRGTYP= 5
##$CHEMSTR= <none>
##$CNST= (0..31)
1 1 145 1 1 1 1 1 1 1 1 1 1 1 1 1 1 1 1 1 1 1 1 1 1 1 1 1 1 1 1 1 
##$CPDPRG= <>
##$CPDPRG1= <>
##$CPDPRG2= <>
##$CPDPRG3= <>
##$CPDPRG4= <mlev>
##$CPDPRG5= <mlev>
##$CPDPRG6= <mlev>
##$CPDPRG7= <mlev>
##$CPDPRG8= <mlev>
##$CPDPRGB= <>
##$CPDPRGT= <>
##$D= (0..31)
0 1.2 0 0 0 0 0 0 0 0.06 0 0.03 0 0 0 0 0.0002 0 0 0 0 0 0 0 0 0 0 0 0 
0 0 0 
##$DATE= 1623049841
##$DBL= (0..7)
$$ [...]
##$SUBNAM3= <"">
##$SUBNAM4= <"">
##$SUBNAM5= <"">
##$SUBNAM6= <"">
##$SUBNAM7= <"">
##$SUBNAM8= <"">
##$SUBNAM9= <"">
##$SW= 20.0188882624521
##$SWIBOX= (0..15)
0 0 2 0 0 0 0 0 0 0 0 0 0 0 0 0 
##$SW_h= 4006.41025641026
##$TD= 16384
##$TD0= 1
##$TE= 0
##$TE2= 300
##$TE3= 300
##$TEG= 300
##$TL= (0..7)
0 120 120 120 120 120 120 120 
##$TP= (0..7)
150 150 150 150 150 150 150 150 
##$TP07= 0
##$TPNAME0= <>
##$TPNAME1= <>
##$TPNAME2= <>
##$TPNAME3= <>
##$TPNAME4= <>
##$TPNAME5= <>
##$TPNAME6= <>
##$TPNAME7= <>
##$TPOAL= (0..7)
0.5 0.5 0.5 0.5 0.5 0.5 0.5 0.5 
##$TPOFFS= (0..7)
0 0 0 0 0 0 0 0 
##$TUNHIN= 0
##$TUNHOUT= 0
##$TUNXOUT= 0
##$USERA1= <user>
##$USERA2= <user>
##$USERA3= <user>
##$USERA4= <user>
##$USERA5= <user>
##$V9= 5
##$VALIST= <valist>
##$VCLIST= <CCCCCCCCCCCCCCC>
##$VD= 0
##$VDLIST= <DDDDDDDDDDDDDDD>
##$VPLIST= <PPPPPPPPPPPPPPP>
##$VTLIST= <TTTTTTTTTTTTTTT>
##$WBST= 1024
##$WBSW= 4
##$XGAIN= (0..3)
0 0 0 0 
##$XL= 0
##$YL= 0
##$YMAX_a= 176021
##$YMIN_a= -144995
##$ZGOPTNS= <>
##$ZL1= 120
##$ZL2= 120
##$ZL3= 120
##$ZL4= 120
##$ABSF1= 17.48367
##$ABSF2= -2.535368
##$ABSG= 5
##$ABSL= 3
##$ALPHA= 0
##$AQORDER= 0
##$ASSFAC= 0
##$ASSFACI= 0
##$ASSFACX= 0
##$ASSWID= 0
##$AUNMP= <proc_1d>
##$AZFE= 0.1
##$AZFW= 0.1
##$BCFW= 0
##$BC_mod= 2
##$BYTORDP= 0
##$COROFFS= 0
##$CY= -3
##$DATMOD= 1
##$DC= 0
##$DFILT= <>
##$DTYPP= 0
##$F1P= 0
##$F2P= 0
##$FCOR= 1
##$FTSIZE= 16384
##$FT_mod= 6
##$GAMMA= 0
##$GB= 0
##$INTBC= 1
##$INTSCL= 1.334414e-10
##$ISEN= 128
##$LB= 0.24
##$LEV0= 0
##$LPBIN= 0
##$MAXI= 10000
##$MC2= 0
##$MEAN= 0
##$ME_mod= 0
##$MI= 1.114404
##$NCOEF= 0
##$NC_proc= -8
##$NLEV= 6
##$NOISF1= 3.799351
##$NOISF2= 2.8
##$NSP= 0
##$NTH_PI= 0
##$NZP= 0
##$OFFSET= 17.48367
##$PC= 1
##$PHC0= -11484.89
##$PHC1= 13.20101
##$PH_mod= 1
##$PKNL= yes
##$PPARMOD= 0
##$PSCAL= 0
##$PSIGN= 0
##$REVERSE= no
##$SF= 200.13001019901
##$SI= 16384
##$SIGF1= 3
##$SIGF2= 2
##$SINO= 5.538805
##$SIOLD= 16384
##$SREGLST= <1H.CDCl3>
##$SSB= 0
##$STSI= 16384
##$STSR= 0
##$SW_p= 4006.41025641026
##$SYMM= 0
##$S_DEV= 0
##$TDeff= 16384
##$TDoff= 0
##$TI= <>
##$TILT= no
##$TM1= 0
##$TM2= 0
##$TOPLEV= 0
##$USERP1= <user>
##$USERP2= <user>
##$USERP3= <user>
##$USERP4= <user>
##$USERP5= <user>
##$WDW= 1
##$XDIM= 16384
##$YMAX_p= 450852633
##$YMIN_p= -1070706
$$ End of Bruker specific parameters
$$ ---------------------------------
##NTUPLES= NMR SPECTRUM
##VAR_NAME=  FREQUENCY,     SPECTRUM/REAL,   SPECTRUM/IMAG
##SYMBOL=    X,             R,               I
##VAR_TYPE=  INDEPENDENT,   DEPENDENT,       DEPENDENT
##VAR_FORM=  AFFN,          ASDF,            ASDF
##VAR_DIM=   16384,         16384,           16384
##UNITS=     HZ,            ARBITRARY UNITS, ARBITRARY UNITS
##FACTOR=    0.24454680195387, 1,            1
##FIRST=     3499.00691152382, 0,            0
##LAST=      -507.403344886439, 0,           0
##MIN=       -507.403344886439, -1070706,    0
##MAX=       3499.00691152382, 450852633,    0
$$ Real data points
##PAGE= N=1
##DATA TABLE= (X++(R..R)), XYDATA
$$ [...]
6047b51622L42488L08991k16611L155j03791L27872n41900K51344N31734l42306
$$ -251622 90866 399857 183246 186401 82610 410482 -131418 119926 651660 309354
6037C09354k32367j17825P3151j10402L19291J50832p16111L13904L17492r595
$$ 309354 76987 -40838 32313 -78089 241202 392034 -324077 -10173 307319 297724
6027B97724L36380k03919l39423j08992l19625K4680P00302q6247n69841M29714
$$ 297724 634104 430185 90762 -18230 -337855 -313175 387127 300880 -268961 160753
6017A60753j02810M48784q0709k40443J82682k50981L89857j10145k58281k74283
$$ 160753 57943 506727 426018 185575 368257 117276 507133 396988 138707 -135576
6007a35576J08170j7552m7189k57162K53116J47193R7108J25388J21981k48995
$$ -135576 -27406 -44958 -92147 -349309 -96193 51000 148108 273496 395477 146482
5997A46482L41652l75122Q0678J19765Q5081M0700K9538J18355m30534K51126
$$ 146482 488134 113012 193690 313455 398536 439236 468774 587129 156595 407721
5987D07721k36243r8192K30872K74372j05292k14469j08792l1306K18710p6661
$$ 407721 171478 73286 304158 578530 473238 258769 149977 118671 337381 260720
5977B60720j33570P5905L87229j43734o97084k4828j00494m53583O46586K19185
$$ 260720 127150 203055 590284 446550 -250534 -275362 -375856 -829439 -182853 36332
5967C6332K06651j66014j67112K03194K1290n0162p3576N25741k97394n84615
$$ 36332 242983 76969 -90143 113051 134341 84179 10603 536344 238950 -345665
5957c45665J25645q4470K65102M18831j21158j46051Q9118K71900o7724J83211
$$ -345665 -220020 -304490 -39388 379443 258285 112234 201352 473252 405528 588739
5947E88739k36342k56770m16459J96441K84178j98882J19925j98930J48260M9086
$$ 588739 352397 95627 -320832 -124391 159787 -39095 80830 -118100 30160 79246
5937G9246m1456J81336O5257r7894k56294J28368L78649k35633K87519l4959k35444
$$ 79246 37790 219126 284383 186489 -69805 58563 437212 201579 489098 454139 218695
5926B18695K74974l09853J78356L53306j83507j75261m09603n8200L38900J45841
$$ 218695 493669 183816 362172 715478 531971 356710 -52893 -111093 227807 373648
5916C73648o9448j02069N24388j82845k05071R3392r6939o13767O97740L96878
$$ 373648 304200 202131 726519 543674 338603 431995 335056 -278711 419029 815907
5906H15907r0124k12501r5934q3931K93828K68171o53507m9838K18025M5988K11574
$$ 815907 725783 513282 417348 333417 627245 895416 241909 192071 410096 456084 667658
5895F67658j46068Q9310p0956l04579J71433N07152R4664q64806J81033M23656
$$ 667658 521590 610900 539944 235365 406798 913950 1008614 143808 324841 748497
5885G48497J59369o14499m82357N00518N5008L13022r1975j90433J55879K57287
$$ 748497 907866 293367 -188990 311528 366536 679558 587583 397150 553029 810316
5875H10316p7056m71068K11986j60347m5969Q3284K51566j66547k36867M50360
$$ 810316 733260 262192 474178 313831 267862 351146 602712 436165 199298 649658
5865F49658J17609k03716L51247n87280k58392k91091K21878j57593R4273J40168
$$ 649658 767267 563551 914798 327518 69126 -221965 -87 -157680 -63407 76761
5855G6761J35535J91609K4033j00767j44905K50121K16745J18439O6441j30433
$$ 76761 212296 403905 427938 327171 182266 432387 649132 767571 834012 703579
5845G03579r8109M9658m20276j86363l3541K16584l1412L77702m3736j80035k83088
$$ 703579 605470 655128 234852 48489 14948 231532 200120 577822 534086 354051 70963
5834G0963j59019M24113Q6936n53987L28187N93597j47413J65277k0095J19089
$$ 70963 -88056 336057 422993 -130994 197193 790790 643377 808654 788559 907648
5824I07648n72187Q6375o2368K59805K11050k36248N5282K32056j2637j94056
$$ 907648 335461 421836 359468 619273 830323 594075 649357 881413 868776 674720
5814F74720Q4116k94681l05080N49735J02912m48139M27765n36825K36736j527
$$ 674720 758836 464155 159075 708810 811722 363583 791348 254523 491259 489732
5804D89732l7462j85696M16494K9856j05373P4111j59474j47337P5862J5456J01423
$$ 489732 452270 266574 683068 712924 607551 681662 522188 374851 450713 466169 567592
5793E67592k39462J49191j79504M47734l53446k76666L74148j9273o55471j87
$$ 567592 328130 477321 297817 745551 392105 115439 489587 470314 -185157 -185344
5783a85344K42820j59281L6071L48151N32311n71012k56680L10012L39738n21397
$$ -185344 57476 -101805 -65734 282417 814728 243716 -12964 297048 636786 115389
5773A15389L48097Q9523l61012J74484K44780n0363R2070k47841k76738K47658
$$ 115389 463486 553009 191997 366481 611261 560898 652968 405127 128389 376047
5763C76047j34618J66042l26315N2720m69603K65140N91966l82250K11006L20514
$$ 376047 241429 407471 81156 133876 -335727 -70587 521379 139129 350135 670649
5753F70649K40297m49584k4402J65746K96722K35049j11044K8703n7392m50371
$$ 670649 910946 461362 436960 602706 899428 1134477 1023433 1052136 994744 544373
5743E44373J60279m11696K64481k00163J5266K93195L45714l11140J87107j03140
$$ 544373 704652 292956 557437 357274 372540 665735 1011449 700309 887416 784276
5733G84276j99620J69706l79373n6009K3690J96947J86570N99409J23770j95636
$$ 784276 584656 754362 374989 318980 342670 539617 726187 1325596 1449366 1253730
5723A253730P8379K92934N3127o18354K21342J30613k60306j56243k627J99572
$$ 1253730 1332109 1625043 1678170 1059816 1281158 1411771 1151465 995222 992595 1192167
5713A192167m5212J60596j91544k38430j9895j77619j31933k7331L52412J18857
$$ 1192167 1146955 1307551 1116007 877577 857682 680063 548130 520799 873211 992068
5703I92068M2635k87179j33698M21751j17638k28550l35061M74341q1950l41951
$$ 992068 1034703 747524 613826 1035577 917939 689389 354328 828669 746719 404768
5693D04768j21649k4737K88989L4149p383j44103j89125q9683M81819R6111M1895
$$ 404768 283119 258382 547371 581520 574137 430034 240909 151226 633045 729156 771051
5682G71051L08753k25848j19112m26492P9911K54015M59732J55111m08875j64195
$$ 771051 1079804 853956 734844 308352 388263 642278 1102010 1257121 848246 684051
5672F84051m33422J43287M04038m3486J9922j3540k98947K97353K55344m89735
$$ 684051 250629 393916 797954 754468 774390 760850 461903 759256 1014600 524865
5662E24865J13326J27694N8384L08458J79474j89062l71494L79280M78700q0872
$$ 524865 638191 765885 824269 1132727 1312201 1123139 751645 1130925 1609625 1528753
5652A528753l20619k39876P8324j86011P65798J30279n3581L14221l15995k71204
$$ 1528753 1208134 968258 1046582 860571 1626369 1756648 1703067 2017288 1701293 1430089
5642A430089R7273J71253k66476P4341J1416K60669J6373N619k92493J60785p7532
$$ 1430089 1527362 1698615 1432139 1506480 1517896 1778565 1794938 1800557 1508064 1668849 1591317
5631A591317J66132M04202o90939l41503J6221R8371r4015O97550j68562p3614
$$ 1591317 1757449 2161651 1470712 1129209 1145430 1243801 1149786 1847336 1678774 1605160
5621A605160N06233p97429n99712M24093P28729m09507J03230l7009j92177J50325
$$ 1605160 2111393 1313964 714252 1138345 1867074 1457567 1560797 1523788 1331611 1481936
5611A481936M60407j90329l87746L68501J65970l59935J75167j88227L13131O29126
$$ 1481936 1942343 1752014 1364268 1732769 1898739 1538804 1713971 1525744 1838875 2468001
5601B468001m36814J07638M2864J90298m89729j4058L72188j38786J36974o3914
$$ 2468001 2031187 2138825 2181689 2371987 1882258 1868200 2240388 2101602 2238576 2174662
5591B174662L28853J9890m3306J46420K70976k17622l95671J22631K57237L45426
$$ 2174662 2503515 2523405 2480099 2626519 2897495 2679873 2284202 2406833 2664070 3009496
5581C009496m86456j25388L42452m674n71699r0897Q928R3409P6155N01006J15147
$$ 3009496 2523040 2397652 2740104 2735430 2163731 2072834 2081762 2175171 2251326 2752332 2867479
5570B867479j21051l97914M61397L02424k99444m5402k96010o93913r8484Q7609
$$ 2867479 2746428 2348514 2809911 3112335 2812891 2767489 2471479 1777566 1679082 1766691
5560A766691L31069j23714n94466K49410J93162O8181p9099K95K71919J2114l30374
$$ 1766691 2097760 1974046 1379580 1628990 1822152 1890333 1811234 1811529 2083448 2095562 1765188
5549A765188O9407M7380j30230r8899k37822q0174N04888J11749m86042O5373
$$ 1765188 1834595 1881975 1751745 1652846 1415024 1334850 1839738 1951487 1465445 1530818
5539A530818N17688J45398N3978j67882j26990j75397p2613M13660j86435P1772
$$ 1530818 2048506 2193904 2247882 2080000 1953010 1777613 1705000 2118660 1932225 2003997
5529B003997J51538O5995j03131l40749l3676J93930L89410Q9708n2147J27691
$$ 2003997 2155535 2221530 2118399 1777650 1743974 1937904 2327314 2417022 2364875 2492566
5519B492566l46085k08658q4713L02887K80164n71700k7949J87811K34192k63531
$$ 2492566 2146481 1937823 1853110 2155997 2436161 1864461 1836512 2024323 2258515 1994984
5509A994984n5386L73671L42833k93929L1830J32395Q8628k44619K13164m5893
$$ 1994984 1939598 2313269 2656102 2362173 2394003 2526398 2615026 2370407 2583571 2537678
5499B537678m28859L34287L88890J23396m30646j50528J28287k58837O5902K9986
$$ 2537678 2108819 2443106 2831996 2955392 2524746 2374218 2502505 2243668 2309570 2339556
5489B339556K35966J17361k1342J1435l54079L69926J31663j61838j66533M42559
$$ 2339556 2575522 2692883 2671541 2682976 2328897 2698823 2830486 2668648 2502115 2944674
5479B944674K84342J35044l54933l22958N54476k33705j1951l69475L21495M05701
$$ 2944674 3229016 3364060 3009127 2686169 3240645 3006940 2994989 2625514 2947009 3352710
5469C352710P4061j61071m13456M34379L70963k10504q0764K89955K31947l3601
$$ 3352710 3426771 3265700 2852244 3286623 3657586 3447082 3366318 3656273 3888220 3854619
5459C854619P5846p7764Q5238O92226M6590L11342n0480L34310K64842k68167
$$ 3854619 3930465 3852701 3937939 4630165 4676755 4988097 4937617 5271927 5536769 5268602
5449E268602J48252k1587M06667k90733q0653p8391M468K42485M00560q1459K75288
$$ 5268602 5416854 5395267 5801934 5511201 5430548 5352157 5356625 5599110 5999670 5918211 6193499
5438F193499L24796N6597P6338J24630k71389K43181K93588k31861N86803J14340
$$ 6193499 6518295 6574892 6651230 6775860 6504471 6747652 7041240 6809379 7396182 7510522
5428G510522O2830J02558k26350Q7714L45773P7177L20507N52885L96860L02167
$$ 7510522 7573352 7675910 7449560 7537274 7883047 7960224 8280731 8833616 9230476 9532643
5418I532643N94543N7097m6434Q49402q3056o78135L2828m17344k1747j30890
$$ 9532643 10127186 10184283 10137849 10987251 10904195 10226060 10258888 9841544 9819797 9688907
5408I688907o68329O25556J44095P6470R83249L26221q7651M90926N46370k2137
$$ 9688907 9020578 9646134 9790229 9866699 10849948 11176169 11088518 11579444 12125814 12103677
5398A2103677j8118K24305L65176M11105L92261L89459K44194M75136P21519K66882
$$ 12103677 12085559 12309864 12675040 13086145 13478406 13867865 14112059 14587195 15308714 15575596
5388A5575596J256346R10169N06325J83039l48055N97737L96690L18017M66478
$$ 15575596 16831942 17742111 18248436 18431475 18083420 18681157 19077847 19395864 19862342
5379A9862342P05905Q13383L87973J159445Q19989N84331K86622M42845M66990
$$ 19862342 20568247 21381630 21769603 22929048 23749037 24333368 24619990 25062835 25529825
5370B5529825P04386J658796J191403J657003J626869K032547L368550L984602
$$ 25529825 26234211 27893007 29084410 30741413 32368282 34400829 37769379 41753981
5362D1753981L805415L843002M829576N313856M741455L517811M116391J540734
$$ 41753981 45559396 49402398 54231974 59545830 64287285 67805096 71921487 73462221
5354G3462221J97314j002800j312484j004419M13128J221021J363043J837969
$$ 73462221 73659535 72656735 71344251 70339832 70752960 71973981 73337024 75174993
5346G5174993K815806L200785L484397L523605K895103J546094J61918q12736
$$ 75174993 77990799 81191584 84675981 88199586 91094689 92640783 92802701 91989965
5338I1989965k129335o19896J061663K118466M394122N811113P634267Q984918
$$ 91989965 89860630 89240734 90302397 92420863 96814985 102626098 110260365 119245283
5330A19245283J0012348J0775252J0948685R938443P530337M128637p51231n641993
$$ 119245283 129257631 140032883 150981568 160920011 168450348 172578985 171827754 166185761
5322A66185761r189647j2194410j4631455j4674891j3690410j1346002r327573
$$ 166185761 156996114 144801704 130170249 115495358 101804948 90458946 81131373
5315H1131373p492480o612227n813199n067729m105548l740583k888254l007397
$$ 81131373 73638893 67026666 61213467 56145738 52040190 48299607 45411353 42403956
5307D2403956k178552j934253j281637j422545j157244j263810q22596p77170
$$ 42403956 40225404 38291151 37009514 35586969 34429725 33165915 32343319 31566149
5299C1566149p36659o04166p07846o19520o28851n83581j55116n0637J003497
$$ 31566149 30829490 30225324 29517478 28897958 28269107 27685526 27530410 27479773 28483270
5290B8483270K09671Q22J107990J634732J384480J213507J359422J120804O33191
$$ 28483270 28692941 28693763 29801753 31436485 32820965 34034472 35393894 36514698 37147889
5281C7147889M61457j23858j238565o76879k83305K91333J70371K9679Q35112
$$ 37147889 37609346 37485488 36246923 35570044 35286739 35578072 35748443 35778122 36613234
5272C6613234J332768J403967J654282J640144R06702q5166l12764m54020r80143
$$ 36613234 37946002 39349969 41004251 42644395 43551097 43465931 43153167 42699147 41719004
5263D1719004n58923j318806j187428m10130r76105J0413K43131Q03022J384302
$$ 41719004 41160081 39841275 38653847 38243717 37267612 37278025 37521156 38324178 39708480
5254C9708480J254163J701123J801953J209840K51317p3550l70952j390287j730875
$$ 39708480 40962643 42663766 44465719 45675559 45926876 45853326 45482374 44092087 42361212
5245D2361212j618796q35663p36964m07938L64730M82184N58766Q18021K50712
$$ 42361212 40742416 39906753 39169789 38761851 39126581 39608765 40167531 40985552 41236264
5236D1236264M85240j94233J5332k71039j22308m65558o99796n92857n57321j320897
$$ 41236264 41721504 41527271 41542603 41271564 41149256 40683698 39983902 39391045 38833724 37512827
5226C7512827j429444p39919q00584J02513L65756L6040k08739J64856m23497
$$ 37512827 36083383 35343464 34542880 34645393 35011149 35047189 34838450 35003306 34579809
5217C4579809o94956n33692o97634q19312j535004j480745p94249j282725n74832
$$ 34579809 33884853 33351161 32653527 31834215 30299211 28818466 28024217 26741492 26166660
5208B6166660k21708m00554o76114r37919o50893m72785q15569k36610o91993
$$ 26166660 25944952 25544398 24868284 23930365 23279472 22806687 21991118 21754508 21062515
5199B1062515q34206j114078j304467r01764q26328l88941m06374m99077k94223
$$ 21062515 20228309 19114231 17809764 16908000 16081672 15692731 15286357 14787280 14493057
5190A4493057o85125j89434k41526l00027M8956n06440m25888o12632q22895m62784
$$ 14493057 13807932 13618498 13376972 13076945 13125901 12619461 12193573 11580941 10758046 10295262
5180A0295262m50415j493386o35892k2858l98588j44716l70046o12597p25851
$$ 10295262 9844847 8351461 7715569 7692711 7294123 7149407 6779361 6166764 5440913
5171E440913j12307Q1090j39036j06461p93319L57791L20903k24795l96453m62172
$$ 5440913 5328606 5409696 5270660 5164199 4370880 4728671 5049574 4824779 4428326 3966154
5161C966154l02435k74559J04449N51848k38598n5792k0378j50087n38190N1129
$$ 3966154 3663719 3389160 3493609 4045457 3806859 3751067 3730689 3580602 3042412 3093541
5151C093541j04876K89299k2381n15508L75111J27074j46053o69258K48040k61175
$$ 3093541 2988665 3277964 3255583 2740075 3115186 3242260 3096207 2426949 2674989 2413814
5141B413814j68379K41079k99782K04216J56043p2638m97701J53485L24331k10126
$$ 2413814 2245435 2486514 2186732 2390948 2546991 2474353 1976652 2130137 2454468 2244342
5131B244342k11213L1328M4885j1820j95235K19601L38259n00944l35062L91972
$$ 2244342 2033129 2064457 2109342 2097522 1902287 2121888 2460147 1959203 1624141 2016113
5121B016113L32030m07815J08092m06797R6754j19544r8475M74418N06673k49143
$$ 2016113 2348143 1940328 2048420 1641623 1738377 1618833 1520358 1994776 2501449 2252306
5111B252306p6925R6627n24726K18606K57730N4450R4481m25333J09214j67325
$$ 2252306 2175381 2272008 1747282 1965888 2223618 2278068 2372549 1947216 2056430 1889105
5101A889105R3869k10544j51800k26284K4704O24528k87220k45378o7154q6616
$$ 1889105 1982974 1772430 1620630 1394346 1419050 2043578 1756358 1510980 1443826 1357210
5091A357210p5065j37180r5685K08425L42369R644Q5307M8414k23748m48268P6647
$$ 1357210 1282145 1144965 1049280 1257705 1600074 1609718 1695025 1743439 1519691 1071423 1148070
5080A148070L74411K83263J12059n03599L50757l6173j51459K62749l9875k71279
$$ 1148070 1522481 1805744 1917803 1414204 1764961 1728788 1577329 1840078 1800203 1528924
5070A528924K2396L36171K84688K1490o03886J74395N24654k87468P9640J76231
$$ 1528924 1551320 1887491 2172179 2193669 1589783 1764178 2288832 2001364 2081004 2257235
5060B257235k33272m73726O9623q3851J86612n34998L13529N95017m36380l21479
$$ 2257235 2023963 1550237 1619860 1536009 1722621 1187623 1501152 2096169 1659789 1338310
5050A338310L66693M21437M4852M52189l29265k52803p1554j49772k96130L7990
$$ 1338310 1705003 2126440 2171292 2623481 2294216 2041413 1969859 1820087 1523957 1561947
5040A561947M18288k0101j34181l45992K20845O6316k79268L59780j44137l36491
$$ 1561947 1980235 1960134 1825953 1479961 1700806 1767122 1487854 1847634 1703497 1367006
5030A367006K47355L6750l22695M09154k27791Q4936k77200k22556M41476K09038
$$ 1367006 1614361 1651111 1328416 1737570 1509779 1594715 1317515 1094959 1536435 1745473
5020A745473k65570l68135J69919L04693J64348n42883L30739J23057l66891M06943
$$ 1745473 1479903 1111768 1281687 1586380 1750728 1207845 1538584 1661641 1294750 1701693
5010A701693r0377N1431J35000l8025M7902J29821P5468l16748M341K84717M43506
$$ 1701693 1611316 1662747 1797747 1759722 1807624 1937445 2012913 1696165 1700506 1985223 2428729
4999B428729k25080k38164j0515J39586j29363l36393n9639j71465J81449k7831
$$ 2428729 2203649 1965485 1954970 2094556 1965193 1628800 1569161 1397696 1579145 1551314
4989A551314P42279m85965J58955M20793J49192J0153j47272m1157l05296J5881
$$ 1551314 2293593 1807628 1966583 2387376 2536568 2546721 2399449 2358292 2052996 2068877
4979B068877J49696j61262k49467M5920j04203L23830k26124q0125j1019J93253
$$ 2068877 2218573 2057311 1807844 1853764 1749561 2073391 1847267 1767142 1756123 1949376
4969A949376k38529L1768k9410M14818q0204n12867J33944K13426J30316m48382
$$ 1949376 1710847 1742615 1713205 2128023 2047819 1534952 1668896 1882322 2012638 1564256
4959A564256j54810K29094J48296j70744O06296r3755j72330Q5354k89512o7358
$$ 1564256 1409446 1638540 1786836 1616092 2222388 2128633 1956303 2041657 1752145 1684787
4949A684787n42740O06380L61753K0443k1252R9438J30929M7266l73189n7114
$$ 1684787 1142047 1748427 2110180 2130623 2109371 2208809 2339738 2387004 2013815 1956701
4939A956701m5429Q9805l65059j06803k60690K30851K64681j56565M21394j88223
$$ 1956701 1911272 2001077 1636018 1529215 1268525 1499376 1764057 1607492 2028886 1840663
4929A840663L56684r6885l08713o7324K33697J03142j05825o0735l26330K65019
$$ 1840663 2197347 2100462 1791749 1724425 1958122 2061264 1955439 1894704 1568374 1833393
4919A833393L28307K31498r57035J32394P65549o03360L66215j15210k9028k1078
$$ 1833393 2161700 2393198 1436163 1568557 2334106 1730746 2096961 1981751 1952723 1931645
4909A931645L83593J43117k18525l85986J1323l7782o9747J57935l18502j03496
$$ 1931645 2315238 2458355 2239830 1853844 1865167 1827385 1757638 1915573 1597071 1493575
4899A493575J96058N8485p2958k49438l6174k15661J99330N4167M56262l48260
$$ 1493575 1689633 1748118 1675160 1425722 1389548 1173887 1373217 1427384 1883646 1535386
4889A535386n62317N38427j36560K16976J28519j31177N19230L22427l60848o50745
$$ 1535386 973069 1511496 1374936 1591912 1720431 1589254 2108484 2430911 2070063 1419318
4879A419318j49850K04578m42069K85388L37592J01602l92342J80714k21818k62916
$$ 1419318 1269468 1474046 1031977 1317365 1654957 1756559 1364217 1544931 1323113 1060197
4869A060197O10770j35035J75013j83751k67488K20947o0652j62647j18336k39177
$$ 1060197 1670967 1535932 1710945 1527194 1259706 1480653 1420001 1257354 1139018 899841
4859H99841J03969J17737Q145J42208m39382M55399K65229L1836J09957k07211
$$ 899841 1003810 1121547 1129692 1271900 832518 1287917 1553146 1584982 1694939 1487728
4849A487728k12946l2611L85242k28739J36973k89970l7575J519L7584P0802j22655
$$ 1487728 1274782 1242171 1627413 1398674 1535647 1245677 1208102 1209621 1247205 1318007 1195352
4838A195352k40484N40533K10158j15828k0727m68429k01237k06455N45754L91656
$$ 1195352 954868 1495401 1705559 1589731 1569004 1100575 899338 692883 1238637 1630293
4828A630293k66050k32432L04772K10731k46721M7448q6223k71301M963N0636
$$ 1630293 1364243 1131811 1436583 1647314 1400593 1448041 1361818 1090517 1095480 1146116
4818A146116j89369r2799N78962l71356K96405J65377J66827k71016j67040P4719
$$ 1146116 956747 863948 1442910 1071554 1367959 1533336 1700163 1429147 1262107 1336826
4808A336826o0943L49459j19484q952K86544J9876n47195M29210K26696m37746
$$ 1336826 1275883 1625342 1505858 1496906 1783450 1803326 1256131 1685341 1912037 1474291
4798A474291L05933N4649m1984J58609k84670K4247O9627r0480j22663l84087
$$ 1474291 1780224 1834873 1792889 1951498 1666828 1691075 1760702 1670222 1547559 1163472
4788A163472L35065n6477L23403k51215J15795L2681k04195j86487K62399M63246
$$ 1163472 1498537 1442060 1765463 1514248 1630043 1662724 1458529 1272042 1534441 1997687
4778A997687j29974k68448n42337M33823K37257n42930K88016K1145j99880M78012
$$ 1997687 1867713 1599265 1056928 1490751 1728008 1185078 1473094 1494239 1294359 1772371
4768A772371l20904K64271K65533k18812m92986J94770m739J86857M21152j33797
$$ 1772371 1451467 1715738 1981271 1762459 1269473 1464243 1459504 1646361 2067513 1933716
4758A933716K58290K17837j30712j62396j65641l464k19892O16536l15961k61038
$$ 1933716 2192006 2409843 2279131 2116735 1951094 1947630 1727738 2344274 2028313 1767275
4748A767275j15133L31630j59522K06928J07461r1503J45626N0291l93726m8952
$$ 1767275 1652142 1983772 1824250 2031178 2138639 2047136 2192762 2243053 1849327 1800375
4738A800375M56848j72295J58938M04825k32499k99050R5418o4316m49841J99839
$$ 1800375 2257223 2084928 2243866 2648691 2416192 2117142 2212560 2148244 1698403 1898242
4728A898242k25298j75909k30358r2700M87069K32236K84311k42544O35915k38628
$$ 1898242 1672944 1497035 1266677 1173977 1661046 1893282 2177593 1935049 2570964 2332336
4718B332336o495J96837o09384J16471n1791L37489j89801l1710M46877k39398
$$ 2332336 2325841 2522678 1913294 2029765 1977974 2315463 2125662 2093952 2540829 2301431
4708B301431j51439K37803j0767L02178K34106k02035l95222K55332L48300L7055
$$ 2301431 2149992 2387795 2377028 2679206 2913312 2711277 2316055 2571387 2919687 2956742
4698B956742J21422J7503L14764k34116K30304o71363J78832L59912l5435K67879
$$ 2956742 3078164 3095667 3410431 3176315 3406619 2735256 2914088 3274000 3238565 3506444
4688C506444N51953l97044J31004l07016k09860K41807J46445l45041O0924l4839
$$ 3506444 4058397 3661353 3792357 3485341 3275481 3517288 3663733 3318692 3379616 3344777
4678C344777k40l9582P3201N0613O2851m1599r5708K15931J6658j08873N0155
$$ 3344777 3344537 3304955 3378156 3428769 3491620 3450021 3354313 3570244 3586902 3478029 3528184
4667C528184l53373k01922L30966J44451n5010m09025o4581O37778q25658j10864
$$ 3528184 3174811 2972889 3303855 3448306 3393296 2984271 2919690 3557468 2731810 2620946
4657B620946k53661K48946M32787j80629j17201k27413L15172r3803J69502J37825
$$ 2620946 2367285 2616231 3049018 2868389 2751188 2523775 2838947 2745144 2914646 3052471
4647C052471K68909m45926q4860l69326K15884k85799o6658Q1096Q68571m04829
$$ 3052471 3321380 2875454 2790594 2421268 2637152 2351353 2284695 2365791 3234362 2829533
4637B829533j91704L43337J87075k35807K23174J58767m10558K67714J47179m20845
$$ 2829533 2637829 2981166 3168241 2932434 3155608 3314375 2903817 3171531 3318710 2897865
4627B897865K07414J22035j29721P826L45177J0972J14027k00088m58151Q0574
$$ 2897865 3105279 3227314 3097593 3105419 3450596 3461568 3575595 3375507 2917356 2997930
4617B997930n6158l05993J32334J54453k6133J22361l51171L67576K15585O1210
$$ 2997930 2941772 2635779 2768113 2922566 2896433 3018794 2667623 3035199 3250784 3311994
4607C311994o324q5181j08028L1019O9256O07832M1756Q7147k48086k92288J39040
$$ 3311994 3305670 3220489 3112461 3143480 3212736 3820568 3862324 3949471 3701385 3409097 3548137
4596C548137l04930K83962J46878n42982L30600j65485j01278M81543N62300J32548
$$ 3548137 3243207 3527169 3674047 3131065 3461665 3296180 3194902 3676445 4238745 4371293
4586D371293q3620k55597K45130j9922l46747O6547l22537j80002N86636j0494
$$ 4371293 4287673 4032076 4277206 4257284 3910537 3977084 3654547 3474545 4061181 4050687
4576D050687J87543k95272J51617N3541m39344j01770N90761o7980n6434J42925
$$ 4050687 4238230 3942958 4094575 4148116 3708772 3607002 4197763 4129783 4073349 4216274
4566D216274o8373L20405J2848K34633n42793J15221j19875M9189q7970L69626
$$ 4216274 4147901 4468306 4481154 4715787 4172994 4288215 4168340 4217529 4129559 4499185
4556D499185J10679k99083k86669K37147K8122K37541J79218L78498q4619j30252
$$ 4499185 4609864 4310781 4024112 4261259 4289381 4526922 4706140 5084638 5000019 4869767
4546D869767o4515l50479N51659L4290L75477m1025m97009J05608j79860M76258
$$ 4869767 4805252 4454773 5006432 5040722 5416199 5375174 4878165 4983773 4803913 5280171
4536E280171j28806m94605K87588K1182Q3389M96820K3478o7730J57124k24237
$$ 5280171 5151365 4656760 4944348 4965530 5048919 5545739 5569217 5501487 5658611 5434374
4526E434374j3585N08308k90248p5233q8060j63859P4983K87515k7292q5946M02932
$$ 5434374 5420789 5929097 5638849 5563616 5475556 5311697 5386680 5674195 5646903 5560957 5963889
4515E963889k57445l53764j18565M1928K33270M0153J76534J91422p9118M39510
$$ 5963889 5706444 5352680 5234115 5276043 5509313 5549466 5726000 5917422 5838304 6277814
4505F277814k81347l91434M56278J96813k40383l01567l42001M06142l3164J8366
$$ 6277814 5996467 5605033 6061311 6258124 6017741 5716174 5374173 5780315 5747151 5765517
4495E765517K00628J46280N2350k03064j83653J83908L72122O0833j58429j53974
$$ 5765517 5966145 6112425 6164775 5961711 5778058 5961966 6334088 6394921 6236492 6082518
4485F082518K25239L49624M03939J4289m76008j24715P3347j45664L27787r4798
$$ 6082518 6307757 6657381 7061320 7075609 6599601 6474886 6548233 6402569 6730356 6635558
4475F635558r2438K59110J29225l49783j02070K86775N33905m8408j62750k91696
$$ 6635558 6543120 6802230 6931455 6581672 6479602 6766377 7300282 7251874 7089124 6797428
4465F797428K71555L23593J86118P0715j35221J00972L6643k4187k10341M3069
$$ 6797428 7068983 7392576 7578694 7649409 7514188 7615160 7651803 7627616 7417275 7460344
4455G460344M9745M59735l71473J07658K10693K5727K25828j03472P2277l6944
$$ 7460344 7510089 7969824 7598351 7706009 7916702 7942429 8168257 8064785 8137062 8100118
4445H100118J05337N10282k60545q6923Q3803L81346K66047k60464J6685K20456
$$ 8100118 8205455 8715737 8455192 8368269 8452072 8833418 9099465 8839001 8855686 9076142
4435I076142M79271j07321m9278O59087N86665L04583k88210O28015N19538k45467
$$ 9076142 9555413 9448092 9398814 10057901 10644566 10949149 10660939 11288954 11808492 11563025
4425A1563025n3390N32116N12587L47870J70478N71898L06971N68806L41892J94255
$$ 11563025 11509635 12041751 12554338 12902208 13072686 13644584 13951555 14520361 14862253 15056508
4415A5056508j84887O21828K54245L5875M06515M48331K57438J1513m7807O20741
$$ 15056508 14871621 15493449 15747694 15783569 16190084 16638415 16895853 16907366 16859559 17480300
4405A7480300O56266o787J59707L03845P01351N33525M56212K23230J44796J55371
$$ 17480300 18136566 18129779 18289486 18593331 19294682 19828207 20284419 20507649 20652445 20807816
4395B0807816R98066N33994Q903Q6202M87024j70697J07504Q8938n69188n1693
$$ 20807816 21805882 22339876 22348779 22434981 22922005 22751308 22858812 22947750 22378562 22326869
4385B2326869j61589k42157M88849l6280p0740q4235K19200M53879M5489L82836
$$ 22326869 22165280 21923123 22411972 22375692 22304952 22220717 22439917 22893796 22939285 23322121
4375B3322121M62200J79718O96204L37475L47633L75574Q21900L40106M53801
$$ 23322121 23784321 23964039 24660243 24997718 25345351 25720925 26542825 26882931 27336732
4366B7336732L11926R42336Q29826J188756R29168N90325J042978R18388J230423
$$ 27336732 27648658 28590994 29420820 30609576 31538744 32129069 33172047 34090435 35320858
4357C5320858J235407J304354J166033J909440J645496J928049R29104J150761
$$ 35320858 36556265 37860619 39026652 40936092 42581588 44509637 45438741 46589502
4349D6589502R48143M42066M32769L92567P56704j8456M39846M18951P23145R07544
$$ 46589502 47537645 47979711 48412480 48805047 49561751 49543295 49983141 50402092 51125237 52032781
4339E2032781J035408J613173J043975J838597K103215K428227K995004K441043
$$ 52032781 53068189 54681362 55725337 57563934 59667149 62095376 65090380 67531423
4331F7531423K014914K432389K891179L400974K073046J767291K658886J761296
$$ 67531423 69546337 71978726 74869905 78270879 80343925 82111216 84770102 86531398
4323H6531398J432258J110073J973651K039222K166032K474716J804099J933602
$$ 86531398 87963656 89073729 91047380 93086602 95252634 97727350 99531449 101465051
4315A01465051K403228K457797J848281J294293O88665n33287j000253n34416
$$ 101465051 103868279 106326076 108174357 109468650 110157315 109624028 108623775 108089359
4307A08089359O23631M84241Q32874K203967J430885K030383K552649J617084
$$ 108089359 108712990 109197231 110030105 112234072 113664957 115695340 118247989 119865073
4299A19865073K227194R63093k70922j092865j320776j294892j163781q43086
$$ 119865073 122092267 123055360 122784438 121691573 120370797 119075905 117912124 117069038
4291A17069038l54093k28592l43406m36976m3872k77552l85033l23768J30972
$$ 117069038 116714945 116486353 116142947 115705971 115662099 115384547 114999514 114675746 114806718
4282A14806718Q0946K16417Q06039R28272K326381K229162K768137L732150L686643
$$ 114806718 114887664 115104081 115910120 116838392 119164773 121393935 124162072 127894222 131580865
4273A31580865M009766N130407N387685N439481N060764M336433L323983L388764
$$ 131580865 135590631 140721038 146108723 151548204 156608968 160945401 164269384 167658148
4265A67658148K660855P25248n07076j696166k084601k366454j203350O84871
$$ 167658148 170319003 171044251 170537175 168841009 166756408 164389954 163186604 163871475
4257A63871475J813165K756316M738229M891894M991719N649084N125062L920091
$$ 163871475 165684640 168440956 173179185 178071079 183062798 188711882 193836944 197757035
4249A97757035J531748o47589k754246m138388n313917n927763o525553o508019
$$ 197757035 199288783 198641194 195886948 191748560 186434643 180506880 173981327 167473308
4241A67473308o746685o134227n833146n605902m973478m275224l116555k245114
$$ 167473308 160726623 154592396 148759250 143153348 138179870 133904646 130788091 128542977
4233A28542977k049944j137041k047999r23257l0995l16165l91357p71346j165605
$$ 128542977 126493033 125355992 123307993 122384736 122353741 122037576 121646219 120874873 119709268
4224A19709268j792777j546687k626216l597290m252558n197313m950203m910633
$$ 119709268 117916491 116369804 113743588 110146298 105893740 100696427 95746224 90835591
4216I0835591n104355m324977l728873m148075l381978l234503k875564k487821
$$ 90835591 85731236 81406259 77677386 73529311 70147333 66912830 64037266 61549445
4208F1549445k302402j670124j643851j648370j796296q97680j142015j357135
$$ 61549445 59247043 57576919 55933068 54284698 52488402 51590722 50448707 49091572
4200D9091572j402170q13634j022078j117867o18223p67209j199822p73275o57050
$$ 49091572 47689402 46875768 45853690 44735823 44117600 43350391 42150569 41377294 40720244
4191D0720244j127706o45179o67124r49061r22083m67071l56812n51872p06428
$$ 40720244 39592538 38947359 38280235 37331174 36409091 35942020 35585208 35033336 34326908
4182C4326908m15597n98358l90661p03254O0920r3558m37092l47252l39726k74185
$$ 34326908 33911311 33312953 32922292 32219038 32279958 32186400 31749308 31402056 31062330 30788145
4172C0788145k29766n16025k08950j34483k66544L20576l32774O7894J83706K4588
$$ 30788145 30558379 30042354 29833404 29698921 29432377 29752953 29420179 29488073 29671779 29696367
4162B9696367k14645R3338K72191k6446M09516j50327n23334L19327M50845K09450
$$ 29696367 29481722 29575060 29847251 29820805 30230321 30079994 29556660 29875987 30326832 30536282
4152C0536282L96122R24324R54367O67332R19842P35466Q27069J530013J731545
$$ 30536282 30932404 31856728 32811095 33478427 34398269 35133735 35960804 37490817 39222362
4143C9222362K615163K494963K758483K946962L949203M316141L651788L282776
$$ 39222362 41837525 44332488 47090971 50037933 53987136 58303277 61955065 65237841
4135F5237841K149344l5136k009375l684069m040325m329442l434836l079113
$$ 65237841 67387185 67352049 65342674 61658605 57618280 53288838 49854002 46774889
4127D6774889k477331j900864k006665j012500r88834j094137m31267o65780n83439
$$ 46774889 44297558 42396694 40390029 39377529 38388695 37294558 36863291 36197511 35614072
4118C5614072p42854l12519L37917O78004Q0577K38944O65859J188046J567644
$$ 35614072 34871218 34558699 34896616 35574620 35655197 35894141 36560000 37748046 39315690
4109C9315690J658422J815908K384378K631954K726499L714707M168130L793530
$$ 39315690 40974112 42790020 45174398 47806352 50532851 54247558 58415688 62209218
4101F2209218K485306J490074M32920p06370k855026l654381k768866k421204
$$ 62209218 64694524 66184598 66617518 65911148 63056122 59401741 56632875 54211671
4093E4211671j320219l59165N1295J49157J238268R67113J44728l76361j604231
$$ 54211671 52891452 52532287 52583582 52732739 53971007 54938120 55082848 54706487 53102256
4084E3102256k482499l597137k724085l027627j713957j866485k103663j479602
$$ 53102256 50619757 47022620 44298535 41270908 39556951 37690466 35586803 34107201
4076C4107201j463109j409980o20075m40090o78424j151451k21918L42000m02807
$$ 34107201 32644092 31234112 30614037 30173947 29495523 28344072 28122154 28464154 28061347
4067B8061347j6805j35276m2341K01942O46940K10049P25675R03549J457817J525085
$$ 28061347 28044542 27909266 27866925 28068867 28715807 28925856 29651531 30555080 32012897 33537982
4057C3537982J351547J958678K177432J943986J839481L63065J6838j263954k820041
$$ 33537982 34889529 36848207 39025639 40969625 42809106 43172171 43189009 41925055 39105014
4048C9105014k935222k454380k668619k089013j411567j633390j477184j305605
$$ 39105014 36169792 33715412 31046793 28957780 27546213 25912823 24435639 23130034
4040B3130034r19149o95344q29699q82572j22603n39144p50359m00312q0872n32633
$$ 23130034 22210885 21515541 20685842 19803270 19680667 19141523 18391164 17990852 17909980 17377347
4030A7377347j43910l83549m54670n75909r4863K11787j95213l14742O9699n22918
$$ 17377347 17233437 16849888 16395218 15819309 15724446 15936233 15741020 15426278 15495977 14973059
4020A4973059k13209K010K769l34027k50099L23077O344l94354r01858J35984
$$ 14973059 14759850 14761860 14764629 14430602 14180503 14503580 14509924 14115570 13213712 13349696
4010A3349696j02533j34672J38880R145j99767l90178p122m79293N95327k3123
$$ 13349696 13247163 13112491 13251371 13260516 13060749 12670571 12663449 12184156 12779483 12756360
4000A2756360p55337o4530O03326R085K6379O0130k58023j43660J81359O43600
$$ 12756360 12001023 11936493 12539819 12548904 12575283 12635413 12377390 12233730 12415089 13058689
3990A3058689j58918p29802K27977j28998p7995k80580j51002J01306R4141m2877
$$ 13058689 12899771 12169969 12397946 12268948 12190953 11910373 11759371 11860677 11954818 11911941
3980A1911941L93001m43675k40358J37406N733L3549k13716n34254j33833J31704
$$ 11911941 12304942 11861267 11620909 11758315 11764048 11797597 11583881 11049627 10915794 11047498
3970A1047498m67501P4516K60036o1591j87455J78444n05610j77385r2831k82996
$$ 11047498 10579997 10654513 10914549 10852958 10665503 10843947 10338337 10160952 10068121 9785125
3960I785125L13022N3052k92320j71532p5450l05275q5208M21447K29987k48590
$$ 9785125 10098147 10151199 9858879 9687347 9611897 9306622 9221414 9642861 9872848 9624258
3950I624258l46533J51372n93930J58812m7151L63202m08174m89016N29197k21176
$$ 9624258 9277725 9429097 8835167 8993979 8946828 9310030 8901856 8412840 8942037 8720861
3940H720861o97029L95369O14568p14316l44965M18795l1439J02626P9017K33456
$$ 8720861 8023832 8419201 9033769 8319453 7974488 8393283 8361844 8464470 8543487 8776943
3930H776943j5584j05655k42922J13569k45976L23979o96086m2137L30625j28012
$$ 8776943 8761359 8655704 8412782 8526351 8280375 8604354 7908268 7866131 8196756 8068744
3920H068744J9099M529L8945j78257M7156K01226j85533l71301O584L75858l22681
$$ 8068744 8087843 8092372 8131317 7953060 8000216 8201442 8015909 7644608 7651192 8027050 7704369
3909G704369J69101o03377n10155M79133N27462K75124l94834j07850J00460j4553
$$ 7704369 7873470 7270093 6759938 7239071 7766533 8041657 7646823 7538973 7639433 7624880
3899G624880J11538O4787m13226L09539K49840n7037K8701M2925m86827j72294
$$ 7624880 7736418 7801205 7387979 7697518 7947358 7890321 7919022 7961947 7475120 7302826
3889G302826N65961J9178k24128L43850r3417l00280J8943J51687k56223R3281
$$ 7302826 7868787 7887965 7663837 8007687 7914270 7613990 7632933 7784620 7528397 7621678
3879G621678O4959J28843j39653q5390K40661k61989L64634R5908J18168L50015
$$ 7621678 7686637 7815480 7675827 7590437 7831098 7569109 7933743 8029651 8147819 8497834
3869H497834L8704m52946j4794j86475l0946l14794n94646R39515R2075n78084
$$ 8497834 8536538 8083592 8068798 7882323 7851377 7536583 6941937 7881452 7973527 7395443
3859G395443r596K20919J076J29281N5156m56593n46542R26434Q3829O7303k21585
$$ 7395443 7385847 7606766 7607842 7737123 7792279 7335686 6789144 7715578 7799407 7866710 7645125
3848G645125K69141L68262l23008l16774K59454K37778R8776K51191j74104l2191
$$ 7645125 7914266 8282528 7959520 7642746 7902200 8139978 8238754 8489945 8315841 8283650
3838H283650M12555k29385J38591J08854K64436K44739K07957k99735M69135R4577
$$ 8283650 8696205 8466820 8605411 8714265 8978701 9223440 9431397 9131662 9600797 9695374
3828I695374m1697L13920j00075r0143K27998m8175j60284K85466l74248P8962
$$ 9695374 9653677 9967597 9867522 9777379 10005377 9957202 9796918 10082384 9708136 9787098
3818I787098j76248j96589J46467J4980j3390j10125J288J01179q0402O12760
$$ 9787098 9610850 9414261 9560728 9575708 9562318 9452193 9453481 9554660 9474258 10087018
3808A0087018K02047j11014m0964K24763O8822j81605L91444k86007Q8883P09260
$$ 10087018 10289065 10178051 10137087 10361850 10430672 10249067 10640511 10354504 10443387 11152647
3798A1152647N01968m6252J30000k44618J95277K49071K86650M7137K24034O68744
$$ 11152647 11654615 11608363 11738363 11493745 11689022 11938093 12224743 12271880 12495914 13164658
3788A3164658j8124j40614m7289k21331L30089O26194M95044O90656l00499N8503
$$ 13164658 13146534 13005920 12958631 12737300 13067389 13693583 14188627 14879283 14578784 14637287
3778A4637287P35920P40287J96962L02046j62965R27098O94011k69203O32357
$$ 14637287 15373207 16113494 16310456 16612502 16449537 17376635 18070646 17801443 18433800
3769A8433800N57923j34678N09114O32144Q82594L94972O47988P54745R52233
$$ 18433800 18991723 18857045 19366159 19998303 20880897 21275869 21923857 22678602 23630835
3760B3630835R77978M93058J101224Q65568Q69603J162243R73534J465917J307296
$$ 23630835 24608813 25101871 26203095 27068663 27938266 29100509 30074043 31539960 32847256
3751C2847256J409970J249259J425416J757919K171158J363454K233558K808082
$$ 32847256 34257226 35506485 36931901 38689820 40860978 42224432 44457990 47266072
3743D7266072K346314K740474L161524K913052L446522L196163L391024L700636
$$ 47266072 49612386 52352860 55514384 58427436 61873958 65070121 68461145 72161781
3735G2161781M225218M326000M178319M384151M405169M868979M742997M845100
$$ 72161781 76386999 80712999 84891318 89275469 93680638 98549617 103292614 108137714
3727A08137714N457108N368104N409498N418833N121735N581287N253308M702473
$$ 108137714 113594822 118962926 124372424 129791257 134912992 140494279 145747587 150450060
3719A50450060M716341M196506M370832M452942L394009L812496L573642L613292
$$ 150450060 155166401 159362907 163733739 168186681 171580690 175393186 178966828 182580120
3711A82580120K802740K802743J915605J640707J912594P22735K55215n22868
$$ 182580120 185382860 188185603 190101208 191741915 193654509 194377244 194632459 194109591
3703A94109591l72249j068960j363851j718010j345687j444451k537422k642739
$$ 194109591 193737342 192668382 191304531 189586521 188240834 186796383 184258961 181616222
3695A81616222l117078l613609l840119l358656m862153m952490m601335m522712
$$ 181616222 178499144 174885535 171045416 167686760 162824607 157872117 153270782 148748070
3687A48748070l775569m019651l756517l278605l571356l277738l402870l369756
$$ 148748070 144972501 140952850 137196333 133917728 130346372 127068634 123665764 120296008
3679A20296008l055453k652167l132610k983477k784979k104240j663620j697997
$$ 120296008 117240555 114588388 111455778 108472301 105687322 103583082 101919462 100221465
3671A00221465j884038j164917j262408j172269q22494m77335o0955l86772O9184
$$ 100221465 98337427 97172510 95910102 94737833 93915339 93438004 93377049 92990277 93059461
3662I3059461N44698Q70435Q29895Q51376J110844R03712M04852j03386L36105
$$ 93059461 93604159 94474594 95304489 96155865 97266709 98170421 98575273 98471887 98807992
3653I8807992l58972J15698O90959J14396P58692L69652M17183P46564M92415
$$ 98807992 98449020 98564718 99255677 99370073 100128765 100498417 100915600 101662164 102154579
3644A02154579P89853O97101N05465R29243J001481Q68180J984976K268624K776902
$$ 102154579 102944432 103641533 104146998 105076241 106077722 106945902 108930878 111199502 113976404
3635A13976404L171701K696547L559268L091292J676848J776395J221547R30729
$$ 113976404 117148105 119844652 123403920 126495212 128172060 129948455 131170002 132100731
3627A32100731J483410J365621M62337R28040R08786J75982k63305l91945j38893
$$ 132100731 133584141 134949762 135412099 136340139 137248925 137424907 137161602 136769657 136630764
3618A36630764J10780J10525o59629M78558n1401J19455N80486K27447n28523
$$ 136630764 136741544 136852069 136192440 136670998 136619597 136739052 137319538 137546985 137018462
3609A37018462o87677n06632n76826r91259n49541o59587L28651J014825N47944
$$ 137018462 136330785 135824153 135247327 134256068 133706527 133046940 133375591 134390416 134938360
3600A34938360N6546l76066j7143p68334r63113k105150k232231k493897l127081
$$ 134938360 134994906 134618840 134601697 133833363 132870250 130765100 128532869 126038972 122911891
3591A22911891k026040k526941k470440l512836l722583l353752l009535k811303
$$ 122911891 120885851 118358910 115888470 112375634 108653051 105299299 102289764 99478461
3583I9478461k483770j289097j430400n96037j308183q61649j346506q08015n34259
$$ 99478461 96994691 95705594 94275194 93679157 92370974 91509325 90162819 89354804 88820545
3574H8820545j652783r23828j709230q98809j419364j245427n60577r60044n46956
$$ 88820545 87167762 86243934 84534704 83635895 82216531 80971104 80410527 79450483 78903527
3565G8903527m17227j381185j567483k114727k220534k426576k367818k049078
$$ 78903527 78486300 77105115 75537632 73422905 71202371 68775795 66407977 64358899
3557F4358899j531775j388082k054943j124093j137099k089985j449271r74394
$$ 64358899 62827124 61439042 59384099 58260006 57122907 55032922 53583651 52609257
3549E2609257j419301r89461q51185m03411r29092o37587q23459j020503r79560
$$ 52609257 51189956 50200495 49349310 48945899 48016807 47379220 46555761 45535258 44555698
3540D4555698j025855j107166j210888j315969j574616r77485p45147j126376
$$ 44555698 43529843 42422677 41211789 39895820 38321204 37343719 36598572 35472196
3532C5472196j280502q90066r13708r37219n83856j035159q20260k04288q24882
$$ 35472196 34191694 33301628 32387920 31450701 30866845 29831686 29011426 28807138 27982256
3523B7982256k89172o69361j332687p44076n10358p22937q63885j113832o27164
$$ 27982256 27693084 27023723 25691036 24946960 24436602 23713665 22849780 21735948 21108784
3514B1108784m69949l11029r68003k04268l1747l80111j76148m58400m11718m9174
$$ 21108784 20638835 20327806 19359803 19155535 19123788 18743677 18567529 18109129 17697411 17648237
3504A7648237q0041l3780n86879o67011N23955J17184j1364q5809m03129r3812
$$ 17648237 17568196 17534416 16947537 16280526 16804481 16921665 16910301 16824492 16421363 16327551
3494A6327551K89892K32084J11608m57789k32761K59513K83185n45971O48192
$$ 16327551 16617443 16849527 16961135 16503346 16270585 16530098 16813283 16267312 16915504
3485A6915504L45188r2274p1934O8375L60172M52710K28964K19406K28717K12914
$$ 16915504 17260692 17168418 17096484 17164859 17525031 17977741 18206705 18426111 18654828 18867742
3475A8867742K40685L06678N17572O40438N93145N22992Q86474O47798P16141
$$ 18867742 19108427 19415105 19932677 20573115 21166260 21689252 22575726 23223524 23939665
3466B3939665O00941P22304Q72429J031805J539489J120449J335199J410859K534978
$$ 23939665 24540606 25262910 26135339 27167144 28706633 29827082 31162281 32573140 35108118
3457C5108118J762396J422366K296191K548063K596046K339549K971568K710714
$$ 35108118 36870514 38292880 40589071 43137134 45733180 48072729 51044297 53755011
3449E3755011K359171K701694K639154K395056K398398K112897K275009J641058
$$ 53755011 56114182 58815876 61455030 63850086 66248484 68361381 70636390 72277448
3441G2277448J743651K272046J441695J497492J378244O13794Q88934P31399j51745
$$ 72277448 74021099 76293145 77734840 79232332 80610576 81224370 82113304 82844703 82692958
3432H2692958l94558m78385o96538j004100q88023o56535q76739q30621j300542
$$ 82692958 82298400 81820015 81123477 80119377 79231354 78574819 77698080 76867459 75566917
3423G5566917r90815j006480j018538o61456q39788j88372r4330n70400m52525
$$ 75566917 74576102 73569622 72551084 71889628 71049840 70861468 70767138 70196738 69744213
3414F9744213J170732J496509J875187J722587K599265K874382L444953M673383
$$ 69744213 70914945 72411454 74286641 76009228 78608493 81482875 84927828 89601211
3406H9601211M746474N179280N257159N516885O068964O392251O338817O806796
$$ 89601211 94347685 99526965 104784124 110301009 116369973 122762224 129101041 135907837
3398A35907837O713748O793730O091728O541416N766600N229435N316754M815470
$$ 135907837 142621585 149415315 155507043 162048459 167815059 173044494 178361248 183176718
3390A83176718M723671M095524K811102K978210J775358P36659j94090j323017
$$ 183176718 187900389 191995913 194807015 197785225 199560583 200297242 200103152 198780135
3382A98780135k010263k040127l344365l036382l541816m114911m324117m991780
$$ 198780135 196769872 194729745 191385380 188348998 184807182 180692271 176368154 171376374
3374A71376374m337497m095582n206659m433476n025347n008217m229806m298425
$$ 171376374 167038877 162943295 157736636 153303160 148277813 143269596 139039790 134741365
3366A34741365l581469l523937k409284j256430j108533n87795k6346J756139
$$ 134741365 131159896 127635959 125226675 123970245 122861712 122273917 122247571 124003710
3358A24003710J940802K785636L166987L930009M653673M761851M906468N180022
$$ 124003710 125944512 128730148 131897135 135827144 140480817 145242668 150149136 155329158
3350A55329158O102063O115580O238225N450759N523854N472776O050333N658383
$$ 155329158 161431221 167546801 173785026 179235785 184759639 190232415 196282748 201941131
3342B01941131N391753N260098N055089M445868L548190K464930K094299J230210
$$ 201941131 207332884 212592982 217648071 222093939 225642129 228107059 230201358 231431568
3334B31431568k84624j117805k087051k320609k635674l675862m272995n117809
$$ 231431568 231146944 230029139 227942088 225621479 222985805 219309943 215036948 209919139
3326B09919139m973181n221766m526808n114678n113961n639101m798925n726568
$$ 209919139 204945958 199724192 195197384 190082706 184968745 179329644 174530719 168804151
3318A68804151n277008n810706n230308m501149m032665l862378l157521k197494
$$ 168804151 163527143 157716437 152486129 147984980 143952315 140089937 136932416 134734922
3310A34734922j243882m50509O37853J492559K428325L211772M335101N496963
$$ 134734922 133491040 133040531 133678384 135170943 137599268 140811040 145146141 150643104
3302A50643104O318335P070930P549167Q917510R341526R994550J0676797J2048890
$$ 150643104 156961439 164032369 171581536 180499046 189840572 199835122 210511919 222560809
3294B22560809J2453719J2840366J3036789J3795292J3759762J5023162J4966141
$$ 222560809 235014528 247854894 260891683 274686975 288446737 303469899 318436040
3287C18436040J5086092J4861788J4889712J4268567J3473781J1973452J1811497
$$ 318436040 333522132 348383920 363273632 377542199 391015980 402989432 414800929
3280D14800929R863723Q271601P371047N036005L751933J757395l50901k395447
$$ 414800929 424664652 432936253 440307300 445343305 449095238 450852633 450501732 448106285
3272D48106285m078732o307521q182448j0142811j1997819j3170875j3827045
$$ 448106285 444027553 437720032 429537584 419394773 407396954 394226079 380399034
3265C80399034j4806336j5184124j5898901j5712894j6426592j6166637j5288476
$$ 380399034 365592698 350408574 334509673 318796779 302370187 286203550 270915074
3258B70915074j6106642j5258950j4726839j3774970j3408768j3204704j2140419
$$ 270915074 254808432 239549482 224822643 211047673 197638905 184434201 172293782
3251A72293782j1470468j0469492j0122478r015417q285035p981000o184529o271028
$$ 172293782 160823314 150353822 140231344 131215927 122930892 114949892 108765363 102494335
3243A02494335n613523n009621m322212m271178l295257k746184k764854j665346
$$ 102494335 96880812 91871191 87548979 83277801 79982544 77236360 74471506 72806160
3235G2806160j994833j488658j873913j299391q58610q37195j026654r35560p47817
$$ 72806160 70811327 69322669 67448756 66149365 65290755 64453560 63426906 62491346 61743529
3226F1743529q69887o28261j428548o59955q53519j161159r80860q45008r69548
$$ 61743529 60873642 60245381 58816833 58156878 57303359 56142200 55161340 54316332 53346784
3217E3346784o93490j171714j358167j365096j259996j091760j596778j338132
$$ 53346784 52653294 51481580 50123413 48758317 47498321 46406561 44809783 43471651
3209D3471651j788150j122588r45241k025308j725663j399059k057208j344624
$$ 43471651 41683501 40560913 39615672 37590364 35864701 34465642 32408434 31063810
3201C1063810j368424j431943j100902j425701j400866q74695p05843j097337
$$ 31063810 29695386 28263443 27162541 25736840 24335974 23461279 22755436 21658099
3193B1658099q58131l41398q48071o29380p69680n74804n51573o04298o06514
$$ 21658099 20799968 20458570 19610499 18981119 18211439 17636635 17085062 16480764 15874250
3184A5874250j49765j27049p53924p5636n81505m01194j11283q0755l54168p51237
$$ 15874250 15724485 15597436 14843512 14767876 14186371 13785177 13673894 13593139 13238971 12487734
3174A2487734n32706m57458j18844j47181K27303M7554q21269k61659m3912m24216
$$ 12487734 11955028 11497570 11378726 11231545 11458848 11506402 10685133 10423474 10379562 9955346
3164I955346l82316K15457j04346l52931l87554J06414m51848m76748J77912j2363
$$ 9955346 9573030 9788487 9684141 9331210 8943656 9050070 8598222 8121474 8299386 8287023
3154H287023k79303J86373Q7825l46098M7551l32131l29227J34219l18772o450
$$ 8287023 8007720 8194093 8281918 7935820 7983371 7651240 7322013 7456232 7137460 7131010
3144G131010M63580o02369L51185Q1549r5478j74795J98677J8133l73535m1045
$$ 7131010 7594590 6992221 7343406 7424955 7329477 7154682 7353359 7371492 6997957 6956912
3134F956912j05775L35063L2266O854J43514k47009o20957K51914k54681l61949
$$ 6956912 6851137 7186200 7218466 7225320 7368834 7121825 6500868 6752782 6498101 6136152
3124F136152J18852j34299j39659m4221j44250J40741L20958l9197M76708k95610
$$ 6136152 6255004 6120705 5981046 5936825 5792575 5933316 6254274 6215077 6691785 6396175
3114F396175n32180L00766M05759P158l82037k87720J87966k97466L0409L9552
$$ 6396175 5863995 6164761 6570520 6577678 6195641 5907921 6095887 5798421 5828830 5868382
3104E868382L11782K62517m37885M4247J3003L54057J8255l28384l7758K42840
$$ 5868382 6180164 6442681 6004796 6049043 6062046 6416103 6434358 6105974 6068216 6311056
3094F311056o6378O9083K5444K42877K75172p2526L53007M50405L7911K4362J25956
$$ 6311056 6244678 6313761 6339205 6582082 6857254 6784728 7137735 7588140 7626051 7650413 7776369
3083G776369N50742L08242j89727N28127O44003L43191M02585R22191J398725
$$ 7776369 8327111 8635353 8445626 8973753 9617756 9960947 10363532 11285723 12684448
3074A2684448M37554J178638J798756K252672K553209L334244L555984M334621
$$ 12684448 13122002 14300640 16099396 18352068 20905277 24239521 27795505 32130126
3066C2130126P007158P270249N166247M776305N386030l328185j1382309j0485921
$$ 32130126 39137284 46407533 51573780 56350085 61736115 58407930 47025621 36539700
3058C6539700o270779l557364k477476k154170j511272q70864q10334m62349l68757
$$ 36539700 30268921 26711557 24234081 22079911 20568639 19697775 18887441 18425092 18056335
3049A8056335M244O41745J317646J993170J520675K507598L330051M201107N901418
$$ 18056335 18060579 18702324 20019970 22013140 23533815 26041413 29371464 33572571 39473989
3040C9473989O813878N679505M400845M814212l566917j1336418j0304267o874989
$$ 39473989 46287867 51967372 56368217 61182429 57615512 46279094 35974827 29099838
3032B9099838m006799k838678k361999j528434j703151j819699r61044m92406
$$ 29099838 25093039 22254361 19892362 18363928 16660777 14841078 13880034 13387628
3024A3387628q74590r35333l32934l84539p91722m00785N4350k86519m78624o81260
$$ 13387628 12513038 11577705 11244771 10860232 10068510 9667725 9722075 9435556 8956932 8275672
3014H275672m72882n4081J21142m32865n17298k33948m2288m72092j80562L00047
$$ 8275672 7802790 7748709 7869851 7436986 6919688 6685740 6643452 6171360 5990798 6290845
3004F290845k95207p20788j22682k18130J49727j71662r31788m24818K27192j35297
$$ 6290845 5995638 5274850 5152168 4934038 5083765 4912103 3980315 3555497 3782689 3647392
2994C647392L1090R550J08856o4954p731n77824l86310M77804K50432M3396l50188
$$ 3647392 3678482 3688032 3796888 3731934 3724203 3146379 2760069 3237873 3488305 3531701 3181513
2983C181513l98682p308m6087o08276l30405K93241K59231l5934n57207l07626
$$ 3181513 2782831 2775523 2729436 2121160 1790755 2083996 2343227 2307293 1750086 1442460
2973A442460L28917K2689k82752L69420R739k78918N0977l15504J11584Q7478
$$ 1442460 1771377 1794066 1511314 1880734 1890473 1611555 1662532 1347028 1458612 1546090
2963A546090p9392m79263K34856r6121J4577P0137K50322M0950k0651k67828N8705
$$ 1546090 1466698 987435 1222291 1126170 1140747 1210884 1461206 1502156 1481505 1213677 1272382
2952A272382Q9310r6938n26433n1871M34901J84016n08535J07065J2704K19830
$$ 1272382 1361692 1264754 738321 686450 1121351 1305367 796832 903897 916601 1136431
2942A136431o5909j90437J30907m72117j742M90558O721m13312q7267j70887K74539
$$ 1136431 1070522 880085 1010992 538875 537133 1027691 1034412 621100 533833 362946 637485
2931F37485j77303J18949k59438L6178K75052J65723L52774r67277j40838L83971
$$ 637485 460182 579131 319693 355871 630923 796646 1149420 182143 41305 425276
2921D25276J19508K19060j01338l44683J31307J00685l77502j23317N6642L4548
$$ 425276 544784 763844 662506 317823 449130 549815 172313 48996 105638 140186
2911A40186L46122K58593o5933k46548j00415J26930K64579J06234n88436j90611
$$ 140186 486308 744901 678968 432420 332005 458935 723514 829748 241312 50701
2901E0701q4410J81327l37386j04670N23522L45764K79082J54082m96468J36624
$$ 50701 -33709 147618 -189768 -294438 229084 574848 853930 1008012 511544 648168
2891F48168l85713K873n05918k01378L77971L56975J26032l35550l24254j59724
$$ 648168 262455 265328 -240590 -441968 -63997 292978 419010 83460 -240794 -400518
2881d00518K22372k2611L00110M06101n73602k5804L60342K51328L40361n41512
$$ -400518 -178146 -200757 99353 505454 -68148 -93952 266390 517718 858079 316567
2871C16567k3161J75824R0145k76933k88390J47790j63773K512N10465j46899
$$ 316567 293406 469230 559375 282442 -5948 141842 -21931 -19419 491046 344147
2861C44147l67241L42580K85336j3158K11781l73731k96287j65640N62065L4064
$$ 344147 -23094 319486 604822 591664 803445 429714 133427 -32213 529852 563916
2851E63916Q6928J51886l96639j40613m412r5562j39934L78083J25640J33757
$$ 563916 650844 802730 406091 265478 261066 165504 25570 403653 529293 663050
2841F63050j44030o8158K80534o37543l6093k81547m07414M88915J01596J98187
$$ 663050 519020 450862 731396 93853 57760 -223787 -631201 -142286 -40690 157497
2831A57497k7812Q6210J89576j8830J18500k22493j80579j5163J01532K51555
$$ 157497 129685 215895 405471 386641 505141 282648 102069 86906 188438 439993
2821D39993m76806l81919N40340J27946k77595L488O36783K82265n57520N51896
$$ 439993 -36813 -418732 121608 249554 -28041 -24553 612230 894495 336975 888871
2811H88871j14126m74273J81187j61742l4122j17591l1803l18405j19255R21143
$$ 888871 774745 300472 481659 319917 285795 168204 136401 -182004 -301259 619884
2801F19884m81318j21103p9326L73785L54702m88165n59125m48632L10223L39810
$$ 619884 138566 17463 -61863 311922 666624 178459 -380666 -829298 -519075 -179265
2791a79265L56674k8619j50325K0772K85500j08672K11224k54728l30728P77665
$$ -179265 177409 148790 -1535 19237 304737 196065 407289 152561 -178167 599498
2781E99498j62382k32448J61779M03961n22542k12265j81487N7105j35478l61020
$$ 599498 437116 204668 366447 770408 247866 35601 -145886 -88781 -224259 -585279
2771e85279J78321J44826M63679k81418k47782N92156R232l26522R8979o04151
$$ -585279 -406958 -262132 201547 -79871 -327653 264503 273735 -52787 46192 -557959
2761e57959M10070L25399K67237k00141k40416Q4220k05850J5351M12420l8169
$$ -557959 -147889 177510 444747 244606 4190 88410 -117440 -102089 310331 272162
2751B72162k33240k38357K75763K3214o54452K08960M43038l41687K25500q1372
$$ 272162 38922 -199435 76328 99542 -554910 -345950 97088 -244599 -19099 -100471
2741a00471j05998M57028K5354J11868O7153J42429k54270P9066K93113k29925
$$ -100471 -206469 250559 275913 387781 454934 597363 343093 422159 715272 485347
2731D85347m37778k33251N25163K72825N625j36629k75157k13090l6365k16219
$$ 485347 47569 -185682 339481 612306 617931 481302 206145 -6945 -43310 -259529
2721b59529k1560n0386Q1464L0994M6366J62945j28448K03827j17825j64654j16956
$$ -259529 -281089 -331475 -250011 -219017 -172651 -9706 -138154 65673 -52152 -216806 -333762
2710c33762K04092R3985l92783q9460L702L14514K71233K30359k76064K63006
$$ -333762 -129670 -35685 -428468 -517928 -514226 -199712 71521 301880 25816 288822
2700B88822J31190n26998L05247J09279j9912q2111k49801J87043j42673J25294
$$ 288822 420012 -106986 198261 307540 287628 205517 -44284 142759 86 125380
2690A25380K05673j50374R3876K76658p70588L97948j9375m43230J61537j7106
$$ 125380 331053 180679 274555 551213 -219375 178573 159198 -284032 -122495 -139601
2680a39601M05405k14946J98453J89399Q0479n33588K54637r8146r4277L52620
$$ -139601 265804 50858 249311 438710 519189 -14399 240238 142092 47815 400435
2670D00435j0846j31135J79961l50069j09699J37776k49414M4451l82671m66392
$$ 400435 389589 258454 438415 88346 -21353 116423 -132991 -88540 -471211 -937603
2660i37603N48943M87109l9300o6291K5755j04525p7202n6602J05769O1110M0551
$$ -937603 -388660 98449 59149 -7142 18613 -85912 -163114 -219716 -113947 -52837 -12286
2649a2286l02450j66760L96011J1898J37627J9300j1081M32777J9852l55224j60611
$$ -12286 -314736 -481496 -85485 -73587 64040 83340 72259 505036 524888 169664 9053
2638I053J25307J67183m16476j91990o4817P1991P34455r5033k37552m21589J63581
$$ 9053 134360 301543 -114933 -306923 -371740 -299749 434706 339673 102121 -319468 -155887
2627a55887L72683j78218K1737k17474K04742l9967k96541L82993K63246l44664
$$ -155887 216796 38578 60315 -157159 47583 7616 -288925 94068 357314 12650
2617A2650m0986l06789M44624J84423q7209k4191m47114p3967J3837L18705j69569
$$ 12650 -28336 -335125 109499 293922 206713 182522 -264592 -338559 -324722 -6017 -175586
2606a75586m16466K2152M60428R1754J46691J21032n27309j11290m037O31310
$$ -175586 -592052 -569900 -109472 -17718 128973 250005 -277304 -388594 -392631 238679
2596B38679j34700j58802L69809j14213j4854r8118m37873l44208L81162L97541
$$ 238679 103979 -54823 314986 200773 185919 87801 -350072 -694280 -313118 84423
2586H4423l83759j14761N54407n18671j87205O05968j62897O8672o5972J2593
$$ 84423 -299336 -414097 140310 -378361 -565566 40402 -122495 -53823 -119795 -107202
2576a07202N0938j14917j35932L98244n2264k66524L2140K17461J38815l24137
$$ -107202 -56264 -171181 -307113 91131 38867 -227657 -195517 21944 160759 -163378
2566a63378j1176L3731J82921j19554J47257l23560L3806J13592k20385P5437
$$ -163378 -174554 -140823 42098 -77456 69801 -253759 -219953 -106361 -326746 -251309
2556b51309K34740k01432j15170k39051L75546P8881j8102j42675p1950P052M10743
$$ -251309 -16569 -218001 -333171 -572222 -196676 -117795 -135897 -278572 -350522 -343470 67273
2545F7273p1277o7177L39488R812m75229k145J39994j33452K41063k01221l03477
$$ 67273 -4004 -71181 268307 278119 -197110 -199255 -59261 -192713 48350 -152871 -456348
2534d56348N58L97028j92792L29057Q007l64408K96860k96006K2377P68828j06128
$$ -456348 -455790 -58762 -251554 77503 85510 -278898 17962 -278044 -255667 513161 407033
2523D07033l96065l10986l1684K08663L31657l66694J59769m03047J99293K40991
$$ 407033 10968 -300018 -331702 -123039 208618 -158076 1693 -401354 -202061 38930
2513C8930r3749j69650l22143J36507N2843L12440K22652J38070l71232J23622
$$ 38930 -54819 -224469 -546612 -410105 -357262 -44822 177830 315900 -55332 68290
2503F8290Q0048n6840K2475p5244M41849k79123k46737L1218K5309R2057k60976
$$ 68290 148338 91498 113973 38729 480578 201455 -45282 -14064 11245 103302 -157674
2492a57674J02360J03907k82283j70306L91590j27328R5657k23666K84905L24621
$$ -157674 -55314 48593 -233690 -403996 -12406 -139734 -44077 -267743 17162 341783
2482C41783j12597k22962R0819L7927r5845L05987m793j33862m25329j63450k8212
$$ 341783 229186 6224 97043 134970 39125 345112 340319 206457 -218872 -382322 -410534
2471d10534K13238N3209J63766J46417m15844l19815M90755K93798Q3255j88127
$$ -410534 -197296 -144087 19679 166096 -249748 -569563 -78808 214990 298245 110118
2461A10118L53505m70596N2554K69042n0645l17005L62338R8152k13701K28991
$$ 110118 463623 -6973 45581 314623 263978 -53027 309311 407463 193762 422753
2451D22753l91984m39955M02304M17615l65530j7591k34533n41234K8879M19486
$$ 422753 30769 -409186 -6882 410733 45203 27612 -206921 -748155 -719276 -299790
2441b99790K43578k16690L68315l18344K22568m69549m29046L13265O94562M5092
$$ -299790 -56212 -272902 95413 -222931 -363 -469912 -898958 -585693 108869 153961
2431A53961m67405N53848j69253k06270j29157K1474k0729L302K16228J90560
$$ 153961 -313444 240404 71151 -135119 -264276 -242802 -263531 -260229 -44001 146559
2421A46559O7582l09661k22824N29738n6016l54497L7580j34264k99449J29691
$$ 146559 214141 -95520 -318344 211394 155378 -199119 -161539 -295803 -595252 -465561
2411d65561q2400J11282L74275K53104l09892j90244K07800O0667k41543O0636
$$ -465561 -547961 -436679 -62404 190700 -119192 -309436 -101636 -40969 -282512 -221876
2401b21876o8529j46175N375l2587j27203K07131J88499j88601m78139K8151J15391
$$ -221876 -290405 -436580 -431205 -463792 -590995 -383864 -195365 -383966 -862105 -833954 -718563
2390g18563O14328K52548L94130o52869J64917L28513n79080l1821L57203o2609
$$ -718563 -104235 148313 542443 -110426 54491 383004 -196076 -227897 129306 66697
2380F6697J32823l70329k48198k51971j15182M78388J46076J79211J88955m03474
$$ 66697 199520 -170809 -419007 -670978 -786160 -307772 -161696 17515 206470 -197004
2370a97004j64849J5902M70134L54506j78371k72901n0411R1527m77942K13507
$$ -197004 -361853 -345951 124183 478689 300318 27417 -22994 68533 -409409 -195902
2360a95902N57754j80414j22497J55131n8507l74502K38716o6569j30721k19671
$$ -195902 361852 181438 58941 214072 155565 -218937 19779 -46790 -177511 -397182
2350c97182O00843K96204m49841m48312j27991M73023K60811M23324m02420j32129
$$ -397182 203661 499865 50024 -398288 -526279 -53256 207555 630879 228459 96330
2340I6330k46844L84099K62430j27730m55803k97516K89111K43489J06317p67992
$$ 96330 -150514 233585 496015 368285 -87518 -385034 -95923 147566 253883 -514109
2330e14109P093O39342J96547N60440k78681l14777K07322m2599j97910j20032
$$ -514109 -507016 132326 328873 889313 610632 295855 503177 460578 262668 142636
2320A42636J65015k80288O2776N41770O3499r0813j09195K2186k61926l5189j88373
$$ 142636 307651 27363 90139 631909 695408 604595 495400 517586 255660 220471 32098
2309C2098K03809N42351j97792o22189M40582n36123p2107M95695l8104K5761
$$ 32098 235907 778258 580466 -41723 398859 -137264 -209371 286324 248220 273981
2299B73981j86513J3259k3297P3025J89910o26781k54418j43990N09084n79979
$$ 273981 87468 100727 77430 150455 340365 -286416 -540834 -684824 -175740 -755719
2289g55719m4650M61495J34740L75105j1073j43538m31014M25265O2752q3927
$$ -755719 -800369 -338874 -204134 170971 159898 16360 -414654 10611 73363 -10564
2279a0564R9348J47661l11532j51975n0113l4373J71855j32097K3677J82449J47080
$$ -10564 88784 236445 -75087 -227062 -277175 -311548 -139693 -271790 -248113 -65664 81416
2268H1416k9134l509k47114M54439q883l37781M06462J59837r7541J90119n19240
$$ 81416 52282 48773 -198341 256098 247215 -90566 315896 475733 378192 568311 49071
2257D9071k08185K12478K72445q1632k68390J07870J57760j86059J06857L6662
$$ 49071 -159114 53364 325809 244177 -24213 83657 241417 55358 162215 198877
2247A98877M51366l30876Q6078J29581p6307R5788m67124l4037K77038J8230K15917
$$ 198877 650243 319367 405445 535026 458719 554507 87383 53346 330384 348614 564531
2236E64531Q304K23394l48084k6279j82803l19959L31087p3321r1394l70545L19196
$$ 564531 572835 796229 448145 421866 239063 -80896 250191 176870 85476 -285069 34127
2225C4127K11225J05859m4183J56632l75147o1516K87547K05989l60604J15112
$$ 34127 245352 351211 307028 463660 88513 26997 314544 520533 159929 275041
2215B75041M5214m22113J55764j42983p73J99984j78796M74591J23671L62566
$$ 275041 320255 -101858 53906 -89077 -89850 110134 -68662 405929 529600 892166
2205H92166j40362k06217k6324L02433N4950k99404n31518K17171J47148L367
$$ 892166 751804 545587 519263 821696 876646 577242 45724 262895 410043 413410
2195D13410j76513M38670k76889k3655k24426O6454J25831L6655L73354k30046
$$ 413410 236897 675567 398678 375023 150597 217051 342882 379537 752891 522845
2185E22845j3048l9648m09822M39939K54114k50149K25578K60398M10039k29953
$$ 522845 509797 470149 60327 500266 754380 504231 729809 990207 1400246 1170293
2175A170293k23429k33232k15304j27268J84817P42543j07160m96865J436M50801
$$ 1170293 946864 713632 498328 371060 555877 1298420 1191260 694395 695831 1146632
2165A146632m89311L69940L0963l68612j07506K8541j21891L39819K94756J16947
$$ 1146632 657321 1027261 1058224 689612 582106 610647 488756 828575 1123331 1240278
2155A240278j04599L5299Q2904K59399J65188l31408q1325j73681K6248m42123
$$ 1240278 1135679 1170978 1253882 1513281 1678469 1347061 1265736 1092055 1118303 676180
2145F76180O8575J26005M12447p9932L01343J79491l54759j70577Q19280P54948
$$ 676180 744755 870760 1283207 1203275 1504618 1684109 1329350 1158773 1978053 2733001
2135B733001m52276l12396K6317K34512O7413M95102K14329l2190j45461J26605
$$ 2733001 2280725 1968329 1994646 2229158 2296571 2791673 3006002 2973812 2828351 2954956
2125B954956P4044j87336L43810j45230M63544j495J62662j07082K18254L11371
$$ 2954956 3029000 2841664 3185474 3040244 3503788 3502293 3664955 3557873 3776127 4087498
2115D087498K73165k65091k9437M07214N11702j45321o5703k5496k4407J49679
$$ 4087498 4360663 4095572 4066135 4473349 4985051 4839730 4774027 4748531 4724124 4873803
2105D873803O28093M29467L36473K98140O13982j45878J79846M03025L75114R39850
$$ 4873803 5501896 5931363 6267836 6565976 7179958 7034080 7213926 7616951 7992065 8931915
2095H931915O18828P93269J216179P52023J528410J956964J839519J925636J812399
$$ 8931915 9550743 10344012 11560191 12312214 13840624 15797588 17637107 19562743 21375142
2086B1375142J319961K572904L697310N098077O537881P357547Q836530J1838207
$$ 21375142 22695103 25268007 28965317 34063394 40601275 47958822 56795352 68633559
2078F8633559J5025690K0751446K1541691J6769916j786044k3323438k5500560
$$ 68633559 83659249 104410695 125952386 142722302 140936258 117612820 92112260
2071I2112260k0818159j3053054r360007o316831m744992m162637l649872k262970
$$ 92112260 71294101 58241047 48881040 42564209 37819217 33656580 30006708 27743738
2063B7743738k307721j587623j393894k042744j909201k045890j645181n86414
$$ 27743738 25436017 23848394 22454500 20411756 18502555 16456665 14811484 14225070
2055A4225070j406992r91639J04974r13880q64883o43683j47273j45882l02744
$$ 14225070 12818078 11826439 11931413 11017533 10152650 9508967 9361694 9215812 8913068
2046H913068r00381N5532r44056o58567r3796j82586q0796l35410l73749k35653
$$ 8913068 8012687 8068219 7124163 6465596 6371800 6189214 6108418 5773008 5399259 5163606
2036E163606k49866m94232r0337L34357l14069m91383j79803m77434L2376O2917
$$ 5163606 4913740 4419508 4329171 4663528 4349459 3858076 3678273 3200839 3233215 3296132
2026C296132K43943j52259k52740k90395K58512j382n24442j39398J95577Q4780
$$ 3296132 3540075 3387816 3135076 2844681 3103193 3101811 2577369 2437971 2633548 2718328
2016B718328m74439q0698m1767K21475K84523k32022p29035k1039J41722O0317
$$ 2718328 2243889 2163191 2121424 2342899 2627422 2395400 1666365 1645326 1787048 1847365
2006A847365J00611l31869J59719J61903n6800J73705k91885m90213K24929k50961
$$ 1847365 1947976 1616107 1775826 1937729 1880929 2054634 1762749 1272536 1497465 1246504
1996A246504J91386k83440l61846K74190L70324j80649P7683k30542J10410j44398
$$ 1246504 1437890 1154450 792604 1066794 1437118 1256469 1334152 1103610 1214020 1069622
1986A069622m90457L75020p6215l914k3992J36423l47247p4747m156L86557K1550
$$ 1069622 579165 954185 877970 874056 850064 986487 639240 564493 560337 946894 968444
1975I68444l38173m8039M74325M36709n12374o4811m12280j65937J54750n3222
$$ 968444 630271 582232 1056557 1493266 980892 916081 503801 337864 492614 439392
1965D39392k21455j51664m0363O5281j24070N12692M09298J7686o5992k66279
$$ 439392 217937 66273 25910 91191 -32879 479813 889111 906797 840805 574526
1955E74526K2510J42091j16105L73667o05108n12819L1671L8453J47995K27756
$$ 574526 597036 739127 623022 996689 391581 -121238 -89567 -51114 96881 324637
1945C24637l72856N97708K07023m00731o302J4186o5896P969J84992k31859M88226
$$ 324637 -48219 549489 756512 355781 349479 363665 297769 305738 490730 258871 747097
1934G47097l18419k61912J04742k40633o8055J60912r4790K96373P41864l51125
$$ 747097 428678 166766 271508 30875 -37180 123732 28942 325315 1067179 716054
1924G16054n89489J47216M24548m844k25790J22550k11691j7440O5018k16304
$$ 716054 126565 273781 698329 693485 467695 590245 378554 361114 426132 209828
1914B09828n27062M6639L40621k49500J68402N1238k65888N74886J37206n18322
$$ 209828 -317234 -270595 70026 -179474 -11072 40166 -225722 349164 486370 -31952
1904c1952M77243l1782o63206J39140J12063r4508J507Q9520P8520j11849j9536
$$ -31952 445291 413509 -249697 -110557 1506 -93002 -91495 -1975 76545 -35304 -54840
1893e4840L11406p7490l37831Q05963J917m96700j17615Q832K49984q1629M53354
$$ -54840 256566 179076 -158755 647208 649125 152425 34810 43642 293626 211997 665351
1882F65351k47537k21092q0723K64658k23897p9686l93816O4184k17082K28502
$$ 665351 417814 196722 115999 380657 156760 77074 -316742 -252558 -469640 -241138
1872b41138l1303K92600K64626R1531m7275k50360J88159o0173m69691r1440L31124
$$ -241138 -272441 20159 284785 376316 329041 78681 266840 206667 -263024 -354464 -23340
1861b3340k28287K92967J22392l90450K23226K70995K26629k30077M866k97184
$$ -23340 -251627 41340 163732 -226718 -3492 267503 494132 264055 268921 -28263
1851b8263j40802K57468j11841K22410K29658l4258l02066J08179l00917M51683
$$ -28263 -169065 88403 -23438 198972 428630 394372 92306 200485 -100432 351251
1841C51251l7982N1188j78030K3667J64991l88899M95823J26611j61016m06K46478
$$ 351251 313269 364457 186427 210094 375085 -13814 482009 608620 447604 447198 693676
1830F93676l88473k24052m79861O121O5678M41637K16450j32762k20192k17594
$$ 693676 305203 81151 -398710 -392589 -326911 114726 331176 198414 -21778 -239372
1820b39372r3766k6903L04222L43178q8618r7399M51300l27839J20080j08029
$$ -239372 -333138 -360041 -55819 287359 198741 101342 552642 224803 344883 236854
1810B36854m03495k02671K05001k50508M08636k23994J3919L98347k25638P7616
$$ 236854 -166641 -369312 -164311 -414819 -6183 -230177 -216258 182089 -43549 34067
1800C4067j04740K4771j14197J25330J87367k88029L2120j37216r6574M49183
$$ 34067 -70673 -45902 -160099 -34769 152598 -135431 -103311 -240527 -337101 112082
1790A12082k68089k45951j3653J55743j76647J71723L60230k54583L01149J62042
$$ 112082 -156007 -401958 -415611 -259868 -436515 -264792 95438 -159145 142004 304046
1780C04046M33511p5108m31267l97850K03953r831k33209l23098N82049N2826
$$ 304046 737557 662449 231182 -166668 37285 27454 -205755 -528853 53196 106022
1770A06022J42522p808k91035K96733m10236m96720N25662K70676j42889k90002
$$ 106022 248544 240736 -50299 246434 -163802 -660522 -134860 135816 -7073 -297075
1760b97075l1383Q5715L31637l1558k50823N11218o17604J5537L70969l09144
$$ -297075 -328458 -242743 88894 57336 -193487 317731 -299873 -284336 86633 -222511
1750b22511L86359j19540J14908j2721k27249q4290r6205L00286o30914j768M61029
$$ -222511 163848 44308 159216 146495 -80754 -165044 -261249 39037 -591877 -593645 -132616
1739a32616J76994J97591j48618p9977L64932j86571p01357J4560O05582P7780
$$ -132616 44378 241969 93351 13374 378306 191735 -509622 -495062 110520 188300
1729A88300J16060l91635l0717J90041J20986R607l49902n7624K65760p7964O453
$$ 188300 304360 -87275 -117992 72049 193035 202642 -147260 -204884 60876 -17088 -10635
1718a0635j20862j2503l04447j00983M96057K02496k49687k24735O7768m495Q253
$$ -10635 -131497 -144000 -448447 -549430 -53373 149123 -100564 -325299 -257531 -262026 -253773
1707b53773l18777j14132K51438M7010J04570M77391j10827p9156J16389N9573
$$ -253773 -572550 -686682 -435244 -388234 -283664 193727 82900 3744 120133 179706
1697A79706o56381K73696j32148j84366K33930L11627M8078j61495J6666l56808
$$ 179706 -476675 -202979 -335127 -519493 -285563 26064 74142 -87353 -70687 -427495
1687d27495n2482Q6335M49230j26652o23507k2378K04701O41984j9917j01185
$$ -427495 -479977 -393642 55588 -71064 -694571 -716949 -512248 129736 109819 8634
1677H634k58308j62747K75684J13532K72134k88431R8146J54154q183l63245n14678
$$ 8634 -249674 -412421 -136737 -23205 248929 -39502 58644 212798 204615 -158630 -673308
1666f73308L60853K15230k48098j68120J55356J59081l53059R7713L50738M48754
$$ -673308 -312455 -97225 -345323 -513443 -358087 -199006 -552065 -454352 -103614 345140
1656C45140j91034J79814k85120j09426m728n4470l24997J87909k85095j02655
$$ 345140 154106 333920 48800 -60626 -65354 -119824 -444821 -256912 -542007 -644662
1646f44662L26938j4661J75255K48692j87689J56521J80508j52183J94904k47918
$$ -644662 -317724 -332385 -157130 91562 -96127 60394 240902 88719 283623 35705
1636C5705j79067k05541k2323K33890J11093M48279Q6382k39079l68623L6944
$$ 35705 -143362 -348903 -371226 -137336 -26243 422036 508418 269339 -99284 -62340
1626f2340K30210J33250m71341M453M34588L86651q30069k21134N70073r338p0647
$$ -62340 167870 301120 -170221 -165768 268820 655471 -174598 -395732 174341 165003 94356
1615I4356j05983O8325m51459L19656j13712K37263k39749l17624r5298M43282
$$ 94356 -11627 56698 -394761 -75105 -188817 48446 -191303 -508927 -604225 -160943
1605a60943L10180j22824j79282l02341K84630L4384q4292M06275k8917k19652
$$ -160943 149237 26413 -152869 -455210 -170580 -136196 -220488 185787 156870 -62782
1595f2782k31498n1694l05147J32645j5638J32266m9101l31869L86821J66936
$$ -62782 -294280 -345974 -651121 -518476 -534114 -401848 -450949 -782818 -395997 -229061
1585b29061O7148k218M5315m17867m7595L8825J28407j0940N31927m9323j83243
$$ -229061 -161913 -164131 -118816 -536683 -584278 -545453 -417046 -427986 103941 54618 -128625
1574a28625L35360l8961O6506j33654j04289j6375J75232K37026q8714j2216j01161
$$ -128625 206735 167774 234280 100626 -3663 -20038 155194 392220 303506 291290 190129
1563A90129n35852R1863M80137J22858m19606l52268L78191j15183j59384L21524
$$ 190129 -345723 -253860 226277 349135 -70471 -422739 -44548 -159731 -319115 2409
1553B409K70438k16914j36004J38206J84583j40377p9926m33632K89828L89502
$$ 2409 272847 55933 -80071 58135 242718 102341 22415 -411217 -121389 268113
1543B68113J76827k15667m43187K23738o2633j19411J72869n5722K61304n8876
$$ 268113 444940 229273 -213914 9824 -52809 -172220 649 -55073 206231 147355
1533A47355o22164O81315l98987P9545o3687k8606J45098K00889j75994K59929
$$ 147355 -474809 206506 -192481 -112936 -176623 -205229 -60131 140758 -35236 224693
1523B24693M33221l53423p68995j05880J19317L52660K25627m18460m24364L348
$$ 224693 657914 304491 -464504 -570384 -451067 -98407 127220 -291240 -715604 -712256
1513g12256J35626L31715J26714L08395r0714M57524j28141l10407L64635j23118
$$ -712256 -576630 -244915 -118201 190194 99480 557004 428863 118456 483091 359973
1503C59973l50708l77666p370k3647m08149J5526K20847M26096K20101j84743
$$ 359973 9265 -368401 -375771 -399418 -807567 -792041 -571194 -145098 75003 -109740
1493a09740J04378o9426P1666M1702M51901j08699k67992R3305p6208m19504O05194
$$ -109740 -5362 -74788 -3122 38580 490481 381782 113790 207095 130887 -288617 316577
1482C16577J33115j68825l47391R2484N83052j81244j42123m85076J22034J11562
$$ 316577 449692 280867 -66524 25960 609012 427768 285645 -199431 -77397 34165
1472C4165j17642j36820M49809L73083o98275k50287N8653J35557m5290j91405
$$ 34165 -83477 -220297 229512 602595 -95680 -345967 -287314 -151757 -197047 -388452
1462c88452L4248k57213M53734J31521P2972N5554J9372k16546l34912K60148
$$ -388452 -354204 -611417 -157683 -26162 46810 102364 121736 -94810 -429722 -169574
1452a69574j26595l32399N77532M71346M7333k00033j83554J75960k5764n70904
$$ -169574 -296169 -628568 -51036 420310 467643 267610 84056 260016 234252 -336652
1442c36652k55226J083757j65647j2596j28915n18261J24555O03071j32245k10209
$$ -336652 -591878 491879 326232 313636 184721 -333540 -208985 394086 261841 51632
1432E1632K9147l43898J75966L34570m42073J81852j98873L6559k21900q0826
$$ 51632 80779 -263119 -87153 247417 -194656 -12804 -211677 -175118 -397018 -477844
1422d77844J82981j66735O98242j08919l27465L47864l02276K50028l0868k36697
$$ -477844 -294863 -461598 236644 127725 -199740 148124 -154152 95876 65008 -171689
1412a71689K73089M27881n18907J48014k76003R9538r3173k07647J12300k96028
$$ -171689 101400 529281 10374 158388 -117615 -18077 -111250 -318897 -206597 -502625
1402e02625o8368O01201l25607l01009M68173J18359m0427k35367r1212L69952
$$ -502625 -570993 30208 -295399 -596408 -128235 -9876 -50303 -285670 -376882 -6930
1392f930J46830j86991j7413K3957k5057K09435o1970n4872J08206k46084l20674
$$ -6930 139900 -47091 -64504 -40547 -65604 143831 81861 26989 135195 -110889 -431563
1381d31563q6826k53713M39044L27851J48600K1719J61603l79482L3555L54963
$$ -431563 -518389 -772102 -333058 -5207 143393 165112 326715 -52767 -19212 335751
1371C35751k45200k2646J74431P0228l65548j8711m06023J56849L80573r903K3323
$$ 335751 90551 67905 242336 312564 -52984 -71695 -477718 -320869 59704 49801 73124
1360G3124L13265j38666J92932n5147K37712k91353J04463j58386j60243m79744
$$ 73124 386389 247723 440655 385508 623220 331867 436330 277944 117701 -362043
1350c62043q5386J21348N76861k70213K08854j00707k54798J04870j0460J14102
$$ -362043 -447429 -326081 250780 -19433 189421 88714 -166084 -61214 -71674 42428
1340D2428k65325j99290N09290m0288K52648l77898J56412k51737K64210j25776
$$ 42428 -222897 -422187 87103 46815 299463 -78435 77977 -173760 90450 -35326
1330c5326l96963J62705J32416J21205j23003K6967j19567K6787l95972N12803
$$ -35326 -432289 -269584 -137168 -15963 -138966 -111999 -231566 -204779 -600751 -87948
1320h7948M05071k66920n35433j52109J84258L00098j00427K75550J48426J20124
$$ -87948 317123 50203 -485230 -637339 -453081 -152983 -253410 22140 170566 290690
1310B90690j65688l72819M90542q8440P2001K15872J30680l18448l23138M5501
$$ 290690 125002 -247817 242725 154285 226286 442158 572838 254390 -68748 -23247
1300b3247K7246k81859R6317p768K19694j58681k21838J60300j29102M4480l9399
$$ -23247 3999 -277860 -181543 -189311 30383 -128298 -350136 -189836 -318938 -274458 -313857
1289c13857j6001K19085l4886j23637M63696j29447J87867k48360N3040j68826
$$ -313857 -329858 -110773 -145659 -269296 194400 64953 252820 4460 57500 -111326
1279a11326J77957K7276J02354j15085j19830N1002K54305k83009J73745j23911
$$ -111326 66631 93907 196261 81176 -38654 12348 266653 -16356 157389 33478
1269C3478n15448l36170P09424M18547l28811M18753m41243p5443L16905p24017
$$ 33478 -481970 -818140 -108716 309831 -18980 399773 -41470 -116913 199992 -524025
1259e24025Q301N03292l53078N60322M35214k88378k28863Q6701q8573J25333
$$ -524025 -515724 -12432 -365510 194812 630026 341648 112785 199486 110913 236246
1249B36246k38434l6131J7977M52394J01644L8365p07778j46980R2487j10711
$$ 236246 -2188 -38319 -20342 432052 533696 572061 -135717 -282697 -190210 -300921
1239c00921J77937l5538j21991J25152K23221j09492r644l40514M19643p0963
$$ -300921 -122984 -158522 -280513 -155361 67860 -41632 -51276 -391790 27853 -43110
1229d3110l92563k94507J39014L31769K27642n896K46231j89940J77120j02142
$$ -43110 -435673 -730180 -591166 -259397 -31755 -37651 208580 18640 195760 93618
1219I3618j83262k34768j02546p4796O47078n8111o6406j61037K87644L07796
$$ 93618 -89644 -324412 -426958 -501754 145324 87213 20807 -140230 147414 455210
1209D55210j93715n00223K1418k03627L40195k81656N6676J57185k98981K68581
$$ 455210 261495 -238728 -217310 -420937 -80742 -362398 -305722 -148537 -447518 -178937
1199a78937K10081n3811k60915m3294L0745j48255M81007p996n1754O58421j3453
$$ -178937 31144 -22667 -283582 -326876 -296131 -444386 36621 28625 -23129 635292 621839
1188F21839m46990m11646N18578m49508j95974L48447K88627n6483l10182j52395
$$ 621839 174849 -236797 281781 -167727 -363701 -15254 273373 216890 -93292 -245687
1178b45687l8301M6277n4706J07508p6126N56594J92461J1841m84626j43139L08452
$$ -245687 -283988 -237711 -292417 -184909 -261035 295559 488020 499861 15235 -127904 180548
1167A80548k48498K40358m19566K26077R296M76428k38072Q4055j7990n8745j27197
$$ 180548 -67950 172408 -247158 -21081 -11785 464643 226571 310626 292636 233891 106694
1156A06694p1102l17937L81097J58587k30385q4954K83621j75619j47616L69353
$$ 106694 35592 -282345 98752 257339 26954 -58000 225621 50002 -97614 271739
1146B71739k09055k45924K5414j27349J63619L61113j92492k18859K1082n8700
$$ 271739 62684 -183240 -157826 -285175 -121556 239557 47065 -171794 -150712 -209412
1136b09412j59197J165J5241k33053J1498K61966J31577r4901m6234J11444M18333
$$ -209412 -368609 -367444 -352203 -585256 -573758 -311792 -180215 -275116 -321350 -209906 208427
1125B08427L46553l71725k11744n23390K66060N03782J05017K7284k70501L56683
$$ 208427 554980 183255 -28489 -551879 -285819 217963 322980 350264 79763 436446
1115D36446m10158k98600k27773j70701N28761k29444M97860J14050j84568J17977
$$ 436446 26288 -272312 -500085 -670786 -142025 -371469 126391 240441 55873 173850
1105A73850k63009r0066n8379K39297p2437K65664m31352J67356N27678O8507
$$ 173850 -89159 -179225 -237604 1693 -70744 194920 -236432 -69076 458602 527109
1095E27109k51241j14132n53654L65114p3055p5960R2951J99836m55123K87603
$$ 527109 275868 161736 -391918 -26804 -99859 -175819 -82868 116968 -338155 -50552
1085e0552R9130j32497N2786N3072L20138l11532J1419k73899L30913K72925q62
$$ -50552 48578 -83919 -31133 21939 342077 30545 41964 -231935 98978 371903 371041
1074C71041j89280j03791j70036L01413l33955L99184l52219K04984k30904N8749
$$ 371041 181761 77970 -92066 209347 -124608 274576 -77643 127341 -103563 -44814
1064d4814p7673L59147K34660j93674m80199L72322L03263q49029N12929P9056
$$ -44814 -122487 236660 471320 277646 -202553 169769 473032 -375997 136932 215988
1054B15988l59908k89732K37942M74384n7149l08296p1540k038K85609J44053
$$ 215988 -143920 -433652 -195710 278674 221525 -86771 -158311 -160349 125260 269313
1044B69313K2407J75518j63004j29077M3438k16607m23468N87079N59590l43860
$$ 269313 291720 467238 304234 175157 218595 1988 -421480 165599 725189 381329
1034C81329l40729k4619m74819J72544N0572J73219o0191k2006j09586K47878
$$ 381329 40600 15981 -458838 -286294 -235722 -62503 -122694 -144700 -254286 -6408
1024f408L18941J67454K27247l80089l30142l8646j10085J475l6930J1056M49288
$$ -6408 312533 479987 707234 327145 -2997 -41643 -151728 -150253 -187183 -176127 273161
1013B73161O2800m08276N81758l75957l75297M3668M08414L54456m54776R4956
$$ 273161 335961 -72315 509443 133486 -241811 -198143 210271 564727 109951 204907
1003B04907O985M9939n13279M87169l14947m2693j1620m71483l1088N87213j3117
$$ 204907 211892 261831 -251448 235721 -79226 -121919 -133539 -605022 -636110 -48897 -62014
992f2014j31017M83163o2853K9908m3131m0916L29739K37116o23540l14913J61437
$$ -62014 -193031 290132 227279 257187 214056 173140 502879 739995 116455 -198458 -37021
981c7021J39925j21430K13193J71514k86072m96626l55103M37244K20084J65539
$$ -37021 102904 -18526 194667 366181 80109 -416517 -771620 -334376 -114292 51247
971E1247j07812p6106m8075L27827l51301K95934l86928J34953O5274j21134N94765
$$ 51247 -56565 -132671 -180746 147081 -204220 91714 -295214 -160261 -94987 -216121 378644
960C78644J92318J34112k38535k82512k49086J96207m58433K44283J30209K00249
$$ 378644 570962 705074 466539 184027 -65059 131148 -327285 -83002 47207 247456
950B47456q4890j14994M25880r2546K8732j46489k79108J06667m7003l97497K46294
$$ 247456 162566 47572 473452 380906 409638 263149 -15959 90708 43705 -353792 -107498
939a07498O3737l65318J36639M0506M14388k52156k9209R794J3642K42899k72716
$$ -107498 -43761 -409079 -272440 -231934 182454 -69702 -98911 -89117 -75475 167424 -105292
928a05292j01652K04021J58024K18179q0667k89368R0661P04834o1083n51268
$$ -105292 -206944 -2923 155101 373280 292613 3245 93906 798740 737657 186389
918A86389l5233n21675J6586N91611o29449j21732N34959l1465N53500m52351
$$ 186389 151156 -370519 -353933 237678 -391771 -513503 21456 -10009 543491 91140
908I1140j92990L93289K15454l05290N2479k58084q46j44801K94554O12507m58590
$$ 91140 -101850 291439 506893 201603 254082 -4002 -4848 -149649 144905 757412 298822
897B98822N6578K97n15747p6816K54280K7818J68603p9960Q425k45772N79830
$$ 298822 355400 355697 -160050 -236866 17414 45232 213835 133875 142300 -103472 476358
886D76358J86905k91999j1754j89219l04380K9136M6665Q4133j35629k77080K30348
$$ 476358 663263 371264 359510 170291 -134089 -104953 -58288 25845 -109784 -386864 -156516
875a56516J45216j28733J61071J16705k01530M65183l31558J61625M44907k82026
$$ -156516 -11300 -140033 21038 137743 -63787 401396 69838 231463 676370 394344
865C94344o98972N14009j53856L17168M50892p68221K34113K10490m84168m03179
$$ 394344 -304628 209381 55525 372693 823585 55364 289477 499967 15799 -387380
855c87380k7992K16879R3729j52887R1622N08614k13769P1584M39886l02737K381
$$ -387380 -415372 -198493 -104764 -257651 -166029 342585 128816 200400 640286 337549 339930
844C39930k80494J55403K93989j80890j19543l94346k47010k59326M85557L61050
$$ 339930 59436 214839 508828 327938 208395 -185951 -432961 -692287 -206730 154320
834A54320j04681j43329l47238M18515q8013J3652L80357j21529J51744J27515
$$ 154320 49639 -93690 -440928 -22413 -110426 -96774 283583 162054 313798 441313
824D41313m17817l64444J45901M9939J54332k6135l13679Q9774j65299N95258
$$ 441313 23496 -340948 -195047 -145108 9224 -16911 -330590 -240816 -406115 189143
814A89143j55084j22992L065K61185j21908j99529K98704Q5456j56307l01150
$$ 189143 34059 -88933 -85868 175317 53409 -146120 152584 238040 81733 -219417
804b19417o5095k4687J24026K0414L79589l38346J73989k05007K3135M2005l67835
$$ -219417 -284512 -309199 -185173 -164759 214830 -123516 50473 -154534 -131399 -89394 -457229
793d57229L19339k23707J48400J33432K43532l08243j02559n1483j584M8654K4594
$$ -457229 -137890 -361597 -213197 -79765 163767 -144476 -247035 -298518 -300102 -251448 -226854
782b26854L27816N7379k23885K1045j9125P9526l86274J135L67935K90832j88733
$$ -226854 100962 158341 -65544 -44499 -63624 15902 -370372 -369237 -1302 289530 100797
771A00797K64105k26274K4752n0187o54240K15151M9787k39102K65900K1164j3206
$$ 100797 364902 138628 163380 113193 -541047 -325896 -276109 -515211 -249311 -228147 -241353
760b41353L73905j85283K73935K2569j6761m58326q5433N89609J70944K8915k55220
$$ -241353 132552 -52731 221204 243773 227012 -231314 -316747 272862 443806 472721 217501
749B17501m79377j32317k1615L46350J85193k98858K36093L7637j77777L7882
$$ 217501 -261876 -394193 -415808 -69458 115735 -183123 52970 90607 -87170 -49288
739d9288r0743K07847R8159J22362J14695l96051n6291J11760j05900j79064K67228
$$ -49288 -140031 67816 165975 288337 403032 6981 -49310 62450 -43450 -222514 44714
728D4714n6688k47455O12037J9482j17837j41721l10758l93916M53943N8797N7613
$$ 44714 -11974 -259429 352608 372090 254253 112532 -198226 -592142 -138199 -79402 -21789
717b1789N8054J42674j56453j72042J83690K20574M25602L19388k55304k40946
$$ -21789 36265 178939 22486 -149556 34134 254708 680310 999698 744394 503448
707E03448k16182K60653j38734p86513k11529K86577J1158o6345K83143L1899
$$ 503448 287266 547919 409185 -377328 -588857 -302280 -291122 -357467 -74324 -42425
697d2425K73428k40717R334k16749N3700m1922l253K21098j44772J81919J21314
$$ -42425 231003 -9714 -380 -217129 -163429 -205351 -208604 12494 -132278 49641 170955
686A70955K6164l1990R6918J47350l49839k00796l42598L94568L74280N5869K51264
$$ 170955 197119 165129 262047 409397 59558 -141238 -483836 -89268 285012 340881 592145
675E92145l59873K0175j8643j92681K4971J80237j97279k60085k05086M0173O06914
$$ 592145 232272 252447 233804 41123 66094 246331 49052 -211033 -416119 -375946 230968
664B30968j88572L17092J45767m07747j49854k5159l7846R9624l7340m93883K01883
$$ 230968 42396 359488 505255 97508 -52346 -77505 -115351 -15727 -53067 -546950 -345067
653c45067N441j97124k0822K69421J9992K18490n1211j73215N71379k6787n21448
$$ -345067 -339626 -536750 -557572 -288151 -268159 -49669 -100880 -274095 297284 270497 -250951
642b50951J61666j55483K09727l8780j29151J02957K3129M5556m37440n3650j28471
$$ -250951 -89285 -244768 -35041 -73821 -202972 -100015 -76886 -31330 -468770 -522420 -650891
631f50891N72776M2630j43381L13601k25771k17224K95107K02698l89005M54205
$$ -650891 -78115 -35485 -178866 134735 -91036 -308260 -13153 189545 -199460 254745
621B54745j99302J07110j85444k21568J85651J51815k59134L13916J42383J6392
$$ 254745 55443 162553 -22891 -244459 -58808 93007 -166127 147789 290172 306564
611C06564l02535k43776P52553k43237n1077N9429k07466j96484j072o7247L7264
$$ 306564 4029 -239747 512806 269569 218492 277921 70455 -126029 -127101 -194348 -157084
600a57084R2984m0124P21286k85098l94484K63421K19328l13231k56185j26985
$$ -157084 -64100 -104224 617062 331964 -62520 200901 420229 106998 -149187 -276172
590b76172j3118M55080k7394M5006m26987L92209J68759n36595k86690N72448
$$ -276172 -289290 165790 138396 183402 -243585 148624 317383 -219212 -505902 66546
580F6546P4218l15635K98226J38361l53346J47304j60334J72105m36691J73197
$$ 66546 140764 -174871 123355 261716 -91630 55674 -104660 67445 -369246 -196049
570a96049O36288j14682l64694K0661j92090Q03017j99482n4373J36081r60900
$$ -196049 440239 325557 -39137 -18476 -210566 592451 392969 338596 474677 -486223
560d86223k76298K59137p8192K78233K50002J91385n18747M40617Q5847L51J93495
$$ -486223 -762521 -503384 -581576 -303343 -53341 138044 -380703 59914 145761 146112 339607
549C39607m67790J02096J31577j93321L28831J21477l04743K10757k61880L70513
$$ 339607 -128183 -26087 105490 -87831 241000 362477 57734 268491 6611 377124
539C77124N7691m02948k90815J05955j57405M34119j87607k00180O3274L58068
$$ 377124 434815 31867 -258948 -152993 -310398 123721 -63886 -264066 -200792 157276
529A57276K9317L1339n55817P2618J88238j78749k40337N09141K89951P0391l07491
$$ 157276 186593 217932 -337885 -265267 -77029 -255778 -496115 13026 302977 373368 65877
518F5877m29312Q6524L22582j2791l17587K64047N81574O2243L1936l36032k16948
$$ 65877 -363435 -276911 45671 32880 -284707 -20660 560914 623157 655093 319061 102113
507A02113k39260l46474L68069P43629l87175j43250K00107l32772j20262L67290
$$ 102113 -137147 -483621 -115552 628077 240902 97652 297759 -35013 -155275 212015
497B12015l92360R8375j17767K34401M15901m28231L7718M81577L44100j172736
$$ 212015 -180345 -81970 -199737 34664 450565 22334 60052 541629 885729 -287007
487b87007P4429O2817k32311J71430K58935j78752M1530j97058j75947p6022k1734
$$ -287007 -212578 -149761 -382072 -210642 48293 -130459 -88929 -285987 -461934 -537956 -559690
476e59690r0862J81322L77079J07751K85331j50103k67075J83570r1746k9262
$$ -559690 -650552 -469230 -92151 15600 300931 150828 -116247 67323 -24423 -53685
466e3685j62232J8432k95914P03978J02013P1677m12996j9483j33792K27700M3393
$$ -53685 -215917 -197485 -493399 210579 312592 384269 -28727 -48210 -182002 45698 89091
455H9091p8731K26557j55273p0402m3849K7239J64637K94614m98671p0743K71774
$$ 89091 10360 236917 81644 11242 -32607 -5368 159269 453883 -44788 -115531 156243
444A56243K82216l03123J16365J26657J58823l53721l32645L25395j2317k06213
$$ 156243 438459 135336 251701 378358 537181 183460 -149185 176210 163893 -42320
434d2320O08374j94327K34190L7994K64326l28982n89559j67190O1524j30682
$$ -42320 566054 371727 605917 643911 908237 579255 -10304 -177494 -115970 -246652
424b46652J53132O4267J00418N7234l09717J00413J3690P4003J05940K21242J11586
$$ -246652 -93520 -29253 71165 128399 -181318 -80905 -67215 6788 112728 333970 445556
413D45556J60498j91783n29250j58608J13704k07828J87367L69019j30083R9478
$$ 445556 606054 414271 -114979 -273587 -159883 -367711 -180344 188675 58592 158070
403A58070n9520K04614N626n11198P96398k8197m69130J85661l83884L71592N2371
$$ 158070 98550 303164 308790 -202408 593990 565793 96663 282324 -101560 270032 322403
392C22403l85975M8490K3521P6153J22469K66728j3228q01729j347O66511J07499
$$ 322403 -63572 -15082 8439 84592 207061 473789 460561 -341168 -342515 323996 431495
381D31495k16963K15748o56783J52573J96646r6051M36626k13955O9533j01059
$$ 431495 214532 430280 -226503 -73930 122716 26665 463291 249336 318869 217810
371B17810p1673N0607j95550J71006l1235l00104j05300K77782N42914R4299k25486
$$ 217810 146137 196744 1194 172200 140965 -159139 -264439 13343 556257 650556 425070
360D25070k83076j59197k53865j58237L21987M65183k41422J82473J43707K19714
$$ 425070 141994 -17203 -271068 -429305 -107318 357865 116443 298916 442623 662337
350F62337j57006k75211l12576k05505O26138J67124r3940K68299m23177k26954
$$ 662337 505331 230120 -82456 -287961 338177 505301 411361 679660 256483 29529
340B9529J85579r2332m3199m4597k5267P8052K49192J22007j40715J44612m08426
$$ 29529 215108 122776 79577 34980 9713 87765 336957 458964 318249 462861 54435
329E4435L75333l5487p21111J5058P34253j41446l591R954j94037j84544K38976
$$ 54435 429768 394281 -326830 -311772 422481 281035 277444 287398 93361 -91183 147793
318A47793q9839J6288j13035L30921k83283l19153J83053K69583l37956m33710
$$ 147793 57954 74242 -38793 292128 8845 -310308 -127255 142328 -195628 -629338
308f29338N61082Q212J1756K30239L22395k0864k10503l91264l43760L46073L43991
$$ -629338 -68256 -60044 -48288 181951 504346 483482 272979 -118285 -462045 -115972 228019
297B28019k22622k1366l15801q7186O35512j41652k46306R8509J56794J23656
$$ 228019 5397 -15969 -331770 -418956 216556 74904 -171402 -72893 83901 207557
287B07557l10558l2486O5898K18973K50274N0269k78987l01803K83401N33398
$$ 207557 -103001 -135487 -69589 149384 399658 449927 170940 -130863 152538 685936
$$ [...]
##END NTUPLES=NMR SPECTRUM
##END=
