##TITLE=1H_EC-3196(4)
 CDcl3, 8 sc, 
 24.10.2019
##JCAMPDX= 6.0         $$ Bruker NMR JCAMP-DX V2.0
##DATA TYPE= NMR FID
##DATA CLASS= NTUPLES
##ORIGIN= UXNMR, Bruker Analytische Messtechnik GmbH
##OWNER= root
$$ XWIN-NMR		Version 3.5
$$ Thu Oct 24 14:34:32 2019 Russian Standard Time (UT+4h)  she@DPX200
##.OBSERVE FREQUENCY= 200.1315
##.OBSERVE NUCLEUS= ^1H
##.DELAY= (6, 6)
##.ACQUISITION MODE= SIMULTANEOUS
##.ACQUISITION SCHEME= undefined
##.AVERAGES= 8
##.DIGITISER RES= 18
##SPECTROMETER/DATA SYSTEM= spect
##.PULSE SEQUENCE= zg30
##.SOLVENT NAME= CDCl3
##.SHIFT REFERENCE= (INTERNAL, CDCl3, 0, 15.7039)
##AUDIT TRAIL= $$ (NUMBER, WHEN, WHO, WHERE, WHAT)
$$ ##TITLE= Audit trail, XWIN-NMR		Version 3.5
$$ ##JCAMPDX= 5.01
$$ ##ORIGIN= Bruker BioSpin GmbH
$$ ##OWNER= she
$$ F:/spectra/data/she/nmr/H-F/1/audita.txt
$$ ##AUDIT TRAIL=  $$ (NUMBER, WHEN, WHO, WHERE, WHAT)
(   1,<2019-10-24 14:33:14.59 +0400>,<she>,<DPX200>,
      <created by zg, POWCHK disabled, PULCHK disabled
       configuration hash MD5:
       00 E9 B6 7A A2 85 ED C7 34 08 36 98 17 FE 4E 26
       data hash MD5: 16K
       98 85 A6 1C 41 19 91 7B 9D BC CF 0B C1 E2 E4 7C>)
$$ ##END=
$$ 
$$ hash MD5
$$ 2E 5C 6E C0 26 7F 08 F4 3C EF AC 5E FB E0 AB B3
##$RELAX= 
##$RELAX= 
##$RELAX= 
##$RELAX= 
##$RELAX= 
##$RELAX= 
$$ Bruker specific parameters
$$ --------------------------
##$DU= <F:/spectra>
##$EXPNO= 1
##$NAME= <H-F>
##$PROCNO= 1
##$TYPE= <nmr>
##$USER= <she>
##$AMP= (0..31)
100 100 100 100 100 100 100 100 100 100 100 100 100 100 100 100 100 100 
100 100 100 100 100 100 100 100 100 100 100 100 100 100 
##$AQSEQ= 0
##$AQ_mod= 1
##$AUNM= <au_zg>
##$AUTOPOS= <>
##$BF1= 200.13
##$BF2= 200.13
##$BF3= 200.13
##$BF4= 200.13
##$BF5= 200.13
##$BF6= 200.13
##$BF7= 200.13
##$BF8= 200.13
##$BYTORDA= 1
##$CFDGTYP= 0
##$CFRGTYP= 5
##$CHEMSTR= <none>
##$CNST= (0..31)
1 1 145 1 1 1 1 1 1 1 1 1 1 1 1 1 1 1 1 1 1 1 1 1 1 1 1 1 1 1 1 1 
##$CPDPRG= <>
##$CPDPRG1= <>
##$CPDPRG2= <>
##$CPDPRG3= <>
##$CPDPRG4= <mlev>
##$CPDPRG5= <mlev>
##$CPDPRG6= <mlev>
##$CPDPRG7= <mlev>
##$CPDPRG8= <mlev>
##$CPDPRGB= <>
##$CPDPRGT= <>
##$D= (0..31)
0 1.2 0 0 0 0 0 0 0 0.06 0 0.03 0 0 0 0 0.0002 0 0 0 0 0 0 0 0 0 0 0 0 
0 0 0 
##$DATE= 1571913194
##$DBL= (0..7)
120 120 120 120 120 120 120 120 
##$DBP= (0..7)
150 150 150 150 150 150 150 150 
##$DBP07= 0
##$DBPNAM0= <>
##$DBPNAM1= <>
##$DBPNAM2= <>
##$DBPNAM3= <>
##$DBPNAM4= <>
##$DBPNAM5= <>
##$DBPNAM6= <>
##$DBPNAM7= <>
##$DBPOAL= (0..7)
0.5 0.5 0.5 0.5 0.5 0.5 0.5 0.5 
##$DBPOFFS= (0..7)
0 0 0 0 0 0 0 0 
##$DE= 6
##$DECBNUC= <off>
##$DECIM= 24
##$DECNUC= <off>
##$DECSTAT= 4
##$DIGMOD= 1
##$DIGTYP= 9
##$DL= (0..7)
0 120 120 120 120 120 120 120 
##$DP= (0..7)
150 150 150 150 150 150 150 150 
##$DP07= 0
##$DPNAME0= <>
##$DPNAME1= <>
##$DPNAME2= <>
##$DPNAME3= <>
##$DPNAME4= <>
##$DPNAME5= <>
##$DPNAME6= <>
##$DPNAME7= <>
##$DPOAL= (0..7)
0.5 0.5 0.5 0.5 0.5 0.5 0.5 0.5 
##$DPOFFS= (0..7)
0 0 0 0 0 0 0 0 
##$DQDMODE= 0
##$DR= 18
##$DS= 0
##$DSLIST= <SSSSSSSSSSSSSSS>
$$ [...]
##$SUBNAM2= <"">
##$SUBNAM3= <"">
##$SUBNAM4= <"">
##$SUBNAM5= <"">
##$SUBNAM6= <"">
##$SUBNAM7= <"">
##$SUBNAM8= <"">
##$SUBNAM9= <"">
##$SW= 24.0689530833862
##$SWIBOX= (0..15)
0 0 2 0 0 0 0 0 0 0 0 0 0 0 0 0 
##$SW_h= 4816.95568400771
##$TD= 16384
##$TD0= 1
##$TE= 0
##$TE2= 300
##$TE3= 300
##$TEG= 300
##$TL= (0..7)
0 120 120 120 120 120 120 120 
##$TP= (0..7)
150 150 150 150 150 150 150 150 
##$TP07= 0
##$TPNAME0= <>
##$TPNAME1= <>
##$TPNAME2= <>
##$TPNAME3= <>
##$TPNAME4= <>
##$TPNAME5= <>
##$TPNAME6= <>
##$TPNAME7= <>
##$TPOAL= (0..7)
0.5 0.5 0.5 0.5 0.5 0.5 0.5 0.5 
##$TPOFFS= (0..7)
0 0 0 0 0 0 0 0 
##$TUNHIN= 0
##$TUNHOUT= 0
##$TUNXOUT= 0
##$USERA1= <user>
##$USERA2= <user>
##$USERA3= <user>
##$USERA4= <user>
##$USERA5= <user>
##$V9= 5
##$VALIST= <valist>
##$VCLIST= <CCCCCCCCCCCCCCC>
##$VD= 0
##$VDLIST= <DDDDDDDDDDDDDDD>
##$VPLIST= <PPPPPPPPPPPPPPP>
##$VTLIST= <TTTTTTTTTTTTTTT>
##$WBST= 1024
##$WBSW= 4
##$XGAIN= (0..3)
0 0 0 0 
##$XL= 0
##$YL= 0
##$YMAX_a= 166615
##$YMIN_a= -146278
##$ZGOPTNS= <>
##$ZL1= 120
##$ZL2= 120
##$ZL3= 120
##$ZL4= 120
##$ABSF1= 10
##$ABSF2= 0
##$ABSG= 5
##$ABSL= 3
##$ALPHA= 0
##$AQORDER= 0
##$ASSFAC= 0
##$ASSFACI= 0
##$ASSFACX= 0
##$ASSWID= 0
##$AUNMP= <proc_1d>
##$AZFE= 0.1
##$AZFW= 0.1
##$BCFW= 1
##$BC_mod= 2
##$BYTORDP= 1
##$COROFFS= 0
##$CY= 11.3945322036743
##$DATMOD= 1
##$DC= 2
##$DFILT= <>
##$DTYPP= 0
##$F1P= 20.1720416913024
##$F2P= 0.152960286110954
##$FCOR= 0.5
##$FTSIZE= 0
##$FT_mod= 4
##$GAMMA= 1
##$GB= 0.15
##$INTBC= 1
##$INTSCL= 1
##$ISEN= 128
##$LB= 0.24
##$LEV0= 0
##$LPBIN= 0
##$MAXI= 10000
##$MC2= 0
##$MEAN= 0
##$ME_mod= 0
##$MI= 1.114404
##$NCOEF= 0
##$NC_proc= 0
##$NLEV= 6
##$NOISF1= 3.799351
##$NOISF2= 2.8
##$NSP= 1
##$NTH_PI= 0
##$NZP= 0
##$OFFSET= 15.70392
##$PC= 1
##$PHC0= -9569.045
##$PHC1= 12.20082
##$PH_mod= 1
##$PKNL= yes
##$PPARMOD= 0
##$PSCAL= 0
##$PSIGN= 0
##$REVERSE= no
##$SF= 200.130013532006
##$SI= 16384
##$SIGF1= 3
##$SIGF2= 2
##$SINO= 400
##$SIOLD= 16384
##$SREGLST= <1H.CDCl3>
##$SSB= 0
##$STSI= 0
##$STSR= 0
##$SW_p= 3612.71676300578
##$SYMM= 0
##$S_DEV= 0
##$TDeff= 0
##$TDoff= 0
##$TI= <>
##$TILT= no
##$TM1= 0
##$TM2= 0
##$TOPLEV= 0
##$USERP1= <user>
##$USERP2= <user>
##$USERP3= <user>
##$USERP4= <user>
##$USERP5= <user>
##$WDW= 1
##$XDIM= 8192
##$YMAX_p= 0
##$YMIN_p= 0
$$ End of Bruker specific parameters
$$ ---------------------------------
##NTUPLES= NMR FID
##VAR_NAME=  TIME,          FID/REAL,        FID/IMAG
##SYMBOL=    X,             R,               I
##VAR_TYPE=  INDEPENDENT,   DEPENDENT,       DEPENDENT
##VAR_FORM=  AFFN,          ASDF,            ASDF
##VAR_DIM=   8192,          8192,            8192
##UNITS=     SECONDS,       ARBITRARY UNITS, ARBITRARY UNITS
##FACTOR=    0.0002076,     1,               1
##FIRST=     0,             0,               0
##LAST=      1.7004516,     0,               0
##MIN=       0,             -146278,         0
##MAX=       1.7004516,     166615,          0
$$ Real data points
##PAGE= N=1
##DATA TABLE= (X++(R..R)), XYDATA
$$ plain form
0 0 0 0 0 0 0 0 1 -8 8 -8 8 -16 16 -19 24 -32 38 -41 50 -59 72 -81 97 -111 128 -145 165 -188 212 -241 272
31 272 -305 340 -381 427 -475 530 -588 652 -722 800 -887 981 -1086 1203 -1334 1484 -1650
48 -1650 1845 -2071 2337 -2655 3046 -3539 4181 -5060 6342 -8398 12246 -21995 101154 166615
62 166615 52756 94970 104381 126233 134950 130297 107070 131723 109299 56589 41207 53480
74 53480 44615 82182 110120 61413 13572 33256 23510 -2975 20302 55747 61511 68300 41933
87 41933 -5606 10211 59268 52920 49076 74843 63639 45223 73165 70122 28248 34965 70591
100 70591 77119 78512 60009 10798 10385 51303 38166 11592 31169 22978 -18327 -13024 7213
113 7213 -7063 -12636 -12803 -32721 -20260 8138 -18141 -41196 -10088 1635 -9531 14384 19001
$$ packed form
0@%%%%%%JrJ6j6J6k4L2l5M3n6P0p9R1j09J31j53J78k08K39k73L10l53M00m53N13
31B72n77O45p21Q08r02J005j118J240j374J522j687J868k067K289k537K818l134
48a650L495l916M408m992N701o585P720r241J1402j4740K0644l4241J23149O5461
62A66615j13859M2214R411K1852Q717m653k3227K4653k2424n2710j5382J2273
74E3480q865L7567K7938m8707m7841J9684r746k6485K3277L5445N764O789k6367
87D1933m7539J5817M9057o348l844K5767j1204j8416K7942l043m1874O717L5626
100G0591O528J393j8503m9211m13M0918j3137k6574J9577q191m1305N303K0237
113G213j4276n573j67j9918J2461K8398k6279k3055L1108J1723j1166K3915M617
$$ plain form
126 19001 -16524 -7134 33048 33269 29845 42785 32650 28500 43625 27866 19970 65226 73870
139 73870 22562 14296 40231 31331 24330 31269 11407 4894 36175 34505 4191 -3836 -14293
152 -14293 -13585 37597 57437 887 -22671 16328 31922 26033 31725 24575 29641 66949 67824 33087
166 33087 40041 61333 57399 72078 89116 63292 55829 85972 72900 37615 51243 76459 77104
179 77104 73830 48473 13878 36834 69875 41378 17203 36146 37171 28437 42513 31158 -947
192 -947 12456 41340 42375 46624 42672 13876 21729 57647 47437 30243 57644 65122 42327
205 42327 49050 58695 42582 44946 55656 42546 47431 65275 42378 20519 34348 27023 10961
218 10961 35022 43216 9073 2094 16655 3696 -2915 9856 2834 1489 17492 3314 -11336
$$ packed form
126A9001l5525R390M0182K21l424J2940j0135m150J5125j5759p896M5256Q644
139G3870n1308q266K5935q900p001O939j9862o513L1281j670l0314q027j0457
152a4293P08N1182J9840n6550k3558L8999J5594n889N692p150N066L7308Q75l4737
166C3087O954K1292l934J4679J7038k5824p463L0143j3072l5285J3628K5216O45
179G7104l274k5357l4595K2956L3041k8497k4175J8943J025q734J4076j1355l2105
192i47J3403K8884J035M249l952k8796P853L5918j0210j7194K7401P478k2795
205D2327O723R645j6113K364J0710j3110M885J7844k2897k1859J3829p325j6062
218A0961K4061Q194l4143o979J4561j2959o611J2771p022j345J6003j4178j4650
$$ plain form
231 -11336 14423 17374 -14895 -3912 32072 29430 19473 18012 158 2934 36301 36339 16382 23873
245 23873 24505 13052 29041 31537 -4784 -4999 31187 30180 8764 6564 -4318 -10849 7617 4892
259 4892 -14282 1811 15829 -7556 -13594 -2511 -14259 -10554 19389 11721 -13155 313 16363
272 16363 9985 9676 2185 -8257 23270 50657 18780 -6376 13099 20528 15932 27955 21226
285 21226 2036 16393 28969 10624 5844 10934 -1700 4960 24855 6176 -10929 10874 13157
298 13157 -9944 -3369 9528 -57 4673 11456 -3150 594 19217 6655 -4553 13036 9778
311 9778 -1342 20887 30244 4519 1131 15419 8622 8314 19261 9356 7263 23432 11653 -6897
325 -6897 8204 10853 -10290 800 22799 10762 -977 237 -13418 -13864 8680 7123 -5326
$$ packed form
231a1336K5759K951l2269J0983L5984k642r957j461j7854K776L3367L8j9957P491
245B3873O32j1453J5989K496l6321k15L6186j007k1416k200j0882o531J8466k725
259D892j9174J6093J4018k3385o038J1083j1748L705K9943p668k4876J3468J6050
272A6363o378l09p491j0442L1527K7387l1877k5156J9475P429m596J2023o729
285B1226j9190J4357J2576j8345m780N090j2634O660J9895j8679j7105K1803K283
298A3157k3101O575J2897r585M730O783j4606L744J8623j2562j1208J7589l258
311I778j1120K2229R357k5725l388J4288o797l08J0947r905k093J6169j1779j8550
325f897J5101K649k1143J1090K1999j2037j1739J214j3655m46K2544j557j2449
$$ plain form
338 -5326 6622 6007 -10735 -2997 1481 -17989 -9309 20444 13929 -3723 181 -4922 -11303 1426
352 1426 1284 -6407 13366 21347 -6720 -14492 -1225 -8071 -7314 13317 7225 -8026 2715 4551
366 4551 -11274 -9145 -6679 -12183 8406 23146 -4875 -21494 -3179 -2157 -10277 1440 2602
379 2602 -7860 4432 7734 -13465 -13734 -1967 -8125 -2619 11595 -4216 -15348 4015 2790
392 2790 -18021 -9259 5583 -471 2397 4013 -10707 -6482 9504 -1921 -10140 7919 6699 -5858
406 -5858 7252 11497 -8035 -5334 8259 1313 -41 8242 -2205 -5317 9142 624 -13873 445
420 445 5303 -11608 -4633 7627 -5814 -9497 86 -8196 -11465 3128 -122 -8326 3934 3321
434 3321 -10753 27 8767 -7150 -3777 15132 7918 -1819 7337 4404 -2295 8435 5977 -4112
$$ packed form
338e326J1948o15j6742P738M478j9470Q680K9753o515j7652L904n103o381J2729
352A426j42p691J9773P981k8067p772J3267o846P57K0631o092j5251J0741J836
366D551j5825K129K466n504K0589J4740k8021j6619J8315J022q120J1717J162
379B602j0462J2292L302k1199k69J1767o158N506J4214j5811j1132J9363j225
392B790k0811Q762J4842o054K868J616j4720M225J5986j1425q219J8059j220j2557
406e858J3110M245j9532K701J3593o946j354Q283j0447l112J4459q518j4497J4318
420D45M858j6911O975J2260j3441l683R583q282l269J4593l250q204J2260o13
434C321j4074J0780Q740j5917L373J8909p214r737R156k933o699J0730k458j0089
$$ plain form
448 -4112 10220 15712 -5992 -6895 6566 -3106 -8731 3683 -1627 -11738 -1137 -2020 -16446 -10485
462 -10485 -6117 -16069 -6093 4589 -12798 -17663 422 -3870 -14295 -1562 1580 -6252 3271 7376
476 7376 -6145 -1565 8262 -1867 415 13346 2525 -5935 8938 6556 -11241 -4394 3918 -5095
490 -5095 -3945 -1695 -14438 -12827 -1862 -14477 -22433 -6789 -8114 -20804 -10902 -7436 -21291 -15787
504 -15787 -4434 -12198 -11429 -913 -7294 -9132 3466 -2313 -10604 5519 10100 -3744 1889 11398
518 11398 -608 -2845 7699 878 -3196 6318 87 -9502 -591 -3953 -17959 -8591 -484 -16025
532 -16025 -17851 -6255 -14976 -21531 -11610 -14450 -18797 -6704 -7414 -18349 -8387 -1678 -13777 -8010
546 -8010 6733 -933 -4003 9044 4311 -3964 6128 8182 435 8922 11825 -1888 2053 8515
$$ packed form
448d112J4332N492k1704r03J3461r672n625J2414n310j0111J0601q83j4426N961
462a0485M368r952R976J0682j7387m865J8085m292j0425J2733L142p832R523M105
476G376j3521M580R827j0129K282J2931j0821q460J4873k382j7797O847Q312r013
490e095J150K250j2743J611J0965j2615p956J5644j325j2690R902L466j3855N504
504a5787J1353p764P69J0516o381j838J2598n779q291J6123M581j3844N633R509
518A1398j2006k237J0544o821m074R514o231r589Q911l362j4006R368Q107j5541
532a6025j826J1596q721o555R921k840m347J2093p10j0935R962O709j2099N767
546h010J4743p666l070J3047m733q275J0092K054p747Q487K903j3713L941O462
$$ plain form
560 8515 -6020 -9179 4412 -1966 -12865 -4089 -6065 -18760 -14295 -11948 -20732 -14816 -7675 -20268
574 -20268 -19508 -7253 -16428 -23603 -7948 -4676 -13592 -5446 107 -8579 -4046 2471 -5850 -1740 10659
589 10659 2613 -2442 8573 3299 -9109 836 4569 -7733 -4475 1479 -9949 -14080 -8944 -18172
603 -18172 -21161 -10350 -15966 -25442 -15228 -15319 -29418 -24044 -14694 -22481 -20078 -8575 -14394 -17533
617 -17533 -7420 -10901 -15532 -1402 1113 -8133 1431 8796 -4733 -5071 5795 343 -1826 7405
631 7405 1292 -7017 635 -3085 -14959 -7463 -2888 -15105 -13307 -5866 -18468 -23525 -12042 -14994
645 -14994 -21633 -12980 -12526 -19256 -11324 -9717 -19217 -10367 2308 -6558 -7532 5018 868 -4628 6746
660 6746 9129 1915 9795 13114 2921 5651 10626 492 2918 13603 3078 -6544 2060 -742
$$ packed form
560H515j4535l159J3591o378j0899Q776j976j2695M465K347q784N916P141j2593
574b0268P60J2255r175p175J5655L272q916Q146N553q686M533O517q321M110J2399
589A0659q046n055J1015n274j2408R945L733j2302L258N954j1428m131N136r228
603a8172k989J0811n616r476J0214r1j4099N374R350p787K403J1503n819l139
617a7533J0113l481m631J4130K515r246R564P365j3529l38J0866n452k169R231
631G405o113q309P652l720j1874P496M575j2217J798P441j2602n057J1483k952
645a4994o639Q653M54o730P932J607r500Q850J2675q866r74J2550m150n496J1374
660F746K383p214P880L319j0193K730M975j0134K426J0685j0525r622Q604k802
$$ plain form
674 -742 -12326 -6651 -2951 -11782 -8721 -5390 -17610 -18075 -9016 -15033 -15571 -3059 -6698 -15827 -6454
689 -6454 -3653 -12912 -6174 5801 683 1772 8139 -1300 -3831 8151 4870 -1116 10194 11908
703 11908 -1864 -1470 933 -9052 -7061 1962 -5891 -11174 -5669 -13972 -23211 -15405 -16204 -24455 -14627
718 -14627 -8747 -22501 -25594 -17449 -22349 -22441 -11035 -13180 -16124 -6627 -9481 -19635 -11095 -3898 -10496
733 -10496 -3934 4905 -6428 -11896 -3207 -5836 -11795 -3630 -4001 -10855 -6049 -9289 -22899 -19144 -10705
748 -10705 -19911 -21289 -13151 -20749 -28849 -21029 -22720 -29500 -20909 -15410 -22549 -19386 -15624 -24251 -20855
763 -20855 -8187 -12565 -15345 -3527 -4713 -13627 -6481 -2971 -9024 -2313 3853 -5548 -5460 1069 -7213
778 -7213 -11666 -1562 -3785 -12050 -5114 -5565 -17167 -14213 -9530 -17312 -15862 -8595 -15372 -17842 -9304
$$ packed form
674g42j1584N675L700q831L061L331j2220m65R059o017n38J2512l639r129R373
689f454K801r259O738J1975n118J089O367r439k531J1982l281n986J1310J714
703A1908j3772L94K403r985J991R023p853n283N505q303r239P806p99q251R828
718a4627N880j3754l093Q145m900r2J1406k145k944R497k854j0154Q540P197o598
733a0496O562Q839j1333n468Q689k629n959Q165l71o854M806l240j3610L755Q439
748a0705r206j378Q138p598q100P820j691o780Q591N499p139L163L762q627L396
763b0855J2668m378k780J1818j186q914P146L510o053O711O166r401Q8O529q282
778g213m453J0104k223q265O936m51j1602K954M683p782J450P267o777k470Q538
$$ plain form
793 -9304 -15436 -21837 -9329 -5112 -13829 -8619 -2894 -10131 -7702 431 -4984 -4517 5925 2549 -3185
808 -3185 4217 2023 -5620 3889 9008 -2796 -2999 4576 -2183 -6516 -1877 -7005 -9768 -673 -3706
823 -3706 -15054 -10105 -6999 -15147 -11378 -4828 -13368 -13752 -3281 -7973 -15515 -8386 -6046 -8705 -504
838 -504 -147 -9863 -4699 3578 -4586 -5385 3488 -142 -3252 4593 243 -9100 -3716 133 -6535 -2925
854 -2925 -113 -10808 -11200 -3397 -10915 -17303 -7917 -7495 -13601 -8631 -9825 -19583 -13831 -7056 -13463
869 -13463 -11210 -3481 -10605 -13304 -3865 -7666 -13878 -3616 749 -6226 -3216 -698 -9285 -7173 791
884 791 -4263 -5376 2050 -3628 -10394 -2647 -3734 -13492 -7076 -302 -7490 -9216 -6837 -13914 -13759 -3876
900 -3876 -7740 -13236 -5837 -6036 -13789 -8384 -5569 -13014 -7489 2382 -4684 -9386 -3720 -6235 -6898 2488
$$ packed form
793i304o132o401J2508M217q717N210N725p237K429Q133n415M67J0442l376n734
808c185P402k194p643R509N119j1804k03P575o759m333M639n128k763R095l033
823c706j1348M949L106q148L769O550q540l84J0471m692p542P129K340k659Q201
838e04L57r716N164Q277q164p99Q873l630l110P845m350r343N384L849o668L610
854b925K812j0695l92P803p518o388R386M22o106M970j194r758N752O775o407
869a3463K253P729p124k699R439l801o212J0262M365o975L010K518q587K112P964
884G91n054j113P426n678o766P747j087r758O416O774p188j726K379p077J55R883
900c876l864n496P399j99p753N405K815p445N525R871p066m702N666k515o63R386
$$ plain form
916 2488 510 -7512 -753 2475 -6831 -5655 -198 -5521 -3123 5450 -2287 -11661 -5993 -4703 -7828
931 -7828 -959 -1056 -10182 -5720 -511 -11410 -14344 -4441 -4219 -4971 1164 -5176 -14490 -7522 -3138 -8401
947 -8401 -3160 2143 -5273 -4492 554 -8973 -13842 -1622 1692 -1715 1775 -1973 -12153 -7703 -1870
962 -1870 -7719 -4844 3008 -2571 -6336 -2310 -10364 -16811 -4556 2458 -4226 -3571 -3930 -12027 -9914
977 -9914 -3207 -9209 -8619 2162 -396 -8118 -4988 -8416 -14557 -4661 3331 -4247 -5587 -2105 -8283
992 -8283 -8919 -2206 -6679 -9261 1385 1785 -7756 -6640 -5353 -10437 -3883 4037 -4205 -8314 -1202
1007 -1202 -4208 -7596 -1972 -3864 -7624 1485 3148 -8693 -9127 -2281 -5204 -3262 2854 -4266 -9726
1022 -9726 -2158 -2738 -9023 -3473 -1089 -6586 -895 1849 -9812 -10932 -887 -1200 -2320 2907 -2357
$$ packed form
916B488j978q022O759L228r306J176N457n323K398Q573p737r374N668J290l125
931g828O869r7r126M462N209j0899k934R903K22p52O135o340r314O968M384n263
947h401N241N303p416P81N046r527m869J2220L314l407L490l748j0180M450N833
962a870n849K875P852n579l765M026q054o447J2255P014o684O55l59q097K113
977i914O707o002N90J0781k558p722L130l428o141R896P992p578j340L482o178
992h283o36O713m473k582J0646M00r541J116J287n084O554P920q242m109P112
1007a202l006l388N624j892l760R109J663j1841m34O846k923J942O116p120n460
1022i726P568n80o285N550K384n497N691K744j1661j120J0045l13j120N227n264
$$ plain form
1037 -2357 -8890 -1046 787 -6346 -1691 4388 -182 1022 4319 -6535 -9645 2820 4662 -986
1051 -986 2704 934 -6375 -2089 756 -7632 -4278 4844 875 -2657 -432 -7490 -11979 -422 3287
1066 3287 -4431 -2287 507 -4796 -2654 130 -7903 -5772 7090 5931 -1876 -262 -2198 -5383 3171
1081 3171 7126 -2093 -921 6381 1930 -1017 1089 -4374 -4551 6790 5309 -5814 -3169 -936 -5923
1096 -5923 -2798 487 -7128 -6205 2971 -1584 -8351 -4419 -4729 -6495 2118 2272 -7714 -4293 4068 -900
1112 -900 -2903 878 -1968 -1504 7785 4376 -4968 -226 2849 -1452 2875 4767 -4282 -3015 5254
1127 5254 18 -5999 -1503 -3103 -5855 924 138 -9167 -6147 -1651 -7617 -6395 -1082 -6663 -7314
1142 -7314 1447 -1335 -8677 -3615 -1065 -3802 1883 3503 -4640 -1924 5641 415 -2873 3220 1906
$$ packed form
1037b357o533P844J833p133M655O079m570J204L297j0854l110J2465J842n648
1051i86L690j770p309M286K845q388L354R122l969l532K225p058m489J1557L709
1066C287p718K144K794n303K142K784q033K131J2862j159p807J614j936l185Q554
1081C171L955r219J172P302m451k947K106n463j77J1341j481j1123K645K233m987
1096e923L125L285p615R23R176m555o767L932l10j766Q613J54r986L421Q361m968
1112i00k003L781k846M64R289l409r344M742L075m301M327J892r049J267Q269
1127E254n236o017M496j600k752O779p86r305L020M496n966J222N313n581o51
1142g314Q761k782p342N062K550k737N685J620q143K716P565n226l288O093j314
$$ plain form
1157 1906 258 7289 4279 -6327 -3186 2900 -450 662 2064 -6059 -5677 2654 -2369 -10467 -5187
1172 -5187 -2550 -4722 470 -1060 -11642 -8401 845 -2487 -4138 196 -2605 -2562 5152 515 -7348
1187 -7348 875 7456 2769 2925 4807 -1114 1340 8424 1699 -3506 3920 4737 944 3053 -151
1202 -151 -7882 -1448 5799 -2730 -6421 -2342 -4087 -3674 2083 -3872 -10715 -2919 1548 -3735 -1683
1217 -1683 321 -4599 -645 6317 26 -4214 3672 4588 1944 7176 6294 -177 4429 7310 -269
1232 -269 1060 8220 4181 2156 6049 189 -5440 473 2035 -2616 1248 2425 -4501 -2684 1023
1247 1023 -6595 -8672 494 1677 -204 4189 -323 -8490 -2368 4202 1313 3818 6864 2275 3443
1262 3443 8870 1897 -3600 5396 9051 6242 9416 7136 -2207 -352 5627 485 -292 5861 3093
$$ packed form
1157A906j648P031l010j0606L141O086l350J112J402q123L82Q331n023q098N280
1172e187K637k172N192j530j0582L241R246l332j651M334k801M3P714m637p863
1187g348Q223O581m687J56J882n921K454P084o725n205P426Q17l793K109l204
1202a51p731O434P247q529l691M079j745M13N757n955o843P796M467n283K052
1217a683K004m920L954O962o291m240P886R16k644N232q82o471M606K881p579
1232b69J329P160m039k025L893n860n629N913J562m651L864J177o926J817L707
1247A023p618k077R166J183j881M393m512q167O122O570k889K505L046m589J168
1262C443N427o973n497Q996L655k809L174k280r343J855N979n142p77O153k768
$$ plain form
1277 3093 -221 2761 -3152 -9887 -974 3900 -2500 -2089 1032 -3189 -2142 1709 -5354 -6904 4578
1292 4578 7079 1438 2192 468 -3277 4395 9115 967 -267 7598 6020 3328 5756 354 -3686
1307 -3686 4869 6938 -747 296 2940 -2631 -2201 1548 -5210 -6736 888 -660 -5739 -2175 -2802
1322 -2802 -7604 -2673 -1026 -8163 -4806 3828 175 -3322 -25 -3125 -4685 3267 3953 -1933 1870
1337 1870 4665 -471 493 3081 -3581 -3203 5055 3037 -1653 1784 -2170 -8977 -3272 436 -4707
1352 -4707 -3342 -382 -5913 -5985 -1736 -7472 -10269 -1799 89 -4527 -880 -1156 -6987 -4024 813 -3677
1368 -3677 -1621 5848 2237 -1703 1556 -526 -3842 4032 6123 -809 1070 4720 54 -799 1992
1383 1992 -3561 -3894 5238 4445 -3330 -2295 -2762 -5732 -52 3075 -4653 -3914 3029 -234 -3303 -396
$$ packed form
1277C093l314K982n913o735Q913M874o400M11L121m221J047L851p063j550J1482
1292D578K501n641P54j724l745P672M720q148j234P865j578k692K428n402m040
1307c686Q555K069p685J043K644n571M30L749o758j526P624j548n079L564o27
1322b802m802M931J647p137L357Q634l653l497L297l100j560P952O86n886L803
1337A870K795n136R64K588o662L78Q258k018m690L437l954o807N705L708n143
1352d707J365K960n531p2M249n736k797Q470J888m616L647k76n831K963M837m490
1368c677K056P469l611l940L259k082l316P874K091o932J879L650m666q53K791
1383A992n553l33R132p93p775J035m67k970N680L127p728P39O943l263l069K907
$$ plain form
1399 -396 -2466 -3316 5361 5372 -1852 1555 5549 324 1195 5979 2865 3033 9501 5330 -628 4059
1415 4059 5786 2034 5357 5895 -467 2457 7558 823 -2548 3006 1475 59 5137 3033 -4346
1430 -4346 -198 3274 -851 850 4392 -641 14 5990 1893 -1898 4055 4575 94 5198 7043
1445 7043 1189 2563 6038 652 1550 7950 4112 704 5116 3245 -1795 2445 3709 -1484 1262
1460 1262 4426 -1660 -1759 2884 -1810 -4671 1124 946 -2913 2264 1414 -5447 -2405 2344 -1099 -633
1476 -633 3252 -888 -1697 4288 998 -4038 1404 2920 -1154 2651 4559 -2252 -1963 3077 -417 -2172
1492 -2172 2272 400 -2667 2088 548 -5723 -1522 1765 -3661 -2291 2007 -1829 -2864 1875 -2016
1507 -2016 -5924 342 2128 -2056 1006 2071 -2640 62 3952 -1791 -2692 3940 2781 291 4705
$$ packed form
1399c96k070q50Q677J1p224L407L994n225Q71M784l114J68O468m171n958M687
1415D059J727l752L323N38o362K924N101o735l371N554j531j416N078k104p379
1430d346M148L472m125J701L542n033O55N976m097l791N953N20m481N104J845
1445G043n854J374L475n386Q98O400l838l408M412j871n040M240J264n193K746
1460A262L164o086r9M643m694k861N795j78l859N177q50o861L042M749l443M66
1476f33L885m140q09N985l290n036N442J516m074L805J908o811K89N040l494j755
1492b172M444j872l067M755j540o271M201L287n426J370M298l836j035M739l891
1507b016l908O266J786m184L062J065m711K702L890n743r01O632j159k490M414
$$ plain form
1522 4705 2548 -2753 1477 3796 -958 1849 5848 737 159 3947 -571 -3090 3057 3372 -104
1537 -104 3596 4093 -2153 -13 2901 -1979 -186 6585 3703 651 4125 2042 -2493 2863 5107
1552 5107 940 4383 7878 2412 1661 4560 607 67 7056 6214 1981 5818 5401 -1201 1380 4547
1568 4547 1272 2874 7914 3179 927 4757 1354 -1995 3986 5340 974 4718 6552 116 365
1583 365 3799 734 712 6645 4612 847 4979 3719 -1122 2138 4539 702 3193 7424 2160 562
1599 562 4453 1406 -823 4587 4965 1213 4979 5319 -926 432 4018 352 1033 6629 3966 683
1615 683 4484 2191 -2112 2705 4578 784 3469 6740 1443 -93 4021 877 -626 5209 5300 1297
1631 1297 4334 4108 -1435 1335 4764 1208 2112 7371 3588 748 4749 2746 -777 4627 6246
$$ packed form
1522D705k157n301M230K319m754K807L999n111n78L788m518k519O147L15l476
1537a04L700M97o246K140K914m880J793O771k882l052L474k083m535N356K244
1552E107m167L443L495n466p51K899l953n40O989q42m233L837m17o602K581L167
1568D547l275J602N040m735k252L830l403l349N981J354m366L744J834o436K49
1583C65L434l065k2N933k033l765M132j260m841L260K401l837K491M231n264j598
1599E62L891l047k229N410L78l752L766L40o245J358L586l666O81N596k663l283
1615F83L801k293m303M817J873l794K685L271n297j536M114l144j503N835R1m003
1631A297L037k26n543K770L429l556R04N259l783k840M001k003l523N404J619
$$ plain form
1646 6246 2125 4341 6692 1228 1106 5029 2101 2153 7658 5229 516 4114 4618 125 2661 5550
1662 5550 1244 3312 7176 2339 47 4338 3401 1176 5521 4877 516 3930 6076 729 1485 5262
1678 5262 2507 2162 6217 3511 -192 5446 5584 166 3241 4862 1123 3446 6122 672 -51 5557
1694 5557 3379 92 3267 2578 -145 3944 4471 -1511 149 4050 976 430 3764 1112 -634 4421
1710 4421 2611 -1719 2140 4219 222 2516 4953 297 738 5385 1448 -845 4191 4102 826 3375
1726 3375 3077 -1160 2023 5205 705 724 4467 1929 369 4011 1764 -1468 3510 4814 235 1981
1742 1981 4452 408 1285 5120 2264 1730 6279 3930 154 4324 5732 2065 4720 6106 2189
1757 2189 4242 7741 3353 1459 6347 5426 2889 6757 5648 1452 4955 7076 2203 2831 6906
$$ packed form
1646F246m121K216K351n464j22L923k928N2N505k429m713L598N04m493K536K889
1662E550m306K068L864m837k292M291r37k225M345o44m361L414K146n347P56L777
1678E262k755l45M055k706l703N638J38n418L075J621l739K323K676n450p23N608
1694E557k178l287L175o89k723M089N27n982J660L901l074n46L334k652j746N055
1710D421j810m330L859K079l997K294K437m656M41M647l937k293N036q9l276K549
1726C375k98m237L183L182m500J9L743k538j560L642k247l232M978J304m579J746
1742A981K471m044Q77L835k856n34M549k349l776M170J408l667K655J386l917
1757B189K053L499m388j894M888r21k537L868j109m196L503K121m873O28M075
$$ plain form
1772 6906 4254 3713 6204 3051 823 6124 5968 1387 4384 6894 3117 4711 6264 1290 1952 7845
1788 7845 6539 3026 5775 4973 2244 5976 5747 506 3550 8516 4403 2247 4552 1431 912 5589
1804 5589 4057 -86 3890 5228 -248 3 2110 -817 1224 5575 753 -1848 2380 1210 -2405
1819 -2405 605 1268 -1150 3052 4425 -1923 -2910 1660 -264 -1034 3021 1046 -1499 2117 1308 -4175
1835 -4175 -1902 1926 -842 -320 2683 -2102 -3410 935 -1591 -4690 42 1129 -2458 -855 -326
1850 -326 -4569 -2270 1922 -2167 -3363 917 -159 -2296 379 -623 -3481 1067 3428 -1569 -1159
1865 -1159 2607 684 49 2528 -488 -1434 3257 2784 -1636 926 3570 920 1797 3002 -1705 -537
1881 -537 4739 2399 -222 2955 2606 85 2970 2503 -1287 2638 7082 2972 1147 4033 1690 1223
$$ packed form
1772F906k652n41K491l153k228N301j56m581K997K510l777J594J553m974O62N893
1788G845j306l513K749q02k729L732k29n241L044M966m113k156K305l121n19M677
1804E589j532m143L976J338n476K51K107k927K041M351m822k601M228j170l615
1819b405L010O63k418M202J373o348r87M570j924p70M055j975k545L616q09n483
1835d175K273L828k768N22L003m785j308M345k526l099M732J087l587J603N29
1850c26m243K299M192m089j196M280j076k137K675j002k858M548K361m997M10
1865a159L766j923o35K479l016r46M691m73m420K562K644k650Q77J205m707J168
1881e37N276k340k621L177l49k521K885m67l790L925M444m110j825K886k343m67
$$ plain form
1897 1223 5210 4213 1409 5949 7234 1314 1883 3884 1618 4345 7773 4017 1490 5442 3747
1912 3747 241 2786 4038 2643 5823 6046 -505 -309 3857 2032 503 4096 3097 1323 3989 2062
1928 2062 -3024 406 4776 2039 2005 3383 -30 -242 3490 529 -2360 2844 4094 411 969 608
1944 608 -2562 275 3105 -1033 -2056 2055 634 -2622 -548 -1922 -3864 963 2051 -3979 -4014 -614
1960 -614 -1995 -2372 -582 -3274 -4016 776 -677 -5342 -2999 -561 -2324 -1109 -592 -4387 -3618 1133
1976 1133 -1576 -4696 -857 -539 -2727 -882 -1585 -5241 -1735 1964 -2055 -3769 -1116 -2438 -2604 109
1992 109 -2062 -4466 404 1472 -3580 -2502 -687 -3093 -1347 1956 -1482 -2500 1514 38 -3091
2007 -3091 -71 708 -1205 1525 2231 -2160 -916 2894 -94 -1671 2026 1773 242 2726 1400 -2554
$$ packed form
1897A223L987r97k804M540J285n920N69K001k266K727L428l756k527L952j695
1912C747l506K545J252j395L180K23o551J96M166j825j529L593r99j774K666j927
1928B062n086L430M370k737l4J378l413k12L732k961k889N204J250l683N58l61
1944F08l170K837K830m138j023M111j421l256K074j374j942M827J088o030l5L400
1960f14j381l77J790k692p42M792j453m665K343K438j763J215N17l795P69M751
1976A133k709l120L839L18k188J845p03l656L506L699m019j714K653j322j66K713
1992A09k171k404M870J068n052J078J815k406J746L303l438j018M014j476l129
2007c091L020P79j913K730P06m391J244L810k988j577L697k53j531K484j326l954
$$ plain form
2023 -2554 806 3685 294 356 2634 195 384 3430 -208 -2330 2797 3769 -254 788 1774 -462
2039 -462 1982 3083 -1269 -870 4454 3157 -283 943 354 -426 3744 3433 -1681 -233 4037 1688
2055 1688 33 1507 -1003 -277 4541 2722 -2658 -46 2453 -66 216 1182 -1775 236 3800 -75
2071 -75 -3338 -5 418 -1190 1180 355 -3336 179 2773 -1952 -3494 -231 -470 -135 1929 -1512
2087 -1512 -4209 62 788 -2738 -1202 474 -1588 -662 867 -3367 -4449 548 94 -2803 -164 -440
2103 -440 -3422 -1922 -1053 -4074 -2094 1858 -1284 -3469 -975 -2482 -4076 -695 -905 -3252 -238 880
2119 880 -3620 -3764 -805 -1855 -2009 1250 -1486 -3261 -2 -1102 -4680 -2269 594 -1251 -114 269
2135 269 -4148 -3823 1201 -309 -3145 -196 87 -1857 -181 -1278 -5073 -1754 2456 -19 -1695 -600
$$ packed form
2023b554L360K879l391O2K278k439J89L046l638k122N127R72m023J042R86k236
2039d62K444J101m352L99N324j297l440J226n89p80M170l11n114J448M270k349
2055A688j655J474k510P26M818j819n380K612K499k519K82R66k957K011L564l875
2071g5l263L333M23j608K370q25l691L515K594m725j542L263k39L35K064l441
2087a512k697M271P26l526J536J676k062R26J529m234j082M997m54k897K639k76
2103d40k982J500Q69l021J980L952l142k185K494j507j594L381k10k347L014J118
2119H80m500j44K959j050j54L259k736j775L259j100l578K411K863j845J137L83
2135B69m417L25N024j510k836K949K83j944J676j097l795L319M210k475j676J095
$$ plain form
2151 -600 -2343 -2131 1222 -868 -3895 26 2890 -1294 -2200 -1347 -2489 -40 3492 -580 -3316 333
2167 333 704 -1830 -271 -669 -2151 1906 3392 -2190 -3684 113 -86 -154 1830 -787 -2583 1318
2183 1318 1139 -3266 -1837 1020 -389 925 1780 -2673 -3701 1087 434 -1749 876 1075 -1589 183
2199 183 433 -3464 -1449 2393 399 -741 1095 -1179 -2909 315 299 -2405 770 1981 -2019 -1468
2215 -1468 432 -1964 -2288 1324 -409 -1699 1165 -350 -3835 -1312 1012 -1352 -220 728 -2572
2230 -2572 -2352 1105 -1736 -3586 438 992 -1351 -400 -855 -3910 -856 1810 -1742 -2708 424 -948
2246 -948 -1716 -99 -2175 -3642 1022 2028 -2080 -2161 -920 -2345 -873 1345 -2220 -3422 1061 883
2262 883 -2960 -1782 -1582 -2251 1257 2028 -3034 -3253 740 -231 -1679 -83 -1409 -1653 1876 1005 -3773
$$ packed form
2151f00j743K12L353k090l027L921K864m184r06Q53j142K449L532m072k736L649
2167C33L71k534J559l98j482M057J486n582j494L797j99o8J984k617j796L901
2183A318j79m405J429K857j409J314Q55m453j028M788o53k183K625J99k664J772
2199A83K50l897K015L842j994j140J836k274j730L224j6k704L175J211m000N51
2215a468J900k396l24L612j733j290K864j515l485K523K324k364J132R48l300
2230b572K20L457k841j850M024N54k343R51m55l055L054K666l552r66L132j372
2246i48p68J617k076j467M664J006m108q1J241j425J472K218l565j202M483j78
2262H83l843J178K00o69L508P71n062k19L993r71j448J596j326k44L529q71m778
$$ plain form
2279 -3773 -2422 988 -354 18 774 -1986 -2139 2104 134 -2973 -154 704 -883 905 526 -3420
2295 -3420 -1596 1957 -90 -1303 704 -289 -1645 977 352 -2724 -67 1610 -1188 -490 1425 -1410
2311 -1410 -1318 1700 -377 -1873 1070 712 -2084 309 954 -2159 -523 1157 -1236 -1269 1345 -1082
2327 -1082 -2411 801 396 -1848 -147 487 -1760 0 1107 -2588 -2138 1214 305 -1624 289 -1156
2343 -1156 -2416 962 1093 -2762 -1626 942 -1107 -1081 185 -2463 -2520 1584 506 -2369 -629 -427
2359 -427 -2278 -138 184 -3368 -1794 1993 -872 -2614 -534 -1440 -1657 1020 197 -3316 -663 1295
2375 1295 -1192 -1571 -11 -1852 -849 2289 5 -3112 -161 616 -1401 597 264 -2357 -283 2254
2391 2254 -1265 -2234 738 -76 -1232 1681 552 -2064 540 1822 -1037 -90 1732 -186 18 2396
$$ packed form
2279c773J351L410j342L72P56k760j53M243j970l107K819Q58j587J788l79l946
2295c420J824L553k047j213K007r93j356K622o25l076K657J677k798O98J915k835
2311a410R2L018k077j496K943l58k796K393O45l113J636J680k393l3K614k427
2327a082j329L212m05k244J701O34k247J760J107l695M50L352r09j929J913j445
2343a156j260L378J31l855J136K568k049K6J266k648n7M104j078k875J740K02
2359d27j851K140L22l552J574L787k865j742K080r06k17K677q23l513K653J958
2375A295k487l79J560j841J003L138k284l117K951P77k017J998l33k621K074K537
2391B254l519r69K972q14j156K913j129k616K604J282k859R47J822j918K04K378
$$ plain form
2407 2396 -368 -1165 2421 1993 -503 1286 1886 -852 1287 3151 382 66 2825 864 -202 2619
2423 2619 1134 -869 2053 2576 229 1087 1952 -937 330 3470 1298 134 2551 1492 -613 1962
2439 1962 2199 -813 1274 3687 873 679 2148 -194 -373 2857 1882 -128 2174 2315 -714 690
2455 690 1470 -1098 906 3864 553 -936 1232 161 -1251 1168 951 -1498 1225 2245 -1296 -1559
2471 -1559 186 -1148 -608 2464 362 -2079 346 274 -2400 -696 447 -1735 243 2186 -1853 -2650
2487 -2650 233 -648 -1801 571 65 -2069 156 231 -2900 -1927 341 -1460 -958 857 -1482 -2988
2503 -2988 162 -272 -2880 -588 263 -1795 -413 591 -2289 -1919 638 -585 -1736 1289 94 -2095
2519 -2095 852 1000 -2053 -458 1434 -988 -450 1968 33 -952 1597 380 -1665 1189 1605 -1099
$$ packed form
2407B396k764p97L586m28k496J789O00k738K139J864k769l16K759j961j066K821
2423B619j485k003K922N23k347Q58Q65k889J267L140k172j164K417j059k105K575
2439A962K37l012K087K413k814j94J469k342j79L230r75k010K302J41l029J404
2455F90P80k568K004K958l311j489K168j071j412K419k17k449K723J020l541k63
2471a559J745j334N40L072k102k441K425p2k674J704J143k182J978J943m039p97
2487b650K883q81j153K372n06k134K225P5l131R73K268j801N02J815k339j506
2503b988L150m34k608K292Q51k058J382J004k880L70K557j223j151L025j195k189
2519b095K947J48l053J595J892k422N38K418j935r85K549j217k045K854M16k704
$$ plain form
2535 -1099 636 2342 -771 -180 1918 255 -365 2514 1214 -543 2059 2035 -909 1022 2189 68
2551 68 1335 3180 1105 5 2871 1323 -215 2644 2233 342 2459 3193 72 913 2598 527
2567 527 658 3290 1525 -34 2567 1804 -612 1323 2387 80 1343 2825 184 -25 2341 618
2583 618 -211 2402 1814 -199 2054 2284 -910 274 2272 -82 181 2892 634 -781 1957 596
2599 596 -1587 1060 1505 -848 528 1422 -1210 -1073 806 -986 -1772 1271 386 -1751 85 -19 -2936
2616 -2936 -775 887 -1595 -775 989 -1289 -2168 524 -724 -2423 695 831 -1654 -542 608 -2176
2632 -2176 -1370 853 -1411 -2092 1042 -705 -2567 -193 -629 -2489 -211 744 -2297 -1421 339 -1556
2648 -1556 -2137 271 -580 -1995 778 500 -1951 -769 225 -1831 -374 1556 -929 -1301 1706 -417
$$ packed form
2535a099J735J706l113N91K098j663o20K879j300j757K602k4k944J931J167k121
2551F8J267J845k075j100K866j548j538K859m11j891K117P34l121Q41J685k071
2567E27J31K632j765j559K601p63k416J935J064k307J263J482k641k09K366j723
2583F18q29K613n88k013K253K30l194J184J998k354K63K711k258j415K738j361
2599E96k183K647M45k353J376Q94k632J37J879j792p86L043q85k137J836j04k917
2616b936K161J662k482Q20J764k278q79K692j248j699L118J36k485J112J150k784
2632b176Q06K223k264o81L134j747j862K374m36j860K278R55l041Q76J760j895
2648a556n81K408q51j415K773k78k451J182R94k056J457J930k485l72L007k123
$$ plain form
2664 -417 -1713 872 380 -1367 928 1563 -1664 -372 1231 -572 -674 1482 178 -1017 1565 419
2680 419 -1824 245 1395 -878 497 1903 -1023 -536 2071 52 -1294 1503 1182 -517 1514 1609
2696 1609 -1108 331 1712 -256 293 2432 451 -152 2033 625 -1401 930 1896 -788 1085 1990
2712 1990 -537 -1109 1508 -398 -1190 1832 751 -640 1267 268 -2327 -161 1617 -600 207 1947
2728 1947 -469 -1307 1233 -487 -2279 856 1076 -945 724 1029 -2290 -1058 1289 -792 -1122 1333
2744 1333 -288 -1402 1005 -363 -3172 -256 720 -948 -307 624 -1689 -1595 662 -1208 -1992 600
2760 600 256 -1726 111 -140 -2477 -984 1093 -1251 -1150 973 -378 -1579 733 -672 -2504 192
2776 192 707 -1274 -356 735 -1754 -1246 1431 -1151 -2217 851 223 -1332 408 368 -2176 -222 837
$$ packed form
2664d17j296K585m92j747K295O35l227J292J603j803j02K156j304j195K582j146
2680D19k243K069J150k273J375J406k926M87K607k019j346K797l21j699K031R5
2696A609k717J439J381j968N49K139j981o03K185j408k026K331R66k684J873R05
2712A990k527n72K617j906p92L022j081j391J907r99k595K166J778k217Q07J740
2728A947k416q38K540j720j792L135K20k021J669L05l319J232K347k081l30K455
2744A333j621j114K407j368k809K916R76j668O41R31k313R4K257j870p84K592
2760F00l44j982J837k51k337J493K077k344J01K123j351j201K312j405j832K696
2776A92N15j981R18J091k489N08K677k582j066L068o28j555J740m0k544J954J059
$$ plain form
2793 837 -1499 -1244 1400 -152 -1082 1034 -727 -2525 475 1081 -951 954 1376 -1051 -629 1226
2809 1226 -836 -1322 1803 939 -604 1254 17 -2100 -167 1210 -847 272 1698 -179 -811 1223
2825 1223 -1033 -2196 1364 1811 -569 547 750 -1853 -669 1161 -900 -562 2156 702 -1078 451
2841 451 -515 -2248 842 1755 -614 -33 1284 -1303 -1425 877 -666 -1502 1622 1128 -1561 -30 -36
2858 -36 -2287 -391 1400 -1251 -1087 947 -705 -1753 468 -579 -2700 424 940 -1711 -766 751
2874 751 -1560 -1132 816 -1255 -1267 924 170 -1856 -138 -154 -2363 -227 1281 -1643 -1212 903 -919
2891 -919 -1554 242 -1150 -2290 96 655 -2061 -680 233 -1638 -865 384 -1550 -1686 1131 -98
2907 -98 -1520 -5 -92 -2156 -31 669 -1311 -667 1152 -854 -1133 805 -972 -1569 1132 714 -1758
$$ packed form
2793H37k336K55K644j552r30K116j761j798L000O06k032J905M22k427M22J855
2809A226k062m86L125q64j543J858j237k117J933J377k057J119J426j877o32K034
2825A223k256j163L560M47k380J116K03k603J184J830k061L38K718j454j780J529
2841D51r66j733L090R13k369N81J317k587j22K302j543q36L124m94k689J531o
2858c6k251J896J791k651J64K034j652j048K221j047k121L124N16k651R45J517
2874G51k311M28J948k071j2K191p54k026J718j6k209K136J508k924M31K115j822
2891i19o35J796j392j140K386N59k716J381R13j871P73J249j934j36K817j229
2907i8j422J515q7k064K125P00j980O44J819k006k79J938j777n97K701m18k472
$$ plain form
2924 -1758 -88 782 -1120 -277 1443 -1351 -937 1717 280 -1285 422 -173 -1312 959 915 -1655
2940 -1655 -567 1268 -813 -964 940 -638 -1044 1564 504 -1766 169 1048 -885 277 993 -1103
2956 -1103 -460 1342 -364 -1164 997 193 -1203 550 1032 -1202 -245 1285 -1011 -778 1153 -722
2972 -722 -1052 1324 226 -1866 401 457 -1823 86 1369 -1291 -597 1050 -953 -1495 899 -70 -1273
2989 -1273 927 846 -1865 -551 354 -1441 -445 1302 -605 -1389 942 -216 -1973 -130 378 -1464
3005 -1464 708 1120 -1827 -1359 383 -1207 -1166 966 -354 -1099 853 -181 -2664 -713 677 -1123
3021 -1123 92 983 -1457 -1583 744 -752 -1763 822 549 -1148 333 -9 -2362 -878 915 -633
3037 -633 -551 1346 -530 -1397 600 -687 -1918 717 1537 -1143 -186 525 -1657 -645 1038 -696 -1571
$$ packed form
2924a758J670Q70j902Q43J720k794M14K654j437j565J707n95j139K271m4k570
2940a655J088J835k081j51J904j578m06K608j060k270J935Q79j933J162P16k096
2956a103O43J802j706q00K161q04j396J753M82k234R57J530k296K33J931j875
2972g22l30K376j098k092K267N6k280J909J283k660O94J647k003n42K394r69j203
2989a273K200q1k711J314R05j795R96J747j907p84K331j158j757J843N08j842
3005a464K172M12k947M68J742j590M1K132j320p45J952j034k483J951J390j800
3021a123J215Q91k440j26K327j496j011K585k73j697J481l42k353J484J793j548
3037f33Q2J897j876q67J997j287j231K635Q20k680R57P11k182J012J683j734q75
$$ plain form
3054 -1571 1376 111 -1524 -94 21 -1720 206 1237 -1149 -550 1146 -540 -1287 1110 332 -1367
3070 -1367 1111 668 -1506 108 902 -739 -286 1417 -597 -1142 1057 -261 -1529 738 984 -1264
3086 -1264 -195 551 -1749 -106 1101 -961 -1065 435 -584 -1773 264 16 -1560 1064 1188 -1584
3102 -1584 -1199 391 -1012 -967 1332 171 -599 1195 -33 -2421 -450 574 -956 -35 964 -1518
3118 -1518 -1342 276 -1527 -1990 512 580 -1371 326 -512 -2698 -1062 597 -1396 -709 1086 -402
3134 -402 -1746 3 -1139 -2157 239 1102 -1134 -482 525 -1681 -1590 513 -377 -1055 1092 255 -1789
3151 -1789 -434 -356 -1694 -99 510 -1023 -737 954 -1342 -2073 80 -440 -1290 923 449 -2138 -386
3168 -386 542 -1611 -966 903 -725 -594 1329 -433 -1981 626 706 -1228 199 853 -1061 -144 1105
$$ packed form
3054a571K947j265j635J430J15j741J926J031k386N99J696j686p47K397p78j699
3070a367K478m43k174J614P94j641M53J703k014n45K199j318j268K267K46k248
3086a264J069P46k300J643J207k062j04J500j019j189K037k48j576K624J24k772
3102a584L85J590j403M5K299j161p70J794j228k388J971J024j530R21R99k482
3118a518J76J618j803m63K502O8j951J697q38k186J636J659j993O87J795j488
3134d02j344J749j142j018K396Q63k236O52J007k206R1K103q90o78K147q37k044
3151a789J355P8j338J595O09j533K86J691k296p31K153n20q50K213m74k587J752
3168c86R28k153O45J869j628J31J923j762j548K607Q0j934J427O54j914R17J249
$$ plain form
3185 1105 -971 -951 1362 53 -1417 83 -498 -1221 440 723 -1967 -957 735 -1025 -1531 450
3201 450 -1068 -1640 941 -443 -2048 -458 301 -1461 -385 407 -1223 -856 1064 -790 -1959 237
3217 237 63 -1028 181 103 -1697 -458 456 -1694 -1269 417 -917 -1314 -192 -1388 -2501 -452 -53
3234 -53 -2160 -1041 -66 -2300 -1393 -371 -1638 -1955 147 -752 -2119 -429 -405 -2140 -1161 -112 -1644
3251 -1644 -839 681 -1284 -2060 12 -633 -1580 219 -369 -2140 -226 137 -2094 -1684 30 -1011 -1292
3268 -1292 83 -1030 -1999 295 -521 -2101 -403 281 -1142 -750 230 -1784 -1461 657 -124 -1625 37
3285 37 -5 -1067 616 493 -1676 -151 1682 -191 -586 762 -612 -803 1156 361 -1617 347 1376
3302 1376 -843 -481 74 -978 -424 1057 -439 -1496 546 -9 -1257 43 95 -1201 186 1072 -1252
$$ packed form
3185A105k076K0K313j309j470J500n81p23J661K83k690J010J692j760n06J981
3201D50j518n72K581j384j605J590P59j762J076P92j630L67J920j854j169K196
3217B37j74j091J209p8j800J239R14k150M25J686j334l97J122j196j113K049L99
3234e3k107J119R75k234R07J022j267l17K102q99j367J690K4j735R79J049j532
3251a644Q05J520j965p76K072o45r47J799n88j771J914L63k231M10J714j041k81
3268a292J375j113r69K294q16j580J698O84j423L92R80k014L23K118p81j501J662
3285C7m2j062J683j23k169J525J833j873l95J348j374j91J959p95j978J964J029
3302A376k219L62N55j052N54J481j496j057K042n55j248J300N2j296J387Q86k324
$$ plain form
3319 -1252 -1300 446 -601 -607 720 -355 -1334 548 166 -1483 -539 565 -918 -338 940 -1115 -1635
3336 -1635 106 -626 -2093 -128 -92 -1809 -1173 -242 -2089 -1486 50 -1875 -2015 18 -1283 -2451 -1064
3353 -1064 -1129 -2368 -897 -321 -2463 -1587 -491 -1836 -1999 -265 -1342 -1914 -129 -744 -2516 -1419 -510
3370 -510 -2021 -1571 -937 -2451 -2071 -274 -1685 -2404 -1191 -918 -2223 -868 -989 -3055 -1635 -265 -1522
3387 -1522 -2131 -687 -1944 -1776 -521 -1142 -2367 -59 -99 -1855 -1275 -414 -1511 -868 612 -1080 -1840
3404 -1840 248 -179 -1523 -657 -162 -1397 344 691 -1409 -1438 130 -662 -937 602 -265 -1365 459
3421 459 240 -1706 -652 559 -763 -237 848 -484 -1172 546 -6 -1199 887 819 -692 321 638
3438 638 -985 -133 925 -675 -443 850 150 -972 458 130 -1042 507 545 -895 -196 869 -803
$$ packed form
3319a252m8J746j047oJ327j075r79J882l82j649R44J104j483N80J278k055n20
3336a635J741p32j467J965L6j717O36R31j847O03J536j925j40K033j301j168J387
3353a064o5j239J471N76k142Q76J096j345j63J734j077n72J785o15j772J097R09
3370e10j511M50O34j514L80J797j411p19J213K73j305J355j21k066J420J370j257
3387a522o09J444j257J68J255o21j225K308m0j756N80Q61j097O43J480j692p60
3404a840K088m27j344Q66M95j235J741L47k100k9J568p92k75J539q67j100J824
3421D59k19j946J054J211j322N26J085j332o88J718n52j193K086o8j511J013L17
3438F38j623Q52J058j600K32J293p00j122J430l28j172J549L8j440O99J065j672
$$ plain form
3455 -803 -1237 778 21 -875 778 -139 -1311 -263 568 -847 -840 339 -545 -575 708 -831 -1294 380
3473 380 294 -973 195 168 -1423 -149 905 -925 -980 742 -137 -747 441 -12 -1191 464 664 -1192
3491 -1192 -306 333 -802 -140 888 -899 -913 1145 50 -1412 -280 326 -821 -6 803 -1175 -673
3508 -673 891 -436 -805 545 -266 -1105 565 278 -1224 -283 799 -504 -342 929 -397 -645 1098
3525 1098 245 -847 1006 402 -691 442 559 -835 -154 913 -447 -747 756 -206 -961 427 21
3542 21 -976 158 775 -830 -355 747 -763 -300 1019 -82 -832 724 301 -643 789 891 -387
3559 -387 252 1287 -144 76 1596 443 -384 1156 626 -370 935 839 -311 377 1066 -424 -162 1215
3577 1215 35 -300 895 177 -646 608 631 -290 733 1438 83 349 1502 242 247 1769 1214 138
$$ packed form
3455h03m34K015p57q96J653r17j172J048Q31j415PJ179q84l0J283j539m63J674
3473C80q6j267J168k7j591J274J054j830n5J722q79o10J188m53j179J655K00j856
3491a192Q86O39j135O62J028j787j4K058j095j462J132O06j147Q15Q09j978N02
3508f73J564j327l69J350q11q39J670k87j502R41J082j303J62J271j326k48J743
3525A098q53j092J853o04j093J133J17j394O81J067j360l00J503r62p55J388m06
3542B1r97J134O17j605M75J102j510M63J319j101p50J556m23r44J432J02j278
3559c87O39J035j431K20J520j153q27J540n30r96J305r6j150O88O89j490K62J377
3577A215j180l35J195p18q23J254K3r21J023P05j355K66J153j260NJ522n55j076
$$ plain form
3595 138 1747 1844 100 1421 2002 577 1113 2263 893 642 1770 1160 690 1976 2085 317 1334
3612 1334 2086 743 909 2067 1035 819 2325 1260 30 1932 1779 725 1575 2113 672 1434 2464
3629 2464 1225 1293 2673 1718 757 2798 2050 1063 2108 2520 1092 1486 2424 1014 1134 1957 1360 240
3647 240 1619 956 174 1391 1568 -49 855 1471 150 359 1635 432 -184 1151 811 -126 1335
3664 1335 1467 -72 745 1532 373 392 1579 424 489 2083 904 42 1168 1392 116 846 968 -224
3682 -224 64 1152 -212 -405 689 -221 -911 392 188 -954 29 655 -675 -353 617 -326 -592 1194
3700 1194 11 -403 1138 986 -115 736 1094 82 667 2077 696 30 1535 835 194 1493 902
3717 902 131 1227 1292 -325 120 1064 -36 82 1173 284 -169 1057 894 -612 563 1408 539 941
$$ packed form
3595A38J609R7j744J321N81j425N36J150j370k51J128o10m70J286J09j768J017
3612A334P52j343J66J158j032k16J506j065j230J902j53j054Q50N38j441P62J030
3629B464j239O8J380r55r61K041p48r87J045M12j428L94R38j410J20Q23n97j120
3647B40J379o63p82J217J77j617R04O16j321K09J276j203o16J335l40r37J461
3664A335J32j539Q17P87j159J9J187j155O5J594j179q62J126K24j276P30J22j192
3682b24K88J088j364j93J094r10o90J303k04j142R83O26j330L22R70r43k66J786
3700A194j183m14J541j52j101Q51L58j012N85J410j381o66J505p00o41J299n91
3717I02p71J096O5j617M45R44j100J18J091q89m53J226j63j506J175Q45q69M02
$$ plain form
3735 941 1862 619 562 2132 1284 668 2121 1916 796 2237 1982 849 1461 2344 1313 1421 2751 1244
3753 1244 503 1745 1479 504 1501 1516 56 839 1606 412 140 1535 585 -15 1607 883 -250 1213
3771 1213 1357 181 1271 1390 433 858 2049 861 454 1997 1773 790 1706 1161 286 1369 2039 258
3789 258 386 1694 738 214 982 139 -746 1125 650 -1017 -289 308 -489 -308 826 -913 -693 698
3807 698 222 -331 783 513 -293 1100 1261 -346 109 1306 280 213 1398 666 396 1208 896 -359
3825 -359 416 1191 80 454 469 -894 -418 1055 -92 -959 663 -69 -832 298 362 -1153 -229 958
3843 958 -526 -11 938 -86 -474 1062 588 -123 1108 1194 -38 1148 1601 312 391 1332 733 338
3861 338 1757 783 -176 998 792 -279 248 1079 -471 -226 693 -494 -878 596 404 -757 263
$$ packed form
3735I41R21j243n7J570q48o16J453k05j120J441k55j133O12Q83j031J08J330j507
3753A244p41J242k66r75R97J5j460P83P67j194k72J395r50o00J622p24j133J463
3771A213J44j176J090J19r57M25J191j188m07J543k24r83R16n45q75J083O70j781
3789B58J28J308r56n24P68q43q85J871m75j667P28N97p97J81J134j739K20J391
3807F98m76n53J114k70q06J393J61j607M55J197j026o7J185p32k70Q12l12j255
3825c59P75P75j111L74J5j363M76J473j147q67J622p32p63J130O4j515R24J187
3843I58j484N15R49j024l88J536m74p11J231Q6j232J186M53j289P9R41n99l95
3861C38J419r74r59J174k06j071N27Q31j550K45R19j187l84J474j92j161J020
$$ plain form
3878 263 333 -472 548 1126 -853 -172 1517 713 280 884 240 118 1988 1589 -218 827 1345 412
3896 412 863 1345 -83 81 1757 871 -270 475 664 -830 398 355 -935 8 910 -328 -546 337
3914 337 -20 259 1037 203 -463 927 1549 -159 257 880 169 710 1991 845 -233 1115 1132 476
3932 476 1383 1060 -47 608 1724 282 465 1055 259 -167 1008 323 -188 450 323 -597 435 1122
3950 1122 66 161 1049 -76 -78 1334 391 -358 1047 1081 140 928 1272 75 525 1473 328 617 1676
3969 1676 520 -295 734 975 -97 778 853 -917 -160 1174 308 -666 297 90 -660 659 414 -1187
3987 -1187 116 616 -137 258 438 -766 -178 1213 436 -464 969 630 -240 593 642 -55 501 1548
4005 1548 34 -532 860 653 -70 935 70 -628 917 1196 -586 -655 164 -462 356 1329 -396 -714
$$ packed form
3878B63P0q05J020N78j979O81J689q04m33O04o44j22J870l99j807J045N18r33
3896D12M51M82j428J64J676q86j141P45J89j494J228m3j290R43R02j238k18Q83
3914C37l57K79P78q34o66J390O22j708M16O23p11N41J281j146j078J348J7o56
3932D76R07l23j107O55J116j442J83N90p96m26J175o85n11O38j27r20J032O87
3950A122j056R5Q88j125kJ412r43p49J405L4r41P88L44j197M50R48j145K89J059
3969A676j156q15J029K41j072Q75P5j770P57J334q66r74R63k07p50J319k45j601
3987a187J303N00p53L95J80j204N88J391p77r00J433l39q70Q33M9o97N56J047
4005A548j514n66J392k07p23J005q65o98J545K79j782o9Q19o26Q18R73j725l18
$$ plain form
4023 -714 329 93 -537 479 776 -281 611 1140 -93 -117 949 537 178 1298 831 90 1121 973
4041 973 -278 414 1652 518 613 1322 386 -7 1240 887 155 1012 989 -89 1177 1061 99 340 1266
4060 1266 583 561 1253 663 81 1106 1094 505 1005 1409 -161 716 1751 544 434 1124 927 373 1619
4079 1619 1148 -55 1081 1780 687 1152 1656 605 766 1948 722 -45 1931 1194 136 639 1162
4096 1162 181 771 1645 102 56 1224 893 38 712 826 18 1544 1235 -91 -5 791 361 758 1314
4115 1314 417 102 1217 1068 -195 749 876 54 774 1121 -351 146 1458 330 96 1177 497 -39
4133 -39 1151 819 -597 489 1390 7 194 598 -131 -74 1022 335 -635 584 386 -106 343 536 -422
4152 -422 -3 1188 193 31 925 652 -42 905 1026 6 781 809 -183 527 1276 -37 -279 1156 349
$$ packed form
4023g14J043k36o30J016K97j057Q92N29j233k4J066m12l59J120m67p41J031j48
4041I73j251O92J238j134R5P09r36l93J247l53p32Q57k3j078J266j16r62K41R26
4060A266o83k2O92n90n82J025j2n89N00M04j570Q77J035j207j10O90j97n54J246
4079A619m71j203J136O99j093M65N04j051J61J182j226p67J976p37j058N03N23
4096A162r81N90Q74j543m6J168l31q55O74J14q08J526l09j326Q6P96m30L97N56
4115A314q97l15J115j49j263R44J27q22P20L47j472M97J312j128k34J081o80n36
4133c9J190l32j416J086R01j383J87M04p29N7J096o87r70J219j98m92M49J93r58
4152d22M19J191r95j62Q94k73o94R47J21j020P75K8r92P10P49j313k42J435q07
$$ plain form
4171 349 -124 876 512 -444 378 709 -371 -83 665 -215 -250 501 -21 -745 722 660 -585 232 617
4190 617 -354 373 610 -652 -128 1057 764 -79 749 228 -289 1019 1134 -396 233 913 -104 43
4208 43 241 -496 -456 502 321 -548 262 81 -995 -282 149 -647 -377 602 -388 -1090 203 -176 -677 183
4228 183 120 -713 365 909 -444 -487 682 53 49 953 202 -361 279 226 -486 358 491 -379 224 376 -539
4249 -539 -695 391 -118 -1152 452 40 -1174 -382 -146 -1356 -556 193 -616 -578 234 -215 -483 426 81
4268 81 -661 554 994 -371 116 798 74 -286 801 -55 -619 791 342 -459 256 501 -790 -415 59
4287 59 -1287 -1044 156 -464 -1301 -345 -926 -1587 -114 -75 -1155 -375 -42 -1047 -804 70 -643 -886 595
4306 595 -116 -891 424 190 -421 -278 303 -439 -18 590 -325 -1343 -140 -355 -991 -478 -425 -1540 -878
$$ packed form
4171C49m73J000l64r56Q22L31j080K88P48q80l5P51n22p24J467o2j245Q17L85
4190F17r71P27K37j262N24J185k93q43Q28n21n17J308J15j530O29O80j017J47
4208D3J98p37M0R58j81q69Q10j81j076P13M31p96K70R79r90p02J293l79n01Q60
4228A83o3q33J078N44j353m3J169o29mR04p51n63O40n3p12Q44J33q70O03J52r15
4249e39j56J086n09j034J604m12j214P92K36j210Q00P49q09L8Q12m49k68R09l45
4268H1p42J215M40j365M87O82p24l60J087q56n64J410m49q01P15K45j291L75M74
4287E9j346K43J200o20q37R56n81o61J473L9j080P80L33j005K43Q74p13k43J481
4306E95p11p75J315k34o11J43N81p42M21O08r15j018J203k15o36N13N3j115O62
$$ plain form
4325 -878 -499 -2360 -1552 -901 -1362 -1594 -687 -884 -1971 -910 -984 -1869 -805 -340 -1557 -863 -357 -1323 -1187
4344 -1187 18 -319 -848 17 14 -783 -178 -2 -1310 -961 121 -1102 -925 -419 -972 -1794 -671 -1045 -1704
4363 -1704 -792 -703 -1866 -1493 -1251 -1672 -1277 -566 -1377 -1656 -333 -486 -1470 -544 -315 -1220 -47 -161 -826
4382 -826 -234 656 -297 -893 116 -344 -513 -173 -86 -1100 -273 -61 -1086 -877 -502 -1373 -1654 -552 -1170
4401 -1170 -1615 -1197 -882 -1706 -1154 -442 -1428 -1213 -216 -803 -1036 -279 -448 -968 51 257 -703 -34 410
4420 410 -420 -303 495 56 -424 636 -63 -1012 83 -170 -1066 -403 -137 -1235 -1064 -291 -1186 -1610 -238
4439 -238 -1233 -1681 -558 -775 -1351 -432 -700 -1111 -416 13 -602 -833 342 -215 -579 204 59 -490 171
4458 171 365 -678 -13 381 -580 -359 372 -475 -1047 132 -460 -1118 -873 -690 -1513 -848 -622 -1385 -1331 -611
$$ packed form
4325h78L79j861Q08O51m61k32R07j97j087J061p4q85J064M65j217O94N06r66J36
4344a187J205l37n29Q65lp97O05J76j308L49J082j223J77N06n53q22J123l74o59
4363a704R12Q9j163L73K42m21L95P11q11k79J323j53r84R26K29r05J173j14o65
4382h26N92Q90r53n96J009m60j69L40Q7j014Q27K12j025K09L75q71k81J102o18
4401a170m45M18L15q24N52P12r86K15R97n87k33P57j69n20J019K06r60O69M44
4420D10q30J17P98m39m80J060o99r49J095k53q96O63K66j098J71P73q95m24J372
4439b38r95m48J123k17n76R19k68m11O95M29o15k31J175n57l64P83j45n49O61
4458A71J94j043O65L94r61K21P31q47n72J179n92o58K45J83q23O65K26p63N4P20
$$ plain form
4478 -611 -1113 -1173 -258 -958 -1514 -618 -453 -1077 -488 16 -469 -521 360 -423 -721 279 -100 -895 -93 119
4498 119 -541 -187 -89 -1177 -676 218 -843 -1252 -461 -1013 -1262 -435 -1156 -1955 -866 -767 -1434 -984 -64 -1097
4518 -1097 -1544 -241 -917 -1247 -225 -330 -1094 21 -89 -783 -487 326 -354 -459 157 -132 -486 236 -106
4537 -106 -760 -108 16 -615 -559 -9 -809 -767 -99 -696 -1007 -243 -723 -1352 -627 -483 -1062 -688 -185 -462 -582
4558 -582 265 -506 -460 493 74 -472 753 697 -308 328 734 -591 -13 606 -88 -244 431 -47 -561 226
4578 226 0 -534 -264 108 -697 -576 -93 -785 -1062 45 -601 -1112 -435 -184 -822 -423 396 -786 -543
4597 -543 328 -341 -480 643 -36 -528 735 84 -163 233 222 -814 -33 578 -499 -457 212 -33 -788
4616 -788 -229 -296 -1033 -389 -200 -1080 -704 60 -989 -692 -199 -601 -773 -118 -442 -1052 -43 138 -684 -356
$$ packed form
4478f11n02o0R15p00n56Q96J65o24N89N04m85n2Q81p83k98J000l79p95Q02K12
4498A19o60L54R8j088N01Q94j061m09P91n52k49Q27p21p99J089R9o67M50R20j033
4518a097m47J303o76l30J022j05p64J115j10o94K96Q13o80j05O16k89l54P22l42
4537a06o54O52J24o31N6N50q00M2O68n97l11P64m80o29P25J44n79L74N03k77j20
4558e82Q47p71M6R53m19n46J225n6j005O36M06j325N78O19o94j56O75m78n14P87
4578B26k26n34K70L72q05J21M83o92k77J107o46n11O77K51o38L99Q19j182K43
4597e43Q71o69j39J123o79m92J263o51k47L96j1j036P81O11j077M2O69k45p55
4616g88N59o7p37O44J89q80L76P64j049K97M93m02j72O55l24o10J009J81q22L28
$$ plain form
4636 -356 255 -410 -526 346 -592 -384 596 222 -662 191 161 -760 -233 111 -426 -508 372 -217 -763 -41 -363
4657 -363 -763 68 34 -917 -288 453 -756 -628 639 -428 -723 273 -2 -513 378 163 -332 78 456
4676 456 215 -57 721 32 -260 717 74 -554 435 744 3 228 262 -206 -51 789 -101 -64 378 29 -244
4697 -244 357 387 -702 255 335 -256 -40 194 -57 -440 401 -63 -433 325 350 -432 135 730 -496 -25
4717 -25 597 -230 -291 538 -309 -283 278 238 -367 -2 351 -375 -134 573 -347 -50 417 -24 -620 48 -253
4738 -253 -482 -200 75 -721 -416 250 -360 -676 210 -461 -919 -211 -390 -513 13 -418 -628 -426 463 -1058
4758 -1058 -394 338 -422 -801 405 -147 -790 -7 73 -443 -207 152 -774 -238 250 -451 -504 96 -275 -860
4778 -860 -294 -89 -920 -404 199 -534 -542 112 -637 -557 -112 -269 -725 45 126 -612 -89 506 -441 40 578
$$ packed form
4636c56O11o65j16Q72r38K08R80l74q84Q53l0r21N27L44n37q2Q80n89n46P22l22
4657c63m00Q31l4r51O29P41j209J28J267j067k95R96k75n11Q91k15m95M10L78
4676D56k41k72P78o89k92R77o43o28R89L09p41K25L4m68J55Q40q90L7M42l49k73
4697b44O01L0j089R57Q0n91K16K34k51l83Q41m64l70P58K5p82N67N95j226M71
4717b5O22q27o1Q29q47K6N61m0o05L65L53p26K41P07r20K97M67m41n96O68l01
4738b53k29K82K75p96L05O66o10l16Q86o71m58P08j79j23N26m31k10K02Q89j521
4758a058O64P32p60l79J206n52o43P83Q0n16K36L59r26N36M88p01n3O00l71n85
4778h60N66K05q31N16O03p33qO54p49Q0M45j57m56P70Q1p38N23N95r47M81N38
$$ plain form
4799 578 -179 -14 784 338 -258 194 101 -446 153 386 -398 -229 351 -228 -447 518 -156 -447 -14 -11 -797
4820 -797 -58 88 -817 -268 192 -438 -332 428 -35 -482 160 135 -151 338 458 -92 36 743 59 -232
4840 -232 659 194 -253 655 347 -181 158 78 -571 -4 111 -327 -418 -20 -591 -538 87 -377 -917 -163 -272
4861 -272 -972 -336 253 -843 -453 124 -467 -530 338 73 -659 202 6 -221 304 390 -198 288 283 -184 -488
4882 -488 195 -239 -469 102 -144 -1071 -432 -37 -801 -667 -395 -823 -738 -292 -554 -965 -447 -447 -726 -245 -250 -885
4904 -885 -269 27 -472 -627 46 15 -65 424 93 -414 224 391 -162 52 262 -202 -204 368 -497 -687 -15
4925 -15 -119 -637 -347 -197 -1219 -459 18 -821 -887 50 -591 -800 -88 -495 -861 82 225 -520 -208 303
4945 303 -144 -214 795 358 -49 636 -45 239 356 403 161 214 770 -124 -88 303 -503 -623 189 -275 -755
$$ packed form
4799E78p57J65P98m46n96M52r3n47N99K33p84J69N80n79k19R65o74k91M33Lp86
4820g97P39J46r05N49M60o30J06P60m63m47O42k5k86M89J20n50J28P07o84k91
4840b32Q91m65m47R08l08n28L39q0o49N67J15m38r1L98n71N3O25m64n40P54j09
4861b72p00O36N89j096L90N77n91o3Q68k65p32Q61j96k27N25Q6n88M86nm67l04
4882d88O83m34k30N71k46r27O39L95p64J34K72m28Q5M46k62m11N18%k79M81no35
4904h85O16K96m99j55O73l1q0M89l31n07O38J67n53K14K10m64kN72q65j90O72
4925a5j04n18K90J50j022P60M77q39o6R37o41k09P12m07l66R43J43p45L12N11
4945C03m47p0J009m37m07O85o81K84J17M7k42N3N56q94L6L91q06j20Q12m64m80
$$ plain form
4966 -755 246 -303 -760 -219 105 -632 -518 181 -302 -578 -94 -301 -371 419 244 -255 193 698 -64 298
4986 298 741 372 398 758 403 -157 445 398 -266 433 350 -522 42 287 -478 -635 36 -435 -411 -100 -17 -722
5008 -722 -250 -170 -663 -303 183 -318 -42 334 54 -250 964 634 72 670 207 185 484 454 -61 -98 684
5029 684 120 -205 426 -19 -402 282 -13 -418 -253 -60 -713 -524 -116 -669 -477 131 122 -720 -133 -163 -443
5050 -443 -25 228 -346 -343 815 11 -195 483 435 -65 405 270 -342 180 560 -242 -121 379 -208 -474 316
5071 316 -243 -640 -165 -185 -423 -493 -170 -790 -497 -128 -698 -513 321 -476 -619 233 253 -288 21 506 -209
5092 -209 484 800 108 207 719 416 -185 775 593 188 553 806 47 112 313 -5 -303 304 -238 -449 230
5113 230 -106 -809 -72 275 -125 -91 219 -135 12 428 152 -23 546 391 290 690 960 66 346 748
$$ packed form
4966g55J001n49m57N41L24p37J14O99m83k76M84k07p0P90j75m99M48N05p62L62
4986B98M43l69K6L60l55n60O02m7o64O99q3q72N64K45p65j57O71m71K4L11Q3p05
5008g22M72Q0m93L60M86n01K76L76k80l04J214l30n62N98m63k2K99l0n15l7P82
5029F84n64l25O31m45l83O84k95m05J65J93o53J89M08n53J92O08rq42N87l0k80
5050d43M18K53n74LJ158q04k06O78m8n00M70j35o12N22L80q02J21N00n87k66P90
5071C16n59l97M75k0k38p0L23o20K93L69n70J85Q34p97j43Q52K0n41L09M85p15
5092b09O93L16o92R9N12l03o01R60j82m05L65K53p59O5K01l18k98O07n42k11O79
5113B30l36p03P37L47m00L4L10l54J47M16k76j75N69j55j01M00K70q94K80M02
$$ plain form
5133 748 577 353 714 424 54 643 316 84 338 357 -33 426 450 87 148 151 -168 -403 166 211 31 66
5155 66 34 -406 137 780 -135 -34 533 -11 59 793 373 -71 612 598 55 366 757 166 280 812 522
5176 522 220 568 176 -127 440 190 -213 -8 290 -158 -5 400 -314 -274 307 -365 -411 344 -55 -420 335
5197 335 571 -309 169 466 -165 128 641 426 280 828 459 -100 443 679 -114 345 229 -284 93 821
5217 821 325 -139 541 152 -71 351 35 -61 47 270 127 -156 277 -51 -81 806 102 -83 609 570 256
5238 256 -4 696 187 365 889 296 31 969 787 -59 806 474 137 763 753 118 197 545 286 -50 482
5259 482 121 -125 570 490 -247 403 304 -106 417 859 205 100 639 274 50 661 586 62 242 680 152
5280 152 316 858 394 304 805 324 44 886 500 8 523 693 -2 367 898 283 177 566 261 227 461
$$ packed form
5133G48j71k24L61k90l70N89l27k32K54J9l90M59K4l63O1Ll19k35N69M5j80L5
5155F6l2m40N43O43r15J01N67n44P0P34m20m44O83j4n43L11L91n91J14N32k90
5176E22l02L48l92l03N67k50m03K05K98m48J53M05p14M0N81o72m6P55l99l65P55
5197C35K36q80M78K97o31K93N13k15j46N48l69n59N43K36p93M59j16n13L77P28
5217H21m96m64O80l89k23M22l16r6J08K23j43k83M33l28l0Q87p04j85O92l9l14
5238B56k60P00n09J78N24n93k65R38j82q46Q65l32l37O26j0o35P9L48k59l36N32
5259D82l61k46O95q0p37O50r9m10N23M42o54j05N39l65k24O11p5n24J80M38n28
5280A52J64N42m64r0N01m81k80Q42l86m92N15J70o95L69N31o15j06L89l05l4K34
$$ plain form
5301 461 56 57 709 662 118 263 527 -22 119 623 156 211 599 479 92 587 385 2 437 601 234
5322 234 70 664 278 127 407 440 110 540 421 -43 208 595 112 366 492 146 113 426 300 97 305
5343 305 245 -26 347 236 -135 405 678 86 44 172 186 -132 764 553 83 315 351 345 -22 702 142 142 542
5366 542 77 66 668 203 -80 245 861 -86 176 691 190 -111 448 56 -62 243 20 -334 296 360 -247
5387 -247 66 213 119 107 468 -321 -83 368 273 -312 206 345 -177 138 266 -33 70 477 93 -31 250
5408 250 499 -96 355 450 -224 -15 371 77 -178 719 -106 -149 234 78 -96 412 69 -362 150 473 17
5429 17 180 317 37 -146 460 270 -15 804 583 192 401 500 224 366 846 353 211 683 382 233 578
5450 578 279 -160 384 777 -153 329 343 139 302 554 220 45 842 263 -19 560 320 -60 345 819
$$ packed form
5301D61m05JO52m7n44J45K64n49J41N04m67N5L88j20l87M95k02l83M35J64l67
5322B34j64N94l86j51K80L3l30M30j19m64K51L87m83K54J26l46l3L13j26k03K08
5343C05o0k71L73j11l71N40K73n92m2J28J4l18Q96k11m70K32L6ol67P24n60%M00
5366E42m65j1O02m65k83L25O16r47K62N15n01l01N59l92j18L05k23l54O30O4o07
5387b47L13J47r4j2L61p89K38M51r5n85N18J39n22L15J28k99J03M07l84j24K81
5408B50K49n95M51R5o74K09L86k94k55Q97q25m3L83j56j74N08l43m31N12L23m56
5429A7J63J37k80j83O06j90k85Q19k21l91K09R9k76J42M80m93j42M72l01j49L45
5450E78k99m39N44L93r30M82J4k04J63K52l34j75P97n79k82N79k40l80M05M74
$$ plain form
5470 819 446 204 833 472 262 643 799 224 669 665 143 447 648 347 222 438 320 -188 590 49 -2
5491 -2 220 381 -125 142 530 -68 81 386 97 -35 278 50 -98 353 -97 31 106 730 177 -17 313
5512 313 -33 -4 536 498 -253 380 409 192 45 225 133 -241 -27 -77 -193 154 -7 -357 18 40 -369 -40
5534 -40 116 -364 -413 19 -9 -352 376 -62 -300 117 349 -101 371 429 -60 161 376 -118 0 623 384
5555 384 -267 270 257 -90 64 371 -141 -134 764 -8 -334 62 -215 -539 538 -34 -292 85 469 -310 209
5576 209 455 -102 137 537 195 12 604 466 59 433 -25 207 398 711 235 243 493 87 61 677 138
5597 138 -13 492 398 61 68 294 22 185 573 136 -134 369 278 -459 388 293 -170 136 541 182 52 445
5619 445 349 243 421 439 200 357 503 204 224 393 -193 329 532 143 -39 317 167 -219 305 140 -638
$$ packed form
5470H19l73k42O29l61k10L81J56n75M45mn22L04K01l01j25K16j18n08P78n41n1
5491bK22J61n06K67L88n98J49L05k89j32L13k28j48M51m50J28P5O24n53j94L30
5512C13l46K9N40l8p51O33K9k17j47J80r2l74K14n0j16L47j61l50L75K2m09L29
5534d0J56m80m9M32k8l43P28m38k38M17K32m50M72N8m89K21K15m94J18O23k39
5555C84o51N37j3l47J54L07n12PQ98p72l26L96k77l24J077n72k58L77L84p79N19
5576B09K46n57K39M00l42j83N92j38m07L74m58K32J91L13m76QK50m06k6O16n39
5597A38j51N05r4l37PK26k72J63L88m37k70N03r1p37Q47r5m63L06M05l59j30L93
5619D45r6j06J78J8k39J57J46k99K0J69n86N22K03l89j82L56j50l86N24j65p78
$$ plain form
5640 -638 85 32 -136 -35 -3 -287 -241 88 -130 -40 228 87 -208 354 35 -173 -7 495 -144 -100 359 158
5662 158 -157 217 267 -203 166 262 -200 285 405 -118 -288 -182 -125 -204 102 57 -422 74 -85 -328 239 157
5684 157 -170 -54 228 -188 -387 -76 261 -274 235 164 -79 59 573 2 61 713 -24 -58 558 368 187
5705 187 436 134 148 253 130 -164 -64 333 -103 -3 300 -230 -280 190 38 -195 -96 -115 -348 -284 145 -243
5727 -243 -223 248 253 -381 503 467 -107 302 260 -230 139 298 -195 67 229 85 -273 -92 320 -383 260 74
5749 74 -322 -409 -148 -95 -175 -44 -280 -162 219 -152 -318 65 -68 -425 -178 521 -299 226 -5 240 -243
5770 -243 -3 -165 -130 -278 383 -464 34 -144 -323 -178 215 -175 -517 -16 -202 -306 16 111 -366 139 359
5791 359 -329 -2 295 -369 -469 202 -7 -413 18 -12 -322 30 265 -160 189 38 -11 -134 271 191 -114
$$ packed form
5640f38P23n3j68J01L2k84M6L29k18R0K68j41k95N62l19k08J66N02o39M4M59k01
5662A58l15L74N0m70L69R6m62M85J20n23j70J06N7p9L06m5m79M96j59k43N67q2
5684A57l27J16K82m16j99L11L37n35N09p1k43J38N14n71N9O52p37l4O16j90j81
5705A87K49l02J4J05j23k94J00L97m36J00L03n30n0M70j52k33R9j9k33O4M29l88
5727b43K0M71No34Q84l6n74M09m2m90L69J59m93K62J62j44l58J81M12p03O43j86
5749G4l96q7K61N3q0J31k36J18L81l71j66L83j33l57K47O99q20N25k31K45m83
5770b43K40j62L5j48O61q47M98j78j79J45L93l90l42N01j86j04L22R5m77N05K20
5791C59o88L27K97o64j00O71k09m06M31l0l10L52K35m25L49j51m9j23M05q0l05
$$ plain form
5812 -114 284 292 -482 355 229 -275 229 171 -150 89 -28 -83 -379 137 218 -132 240 323 -410 -105 170 -54
5834 -54 -256 371 -13 -355 446 154 -388 184 313 -197 71 95 -140 -211 276 -134 48 426 -129 -192 196
5855 196 198 -410 -109 117 -280 -120 163 -273 -619 216 -398 -649 -114 170 -384 -424 -79 -486 -273 52 -603
5876 -603 -970 230 -71 -407 -146 -19 -432 -108 -105 -498 -8 -233 -230 -185 273 25 -353 -183 -9 -582 -368
5897 -368 -98 -500 -402 -296 -610 -423 -8 -152 -150 -117 -184 -559 -163 197 -703 -391 162 -405 -260 -147 -409 -263
5919 -263 25 -7 -398 -197 -89 -290 -106 308 -160 -312 160 -98 -318 51 -215 -421 -246 189 -368 43
5939 43 270 -247 -236 81 -84 -395 141 19 -392 -162 -217 -165 -103 11 -375 -111 539 53 -323 268 56 -172
5961 -172 307 126 -109 -174 136 -479 -24 443 54 -194 228 91 -328 -24 -136 -413 -120 -55 -567 -276 157
$$ packed form
5812a14L98Qp74Q37j26n04N04n8l21K39j17n5k96N16Q1l50L72Q3p33L05K75k24
5834e4k02O27l84l42Q01k92n42N72J29n10K68K4k35p1M87m10J82L78n55o3L88
5855A96Ko08L01K26l97J60K83m36l46Q35o14k51N35K84n54m0L45m07K13L25o55
5876f03l67J200l01l36K61J27m13L24Ll93M90k25LM5M58k48l78J70J74n73K14
5897c68K70m02R8J06l14J87M15j44KL3o7l75L96L60r00L12N53n67J45J13k62J46
5919b63K88l2l91K01J08k01J84M14m68j52M72k58k20L69k66k06J75M35n57M11
5939D3K27n17J1L17j65l11N36j22m11K30n5N2O2J14l86K64O50m86l76N91k12k28
5961a72M79j81k35o5L10o15M55M67l89k48M22j37m19L04j12k77K93O5n12K91M33
$$ plain form
5982 157 -360 -271 -381 -73 -267 202 163 -299 -264 194 38 -210 -33 -239 -612 -149 -188 -327 -30 127 -163
6003 -163 5 -50 -367 -60 308 -277 -146 -135 -499 -481 -124 -326 -566 -12 -134 -306 -290 126 -313 -169 3
6024 3 -345 -459 -264 -231 -525 -275 167 -669 -393 92 -306 -267 209 -54 -263 365 23 -374 -74 13 -382 -297
6046 -297 -130 18 -78 128 -405 -273 -74 -84 -673 -13 -34 -750 -31 -150 -291 -530 311 -317 -310 -88 32 -228
6068 -228 -12 260 -168 199 -175 -63 -26 -7 -67 -115 -24 53 -367 302 -74 -241 -222 326 -145 -57 -7 -438 -117
6091 -117 332 -29 -362 -246 -56 -303 44 -156 -390 -118 97 -242 -245 73 -39 45 225 308 -209 9 444
6112 444 -304 -17 189 -260 -71 265 -114 -219 28 315 -235 139 393 -640 -59 353 -391 -310 38 -145
6132 -145 -212 151 -207 -374 144 159 -268 -244 52 -121 -88 142 -371 -176 -143 61 -209 -88 256 -325 11 268
$$ packed form
5982A57n17Q9j10L08j94M69l9m62L5M58j56k48J77k06l73M63l9j39K97J57k90
6003a63J68n5l17L07L68n85J31J1l64J8L57k02k40N54j22j72J6M16m39J44J72
6024Cl48j14J95L3k94K50M42q36K76M85l98L9M76k63k09O28l42l97L00Q7l95Q5
6046b97J67J48r6K06n33J32J99j0n89O60k1p16P19j19j41k39Q41o28PK22J20k60
6068b28K16K72m28L67l74J12L7J9o0m8R1P7m20O69l76j67J9N48m71Q8N0m31L21
6091a17M49l61l33J16J90k47L47k00k34K72K15l39lL18j12Q4J80Q3n17K18M35
6112D44p48K87K06m49J89L36l79j05K47K87n50L74K54j033N81M12p44Q1L48j83
6132a45o7L63l58j67N18J5m27K4K96j73L3K30n13J95L3K04k70J21L44n81L36K57
$$ plain form
6154 268 10 115 291 -93 -298 -215 137 -462 108 81 -138 61 192 -296 83 -110 -220 -156 -18 -178 -109
6175 -109 -187 -22 -303 -136 86 -399 -3 202 -440 83 205 -182 -321 -53 277 -418 108 58 -376 -24 437
6196 437 24 -113 -23 135 33 202 227 65 -204 198 13 -183 356 -300 -252 -97 -220 -118 100 131 -210
6217 -210 33 -59 -34 -215 313 -209 -304 91 -58 -161 -25 -202 -338 -133 29 -379 211 47 -330 15 99
6238 99 -208 -75 138 -127 -282 -119 -88 -245 252 261 -231 -273 212 -320 -130 -159 -206 -620 79 71 -155 56 167
6261 167 -156 -198 171 -382 -241 147 67 0 -46 91 -217 133 158 -152 -456 -18 -304 -238 377 -144 -216 15
6283 15 35 -183 -82 245 -17 161 469 -30 -80 42 100 -369 380 248 -318 109 493 -118 127 362 -189
6304 -189 83 299 -5 -197 408 136 -183 275 -87 31 158 41 -124 212 203 3 -72 280 25 32 148 20
$$ packed form
6154B68k58J05J76l84k05Q3L52n99N70k7k19J99J31m88L79j93j10O4J38j60O9
6175a09p8J65k81J67K22m85L96K05o42N23J22l87j39K68L30o95N26n0m34L52M61
6196D37m13j37R0J58j02J69K5j62k69M02j85j96N39o56M8J55j23J02K18L1l41
6217b10K43r2K5j81N28n22r5L95j49j03J36j77j36K05J62m08N90j64l77L45Q4
6238I9l07J33K13k65j55J63L1j57M97Rm92m2M85n32J90k9m7m14O99qk26K11J11
6261A67l23m2L69n53J41L88q0o7m6J37l08L50K5l10l04M38k86O6O15n21p2K31
6283A5K0k18J01L27k62J78L08m99n0J22N8m69P49j32n66M27L84o11K45K35n51
6304a89K72K16l04j92O05k72l19M58l62J18J27j17j65L36rk00p5L52k55PJ16j28
$$ plain form
6326 20 -306 -12 -1 -128 -44 482 164 -328 131 -6 -270 249 420 -71 74 148 -357 170 263 166 -269 148
6348 148 -151 -60 226 -70 -374 -51 193 125 -124 -151 -324 -56 283 82 -445 226 133 -307 141 86 -355 -72
6370 -72 418 -189 -413 -16 -349 -219 0 -150 -102 151 228 -20 -77 229 -99 215 81 219 -524 19 136
6391 136 -355 81 0 -282 -48 259 -239 -201 208 -30 -231 -93 -141 -322 11 87 -74 69 186 -15 -114 204
6413 204 -231 -328 276 166 -290 100 203 24 14 405 -216 -247 174 -82 21 172 226 -266 63 -59 -414
6434 -414 -37 472 -141 -55 190 25 -171 258 51 -368 149 434 -122 182 87 -90 -13 281 66 52 297
6455 297 70 -164 127 218 9 100 -52 -124 33 247 112 -44 403 -117 -82 213 329 -266 73 170 -247 -123
6477 -123 105 -83 -344 455 165 -209 174 239 -203 378 118 319 139 27 289 -28 170 155 -121 41 95
$$ packed form
6326B0l26K94J1j27Q4N26l18m92M59j37k64N19J71m91J45P4n05N27R3r7m35M17
6348A48k99R1K86k96l04L23K44o8k49k7j73K68L39k01n27O71r3m40M48n5m41K83
6370g2M90o07k24L97l33J30K19j50M8K53P7k48n7L06l28L14j34J38p43N43J17
6391A36m91M36q1k82K34L07m98L8M09k38k01J38m8j81L33P6j61J43J17k01r9L18
6413B04m35r7O04j10m56L90J03j79j0L91o21l1M21k56J03J51N4m92L29j22l55
6434d14L77N09o13Q6K45j65j96M29k07m19N17K85n56L04r5j77P7K94k15j4K45
6455B97k27k34K91R1k09R1j52p2J57K14j35j56M47n20L5K95J16n95L39R7m17J24
6477a23K28j88k61P99k90l74L83O5m42N81k60K01j80j12K62l17J98j5k76J62N4
$$ plain form
6498 95 -271 44 170 -127 62 78 21 -177 240 -352 -114 241 -113 -219 89 142 -390 -150 62 -142 -8
6519 -8 313 -210 -190 392 97 -117 180 221 -133 -36 241 -87 37 111 18 -139 328 330 -225 261 207 -384 137
6542 137 403 -119 -27 67 -287 -127 83 -178 -172 65 190 221 219 138 -134 -50 275 198 -159 105 -91 -55 353 369
6566 369 156 646 435 -158 208 72 57 190 -111 236 -120 79 -37 -237 164 4 -367 30 183 1
6586 1 25 129 -112 -254 194 226 -213 121 429 -168 108 101 34 -3 162 193 -62 27 42 -87 -119 161 221 157 -3
6611 -3 -166 -306 202 -363 -195 57 -154 -162 -328 163 -323 24 176 -106 -184 -85 152 131 369 -90 -155 260 131
6634 131 -94 -13 220 -217 -68 174 14 -111 206 -136 -161 36 -87 -238 -31 221 -274 -86 -182 -374 -70
6655 -70 55 42 -239 -17 241 -356 140 91 27 -223 189 31 -107 466 -190 -79 231 68 -119 -238 347
$$ packed form
6498I5l66L15J26k97J89J6n7j98M17n92K38L55l54j06L08N3n32K40K12k04J34
6519hL21n23K0N82k95k14K97M1l54R7K77l28J24P4r3j57M67Kn55M86n4n91N21
6542A37K66n22R2R4l54J60K10k61OK37J25L1kq1k72Q4L25p7l57K64j96L6M08J6
6566C69k13M90k11n93L66j36j5J33l01L47l56J99j16k00M01j60l71L97J53j82
6586AK4J04k41j42M48L2m39L34L08n97K76po7l7J65L1k55Q9J5j29l2K80O0o4j60
6611cj63j40N08n65J68K52k11qj66M91m86L47J52k82p8R9K37k1K38m59o5M15j29
6634A31k25Q1K33m37J49K42j60j25L17l42k5J97j23j51K07K52m95J88r6j92L04
6655g0J25j3k81K22K58n97M96m9o4k50M12j58j38N73o56J11L10j63j87j19N85
$$ plain form
6676 347 -100 -250 380 68 -277 343 -239 -355 227 12 -28 -144 186 -187 -101 56 -449 -190 -137 45 -48
6697 -48 125 -120 -106 316 47 -176 192 332 -65 152 224 -295 -171 414 4 -244 119 127 -173 -50 383 -109
6719 -109 -7 118 -98 -188 70 48 -357 188 133 -206 130 78 -281 -14 433 -21 -15 -114 8 -258 95 -190
6741 -190 -276 20 31 56 -140 234 -10 -372 98 120 -112 44 86 -479 287 196 -360 -350 -197 -144 -242 -21 -65
6764 -65 -440 -122 -78 -298 -127 -77 -19 -59 49 -75 -265 -195 -247 -144 141 -157 -239 51 412 41 156 165 -223
6787 -223 -224 55 -272 -358 13 315 -202 84 -140 -146 -56 158 -243 -162 212 -119 -163 114 114 -128 267 67 -87
6810 -87 209 14 -265 49 214 33 -36 247 135 -433 167 181 -90 119 -9 -30 -91 86 -144 -265 67 88
6832 88 -35 100 108 -54 167 94 -201 -62 450 27 -91 32 138 76 43 -176 -140 81 259 -135 -214 172 -75
$$ packed form
6676C47m47j50O30l12l45O20n82j16N82k15m0j16L30l73Q6J57n05K59N3J82r3
6697d8J73k45J4M22k69k23L68J40l97K17P2n19J24N85m10k48L63Ql00J23M33m92
6719a09J02J25k16r0K58k2m05N45n5l39L36n2l59K67M47m54Or9J22k66L53k85
6741a90q6K96J1K5j96L74k44l62M70K2k32J56M2n65P66r1n56J0J53N3r8K21m4
6764f5l75L18M4k20J71N0N8m0J08j24j90P0n2J03K85k98q2K90L61l71J15Rl88
6787b23jK79l27q6L71L02n17K86k24oR0K14m01Q1L74l31m4K77%k42L95k00j54
6810h7K96j95k79L14J65j81o9K83j12n68O00J4k71K09j28k1o1J77k30j21L32K1
6832H8j23J35Qj62K21p3k95J39N12m23j18J23J06o2l3k19L6K21J78l94p9L86k47
$$ plain form
6855 -75 -142 178 -215 -405 53 32 -183 78 18 -297 -66 -176 -175 -25 219 115 -190 141 71 -50 -19 85 68
6878 68 -195 218 -411 -149 372 260 -49 21 -115 -485 3 -153 -213 -56 335 -170 -208 -76 -116 -109 411 17
6900 17 -263 75 90 -279 -333 134 -340 -133 585 -55 -204 380 -55 110 305 183 -87 70 244 -12 -362
6921 -362 -53 -257 -15 129 -133 -515 -62 -14 -111 -372 -209 -125 -194 127 -153 65 36 53 -217 147 158 -177
6943 -177 174 -26 -149 62 108 37 -228 87 129 71 302 67 -221 240 -89 -125 200 118 -61 -155 211 -61
6965 -61 -9 226 102 -149 -55 73 3 110 65 13 -270 6 -101 131 145 212 -240 87 33 -4 56 273 316 -60
6989 -60 203 148 -134 279 -63 111 84 259 -83 56 246 -119 -178 195 -408 -19 315 140 9 75 46 -156
7011 -156 16 50 -246 131 279 -56 241 79 -305 -184 178 147 45 144 471 51 17 -58 -88 134 -13 -120
$$ packed form
6855g5o7L20l93j90M58k1k15K61o0l15K31j10JJ50K44j04l05L31p0j21L1J04j7
6878F8k63M13o29K62N21j12l09P0j36l70M88j56o0J57L91n05l8J32m0PN20l94
6900A7k80L38J5l69n4M67m74K07P18o40j49N84m35J65J95j22k70J57J74k56l50
6921c62L09k04K42J44k62l82M53M8r7k61J63Q4o9L21k80K18k9J7k70L64J1l35
6943a77L51k00j23K11M6p1k65L15M2n8K31k35k88M61l29l6L25q2j79r4L66k72
6965f1N2K35j24k51R4J28p0J07m5n2k83K76j07K32J4O7m52L27n4l7O0K17M3l76
6989f0K63n5k82M13l42J74k7J75l42J39J90l65n9L73o03L89L34j75j31O6k9k02
7011a56J72L4k96L77J48l35K97j62l84J21L62l1j02R9L27m20l4p5l0K22j47j07
$$ plain form
7033 -120 -149 329 168 -486 -5 344 -102 142 147 51 -200 213 175 -80 -21 82 -487 122 170 -21 -60 92 -9
7056 -9 -142 -80 54 24 78 -230 -344 -111 338 -196 -206 55 -35 -154 113 22 -182 348 153 -83 343 122 -35
7079 -35 -2 112 -220 -28 260 -34 114 112 -101 -154 68 -35 -90 101 136 -10 63 290 148 135 -117 153 -136
7102 -136 -116 83 -25 9 172 -157 -122 216 43 117 6 35 -128 191 160 26 100 150 -37 142 168 77 -107
7125 -107 376 -9 1 99 303 -322 189 -33 52 325 424 -22 131 542 -51 -211 8 261 -481 89 54 -156
7147 -156 136 143 112 -10 -145 178 -343 -62 -100 91 -27 297 -265 -389 71 -239 17 572 88 -40 179
7168 179 116 33 204 194 73 60 277 172 135 402 -235 -413 278 189 -9 135 132 -127 -49 282 165 -9 176
7191 176 313 29 142 -4 -96 70 161 -248 177 408 -99 -5 268 147 -254 314 -52 -107 296 52 -175
$$ packed form
7033a20k9M78j61o54M81L49m46K44Nr6k51M13l8k55N9J03n69O09M8j91l9J52j01
7056ij33O2J34l0N4l08j14K33M49n34j0K61r0j19K67r1k04N30j95k36M26k21j57
7079c5L3J14l32J92K88k94J48kk13n3K22j03n5J91L5j46P3K27j42j3k52K70k89
7102a36K0J99j08L4J63l29L5L38j73P4j11K9j63L19l1j34P4N0j87J79K6r1j84
7125a07M83l85J0R8K04o25N11k22Q5K73R9m46J53M11n93j60K19K53p42N70l5k10
7147a56K92Pl1j22j35L23n21K81l8J91j18L24n62j24M60l10K56N55m84j28K19
7168A79o3q3J71j0j21j3K17j05l7K67o37j78O91q9j98J44lk59P8L31j17j74J85
7191A76J37k84J13j46r2J66R1m09M25K31n07R4K73j21m01N68l66n5M03k44k27
$$ plain form
7212 -175 136 39 -188 -5 373 -150 -284 387 -41 -317 140 91 -68 110 135 -29 -163 180 119 -111 -119 166
7234 166 5 319 239 -167 -132 209 42 45 -126 -118 -247 283 38 -224 -52 -157 -228 166 40 -230 -252 -166 48
7257 48 -137 316 -272 -39 80 102 -312 93 93 -110 70 -38 77 -72 295 -177 19 240 468 -126 250
7278 250 69 -343 125 288 86 -482 92 -7 60 34 41 -266 160 125 119 -82 215 238 -55 453 -48 -118 38
7301 38 93 -107 105 129 -159 -95 -19 -142 -433 332 1 194 293 -106 -192 -108 168 -35 76 131 -154 -85 34
7324 34 -291 -189 116 -90 203 179 142 90 -73 91 -168 -18 116 26 -7 415 -67 -77 44 194 -65 137
7346 137 166 116 -57 87 132 -171 88 9 -366 -41 -53 -62 151 -241 -232 -88 -18 104 -361 266 -183 11 66 155
7370 155 -77 286 330 -241 42 334 -46 89 94 71 -155 412 75 47 191 301 -87 252 -105 -283 -31 187
$$ packed form
7212a75L11r7k27J83L78n23j34O71m28k76M57m9j59J78K5j64j34L43o1k30qK85
7234A66j61L14q0m06L5L41j67Lj71Qj29N30k45k62J72j05p1L94j26k70k2Q6K14
7257D8j85M53n88K33J19K2m14M05%k03J80j08J15j49L67m72J96K21K28n94L76
7278B50j81m12M68J63k02n68N74r9O7k6Pl07M26l5ok01K97K3k93N08n01p0J56
7301C8N5k00K12K4k88O4P6j23k91P65l31J93R9l99q6Q4K76k03J11N5k85O9J19
7324C4l25J02L05k06K93k4l7n2j63J64k59J50J34r0l3M22m82j0J21J50k59K02
7346A37K9n0j73J44M5l03K59p9l75L25j2rK13l92RJ44P0J22m65O27m49J94N5Q9
7370A55k32L63M4n71K83K92l80J35Nk3k26N67l37k8J44J10l88L39l57j78K52K18
$$ plain form
7392 187 188 -46 444 162 -185 2 -37 -180 -203 -82 -444 -78 182 -98 -125 -32 214 -40 276 304 187 77
7414 77 -181 -202 339 289 65 -179 136 30 67 93 -266 -249 -18 72 -297 -315 -1 157 -273 269 -183 -118 363
7437 363 124 -240 -41 -48 -451 -22 227 -219 -46 195 -77 -196 138 -102 -11 233 87 -121 128 143 45 -264
7459 -264 78 -138 1 143 -286 -368 -39 15 -32 452 314 -122 27 66 40 -282 263 -197 -168 32 36 67 38
7482 38 506 -155 137 555 -302 -86 63 -39 -396 -45 161 -348 89 88 -264 -179 301 -137 -108 -69 -193 -281
7504 -281 89 107 -444 -239 243 1 -219 103 -64 -287 170 88 -53 202 -173 -236 71 134 -28 -142 259
7525 259 -78 1 -237 -170 -2 117 185 -243 183 26 -210 -77 -80 -27 -188 19 -113 124 58 -154 -89 303 340
7548 340 -107 -27 158 -181 -63 191 -129 -255 46 108 -74 22 164 -316 287 345 -73 34 264 -258 -114
$$ packed form
7392A87Jk34M90k82l47J87l9j43k3J21l62L66K60k80k7R3K46k54L16K8j17j10
7414G7k58k1N41n0k24k44L15j06L7K6l59J7K31R0l69j8L14J58m30N42m52O5M81
7437C63k39l64J99pm03M29K49m46J73K41k72j19L34k40R1K44j46k08K49J5r8l09
7459b64L42k16J39J42m29q2L29N4m7M84j38m36J49L9k6l22N45m60K9K00ML1k9
7482C8M68o61K92M18q57K16J49j02l57L51K06n09M37jl52Q5M80m38K9L9j24q8
7504b81L70J8n51K05M82k42k20L22j67k23M57q2j41K55l75o3L07O3j62j14M01
7525B59l37P9k38O7J68J19O8m28M26j57k36J33lN3j61K07j32K37o6k12O5L92L7
7548C40m47Q0J85l39J18K54l20j26L01O2j82R6J42m80O03N8m18J07K30n22J44
$$ plain form
7569 -114 45 149 -126 327 83 150 105 61 -397 -155 13 -269 -107 264 -95 147 482 56 35 25 378 -233
7591 -233 -35 301 141 -238 20 191 -234 -43 144 -176 -196 74 -525 -176 41 36 -248 228 -329 -250 -7
7612 -7 -170 -462 -104 -162 -319 76 308 -86 -138 93 -34 -277 81 52 -266 -112 147 -284 102 141 -91 23
7634 23 -75 -231 -199 107 195 -186 -163 -159 -340 -29 137 -39 -84 -46 -39 -39 376 182 -59 -33 376 -119 52 261 1
7659 1 -241 288 -53 -85 213 -4 -224 126 -75 82 28 -53 -127 -3 138 -33 15 153 96 -468 213 199 -181
7682 -181 -499 66 -36 107 -80 -402 173 241 -24 276 219 159 -133 107 337 -94 11 48 162 28 165
7703 165 291 -119 90 -257 -262 218 138 -12 -77 -8 -26 -173 302 -389 -158 137 120 -235 119 197 -13 7 249
7726 249 -161 -122 -43 14 -141 -86 299 -85 -228 -85 -277 -75 74 -220 -227 -122 -4 -185 -54 -120 -153 146 32
$$ packed form
7569a14J59J04k75M53k44O7m5m4m58K42J68k82J62L71l59K42L35m26k1j0L53o11
7591b33J98L36j60l79K58J71m25J91J87l20k0K70n99L49K17nk84M76n57P9K43
7612gj63k92L58n8j57L95K32l94n2K31j27k43L58k9l18J54K59m31L86L9k32J14
7634B3r8j56L2L06Q8l81K3Mj81L11J66j76m5L8P%M15j94k41K6M09m95J71K09k60
7659Ak42N29l41l2K98k17k20L50k01J57n4q1p4J24J41j71M8J38n7n64O81j4l80
7682a81l18N65j02J43j87l22N75O8k65L00n7o0k92K40K30m31J05L7J14j34J37
7703A65J26m10K09l47nM80q0j50o5O9j8j47M75o91K31K95j7l55L54P8k10K0K42
7726B49m10L9P9N7j55N5L85l84j43J43j92K02J49k94pJ05J18j81J31o6l3K99j14
$$ plain form
7749 32 -61 -190 77 -64 -180 99 -28 -221 103 -95 -162 220 -50 -8 -31 187 -213 -82 -151 -47 -211 131
7771 131 -98 -249 240 -5 6 -152 249 -2 -51 -122 -121 80 21 -204 -308 52 94 -16 59 63 -341 -10 125
7794 125 277 -19 111 -83 4 302 60 -167 -9 10 -182 290 291 -121 -201 345 -170 15 343 -57 -320 -106
7816 -106 204 156 108 -127 -61 45 -49 -31 -23 332 119 -82 41 325 -10 -112 163 -196 -103 -96 -78 -32 184 241
7840 241 -132 20 243 -27 42 227 -121 -20 253 -31 -249 -51 281 -218 398 422 -233 -98 149 -82 -77
7861 -77 -291 -304 157 -83 -4 17 76 102 -256 183 144 -210 205 -129 -62 -157 92 -58 -169 99 -19 -281 103
7884 103 217 -218 179 40 -207 -404 244 -234 108 24 -111 -276 -78 -60 -182 57 63 -86 8 183 -132 -132
7906 -132 -252 92 -112 -3 168 -268 127 229 -215 -200 189 17 -289 15 -280 -122 74 -205 -127 -286 93
$$ packed form
7749C2r3j29K67j41j16K79j27j93L24j98o7L82k70M2k3K18m00J31o9J04j64L42
7771A31k29j51M89k45J1j58M01k51m9p1JK01n9k25j04L60M2j10P5Mm04L31J35
7794A25J52k96J30j94Q7K98k42k27J58J9j92M72Jm12q0N46n15J85L28m00k63K14
7816a06L10m8m8k35O6J06r4J8QL55k13k01J23K84l35j02K75l59R3PJ8M6K16N7
7840B41l73J52K23k70O9J85l48J01K73k84k18J98L32m99O16K4o55J35K47k31N
7861g7k14j3M61k40P9K1N9K6l58M39l9l54M15l34O7r5K49j50j11K68j18k62L84
7884A03J14m35L97j39k47j97O48m78L42q4j35j65J98J8j22K39Oj49R4J75l15%
7906a32j20L44k04J09J71m36L95J02m44J5L89j72l06L04k95J58J96k79P8j59L79
$$ plain form
7927 93 -251 -131 71 -113 -47 44 215 -337 265 263 -31 11 57 -324 -75 360 49 -75 227 243 -153 250 130
7950 130 -293 -173 155 12 -7 457 -78 10 202 15 -72 54 -99 -298 -73 -12 130 -170 2 -283 30
7971 30 316 -37 -201 21 -219 -258 100 -105 32 18 100 -443 -279 437 150 -226 197 5 -20 -35 -95 -112 248
7994 248 50 -255 -175 234 -76 -184 -37 8 -400 45 288 -439 -358 32 27 -124 -137 192 55 18 -93 -183 246
8017 246 -108 -148 26 -132 -213 -190 167 -52 -262 78 -185 -274 -7 379 -300 27 -248 -262 73 376 70 137
8039 137 317 -79 66 10 48 -387 244 270 -15 15 108 -145 -20 277 62 -49 28 160 113 -226 -84 -76 62
8062 62 -18 -126 -138 -219 -69 -174 -9 113 -120 -31 -143 -45 -122 -6 -199 -61 129 -3 -15 183 -7 -57 112
8085 112 220 14 -55 78 -17 -255 312 361 -242 256 -112 -366 55 41 -103 -83 3 63 18 171 170 -85 80
$$ packed form
7927I3l44J20K02j84O6R1J71n52O02kk94M2M6l81K49M35l11j24L02J6l96M03j20
7950A30m23J20L28j43j9M64n35Q8J92j87q7J26j53j99K25O1J42l00J72k85L13
7971C0K86l53j64K22k40l9L58k05J37j4Q2n43J64P16k87l76M23j92k5j5o0j7L60
7994B48j98l05Q0M09l10j08J47M5m08M45K43p27Q1L90nj51j3L29j37l7j11r0M29
8017B46l54m0J74j58q1K3L57k19k10L40k63q9K67L86o79L27k75j4L35L03l06O7
8039A37J80l96J45n6L8m35O31K6k85L0R3k53J25K97k15j11P7J32m7l39J42QJ38
8062F2q0j08j2q1J50j05J65J22k33Q9j12R8p7J16j93J38J90j32j2J98j90n0J69
8085A12J08k06o9J33r5k38N67M9o03M98l68k54M21j4j44K0Q6O0m5J53jk55J65
$$ plain form
8108 80 13 -96 166 -73 -236 -89 152 -155 68 249 -360 155 215 48 46 178 -15 -125 244 11 -170 100
8130 100 -1 -6 -156 289 265 -117 86 186 -221 9 329 -430 -15 379 -47 -172 -140 -270 -387 -150 -47
8151 -47 -88 6 -179 -139 192 -73 -194 165 142 43 87 47 335 -56 92 -77 -132 -249 112 69 -42 -53 -65 -277
8175 -277 73 344 -339 -72 31 -170 75 29 -10 -38 51 183 -348 177 19 -34
$$ packed form
8108H0o7j09K62k39j63J47K41l07K23J81o09N15O0j67kJ32j93j10L69k33j81K70
8130A00j01nj50M45k4l82K03J00m07K30L20p59M15L94m26j25L2j30j17K37J03
8151d7m1R4j85M0L31k65j21L59k3r9M4m0K88l91J48j69n5j17L61m3j11j1j2k12
8175b77L50K71o83K67J03k01K45m6l9k8Q9J32n31N25j58n3
8191c4
$$ Imaginary data points
##PAGE= N=2
##DATA TABLE= (X++(I..I)), XYDATA
$$ plain form
0 0 0 0 0 0 0 0 0 0 0 0 -3 8 -8 8 -8 8 -15 16 -16 23 -24 29 -32 38 -44 50 -56 64 -73 82 -93 104 -117 129
34 129 -144 161 -179 198 -222 245 -270 299 -332 367 -408 452 -502 559 -627 704 -798 911 -1049
53 -1049 1227 -1463 1794 -2287 3108 -4723 9109 -44989 -146278 -72363 -15038 -2871 2200 -2929
67 -2929 -26088 -10498 -15287 -55549 -52036 -11288 -6129 6936 19106 -36002 -89049 -61124 -46698
80 -46698 -71700 -54484 -24628 -43875 -68286 -94004 -128598 -108450 -53436 -61725 -87521 -69842
92 -69842 -73802 -96115 -71964 -58817 -87732 -71997 -21402 -14589 -28083 -36611 -58813 -43500 12342
105 12342 13118 -17884 358 9960 -21900 -13613 18332 6077 -9657 -4428 -16322 -14337 7544
118 7544 -16561 -47215 -19810 -3291 -27722 -24031 -17921 -48894 -43837 -31 -1292 -20216 -9548
$$ packed form
0@%%%%%%%%%%lJ1j6J6j6J6k3L1l2L9m7N3o1P0q2R4j06J20j37J55j75J97k21K46
34A29k73L05l40L77m20M67n15N69o31O99p75Q60r54J061j186J331j502J709j960
53a049K276k690L257m081N395p831J3832n4098j01289P3915N7325J2167N071n129
67b929k3159J5590m789m0262L513M0748N159J3065J2170n5108n3047K7925J4426
80d6698k5002J7216K9856j9247k4411k5718l4594K0148N5014q289k5796J7679
92f9842l960k2313K4151J3147k8915J5735N0595O813j3494q528k2202J5313N5842
105A2342P76l1002J8242R602l1860Q287L1945j2255j5734N229j1894J985K1881
118G544k4105l0654K7405J6519k4431L691O110l0973N057M3806j261j8924J0668
$$ plain form
131 -9548 -9744 -14515 5743 9100 4621 43700 57198 11071 6514 51462 55283 42528 54465 49173
145 49173 42113 68439 67726 30190 24506 33867 37195 65984 70657 7184 -22524 23240 40805
158 40805 15160 8857 6572 2595 24167 21082 -17210 -12903 20075 18156 18858 33634 14386 3541
172 3541 35347 36186 6500 26588 62097 55756 40492 26950 9634 34724 70522 42825 10144
185 10144 31043 40064 20413 22014 14964 -14361 -3147 25945 15239 -2432 -9882 -31445 -27840
198 -27840 6892 -1663 -28422 -8348 4413 -20376 -19105 386 -9068 -8377 10390 6112 5645 24595
212 24595 11208 -8724 12725 23452 9953 27445 39300 6477 -4040 19642 14170 1948
224 1948 14581 11618 470 9975 114 -20010 -1788 6029 -24714 -19376 16697 7887 -17043
$$ packed form
131i548j96m771K0258L357m479L9079J3498m6127m557M4948L821j2755J1937n292
145D9173p060K6326p13l7536n684R361L328K8789M673o3473k9708M5764J7565
158D0805k5645o303k285l977K1572l085l8292M307L2978j919P02J4776j9248j0845
172C541L1806Q39k9686K0088L5509o341j5264j3542j7316K5090L5798k7697l2681
185A0144K0899R021j9651J601p050k9325J1214K9092j0706j7671p450k1563L605
198b7840L4732q555k6759K0074J2761k4789J271J9491r454O91J8767m278m67J8950
212B4595j3387j9932K1449J0727j3499J7492J1855l2823j0517K3682n472j2222
224A948J2633k963j1148R505r861k0124J8222P817l0743N338L6073q810k4930
$$ plain form
237 -17043 -15988 -18846 -14046 17299 19589 -5855 -125 13466 5801 16615 27377 3327 5380
250 5380 46167 47218 16873 16279 20911 18265 35191 38129 16790 25210 39741 15672 2529 19102
264 19102 14978 10727 31731 23850 -7135 2799 22692 10999 3338 4644 1178 22796 43900
277 43900 10442 -16769 11922 32091 22162 27216 27646 12029 24222 42184 24872 16752 29989
290 29989 25843 26670 43884 29461 7963 27496 35654 10765 12227 29917 19271 13755 21280
303 21280 9204 5955 22301 13026 -3490 12876 17570 3131 16821 27658 1717 -4784 17740
316 17740 16927 11276 22979 18103 11031 25179 20090 1711 16066 28321 11029 16325 38724
329 38724 24480 4809 10805 8801 8317 29091 28772 8893 14312 18802 1664 5348 17158 4077
$$ packed form
237a7043J055k858M800L1345K290k5444N730J3591p665J0814J0762k4050K053
250E380M0787J051l0345n94M632k646J6926K938k1339Q420J4531k4069j3143J6573
264A9102m124m251K1004p881l0985R934J9893j1693p661J306l466K1618K1104
277D3900l3458k7211K8691K0169r929N054M30j5617J2193J7962j7312q120J3237
290B9989m146Q27J7214j4423k1498J9533Q158k4889J462J7690j0646n516P525
303B1280j2076l249J6346r275j6516J6366M694j4439J3690J0837k5941o501K2524
316A7740q13n651J1703m876p072J4148n089j8379J4355J2255j7292N296K2399
329C8724j4244j9671N996k004m84K0774l19j9879N419M490j7138L684J1810j3081
$$ plain form
343 4077 7571 34136 24814 -1535 2750 8854 4236 15965 22158 11851 22158 29340 2604 -5818
357 -5818 16600 19246 14357 30285 26118 5901 13969 22047 7549 8553 20568 17727 27038 37451
371 37451 9694 -7765 16217 26655 14305 21263 26491 13719 19136 25818 7210 5721 23809
384 23809 21404 18624 29630 17211 2376 19745 24734 3761 10018 29236 20919 13726 17277
397 17277 6970 7167 24144 16886 4477 20219 23867 7680 15473 24317 7226 7282 26047 21321
411 21321 14599 23037 17878 11059 24550 21807 6744 19043 28790 11702 12970 27203 14752
424 14752 4954 16258 12998 5464 17364 16423 3130 9906 13164 -2132 3503 15727 1956 -941
438 -941 18380 12190 -2563 6587 10679 2973 11579 16035 5972 15061 23781 5260 1752 21342
$$ packed form
343D077L494K6565r322k6349M285O104m618J1729O193j0307J0307P182k6736q422
357e818K2418K646m889J5928m167k0217Q068Q078j4498J004J2015k841R311J0413
371C7451k7757j7459K3982J0438j2350O958N228j2772N417O682j8608j489J8088
384B3809k405k780J1006j2419j4835J7369M989k0973O257J9218q317p193L551
397A7277j0307J97J6977p258j2409J5742L648j6187P793Q844j7091N6J8765m726
411B1321o722Q438n159o819J3491k743j5063J2299R747j7088J268J4233j2451
424A4752r798J1304l260p534J1900r41j3293O776L258j5296N635J2224j3771k897
438i41J9321o190j4753R150M092p706Q606M456j0063R089Q720j8521l508J9590
$$ plain form
452 21342 17348 7704 19570 19260 6373 13650 17394 2893 5496 14701 5492 6757 15769 -414
466 -414 -10557 6745 6156 -8802 -169 6778 -4740 -1597 5049 -6918 -5742 7751 1107 -1198
480 -1198 12845 7188 -3145 11811 16080 390 6632 21490 13773 10398 16732 8333 7302 19789
494 19789 11301 449 14088 16467 -346 3426 9939 -4743 -4517 7788 -355 -7020 2133 -2813
508 -2813 -10064 1 -1246 -11630 974 9024 -5346 -3194 10548 2798 -1244 12744 11638 5628
522 5628 16185 15955 6085 14625 18919 6680 13029 24530 10171 3722 15963 10338 -957 7018
536 7018 7443 -2270 3615 3647 -10670 -6622 1698 -10761 -11893 2560 -4227 -13160 -1555 -1716 -11737
551 -11737 -1710 5433 -2398 3848 11446 1329 2933 15691 7432 3156 19347 18257 5451 12712
$$ packed form
452B1342l994r644J1866l10j2887P277L744j4501K603R205r209J265R012j6183
466d14j0143J7302n89j4958Q633O947j1518L143O646j1967J176J3493o644k305
480a198J4043n657j0333J4956M269j5690O242J4858p717l375O334q399j031J2487
494A9789q488j0852J3639K379j6813L772O513j4682K26J2305q143o665R153m946
508b813p251J0065j247j0384J2604Q050j4370K152J3742p750m042J3988j106o010
522E628J0557k30r870Q540M294j2239O349J1501j4359o449J2241n625j1295P975
536G018M25r713N885L2j4317M048Q320j2459j132J4453o787q933J1605j61j0021
551a1737J0027P143p831O246P598j0117J604J2758q259m276J6191j090j2806P261
$$ plain form
565 12712 16483 4042 6442 13398 4265 4561 11125 -1396 -7051 3664 -3407 -15318 -3195 1387
579 1387 -12851 -10714 -4185 -13599 -13584 -3876 -9320 -9275 3223 -789 -8661 3408 5553 -4711 5785
594 5785 16576 7057 8208 19231 11678 6358 15476 12743 8119 18196 15538 2613 9379 12137
608 12137 -3311 -2040 9259 302 -5147 3669 -2668 -11582 -3976 -4631 -11653 -1327 3120 -7900
622 -7900 -3302 6984 -3233 -5055 10413 10384 5920 16369 15930 7780 16879 20578 11432 18491 27743
637 27743 17101 14589 23886 14936 6871 18223 17689 6329 10079 11338 643 2601 5445 -5666
651 -5666 -2663 8280 -1832 -9815 1490 -6 -8877 949 6430 -1707 2940 9333 2116 3819
665 3819 14106 9425 9750 22260 16241 6525 16596 20724 9728 14510 21963 12213 10112 14344
$$ packed form
565A2712L771j2441K400O956r133K96O564j2521n655J0715p071j1911J2123M582
579A387j4238K137O529r414J5R708n444M5J2498m012p872J2069K145j0264J0496
594E785J0791r519J151J1023p553n320R118k733m624J0077k658j2925O766K758
608A2137j5448J271J1299q957n449Q816o337q914P606o55p022J0326M447j1020
622g900M598J0286j0217j822J5468k9m464J0449m39q150R099L699r146P059R252
637B7743j0642k512R297q950q065J1352n34j1360L750J259j0695J958K844j1111
651e666L003J0943j0112p983J1305j496q871R826N481q137M647O393p217J703
665C819J0287m681L25J2510o019r716J0071M128j0996M782P453r750k101M232
$$ plain form
679 14344 4227 -50 9533 5006 -2743 4806 946 -12906 -8191 -2836 -13388 -10961 97 -6265
693 -6265 -11475 -5735 -10386 -14078 -369 1889 -5889 3712 9301 -3055 -2233 7987 4013 5316 17337
708 17337 12113 3688 10077 7410 -1155 6988 10849 1030 4704 10266 -5088 -12129 -2581 -4648 -9313
723 -9313 -1615 -4088 -13119 -8077 -8197 -18605 -11183 -673 -6753 -5456 3673 -5119 -10918 1914 5736
738 5736 273 9004 13952 6446 10022 13001 3995 8872 20976 14701 9111 17226 12045 1835 9249
753 9249 11213 2369 6595 12153 1900 -1280 2824 -4390 -5094 6306 2453 -5571 2723 3977 -6641
768 -6641 -1315 7196 2008 5750 13925 6547 4601 14415 11383 6935 18646 20954 11459 16589 20464
783 20464 10419 11697 19858 13590 10568 17667 11360 4014 10283 7109 -1702 6295 10767 -1546
$$ packed form
679A4344j0117m277R583m527p749P549l860j3852M715N355j0552K427J1058o362
693f265n210N740m651l692J3709K258p778R601N589j2356Q22J0220l974J303J2021
708A7337n224q425O389k667q565Q143L861r819L674N562j5354p041R548k067m665
723i313P698k473r031N042j20j0408P422J0510o080J297R129q792n799J2832L822
738E736n463Q731M948p506L576K979r006M877J2104o275n590Q115n181j0210P414
753I249J964q844M226N558j0253l180M104p214p04J1400l853q024Q294J254j0618
768f641N326Q511n188L742Q175p378j946R814l032m448J1711K308r495N130L875
783B0464j0045J278Q161o268l022P099o307p346O269l174q811P997M472j2313
$$ plain form
797 -1546 -2548 4141 -3291 -4994 3204 -656 -4579 4584 3343 -4860 1791 4922 -1526 5577 14223
812 14223 3617 1507 12658 9252 3504 10182 9817 5606 12958 12385 327 2871 9560 1932 1028
827 1028 7903 -422 -5678 3041 -894 -11487 -5440 -968 -6789 -3918 -2689 -12188 -10432 195 -6128
842 -6128 -9711 495 -505 -5893 872 1505 -7147 -521 7707 1385 2641 7797 36 -1915 7796
857 7796 3617 -3748 5071 7702 -1328 -70 1243 -7156 -4173 3883 -3301 -6584 346 -5573 -11721
872 -11721 -3399 -3620 -11440 -3957 2847 -6347 -6770 -1412 -6953 -6291 4453 1185 -3130 4364 2431
887 2431 -4870 2754 6142 -2609 1666 11063 3161 -2027 2677 -697 -2756 6609 3955 -5217 427
902 427 1662 -6729 -4810 1154 -6183 -5012 3775 -3732 -11656 -4791 -3313 -6118 651 538 -8273 -3697
$$ packed form
797a546j002O689p432j703Q198l860l923R163j241q203O651L131o448P103Q646
812A4223j0606k110J1151l406n748O678l65m211P352n73j2058K544O689p628r04
827A028O875q325n256Q719l935j0593O047M472n821K871J229r499J756J0627o323
842f128l583J0206j000n388O765O33q652O626Q228o322J256N156p761j951R711
857G796m179p365Q819K631r030J258J313q399K983Q056p184l283O930n919o148
872a1721Q322k21p820P483O804r194m23N358n541O62J0744l268m315P494j933
887B431p301P624L388q751M275R397p902n188M704l374k059R365k654r172N644
902D27J235q391J919N964p337J171Q787p507p924O865J478k805O769j13q811M576
$$ plain form
918 -3697 2447 -5879 -6078 2538 -9 -1523 5895 -26 -9609 -2137 3465 -600 2588 3710 -5710
933 -5710 -4143 2695 -5658 -10001 1539 2789 -3410 -762 -5073 -14237 -6883 647 -4877 -4193 987
948 987 -6680 -9360 -3308 -8394 -12718 71 4815 -3626 -4035 -4589 -12237 -7204 2446 -2448 -3468 3649
964 3649 -1384 -8226 -3494 -5825 -10955 723 8368 -2176 -6131 -4099 -9763 -7778 921 -3362 -5845
979 -5845 2710 616 -9765 -7413 -5196 -9411 -1440 6567 -2664 -8096 -3223 -6171 -8004 -193 -1908
994 -1908 -6336 1942 2698 -8525 -8381 -2416 -5630 -1593 5509 -3099 -9363 -1685 -1458 -6334 -1459 -190
1010 -190 -5227 816 3495 -8054 -8951 1718 374 -1997 2917 -2206 -8627 -1183 1631 -5915 -1881
1025 -1881 2158 -4244 -2805 825 -8309 -11026 1022 2233 -4213 -1926 -4745 -11240 -4327 389 -6834
$$ packed form
918c697O144q326j99Q616k547j514P418n921r583P472N602m065L188J122r420
933e710J567O838q353m343J1540J250o199K648m311r164P354P530n524O84N180
948I87p667k680O052n086m324J2789M744q441m09n54p648N033R650m894j020P117
964C649n033o842M732k331n130J1678P645j0544l955K032n664J985Q699m283k483
979e845Q555k094j0381K352K217m215P971Q007r231n432M873k948j833P811j715
994a908m428Q278P56j1223J44N965l214M037P102q608o264P678K27m876M875J269
1010a90n037O043K679j1549q97J0669j344k371M914n123o421P444K814p546M034
1025a881M039o402J439L630r134k717J2048J211o446K287k819o495O913M716p223
$$ plain form
1040 -6834 -4891 2383 -2923 -5674 -2021 -7529 -10230 2373 5729 -3403 -2753 -1445 -7336 -3960 2153
1055 2153 -4264 -3378 5715 1379 -6476 -3923 -6045 -9443 926 5107 -5519 -7492 -2632 -7169 -8563
1070 -8563 -4124 -8699 -9015 2011 -77 -11439 -10179 -7197 -9522 -2911 1639 -7296 -8254 70 -2621
1085 -2621 -8003 -3504 -4082 -4804 4574 3960 -8276 -6754 690 -3730 -3282 1347 -4611 -6448 1158 -2256
1101 -2256 -11166 -7068 -3958 -7129 -2456 -2181 -12634 -11224 -1948 -6558 -11416 -6376 -6625 -8240 -745
1116 -745 -2954 -12412 -7703 -495 -4328 -3093 768 -5985 -5461 3882 407 -7160 -1349 860 -2749
1131 -2749 1774 2189 -6846 -5360 1340 -3598 -5332 -275 -4356 -8466 -1391 -2916 -12206 -7653 -2725
1146 -2725 -6624 -5179 -2853 -9838 -9154 -445 -4282 -9063 -2319 -296 -3569 1219 916 -8188 -3316
$$ packed form
1040f834J943P274n306k751L653n508k701J2603L356r132O50J308n891L376O113
1055B153o417Q86R093m336p855K553k122l398J0369M181j0626j973M860m537j394
1070h563M439m575l16J1026k088j1362J260K982k325O611M550q935r58Q324k691
1085b621n382M499n78p22R378o14j2236J522P444m420M48M629n958j837P606l414
1101b256q910M098L110l171M673K75j0453J410R276m610m858N040k49j615P495
1116g45k209r458M709P208l833J235L861o753N24R343l475p567N811K209l609
1131b749M523M15r035J486O700m938j734N057m081m110P075j525r290M553M928
1146b725l899J445K326o985O84Q709l837m781O744K023l273M788l03r104M872
$$ plain form
1161 -3316 5633 2979 1089 3413 -1524 -2084 6543 2753 -5746 -368 4922 546 1191 -54 -9157
1176 -9157 -7148 2837 -570 -6529 -2823 -4407 -7029 -1473 -3537 -11627 -4578 3866 -2288 -5341 -1264
1191 -1264 -4272 -3122 4498 858 -5262 3075 7315 1039 1671 2592 -2470 3030 10918 2617 -3401
1206 -3401 2425 3223 138 4085 22 -7769 -912 4273 -3145 -5143 -1489 -5366 -5401 1197 -4550 -10474
1222 -10474 -2349 877 -4030 -1237 7 -5985 -2620 3404 -2133 -1725 6744 4480 -33 4309 2224
1237 2224 -2964 3609 8364 2459 3341 5848 -1112 -1664 3521 -2414 -5653 3035 4009 -2487 -1962 -4645
1253 -4645 -12217 -6459 2063 -2420 -4954 -1208 -5116 -6998 -893 -4781 -9429 278 5904 443 179
1268 179 385 -6049 -3261 5845 2977 119 6084 4337 -1350 1130 -840 -6216 1794 7767 -733
$$ packed form
1161c316Q949k654j890K324m937n60Q627l790q499N378N290m376O45j245r103
1176i157K009R985l407n959L706j584k622N556k064q090P049Q444o154l053M077
1191a264l008J150P620l640o120Q337M240o276O32R21n062N500P888q301o018
1206c401N826P98l085L947m063p791O857N185p418j998L654l877l5O598n747n924
1222a0474Q125L226m907K793J244n992L365O024n537M08Q469k264m513M342k085
1237B224n188O573M755n905Q82K507o960n52N185n935l239Q688R74o496N25k683
1253d645p572N758Q522m483k534L746l908j882O105l888m648R707N626n461k64
1268A79K06o434K788R106k868k858N965j747n687K480j970n376Q010N973q500
$$ plain form
1283 -733 -4309 -593 -3975 -6111 -2340 -6865 -9473 -126 1753 -7753 -9444 -7410 -9915 -4109 1272
1298 1272 -6796 -9374 -634 -135 -5447 -2746 -3580 -6513 2074 5715 -2270 -3019 2184 -1652 -2835 1949
1314 1949 -1811 -4627 2719 2402 -5369 -3549 -2030 -6620 -4749 -2129 -8165 -7416 260 -4013 -10905
1329 -10905 -7517 -7426 -9336 -2832 -823 -8153 -5947 -855 -5423 -5864 -737 -4036 -4430 4247 3541 -3007
1345 -3007 -419 -61 -5080 177 6193 1069 -749 3075 -1268 -3924 986 -2500 -6361 1427 3279
1360 3279 -4078 -3950 -2663 -8162 -6025 346 -3631 -5127 1381 -1452 -7747 -3674 -2060 -4721 1588
1375 1588 4945 -2353 -2473 3494 289 -1465 2704 847 -360 7836 7095 -2723 -1663 1769 -837
1390 -837 2564 5441 -1815 -4329 3055 382 -5199 -2285 -1800 -4497 1351 1172 -7289 -5907 -53 -4247
$$ packed form
1283g33l576L716l382k136L771m525k608R347J879r506j691K034k505N806N381
1298A272q068k578Q740M99n312K701q34k933Q587L641p985p49N203l836j183M784
1314A949l760k816P346l17p771J820J519m590J871K620o036P49P676m273o892
1329a0905L388R1j910O504K009p330K206N092m568m41N127l299l94Q677p06o548
1345c007K588L58n019N257O016n124j818L824m343k656M910l486l861P788J852
1360C279p357J28J287n499K137O371l977j496O508k833o295M073J614k661O309
1375A588L357p298j20N967l205j754M169j857j207Q196p41r818J060L432k606
1390h37L401K877p256k514P384k673n581K914M85k697N848j79q461J382N854m194
$$ plain form
1406 -4247 -5826 -160 -1530 -3504 1518 -795 -6932 -1776 2361 -1738 -342 2385 -2737 -1819 4297
1421 4297 -1121 -5404 527 1602 -2219 1009 -139 -7587 -5041 607 -4006 -5297 -1130 -5641 -7849
1436 -7849 -2361 -4975 -10518 -4871 -2694 -7883 -5248 -2173 -8153 -7776 -2378 -5877 -6860 51 -1926
1451 -1926 -7651 -3247 -1899 -7161 -3398 205 -4724 -3694 514 -4894 -7013 -1429 -3622 -7796 -2492
1466 -2492 -1307 -6886 -4233 -3287 -9500 -8002 -1353 -5160 -7421 -3435 -6262 -8615 -2941 -4110 -9701
1481 -9701 -4535 -712 -5471 -3894 -922 -6228 -6752 -25 -1828 -5325 -376 -110 -4212 -433 67 -6003
1497 -6003 -2918 1846 -2632 -3774 1080 -1864 -4712 -393 -2868 -7118 -1163 1750 -4084 -3106 -679
1512 -679 -4750 -4176 694 -3500 -5784 1348 970 -3852 -754 -825 -5646 -1510 3101 -1414 -1184 3649
$$ packed form
1406d247j579N666j370j974N022k313o137N156M137m099J396K727n122R18O116
1421D297n418m283N931J075l821L228j148p448K546N648m613j291M167m511k208
1436g849N488k614n543N647K177n189K635L075n980L77N398l499r83O911j977
1451a926n725M404J348n262L763L603m929J030M208n408k119N584k193m174N304
1466b492J185n579K653R46o213J498O649l807k261L986k827k353N674j169n591
1481i701N166L823m759J577K972n306n24O727j803l497M949K66m102L779N00o070
1497f003L085M764m478j142M854k944k848M319k475m250N955K913n834R78K427
1512f79m071N74M870m194k284P132l78m822L098p1m821M136M611m515K30M833
$$ plain form
1528 3649 -507 -3689 1177 -399 -3825 2336 3895 -1809 130 1955 -3924 -3377 1693 -1646 -2243
1543 -2243 3593 1060 -4981 -1396 -1371 -5398 -1133 2295 -2314 -1496 2151 -3020 -5412 -954 -1567 -3651
1559 -3651 2662 2341 -3474 -1387 459 -5196 -3588 2040 -967 -1598 2842 -1038 -5121 -1173 -1821 -5241
1575 -5241 -289 1972 -2976 -1997 966 -4860 -6036 -315 -2299 -3687 1663 331 -5342 -2563 -1106
1590 -1106 -6170 -3112 1468 -2333 -2133 1833 -2480 -6333 -1224 -1448 -4725 184 2001 -3130 -1575
1605 -1575 813 -5116 -4577 1165 -1406 -2511 2688 519 -4595 -1077 -640 -5109 -1359 2888 -1624
1620 -1624 -1074 2176 -2357 -5138 249 -749 -2952 2077 2628 -2762 -1089 260 -4350 -2516 2715 -811
1636 -811 -1607 3030 -323 -4468 -370 170 -3639 410 3417 -1778 -1411 1833 -2327 -3657 1766 522
$$ packed form
1528C649m156l182M866j576l426O161J559n704J939J825n879N47N070l339n97
1543b243N836k533o041L585K5m027M265L428m609Q18L647n171k392M458o13k084
1559c651O313l21n815K087J846n655J608N628l007o31M440l880m083L948o48l420
1575e241M952K261m948R79K963n826j176N721j984j388N350j332n673K779J457
1590a106n064L058M580l801K00L966m313l853N109k24l277M909J817n131J555
1605a575K388n929N39N742k571j105N199k169n114L518M37m469L750M247m512
1620a624N50L250m533k781N387r98k203N029N51n390J673J349m610J834N231l526
1636h11p96M637l353m145M098N40l809M049L007n195L67L244m160j330N423j244
$$ plain form
1652 522 -1817 2841 1543 -4090 -690 1981 -2729 -1112 2617 -948 -1304 2930 -1059 -4607 715
1667 715 1085 -2442 520 1343 -3725 -1786 1948 -2994 -3656 1574 -433 -2868 1048 -259 -4013 69
1683 69 1651 -3783 -1809 2100 -1081 -1178 2444 -1877 -3333 2551 1717 -2923 257 1524 -1845 1092
1699 1092 2891 -2841 -2337 3153 631 -1884 1856 403 -2494 1826 1658 -3403 -517 3375 -741
1714 -741 -736 2847 -557 -1392 3383 1178 -1962 3092 4198 -178 1559 3547 -631 1842 5871 1462
1730 1462 268 4708 2695 363 4020 3680 -192 3803 5661 884 1352 4736 1411 641 4783 2620
1746 2620 299 4698 3412 -1581 2411 5212 761 1981 4847 1076 1161 5639 2017 -928 4552
1761 4552 4946 1398 3728 4268 170 2398 5692 1067 412 5525 3191 411 3359 1824 -1522 3282
$$ packed form
1652E22k339M658j298n633L400K671m710J617L729l565l56M234l989l548N322
1667G15L70l527K962Q23n068J939L734m942o62N230k007k435L916j307l754M082
1683F9J582n434J974L909l181r7L622m321j456N884q34m640L180J267l369K937
1699A092J799n732N04N490k522k515L740j453k897M320j68n061K886L892m116
1714g41NL583l404q35M775k205l140N054J106m376J737J988m178K473M029m409
1730A462j194M440k013k332L657l40l872L995J858m777M68L384l325p70M142k163
1746B620k321M399j286m993L992K801m451J220K866l771Q5M478l622k945N480
1761D552L94l548K330N40m098K228L294m625o55N113k334k780K948j535l346M804
$$ plain form
1777 3282 4237 -1433 175 3469 -65 -1039 1339 -1951 -2046 3864 2199 -3109 -446 666 -2241 303
1793 303 1800 -2743 -663 4534 331 -3169 -25 -265 -1966 2610 1975 -2513 617 2514 -2591 -2769
1809 -2769 636 -664 -218 3068 -517 -4617 -525 499 -3335 -1513 1100 -1366 384 1873 -3388
1824 -3388 -4721 1150 967 -1066 2148 1475 -1987 1267 2123 -2534 -580 4625 2314 1061 3679 780
1840 780 -775 3943 3361 -583 3647 6090 1729 1578 3348 612 1832 6590 3070 -15 4991 4720
1856 4720 1187 3546 4066 1114 4350 7416 1921 1514 5972 4743 2784 5552 4488 2439 6905
$$ packed form
1777C282R55n670J608L294l534r74K378l290r5N910j665n308K663J112k907K544
1793C03J497m543K080N197m203l500L144k40j701M576o35m488L130J897n105j78
1809b769L405j300M46L286l585m100M092J024l834J822K613k466J750J489n261
1824c388j333N871j83k033L214o73l462L254Q56m657J954N205k311j253K618k899
1840G80j555M718n82l944M230K443m361j51J770k736J220M758l520l085N006k71
1856D720l533K359N20k952L236L066n495m07M458j229j959K768j064k049M466
$$ [...]
8191a66
##END NTUPLES=NMR FID
##END=
