##TITLE=1H_EC-3195(Xa)
 DMSO, 8 sc, 
 7.5.2019
##JCAMPDX= 6.0         $$ Bruker NMR JCAMP-DX V2.0
##DATA TYPE= NMR FID
##DATA CLASS= NTUPLES
##ORIGIN= UXNMR, Bruker Analytische Messtechnik GmbH
##OWNER= root
$$ XWIN-NMR		Version 3.5
$$ Tue May  7 12:41:27 2019 Russian Standard Time (UT+4h)  she@DPX200
##.OBSERVE FREQUENCY= 200.1315
##.OBSERVE NUCLEUS= ^1H
##.DELAY= (6, 6)
##.ACQUISITION MODE= SIMULTANEOUS
##.ACQUISITION SCHEME= undefined
##.AVERAGES= 8
##.DIGITISER RES= 18
##SPECTROMETER/DATA SYSTEM= spect
##.PULSE SEQUENCE= zg30
##.SOLVENT NAME= DMSO
##.SHIFT REFERENCE= (INTERNAL, DMSO, 0, 15.7039)
##AUDIT TRAIL= $$ (NUMBER, WHEN, WHO, WHERE, WHAT)
$$ ##TITLE= Audit trail, XWIN-NMR		Version 3.5
$$ ##JCAMPDX= 5.01
$$ ##ORIGIN= Bruker BioSpin GmbH
$$ ##OWNER= she
$$ F:/spectra/data/she/nmr/H-F/1/audita.txt
$$ ##AUDIT TRAIL=  $$ (NUMBER, WHEN, WHO, WHERE, WHAT)
(   1,<2019-05-07 12:40:08.90 +0400>,<she>,<DPX200>,
      <created by zg, POWCHK disabled, PULCHK disabled
       configuration hash MD5:
       00 E9 B6 7A A2 85 ED C7 34 08 36 98 17 FE 4E 26
       data hash MD5: 16K
       E3 46 B0 BC F4 7F 7D 76 F0 43 37 8F 42 D8 89 E8>)
$$ ##END=
$$ 
$$ hash MD5
$$ 6B B8 66 8B 93 53 AE 01 E7 49 33 99 2C 75 11 B9
##$RELAX= 
##$RELAX= 
##$RELAX= 
##$RELAX= 
##$RELAX= 
##$RELAX= 
$$ Bruker specific parameters
$$ --------------------------
##$DU= <F:/spectra>
##$EXPNO= 1
##$NAME= <H-F>
##$PROCNO= 1
##$TYPE= <nmr>
##$USER= <she>
##$AMP= (0..31)
100 100 100 100 100 100 100 100 100 100 100 100 100 100 100 100 100 100 
100 100 100 100 100 100 100 100 100 100 100 100 100 100 
##$AQSEQ= 0
##$AQ_mod= 1
##$AUNM= <au_zg>
##$AUTOPOS= <>
##$BF1= 200.13
##$BF2= 200.13
##$BF3= 200.13
##$BF4= 200.13
##$BF5= 200.13
##$BF6= 200.13
##$BF7= 200.13
##$BF8= 200.13
##$BYTORDA= 1
##$CFDGTYP= 0
##$CFRGTYP= 5
##$CHEMSTR= <none>
##$CNST= (0..31)
1 1 145 1 1 1 1 1 1 1 1 1 1 1 1 1 1 1 1 1 1 1 1 1 1 1 1 1 1 1 1 1 
##$CPDPRG= <>
##$CPDPRG1= <>
##$CPDPRG2= <>
##$CPDPRG3= <>
##$CPDPRG4= <mlev>
##$CPDPRG5= <mlev>
##$CPDPRG6= <mlev>
##$CPDPRG7= <mlev>
##$CPDPRG8= <mlev>
##$CPDPRGB= <>
##$CPDPRGT= <>
##$D= (0..31)
0 1.2 0 0 0 0 0 0 0 0 0 0.03 0 0 0 0 0 0 0 0 0 0 0 0 0 0 0 0 0 0 0 0 
##$DATE= 1557218408
##$DBL= (0..7)
120 120 120 120 120 120 120 120 
##$DBP= (0..7)
150 150 150 150 150 150 150 150 
##$DBP07= 0
##$DBPNAM0= <>
##$DBPNAM1= <>
##$DBPNAM2= <>
##$DBPNAM3= <>
##$DBPNAM4= <>
##$DBPNAM5= <>
##$DBPNAM6= <>
##$DBPNAM7= <>
##$DBPOAL= (0..7)
0.5 0.5 0.5 0.5 0.5 0.5 0.5 0.5 
##$DBPOFFS= (0..7)
0 0 0 0 0 0 0 0 
##$DE= 6
##$DECBNUC= <off>
##$DECIM= 24
##$DECNUC= <off>
##$DECSTAT= 4
##$DIGMOD= 1
##$DIGTYP= 9
##$DL= (0..7)
0 120 120 120 120 120 120 120 
##$DP= (0..7)
150 150 150 150 150 150 150 150 
##$DP07= 0
##$DPNAME0= <>
##$DPNAME1= <>
##$DPNAME2= <>
##$DPNAME3= <>
##$DPNAME4= <>
##$DPNAME5= <>
##$DPNAME6= <>
##$DPNAME7= <>
##$DPOAL= (0..7)
0.5 0.5 0.5 0.5 0.5 0.5 0.5 0.5 
##$DPOFFS= (0..7)
0 0 0 0 0 0 0 0 
##$DQDMODE= 0
##$DR= 18
##$DS= 0
##$DSLIST= <SSSSSSSSSSSSSSS>
##$DSPFIRM= 0
$$ [...]
##$SUBNAM2= <"">
##$SUBNAM3= <"">
##$SUBNAM4= <"">
##$SUBNAM5= <"">
##$SUBNAM6= <"">
##$SUBNAM7= <"">
##$SUBNAM8= <"">
##$SUBNAM9= <"">
##$SW= 24.9337058887773
##$SWIBOX= (0..15)
0 0 2 0 0 0 0 0 0 0 0 0 0 0 0 0 
##$SW_h= 4990.01996007984
##$TD= 16384
##$TD0= 1
##$TE= 0
##$TE2= 300
##$TE3= 300
##$TEG= 300
##$TL= (0..7)
0 120 120 120 120 120 120 120 
##$TP= (0..7)
150 150 150 150 150 150 150 150 
##$TP07= 0
##$TPNAME0= <>
##$TPNAME1= <>
##$TPNAME2= <>
##$TPNAME3= <>
##$TPNAME4= <>
##$TPNAME5= <>
##$TPNAME6= <>
##$TPNAME7= <>
##$TPOAL= (0..7)
0.5 0.5 0.5 0.5 0.5 0.5 0.5 0.5 
##$TPOFFS= (0..7)
0 0 0 0 0 0 0 0 
##$TUNHIN= 0
##$TUNHOUT= 0
##$TUNXOUT= 0
##$USERA1= <user>
##$USERA2= <user>
##$USERA3= <user>
##$USERA4= <user>
##$USERA5= <user>
##$V9= 5
##$VALIST= <valist>
##$VCLIST= <CCCCCCCCCCCCCCC>
##$VD= 0
##$VDLIST= <DDDDDDDDDDDDDDD>
##$VPLIST= <PPPPPPPPPPPPPPP>
##$VTLIST= <TTTTTTTTTTTTTTT>
##$WBST= 1024
##$WBSW= 4
##$XGAIN= (0..3)
0 0 0 0 
##$XL= 0
##$YL= 0
##$YMAX_a= 66540
##$YMIN_a= -107961
##$ZGOPTNS= <>
##$ZL1= 120
##$ZL2= 120
##$ZL3= 120
##$ZL4= 120
##$ABSF1= 10
##$ABSF2= 0
##$ABSG= 5
##$ABSL= 3
##$ALPHA= 0
##$AQORDER= 0
##$ASSFAC= 0
##$ASSFACI= 0
##$ASSFACX= 0
##$ASSWID= 0
##$AUNMP= <proc_1d>
##$AZFE= 0.1
##$AZFW= 0.1
##$BCFW= 1
##$BC_mod= 2
##$BYTORDP= 1
##$COROFFS= 0
##$CY= 11.3945322036743
##$DATMOD= 1
##$DC= 2
##$DFILT= <>
##$DTYPP= 0
##$F1P= 18.9103706918063
##$F2P= -1.10871071338519
##$FCOR= 0.5
##$FTSIZE= 0
##$FT_mod= 4
##$GAMMA= 1
##$GB= 0.15
##$INTBC= 1
##$INTSCL= 1
##$ISEN= 128
##$LB= 0.24
##$LEV0= 0
##$LPBIN= 0
##$MAXI= 10000
##$MC2= 0
##$MEAN= 0
##$ME_mod= 0
##$MI= 1.114404
##$NCOEF= 0
##$NC_proc= 0
##$NLEV= 6
##$NOISF1= 3.799351
##$NOISF2= 2.8
##$NSP= 1
##$NTH_PI= 0
##$NZP= 0
##$OFFSET= 15.70392
##$PC= 1
##$PHC0= -8857.417
##$PHC1= 15.80026
##$PH_mod= 1
##$PKNL= yes
##$PPARMOD= 0
##$PSCAL= 0
##$PSIGN= 0
##$REVERSE= no
##$SF= 200.130013532006
##$SI= 16384
##$SIGF1= 3
##$SIGF2= 2
##$SINO= 400
##$SIOLD= 16384
##$SREGLST= <1H.CDCl3>
##$SSB= 0
##$STSI= 0
##$STSR= 0
##$SW_p= 3612.71676300578
##$SYMM= 0
##$S_DEV= 0
##$TDeff= 0
##$TDoff= 0
##$TI= <>
##$TILT= no
##$TM1= 0
##$TM2= 0
##$TOPLEV= 0
##$USERP1= <user>
##$USERP2= <user>
##$USERP3= <user>
##$USERP4= <user>
##$USERP5= <user>
##$WDW= 1
##$XDIM= 8192
##$YMAX_p= 0
##$YMIN_p= 0
$$ End of Bruker specific parameters
$$ ---------------------------------
##NTUPLES= NMR FID
##VAR_NAME=  TIME,          FID/REAL,        FID/IMAG
##SYMBOL=    X,             R,               I
##VAR_TYPE=  INDEPENDENT,   DEPENDENT,       DEPENDENT
##VAR_FORM=  AFFN,          ASDF,            ASDF
##VAR_DIM=   8192,          8192,            8192
##UNITS=     SECONDS,       ARBITRARY UNITS, ARBITRARY UNITS
##FACTOR=    0.0002004,     1,               1
##FIRST=     0,             0,               0
##LAST=      1.6414764,     0,               0
##MIN=       0,             -107961,         0
##MAX=       1.6414764,     66540,           0
$$ Real data points
##PAGE= N=1
##DATA TABLE= (X++(R..R)), XYDATA
$$ [...]
$$ plain form
2058 -305 -1028 -570 350 1210 548 -957 -831 -860 347 1028 931 -374 -1413 -478 464 1174 178 -447 -894
2077 -894 -481 551 778 578 -226 -826 -726 152 907 873 -237 -917 -835 134 853 1082 -299 -1169 -1022 561
2097 561 832 703 -309 -1047 -382 98 856 564 123 -611 -784 -328 659 923 720 -981 -1200 -359 918
2116 918 1088 275 -835 -901 -20 898 984 -138 -1122 -733 7 661 941 -374 -627 -507 182 653 668 -86
2136 -86 -564 -554 -180 216 842 510 57 -650 -584 352 1026 1272 -334 -1382 -732 466 1213 432 -884 -1298
2156 -1298 -452 591 809 -79 -440 -426 100 410 330 515 92 -439 -487 -86 1075 824 -21 -1143 -881 110
2176 110 988 639 -269 -1147 -592 43 860 298 -226 -982 -771 316 750 767 -228 -818 -60 185 641 429
2196 429 -91 -348 -277 -10 348 898 393 -557 -1193 -376 819 1234 182 -957 -1294 -41 1012 790 -174
$$ packed form
2058c05p23M58R20Q60o62j505J26k9J207O81r7j305j039R35R42P10r96o25m47
2077h94M13J032K27k00q04o00J00Q78P55l4j110o80Q2R69P19K29j381q70J47J583
2097E61K71j29j012p38O65M80P58k92m41p34j73M56R87K64k03j701k19Q41J277
2116I18J70q13j110o6Q81R18Q6j122r84L89P40O54K80j315k53J20O89M71J5p54
2136h6m78J0L74L96O26l32m53p07O6R36O74K46j606j048O50J198P47p81j316m14
2156a298Q46J043K18q88l61J4N26L10q0J85m23n31m8M01J161k51q45j122K62R91
2176A10Q78l49r08q78N55O35Q17n62n24p56K11J087M34J7r95n90P58K45M56k12
2196D29n20k57P1K67L58N50n05r50o36Q17J195M15j052j139l37J253J053k22r64
$$ plain form
2215 -174 -769 -1100 533 583 226 57 -243 -395 -167 255 720 549 -67 -886 -758 282 1308 516 -856
2234 -856 -1191 -216 841 720 157 -1012 -1159 -160 796 716 -155 -831 -580 -433 465 118 48 -414 -352 -505
2254 -505 163 175 439 329 -260 -779 -412 736 865 37 -1234 -1040 163 1513 782 -538 -1435 -353
2272 -353 372 884 -101 -738 -425 -215 328 294 -60 71 -348 -345 -241 319 927 294 -579 -1052 -575 580 1000
2293 1000 193 -917 -901 439 775 599 -175 -798 -565 319 578 338 -214 -378 -235 77 493 -34 168
2312 168 -37 -221 -409 164 412 797 129 -898 -723 100 1202 595 -682 -1538 -250 1119 1087 -52
2330 -52 -1242 -611 467 626 58 -315 -360 -108 301 -8 -301 502 183 -124 -965 -379 749 944 90 -1065
2350 -1065 -891 741 1328 468 -820 -1285 -257 559 669 9 -1279 -499 -31 645 329 -256 -258 -185 -90 -221
$$ packed form
2215a74n95l31J633N0l57j69l00j52K28M22M65j71o16q19J28J040J026p92j372
2234h56l35R75J057j21n63j169j47R99R56q0q71o76K51J47Q98l47p0m62O2j53
2254e05O68J2K64j10n89n19L67J148J29q28j271J94J203J350p31j320q97J082
2272c53P25N12r85o37L13K10N43l4l54J31m19LJ04N60O08o33q73m73M77J155M20
2293A000q07j110J6J340L36j76p74o23K33Q84K59k40n52j64J43L12M16n27K02
2312A68k05j84j88N73K48L85o68j027J75Q23J102o07j277q56J288J369l2j139
2330e2j190O31J078J59n68l73m5K52M09l09k93Q03l19l07q41N86J128J95q54j155
2350a065J74J632N87q60j288m65J028Q16J10o60j288P80M68O76l16n85kP3R5j31
$$ plain form
2370 -221 -18 456 408 86 -668 -573 324 1055 559 -678 -1410 -17 1180 1513 -457 -1548 -925 642 1432
2389 1432 64 -996 -863 228 703 62 -294 -402 124 260 -305 -442 135 650 -65 -773 -730 308 1284
2408 1284 333 -928 -1170 -285 1232 761 -52 -847 -472 237 759 379 -467 -166 4 -24 163 194 -57 163
2428 163 112 -540 -725 174 853 397 -845 -887 -254 1109 1241 -391 -1456 -796 782 1215 252 -939 -1045
2447 -1045 160 1122 494 -605 -545 6 626 115 -269 -80 278 345 -511 -630 135 979 466 -633 -1113
2466 -1113 -23 1035 1194 -196 -1321 -561 541 807 283 -661 -889 -56 841 660 -269 -186 92 28 201
2485 201 -280 157 184 149 -274 -618 7 1027 902 -376 -1229 -644 607 1650 209 -1450 -653 214 1365
2504 1365 300 -670 -1225 -296 884 673 -464 -764 86 592 94 -643 -104 583 517 -236 -999 -273 873
$$ packed form
2370b21K03M74m8l22p54R5Q97P31m96j237p32J393J197L33j970j091O23J567P90
2389A432j368j060J33J091M75o41l56j08N26J36n65j37N77N15p15p08M3J038R76
2408A284r51j261k42Q85J517m71q13p95L75P09N22l80q46L01J70k8J87L1k51K20
2428A63n1o52j85Q99O79m56j242m2O33J363J32j632j065O60J578M33r63j191j06
2447a045J205R62o28j099O0N51O20n11l84J89L58O7q56j19P65Q44n13j099m80
2466a113J090J058J59j390j125P60J102K66n24r44k28Q33Q97j81r29Q3K78o4J73
2485B01m81M37K7l5m23l44O25J020j25j278q53N85J251J043j441j659P97Q67J151
2504A365j065r70n55R29J180k11j137l00Q50N06m98p37N39O87o6p53p63P26J146
$$ plain form
2523 873 962 -203 -1331 -733 796 1316 484 -1237 -1029 300 900 593 -418 -1021 -139 160 318 -273
2541 -273 -177 259 131 -210 -467 -86 622 762 -214 -820 -624 589 907 67 -1082 -832 421 1473 615
2560 615 -866 -1201 -196 822 557 -364 -1113 -124 763 93 -533 -363 487 617 -340 -539 -329 599 1100
2579 1100 104 -1392 -753 865 1342 154 -1041 -1112 86 1600 634 -461 -939 -339 756 681 -57 -677
2597 -677 -99 132 270 -87 -109 112 386 -40 -351 -206 437 848 193 -743 -783 389 1219 401 -585 -1281
2617 -1281 -101 945 946 -249 -1142 -696 631 532 -311 -782 -206 370 354 -555 -310 402 881 98 -939
2636 -939 -678 602 1053 321 -1025 -1225 266 1498 850 -686 -936 -401 878 988 -201 -1222 -374
2653 -374 345 661 14 -714 -559 459 279 -338 -312 459 414 -57 -609 -441 -6 1067 742 -703 -1220 4
$$ packed form
2523H73Q9j165j128N98J529N20q32j721K08J329O00l07j011o03Q82K99J58n91
2541b73R6M36j28l41k57L81P08J40r76o06J96J213L18q40j149K50J253J052q58
2560F15j481l35J005J018k65r21p49R89Q87o70o26J70Q50J30r57j99K10R28N01
2579A100r96j496O39J618M77j188j195p1J198J514r66j095m78O00J095p5p38o20
2597f77N78K31J38l57k2K21K74m26l11J45O43M11o55r36m0J172Q30q18r86o96
2617a281J180J046Jj195q93M46J327r9q43m71N76N76j6r09K45P12M79p83j037
2636i39K61J280M51p32j346k00J491J232o48j536k50N35J279J10j189j021Q48
2653c74P19L16o47p28J55J018j80o17K6P71m5m71n52J68M35J073l25j445n17J224
$$ plain form
2673 4 651 1007 -328 -900 -329 607 1045 -135 -613 -326 573 480 -229 -499 -274 454 240 -580 -770 276
2693 276 930 554 -785 -1168 280 1054 1129 -713 -1381 -393 795 1078 -601 -1071 -762 526 745 -298
2711 -298 -611 -381 330 166 80 -383 97 435 420 -67 -762 285 924 643 -304 -597 133 1209 761 -240
2731 -240 -1170 -724 440 857 318 -832 -1011 45 860 110 -572 -442 239 426 67 -277 -276 163 266 -498
2751 -498 -887 219 879 422 -645 -1161 -375 1228 1091 -446 -1337 -661 510 646 33 -686 -717 70 551
2770 551 -26 -572 -274 91 247 -18 -380 -174 463 342 31 -747 -234 666 440 -203 -1101 -716 773 1025
2790 1025 240 -945 -1020 447 694 607 -614 -856 -43 477 580 -597 -608 278 301 -1 -159 -237 399 858
2810 858 -301 -891 -173 1143 1446 -250 -1063 -580 826 968 48 -1013 -926 278 725 356 -640 -685 -90
$$ packed form
2673DO47L56j335n72N71R36M38j180m78K87Q99r3p09k70K25P28k14q20j90J046
2693B76O54l76j339l83J448P74P5j842o68R88J188K83j679m70L09J288K19j043
2711b98l13K30P11j64q6m63M80L38j5m87o95J047O39k81r47k93P30J076m48j001
2731b40r30M46J164M17n39j150j79J056Q15p50o82J30O81J87l59l44JM39J03p64
2751d98l89J106O60m57j067n16P86J603j37j537q91O76J171J36o13p19l1P87M81
2770E51n77n46K98L65J56k65l62K06O37j21l11p78N13R00k26o43q98L85J489K52
2790A025p85j185p5J467K47q7j221k42Q13N20J03j177j1Q86K3l02j58p8O36M59
2810H58j159n90P18J316L03j696q13M83J406J42r20j061Q7J204M47l69r96m5N95
$$ plain form
2829 -90 566 215 -639 -115 -33 697 -275 -438 -164 619 700 -106 -669 -426 349 726 318 -285 -631 327 897
2850 897 418 -734 -1106 -15 488 333 -103 -556 -15 360 328 -184 -390 310 238 198 -577 -203 522 1013
2870 1013 117 -959 -483 354 761 567 -885 -596 417 1233 278 -1076 -769 15 815 218 -531 -448 210
2889 210 117 -122 -699 -245 132 315 -549 -281 -300 509 659 154 -744 -827 409 752 475 -535 -869 -231
2909 -231 509 775 -368 -928 -536 409 281 -371 -359 -365 221 51 -414 -492 173 321 194 -264 -721 564 804
2930 804 563 -745 -645 180 839 737 -200 -833 -26 610 368 48 -247 114 509 194 -269 -470 185 215
2950 215 36 -812 -51 378 475 240 -718 -545 293 846 47 -421 -532 -148 744 668 -1 -565 -545 386 448
2971 448 -99 -542 -594 231 402 7 -552 26 159 177 -531 -232 -75 570 632 -329 -460 40 877 664 -115
$$ packed form
2829i0O56l51q54N24Q2P30r72j63K74P83Q1q06n63K43P75L77m08o03l46R58N70
2850H97m79j152l72J091N03j55m36m53N41L75l2n12k06P00p2m0p75L74P25M91
2870A013q96j076M76Q37M07j94j452K89J013Q16r55j354L07P84Q00n97p49Q3O58
2889B10r3k39n77M54L77J83q64K68j9Q09J50n05q98q3J236L43k77j010l34O38
2909b31P40K66j143n60L92R45j28o52J2oN86j70m65p8O65J48j27m58m57J285K40
2930H04k41j308J00Q25O59j02r37o33Q07O36k42l20k95L61L95l15m63k01O55L0
2950B15j79q48P61M29R7k35r58J73Q38N53p99m68j11L84Q92p6o69n64K0R31O2
2971D48n47m43n2Q25J71l95n59N78J33J8p08K99J57O45O2r61j31N00Q37k13p79
$$ plain form
2992 -115 -737 -20 746 281 -360 -533 -106 553 180 -65 -635 -351 334 55 -2 -187 144 323 2 -519
3012 -519 -417 233 657 248 -863 -404 -53 564 344 -157 -380 -263 516 346 29 -625 -490 396 352 164
3032 164 -262 -221 -66 341 3 -394 29 240 290 -205 -32 -120 588 626 -282 -816 -371 658 783 -118 -748
3053 -748 -238 329 749 230 -378 -476 -92 323 92 -442 -334 19 99 -257 -64 190 448 43 -236 -493 238
3074 238 619 315 -374 -458 -252 292 280 -64 -144 -451 79 465 107 -475 -305 -169 356 44 -159 5 72
3095 72 169 17 -67 -199 327 707 -322 -391 -513 693 806 -83 -993 -387 219 636 24 -453 -254 160 283
3116 283 16 -256 -326 -119 372 150 62 111 181 193 -179 -39 213 546 146 -355 -397 195 327 364 -117 -571
3138 -571 -441 149 429 237 -201 -157 -5 353 295 -1 -85 -90 -114 180 95 41 46 62 -45 -318 -212 382 625 233
$$ packed form
2992a15o22P17P66m65o41j73M27O59l73k45n70K84O85k79n7j85L31J79l21n21
3012e19J02O50M24m09j111M59L51O17k20n01k23J17P79j70l17o54J35Q86m4j88
3032A64m26M1J55M07l38l97M23K11N0m95J73q8P08L8r08n34M45J029J25r01o30
3053g48N10N67M20n19o08r8L84M15k31n34J08L53Q0l56J93K54K58m05k79k57P31
3074B38L81l04o89q4K06N44j2l44q0l07N30L86l58n82J70J36N25l12k03J64O7
3095G2R7j52q4j32N26L80j029o9j22J206J13q89r10O06O06M17o12m77J99M14J23
3116B83k67k72p0K07M91k22q8M9P0J2l72J40K52L33m00n01m2N92J32L7m81m54
3138e71J30N90K80j92m38M4J52L58n8k96q4nk4K94q5n4NJ6j07k73J06N94K43l92
$$ plain form
3162 233 -500 -286 301 519 69 -579 -380 39 478 310 -156 -540 7 259 550 191 -273 -127 303 278
3182 278 36 169 364 41 -40 -377 -265 -38 116 -197 -447 -263 217 325 219 -50 -138 298 209 105 -85
3203 -85 -331 170 87 86 324 -72 -305 78 144 -20 -35 116 485 18 -375 -285 95 500 46 -150 -277 82
3225 82 639 572 -246 -527 -209 525 185 -328 -90 -325 174 130 -164 -96 -137 268 -284 -368 67 105 393 -428
3247 -428 -538 -42 658 490 40 -59 -342 -256 246 629 -176 -286 35 74 370 -61 -86 -17 -207 156 302 -49
3269 -49 97 -271 -313 52 -23 -15 3 -170 -274 -315 118 584 207 127 -493 150 408 340 176 -274 -329 296 323 -19
3293 -19 -250 -97 100 127 164 -56 209 234 -76 -147 -79 318 155 7 -198 -45 338 171 211 -14 6 156 -157
3316 -157 24 10 -44 -418 -107 31 103 -62 -290 33 101 297 81 -5 277 -170 -116 -238 90 61 -152 -317
$$ packed form
3162B33p33K14N87K18m50o48J99M19M39j68m66l84N47K52K91l59m64J46M30k5
3182B78k42J33J95l23q1l37J12K27J54l13k50J84M80J08j06k69q8M36q9j04j90
3203h5k46N01q3jK38l96k33L83O6j64j5J51L69m67l93R0L80M05m54j96j27L59
3225H2N57o7q18k81L18P34l40n13K38k35M99m4k94O8m1M05n52q4M35L8K88q21
3247d28j10M96P00j68m50r9k83Q6N02L83q05j10L21L9K96m31k5O9j90L63J46l51
3269d9J46l68m2L65p5QJ8j73j04m1M33M66l77q0o20O43K58o8j64m50n5O25K7l42
3293a9k31J53J97K7L7k20K65K5l10p1O8L97j63j48k05J53L83j67M0k25K0J50l13
3316a57J81j4n4l74L11J38P2j65k28L23O8J96k16q6K82m47N4j22L28k9k13j65
$$ plain form
3338 -317 -103 -142 387 133 295 -78 -420 324 415 68 -112 -22 53 103 -22 -322 -59 27 -79 -160 -55 27 102
3361 102 102 -437 -232 34 49 -136 -322 -443 191 237 273 119 2 -100 -243 5 65 309 92 -55 -32 91
3383 91 -33 207 110 -111 -201 46 441 127 -109 -24 83 94 315 262 213 -323 -190 175 71 -25 15 -456 -16
3406 -16 262 -68 139 -191 -104 -96 -111 379 -106 305 -30 -91 -248 37 215 168 9 -421 183 311 -13 -13 -281
3429 -281 5 30 -11 1 -176 35 -235 45 366 40 176 -145 -238 16 233 90 76 -183 -59 26 17 62 133
3452 133 -237 -221 146 279 260 48 -250 -418 141 251 44 218 -335 33 71 213 -50 -230 30 -72 -235
3473 -235 -280 91 98 9 -211 -282 -27 260 305 14 -179 62 416 -47 11 101 286 -7 177 -215 -131 67 -18
3496 -18 -246 -140 29 178 154 -80 91 -52 354 -163 -265 242 30 -23 93 41 116 12 -99 -316 151 56
$$ packed form
3338c17K14l9N29k54J62l73l42P44R1l47j80R0P5N0j25l00K63Q6j06q1J05Q2P5
3361A02%n39K05K66J5j85j86j21O34M6L6j54j17j02j43K48O0K44k17j47K3J23
3383I1j24K40r7k21r0K47L95l14k36Q5J07J1K21n3m9n36J33L65j04r6M0m71M40
3406a6K78l30K07l30Q7Qj5M90m85M11l35o1j57K85J78m7j59m30O04J28l24%k68
3429b81K86K5m1J2j77K11k70K80L21l26J36l21r3K54K17j43j4k59J24Q5rM5P1
3452A33l70J6L67J33j9k12k98j68N59J10k07J74n53L68L8J42k63j80K60j02j63
3473b35m5L71Pq9k20p1K55K87M5k91j93K41L54m63N8R0J85k93J84l92Q4J98q5
3496a8k28J06J69J49k4k34J71j43M06n17j02N07k12n3J16n2P5j04j11k17M67r5
$$ plain form
3518 56 -124 -121 -75 419 8 -27 -256 -323 -168 108 116 -83 -57 12 -187 -231 -278 398 143 -38 -113 -87 202 -37 -128
3543 -128 -321 295 185 85 103 181 -25 47 256 1 -243 44 -164 -195 -330 -14 115 86 21 -11 -54 243 24
3566 24 -153 -97 16 -72 59 228 -67 -176 -41 -130 328 131 -20 -103 -348 -286 274 -110 -29 -242 94 51 80
3589 80 -151 67 12 -357 86 -217 66 409 36 -197 213 161 90 436 40 -71 -141 36 54 -179 245 -300
3611 -300 -100 -66 -190 222 127 -274 -106 27 167 -100 -146 -41 -54 -26 -179 54 247 -115 -8 30 -89 -138
3633 -138 222 14 -395 225 267 202 86 178 -186 209 203 85 -277 29 -137 28 150 209 150 -156 -47 -133 -98
3656 -98 414 -84 -389 -175 -127 149 11 -230 -62 -54 -153 -31 40 286 -101 -166 -375 -229 162 275 69 -65
3678 -65 -519 39 132 -185 -130 38 -151 -137 -10 231 353 -196 21 -16 7 181 216 -265 -127 -105 233 108 -138
$$ packed form
3518E6j80LM6M94m11l5k29o7J55K76Qj99K6O9j99m4m7O76k55j81p5K6K89k39r1
3543a28j93O16j10j00J8P8k06P2K09k55k44K87k08l1j35L16J29k9o5l2m3K97k19
3566B4j77N6J13q8J31J69k95j09J35q9M58j97j51q3k45O2N60l84Q1k13L36m3K9
3589H0k31K18n5l69M43l03K83L43l73k33M10n2p1L46l96j11p0J77J8k33M24n45
3611c00K00L4j24M12r5m01J68J33J40k67m6J05j3K8j53K33J93l62J07L8j19m9
3633a38L60k08m09O20M2o5j16R2l64L95oj18l62L06j66J65J22N9n9l06J09q6L5
3656i8N12m98l05K14M8K76j38k41J68Qr9J22P1K46l87o5k09J46L91J13k06j34
3678f5m54N58R3l17N5J68j89J4J27K41J22n49K17l7K3J74L5m81J38K2L38j25k46
$$ plain form
3701 -138 -430 -173 289 -77 245 -127 16 -278 48 449 52 17 13 201 191 330 90 -133 -146 82 93 169
3723 169 -189 220 -193 -11 -187 125 244 109 -21 -33 -112 18 -52 -7 -234 -293 -94 266 -46 29 -379 -195
3745 -195 88 -27 -15 96 58 -314 155 -160 523 200 -95 -130 -23 240 -28 213 -363 -132 -1 19 -91
3766 -91 160 -206 -229 -135 259 248 33 9 29 -161 -21 178 -187 26 -78 236 231 -103 -3 -119 -108 -40 -207
3789 -207 156 188 -340 -220 -267 214 90 225 -129 -239 -131 -103 -79 -88 -57 -20 229 -21 42 7 214 -190 -211 20
3813 20 93 -35 13 -458 -135 126 -6 68 -192 -267 46 126 196 -78 -72 -100 -98 -93 -152 40 -173 53 -140 -6 116
3838 116 -104 -402 -70 -16 -161 -64 320 -28 -105 -242 -234 -259 -95 244 -88 -6 48 -87 226 -125 -15 -296 -70
3861 -70 62 44 143 76 -188 -122 -97 -100 -253 179 -82 -128 232 136 -39 -53 -86 66 226 153 -444 80 -25 -34 -77
$$ packed form
3701a38k92K57M62l66L22l72J43k94L26M01l97l5mJ88j0J39k40k23j3K28J1P6
3723A69l58M09m13J82j76L12J19j35j30j2p9J30p0M5k27n9J99L60l12P5m08J84
3745a95K83j15J2J11l8l72M69l15O83l23k95l5J07K63k68K41n76K31J31K0j10
3766i1K51l66k3R4L94j1k15k4K0j90J40J99l65K13j04L14nl34J00j16J1O8j67
3789b07L63L2n28J20m7M81j24J35l54j10J08K8K4rL1L7K49k50O3l5K07m04k1K31
3813B0P3j28M8m71L23K61j32P4k60p5L13Q0P0k74Ok8KNn9J92k13K26j93J34J22
3838A16k20k98L32N4j45R7L84l48p7j37Qk5J64L39l32Q2N4j35L13l51J10k81K26
3861g0J32j8R9o7k64O6K5lj53M32k61m6L60r6j75j4l3J52J60p3n97N24j05rm3
$$ plain form
3886 -77 -74 40 -83 -1 -423 -9 125 -294 136 -117 -9 174 151 -130 -147 38 -199 -233 -37 74 212 -9
3908 -9 -129 13 372 245 6 -268 -286 -53 -109 -86 -144 -15 330 -222 339 -12 175 -85 -248 -180 -38 138
3930 138 -93 -286 -260 172 108 -145 -153 -167 57 7 -66 252 27 -19 272 -85 -153 -63 -114 -63 -179 -23 306 258
3954 258 28 -93 120 4 267 153 -74 -124 -60 150 26 272 75 -32 -145 -39 -47 -20 271 66 -108 -106
3976 -106 37 -392 8 137 15 211 114 16 308 30 26 42 303 35 -5 -290 51 92 -84 113 -75 -189
3998 -189 -10 73 -48 -188 141 78 19 -228 104 296 60 -92 -188 -118 60 -92 273 107 8 19 115 -77 345
4021 345 104 -257 -308 -466 -44 266 288 -201 -2 -66 279 144 -15 -108 -388 159 148 -233 202 -213 55 -34
4043 -34 98 42 57 -136 -241 366 -37 296 52 77 176 96 236 -164 21 -60 -369 47 -126 334 253 -118 209
$$ packed form
3886g7LJ14j23Q2m22M14J34m19M30k53J08J83k3k81j7J85k37l4J96J11J38k21
3908ij20J42L59j27k39k74j8K33n6K3n8J29L45n52N61l51J87k60j63O8J42J76
3930A38k31j93K6M32o4k53qj4K24n0p3L18k25m6K91l57o8R0n1N1j16J56L29m8
3954B58k30j21K13j16K63j14k27n0O4K10j24K46j97j07j13J06qK7K91k05j74K
3976a06J43m29M00J29j22J96r7r8K92k78mJ6K61k68m0k85L41M1j76J97j88j14
3998a89J79Q3j21j40L29o3n9k47L32J92k36j52r6P0J78j52L65j66r9J1R6j92M22
4021C45k41l61n1j58M22L10K2m89J99o4L45j35j59r3k80N47j1l81M35m15K68q9
4043c4J32n6J5j93j05O07m03L33k44K5R9q0J40m00J85q1l09M16j73M60q1l71L27
$$ plain form
4066 209 -105 153 165 -4 -62 -237 91 40 -44 2 -10 86 81 -36 82 260 144 2 -14 44 -159 95 -38 -170
4090 -170 132 -105 113 -141 28 -104 210 9 -85 -318 202 51 -148 -91 0 114 -15 -133 -312 -180 151
4111 151 -189 199 -311 -144 -4 -74 -2 109 -81 6 197 -123 141 532 28 -182 14 85 279 -51 63
4132 63 117 319 -141 -157 63 -18 39 159 -306 179 208 -221 -222 -52 50 -115 204 -251 -117 218 194 33 -20
4155 -20 -101 154 -134 -182 -120 59 0 131 70 -62 237 125 -134 51 33 42 -103 -66 -20 184 -110 185 -109 45
4179 45 169 -115 -154 -23 312 384 0 -217 -201 70 133 18 23 -78 -92 -63 -187 46 -2 101 212 -18 -124
4202 -124 -113 -138 -211 -28 -92 141 -16 -151 -394 -66 -19 -97 70 46 -11 -15 -226 -254 11 78 -141 -319 54 136
4226 136 270 191 -162 -49 -67 236 -227 34 157 48 -179 -225 321 266 -203 -61 -144 490 31 120 -18 -55
$$ packed form
4066B09l14K58J2j69n8j75L28n1q4M6j2R6nj17J18J78j16j42j6N8k03K54j33j32
4090a70L02k37K18k54J69j32L14k01r4k33N20j51j99N7R1J14j29j18j79J32L31
4111A51l40L88n10J67J40p0P2J11j90Q7J91l20K64L91n04k10J96P1J94l30J14
4132F3N4K02m60j6K20q1N7J20m65M85K9m29jJ70J02j65L19m55J34L35k4j61n3
4155b0q1K55k88m8O2J79n9J31o1j32K99j12k59J85j8Rj45L7M6K04k94K95k94J54
4179D5J24k84l9J31L35P2l84k17J6K71O3j15Nj01j4K9j24K33m8J03J11k30j06
4202a24J1k5p3J83o4K33j57j35k43L28M7p8J67k4n7mk11k8K65O7k19j78L73Q2
4226A36J34p9l53J13j8L03m63K61J23j09k27m6N46n5m69J42q3O34m59Q9j38l7
$$ plain form
4248 -55 291 -178 -59 -245 -138 165 16 106 98 248 36 -253 205 -164 329 -42 57 -13 -85 -52 24 -321 110
4271 110 144 -116 205 -345 -133 -192 87 -157 -50 225 330 344 -118 69 -216 338 165 -355 2 -24 54 -63
4293 -63 51 162 -34 222 133 -29 21 -161 -13 209 35 -43 -183 75 -195 -145 -497 -165 4 130 138 -111
4315 -111 32 -95 22 0 7 -11 -115 65 -66 -4 29 -169 224 34 75 -72 44 -73 -391 108 -140 167
4337 167 -128 43 87 122 216 127 232 -43 319 241 114 164 -253 24 566 -139 269 -46 145 43 -426 -197
4359 -197 120 -13 -205 87 -49 -111 35 23 -112 -72 56 -3 -124 -19 252 264 -280 -112 158 -311 201 -91
4381 -91 11 116 -62 148 -143 -112 266 164 -8 56 48 -153 -139 -73 -186 42 192 -46 -183 238 -76 60
4403 60 -34 -35 132 170 -107 -148 261 228 109 -337 -13 106 -89 68 -33 -69 149 -72 173 -206 -261 207 27
$$ packed form
4248e5L46m69J19j86J07L03j49R0qJ50k12k89M58l69M93l71R9p0p2L3P6l45M31
4271A10L4k60L21n50K12n9K79k44J07K75J05J4m62J87k85N54j73n20L57k6P8j17
4293f3J14J11j96K56q9j62N0j82J48K22j74p8j40K58k70N0l52L32J69J26Qk49
4315a11J43j27J17k2Pj8j04J80j31O2L3j98L93j90M1j47J16j17l18M99k48L07
4337A67k95J71M4L5R4q9J05k75L62p8j27N0m17K77N42p05M08l15J91j02m69K29
4359a97L17j33j92K92j36o2J46j2j35M0J28n9j21J05K71J2n44J68K70m69N12k92
4381i1J02J05j78K10k91L1L78j02j72O4qk01J4O6j13K28J50k38j37M21l14J36
4403F0r4jJ67L8k77m1M09l3j19m46L24J19j95J57j01l6K18k21K45l79n5M68j80
$$ plain form
4426 27 30 26 128 -48 101 -3 25 -15 -179 -161 -26 66 160 -63 -11 -265 -147 -23 -181 -147 -163 -405 64 -4 -36
4451 -36 74 -94 -238 -208 148 68 186 24 -227 309 112 3 -300 -196 -216 -270 -24 -69 -26 76 -38 -222
4473 -222 -9 7 -7 302 -19 -201 95 19 26 -180 -193 186 -107 165 146 -181 -29 -43 38 313 64 21 214
4496 214 -85 -84 -351 183 -16 -28 44 140 13 -102 130 43 110 130 171 -216 145 115 -33 -13 316 -4 -232 200
4520 200 201 106 181 -205 216 -181 300 110 -90 355 14 306 -252 -232 -196 -38 189 -8 -109 -59 113 66 -296
4543 -296 287 -21 -92 -74 -64 117 0 -36 -221 -89 248 51 268 -210 -74 -78 -5 141 314 15 103 263 -90
4566 -90 -97 -108 203 -79 146 21 -183 130 -6 -78 -40 -30 292 -90 -215 -230 -113 -5 19 -283 -255 234 93
4589 93 26 138 -262 -154 97 -166 331 -16 -105 -161 107 -59 -255 219 -289 324 9 -133 166 -57 10 -104
$$ packed form
4426B7LmJ02j76J49j04K8m0j64J8J35R2R4k23N2k54J18J24j58L4j6k42M69o8l2
4451c6J10j68j44L0L56q0J18j62k51N36j97j09l03J04k0n4K46m5M3J02j14j84
4473b22K13J6j4L09l21j82K96p6Pk06j3L79k93K72j9l27J52j4Q1K75k49m3J93
4496B14k99Jk67N34j99j2P2R6j27j15K32q7O7K0M1l87L61l0j48K0L29l20k28M32
4520B00Jr5P5l86M21l97M81j90k00M45l41K92n58K0L6J58K27j97j01N0J72m7l62
4543b96N83l08p1J8J0J81j17l6j85J32L37j97K17m78J36mP3J46J73k99Q8J60l53
4566i0pj1L11k82K25j25k04L13j36p2L8J0L22l82j25j5J17J08K4l02K8M89j41
4589I3o7J12m00J08K51k63M97l47q9n6K68j66j96M74n08O13l15j42K99k23O7j14
$$ plain form
4611 -104 -187 11 128 198 -258 -236 33 -133 -78 -75 6 60 -160 301 -14 -32 -194 -234 -100 -105 -51 247 122 38 51
4636 51 -102 -295 -115 -376 -63 -116 -64 -239 146 -165 -103 -90 20 -26 256 -143 -79 373 -256 -330 17 109 -5
4659 -5 -72 47 -35 209 -229 112 157 -2 -63 -39 94 -144 -77 -197 -209 14 -109 -156 196 -9 359 80 -172
4682 -172 123 15 -66 -143 -202 113 -23 107 156 -241 115 -29 -103 -164 171 -80 17 -329 94 92 29 -47 -184 67
4706 67 -254 -5 -266 -295 217 7 -115 -94 87 169 90 467 -145 145 -224 -83 316 -170 -61 -53 -222 -188 -70
4729 -70 -93 32 60 -175 -192 196 130 -249 -108 -27 46 142 -65 39 141 -269 -198 95 -84 -129 212 34 458
4752 458 -350 -41 157 -225 169 -282 286 36 -195 199 -20 -26 -424 -36 207 234 -103 -269 188 170 185 18
4774 18 -340 161 11 -57 -243 -33 23 9 177 175 -22 -91 23 -24 -91 24 215 318 265 203 -98 68 334 82
$$ packed form
4611a04q3J98J17P0m56K2K69j66N5LQ1N4k20M61l15j8j62m0J34nN4K98j25q4J3
4636E1j53j93J80k61L13n3N2j75L85l11O2J3J10m6K82l99O4M52o29p4L47R2j14
4659eo7J19q2K44m38L41M5j59o1K4J33k38O7j20j2K23j23m7L52k05L68k79k52
4682a72K95j08q1p7n9L15j36J30M9l97L56j44p4o1L35k51R7l46M23ko3p6j37K51
4706F7l21K49k61k9N12k10j22K1J81Q2p9L77o12K90l69J41L99m86J09Qj69L4J18
4729g0k3J25K8k35j7L88o6l79J41Q1P3R6k07J04J02m10P1K93j79m5L41j78M24
4752D58q08L09J98l82L94m51N68k50k31L94k19ol98L88K43K7l37j66M57j8J5j67
4774A8l58N01j50o8j86K10N6j4J68kj97o9J14m7o7J15J91J03n3o2l01J66K66k52
$$ plain form
4798 82 -96 -54 204 -27 -61 162 134 175 149 -146 132 -160 28 -11 81 232 -21 139 -10 255 -49 -362 -231
4821 -231 116 -183 -277 -2 47 220 150 -95 51 385 145 16 29 102 388 102 355 230 38 86 207 -250
4843 -250 -75 -74 141 256 -364 -203 -111 233 198 81 103 -86 -25 -30 -115 153 99 70 3 -202 -156 -196 121 -158 -141
4868 -141 311 -249 -83 72 -59 19 -167 -34 108 -130 -190 -194 -47 109 -154 -152 -196 34 84 279 -336 -208 45
4891 45 55 -27 218 112 197 -41 -319 -178 58 137 -267 262 24 -179 158 104 -310 -196 172 30 53 16 -427
4914 -427 192 149 -304 -92 -200 186 270 272 -285 -72 116 92 -70 92 50 134 356 -165 8 -4 -62 30 112 -133
4938 -133 114 102 -306 109 -130 -39 -90 236 220 5 143 -57 156 82 92 -176 -304 40 376 132 -50 -131
4960 -131 -202 406 145 -252 -368 286 226 181 43 -363 127 170 -200 -240 2 167 -53 -237 61 -267 33 62
$$ packed form
4798H2j78M2K58k31l4K23k8M1k6k95K78k92J88l9R2J51k53J60j49K65l04l13J31
4821b31L47k99r4K75M9J73p0k45J46L34k40j29J3P3K86k86K53j25j92M8J21m57
4843b50J75JK15J15o20J61R2L44l5j17K2j89O1nq5K68n4k9o7k05M6m0L17k79J7
4868a41M52n60J66J55j31P8j86J33J42k38o0mJ47J56k63Km4K30N0J95o15J28K53
4891D5J0q2K45j06Q5k38k78J41K36P9m04N29k38k03L37n4m14J14L68j42K3l7m43
4914d27O19m3m53K12j08L86Q4Kn57K13J88k4j62J62m2Q4K22n21J73j2n8R2Q2k45
4938a33K47j2m08M15k39R1n1L26j6k15J38k00K13p4J0k68j28L44L36k44j82q1
4960a31p1O08k61l97j16O54o0m5j38m06M90M3l70m0K42J65k20j84K98l28L00K9
$$ plain form
4982 62 139 -36 -89 -187 -50 60 -307 -147 -192 79 166 -236 97 -369 -149 101 294 -61 29 -49 -288 234 -24
5005 -24 54 -72 -79 -155 -10 169 2 17 17 -47 55 -49 -64 259 -115 -49 438 -4 -347 200 141 92 227 -163
5029 -163 -149 141 81 -178 -202 -113 124 299 210 -129 -85 367 124 -79 -216 33 210 62 -112 -297 -27 -30 -102
5052 -102 -36 52 -110 167 123 240 108 23 -8 96 51 75 -168 10 10 -149 163 -22 -88 280 -62 -158 -95 -61
5076 -61 462 132 -38 -268 -41 242 -88 -14 -6 209 -111 119 -241 -86 -94 66 -66 -262 -108 -17 436 -83
5098 -83 125 222 354 175 -249 16 -103 47 369 -27 -173 159 -22 -150 -110 -102 110 -78 -246 165 124 5
5120 5 -65 45 65 40 -179 171 176 -224 -343 105 104 167 -139 -259 -62 -52 100 301 -83 -116 130 -114 412 -9
5144 -9 -61 -148 303 -3 128 93 -3 412 -49 -91 -365 51 25 97 -90 -98 41 335 -101 -127 -10 134 182 -29
$$ packed form
4982F2P7j75n3r8J37J10l67J60m5K71Q7m02L33m66K20K50J93l55R0p8k39N22k58
5005b4P8j26pp6J45J79j67J5%o4J02j04j5L23l74O6M87m42l43N47n9m9J35l90
5029a63J4K90o0k59k4Q9K37J75q9l39M4M52k43k03j37K49J77j48j74j85K70lp2
5052a02O6Q8j62K77m4J17j32q5l1J04m5K4k43J78%j59L12j85o6L68l42r6O3L4
5076f1N23l30j70k30K27K83l30P4QK15l20K30l60J55qJ60j32j96J54R1M53n19
5098h3K08R7J32j79m24K65j19J50L22l96j46L32j81j28M0QK12j88j68M11m1j19
5120Ep0J10K0k5k19L50Nm00j19M48jO3l06j20J97J0J52K01l84l3K46k44N26m21
5144in2q7M51l06J31l5r6M15m61m2k74M16k6P2j87qJ39K94m36k6J17J44M8k11
$$ plain form
5168 -29 -72 118 -423 3 -126 45 41 231 163 -174 -12 -341 -113 69 79 -184 -132 -31 -133 38 252 -328
5190 -328 -48 -75 97 -120 -247 85 247 116 2 67 166 195 355 -247 -212 -76 47 -108 9 -58 110 138
5212 138 -121 -215 -397 16 20 161 -29 -89 -67 -51 113 -92 -69 34 81 -106 244 -167 -70 -300 -338 94 -14
5235 -14 93 128 55 -312 197 258 -202 117 -162 -229 263 45 165 -101 -227 174 55 223 -138 -97 53 -31
5257 -31 349 -265 -9 23 146 -18 -178 -136 -184 -131 262 180 -204 -130 66 185 345 -231 138 -42 -153 -146 -98
5280 -98 87 296 147 -313 113 132 225 282 65 54 -19 85 -115 43 47 -26 312 151 130 -104 -326 205 377
5303 377 111 -4 -70 99 209 147 -146 -276 143 124 -214 -336 -89 -52 75 -251 -134 250 -108 245 -126
5324 -126 -155 -191 29 11 349 -240 99 252 123 -248 -101 -176 122 220 -236 6 -155 -90 -53 -174 -86 -25 -111
$$ packed form
5168b9m3J90n41M26j29J71mJ90o8l37J62l29K28J82J0k63N2J01j02J71K14n80
5190c28K80k7J72k17j27L32J62j31j14O5R9K9J60o02L5J36J23j55J17o7J68K8
5212A38k59r4j82M13MJ41j90o0K2J6J64k05K3J03M7j87L50m11R7k30l8M32j08
5235a4J07L5p3l67N09O1m60L19k79o7M92k18J20k66j26M01j19J68l61M1J50q4
5257c1L80o14K56L2J23j64j60M2m8N3L93q2l84P4J96J19J60n76L69j80j11PM8
5280i8J85K09j49m60M26J9R3N7k17j1p3J04k00J58Mp3L38j61k1k34k22N31J72
5303C77k66j15o6J69J10o2k93j30M19j9l38j22K47L7J27l26J17L84l58L53l71
5324a26k9l6K20j8L38n89L39J53j29l71J47p5K98R8m56K42j61O5L7j21Q8O1q6
$$ plain form
5347 -111 129 198 -39 1 174 -186 -102 -146 208 114 -171 62 -68 -22 291 -117 44 134 -424 178 145 5 -215
5370 -215 327 -27 148 -108 -251 -260 74 60 208 -72 76 100 -46 190 23 3 82 378 -94 27 54 -121
5392 -121 245 381 144 139 -61 332 -41 -91 -133 -304 31 -330 69 -96 202 -155 -17 76 -300 -58 -12 107
5414 107 -179 -120 -149 -205 -157 -484 -32 -260 35 48 -245 -108 -102 52 -30 232 -494 271 323 233 -137 -72 -240 -328
5438 -328 92 -225 -158 69 -80 129 -308 7 389 104 81 -136 -14 348 -69 -139 129 -16 96 81 -132
5459 -132 -73 -147 280 155 -94 -178 -184 -16 29 216 -382 -78 204 143 -154 71 -56 38 4 214 121 -276 2
5482 2 -1 -135 105 140 171 296 48 103 -67 170 -72 132 21 -81 -36 64 67 -217 -326 127 279 -127 233
5505 233 91 -5 188 -137 -176 83 -27 -20 -280 -206 -464 112 216 36 -20 308 16 -158 -18 -187 -217 52
$$ packed form
5347a11K40O9k37M0J73l60Q4m4L54r4k85K33j30M6L13m08J61R0n58O02l3j40k20
5370b15N42l54J75k56j43rL34j4J48k80J48K4j46K36j67k0P9K96m72J21K7j75
5392a21L66J36k37nk00L93l73n0m2j71L35l61L99j65K98l57J38R3l76K42M6J19
5414A07k86N9k9n6M8l27M52k28K95J3k93J37OJ54q2K62p26P65N2r0l70O5j68q8
5438c28M20l17O7K27j49K09m37L15L82k85k3k17J22L62m17p0K68j45J12j5k13
5459a32N9p4M27j25k49q4oJ68M5J87n98L04K82o1k97K25j27R4l4K10r3l97K78
5482Blj34K40L5L1J25k48N5j70K37k42K04j11j02M5J00Lk84j09M53J52m06L60
5505B33j42r6J93l25l9K59j10Pk60P4k58N76J04j80n6L28k92j74J40j69l0K69
$$ plain form
5527 52 58 216 -451 -61 20 154 202 -23 272 15 -10 52 -52 253 305 -97 -9 -101 -93 128 362 364 -138 34 28
5552 28 452 84 197 -194 -30 75 122 168 -67 392 149 130 -37 -238 65 -131 204 96 -234 345 -7
5573 -7 179 -19 29 -38 -115 43 -214 -191 -58 -225 -48 39 -267 189 -76 38 -342 255 180 -169 78 101 -190
5596 -190 -257 -186 -139 97 4 -67 95 -80 126 77 -332 -112 355 -382 -311 212 95 399 -9 -103 -319 -168 116
5619 116 -287 -69 188 -37 188 39 -318 12 28 -341 -261 -89 -305 -320 -12 -82 -511 -158 -94 -85 -264 -221 2
5642 2 102 -192 52 208 -101 34 -36 157 91 -5 -186 -39 304 199 -284 57 264 -142 142 -199 -184 65
5664 65 -7 -93 21 -217 -41 -220 4 -13 165 -74 378 210 -334 90 122 -45 280 138 22 9 -117 82
5686 82 -124 -44 -16 92 -26 -87 55 -137 70 -164 -173 -135 202 -126 -401 59 55 -144 128 56 66 -231 49 79
$$ packed form
5527E2OJ58o67L90Q1J34M8k25K95k57k5O2j04L05N2m02Q8r2QK21K34Kn02J72o
5552B8M24l68J13l91J64J05M7M6k35M59k43j9j67k01L03j96L35j08l30N79l52
5573gJ86j98M8o7p7J58k57K3J33j67J77Q7l06M56k65J14l80N97p5l49K47K3k91
5596a90o7P1M7K36r3p1J62j75K06m9m09K20M67p37P1N23j17L04m08r4k16J51K84
5619A16m03K18K57k25K25j49l57L30J6l69Q0J72k16j5L08p0m29L53O4Rj79M3K23
5642BJ00k94K44J56l09J35p0J93o6r6j81J47L43j05m83L41K07m06K84l41J5K49
5664F5p2q6J14k38J76j79K24j7J78k39M52j68n44M24L2j67L25j42j16j3j26J99
5686H2k06Q0K8J08j18o1J42j92K07k34rL8L37l28k75M60mj99K72p2J0k97K80L0
$$ plain form
5710 79 274 80 71 -89 109 47 316 -196 160 122 7 -117 -109 65 39 116 -178 -124 -149 91 13 -362 -21 104
5734 104 76 -80 -2 -62 86 98 26 -349 -27 -119 -105 -33 -359 -27 -365 -113 58 -7 22 26 95 -16 -188 180
5758 180 -8 174 -49 178 -42 -62 -173 -4 105 -280 7 -1 8 248 62 202 89 99 -4 10 -165 61
5780 61 -6 -150 -2 -163 -86 -109 -189 -157 -51 329 292 -94 73 80 24 73 -339 82 129 89 78 -67 -14 59 -96
5805 -96 -75 -131 -217 45 -249 133 49 -82 -59 157 93 -174 142 182 -181 -112 -67 -208 -141 -35 -15 24 9 -84 23
5830 23 -122 100 110 -152 -218 -4 -168 -305 -207 108 -44 -180 -47 -408 240 -41 -152 -72 -147 74 147 130 343
5853 343 -109 214 249 35 -173 71 -10 59 -55 150 -123 -171 -27 -189 11 29 365 198 -102 -216 -9 -75
5875 -75 48 -147 -32 103 -36 204 -40 5 166 99 53 206 316 7 -39 -51 145 -228 -179 19 159 140 -311
$$ packed form
5710G9J95j94rj60J98o2K69n12L56l8j15j24QJ74k6P7k94N4k5K40p8l75L41J25
5734A04k8j56P8o0J48J2p2l75L22r2J4P2l26L32l38K52J71o5K9MO9j11j72L68
5758A80j88J82k23K27k20k0j11J69J09l85K87qRK40j86J40j13J0j03J4j75K26
5780F1o7j44J48j61P7k3q0L2J06L80l7l86J67Pn6M9m12M21M7m0j1j45N3P3j55
5805i6K1n6q6K62k94L82q4j31K3K16o4k67L16M0l63O9M5j41O7J06K0L9j5r3J07
5830B3j45K22J0k62o6K14j64j37R8L15j52j36J33l61O48k81j11Q0p5K21P3j7K13
5853C43m52L23L5k14k08K44q1O9j14K05k73m8J44j62K00J8L36j67l00j14K07o6
5875g5J23j95J15J35j39K40k44M5J61o7m6J53J10l09m6j2J96l73M9J98J40j9m51
$$ plain form
5898 -311 -16 170 140 -97 -71 302 138 187 -327 -116 40 -243 -49 -246 50 -295 -29 266 130 -113 -291
5919 -291 14 54 -101 90 -1 -139 145 -100 -41 99 234 55 -169 444 -191 -113 -232 -75 -111 85 211 58
5941 58 333 266 -273 -26 201 -143 48 -79 150 -165 193 -92 13 -203 1 -118 -35 43 69 108 -191 47
5963 47 -276 93 -13 31 -20 -35 -102 -178 95 -152 124 -75 248 106 -211 -33 432 303 181 -165 -193 179
5985 179 94 -107 -114 261 16 -246 29 236 -123 -27 -88 64 -5 266 87 2 127 -32 48 -236 -121 153 -38
6008 -38 30 -125 105 379 -81 -6 -146 -35 60 57 208 296 -77 -183 -35 -67 42 -38 -97 154 -55 -15 -1 -146
6032 -146 -107 -63 48 336 -51 265 -231 -72 387 -165 189 212 65 -163 203 -34 415 -180 -37 -127 -15
6053 -15 91 -73 -83 -60 121 -97 -173 -110 -43 29 85 -32 106 -14 143 66 -218 250 133 58 66 -196 -144 -116 -14
$$ packed form
5898c11K95J86l0k37K6L73j64M9n14K11J56k83J94j97K96l45K66K95j36k43j78
5919b91L05M0j55J91r1j38K84k45N9J40J35j79k24O13o35P8j19J57l6J96J26j53
5941E8K75o7n39K47K27l44J91j27K29l15L58k85J05k16K04j19Q3P8K6L9k99K38
5963D7l23L69j06M4n1j5o7p6K73k47K76j99L23j42l17J78M65j29j22l46k8L72
5985A79q5k01pL75k45k62K75K07l59R6o1J52o9K71j79q5J25j59Q0k84J15K74j91
6008c8O8j55K30K74m60P5j40J11R5lJ51Q8l73j06J48l2J09q0n9K51k09M0J4j45
6032a46L9M4J11K88l87L16m96J59M59n52L54K3j47k28L66k37M49n95J43r0J12
6053a5J06j64j0K3J81k18p6O3O7P2N6j17J38j20J57p7k84M68j17p5Qk62N2K8J02
$$ plain form
6078 -14 -34 170 82 -103 -125 246 -23 262 -144 116 -108 40 116 112 75 -81 -5 -128 249 -4 256 76 330
6101 330 53 180 -60 -100 -400 66 -153 294 99 64 -74 44 -58 32 -58 -71 -168 176 22 71 50 -137 206
6124 206 169 -11 -78 -68 -243 -6 -345 50 43 40 10 -115 -101 -230 -82 -163 -99 -162 -78 65 90 131 41 125 385 127
6150 127 -204 -186 -198 63 -48 -280 335 -73 56 -92 -54 -70 74 -42 47 -97 -42 136 54 -132 -173 248 161
6173 161 -136 100 -114 178 -30 -197 34 -53 -112 12 93 79 -58 90 -75 -65 -53 146 121 129 -6 -110 -34
6196 -34 -108 -40 257 -42 48 -14 108 14 -428 -26 463 62 174 11 89 -174 375 -215 -30 36 78 -342 -4
6219 -4 -197 -251 -106 -27 -2 219 -174 225 -43 -181 85 -229 68 -243 45 60 -13 -162 98 -9 -229 -283 -242
6242 -242 -166 -123 161 152 -265 -193 -10 97 -118 -202 107 -355 -165 -296 223 124 -121 -158 -42 113 32 -182 -208
$$ packed form
6078a4k0K04q8j85k2L71k69K85m06K60k24J48P6ml7j56P6j23L77k53K60j80K54
6101C30k77J27k40m0l00M66k19M47j95l5j38J18j02R0r0j3r7L44j54M9k1j87L43
6124B06l7j80o7J0j75K37l39L95pll0j25J4j29J48q1O4o3Q4J43K5M1r0Q4K60k58
6150A27l31J8j2K61j11k32O15m08J29j48L8j6J44j16Q9j44N5J78q2j86m1M21q7
6173A61k97K36k14K92k08j67K31q7n9J24Q1j4j37J48j65J0J2J99k5Qj35j04P6
6196c4p4O8K97k99R0o2J22r4m42M02M89m01J12j63P8k63N49n90J85O6M2m20L38
6219dj93n4J45P9K5K21l93L99k68j38K66l14K97l11K88J5p3j49K60j07k20n4M1
6242b42P6M3K84rm17P2J83J07k15q4L09m62J90j31N19r9k45l7J16J55q1k14k6
$$ plain form
6265 -208 5 -104 62 -291 13 -67 45 -52 193 226 48 24 58 64 -112 -116 -38 -106 -111 -154 314 52 -235 -82 -142
6290 -142 92 -206 141 422 287 -170 -157 143 7 23 -20 -165 -147 7 265 66 -88 114 -83 -78 22 222
6312 222 50 77 -206 -20 255 37 64 51 -147 126 -122 22 -46 113 -82 86 -163 90 -40 19 -122 -77
6334 -77 -55 -69 175 -19 -209 -49 22 -79 -75 15 -251 49 -56 -63 99 52 267 -189 -47 82 -80 38 -126
6357 -126 -48 297 9 12 164 -1 98 113 -155 70 -232 184 201 51 -141 19 -211 3 57 -66 353 -42
6379 -42 -191 -4 34 -15 -157 369 -15 -108 -173 -113 191 -207 50 131 232 -231 -60 421 184 253 194 49 -18
6402 -18 -232 -60 -143 -89 39 -203 162 -46 115 203 84 -248 37 1 -3 -120 -159 138 -286 18 46 -37 45 341
6426 341 -232 173 -122 -194 -255 -316 49 -193 -4 179 107 246 451 -146 -1 130 -83 57 -139 6 135
$$ packed form
6265b08K13j09J66l53L04q0J12r7K45L3j78k4L4Oj76mP8o8nm3M68k62k87J53o0
6290a42K34k98L47K81j35m57J3L00j36J6m3j45J8J54K58j99j54K02j97NJ00K00
6312B22j72K7k83J86K75k18K7j3j98K73k48J44o8J59j95J68k49K53j30N9j41M5
6334g7K2j4K44j94j90J60P1j01MR0k66L00j05pJ62m7K15m56J42J29j62J18j64
6357a26P8L45k88LJ52j65R9J5k68K25l02M16J7j50j92J60k30K14N4j23M19l95
6379d2j49J87L8m9j42N26l84r3o5O0L04l98K57Q1J01m63J71M81k37O9n9j45o7
6402a8k14J72q3N4J28k42L65k08J61Q8j19l32K85l6mj17l9K97m24L04K8q3Q2K96
6426C41n73M05k95p2o1o1L65k42J89J83p2J39K05n97J45J31k13J40j96J45J29
$$ plain form
6447 135 79 103 108 261 -197 -137 72 -102 -21 25 33 -32 149 106 299 145 -101 -18 161 37 7 -10 -137 25 49
6472 49 170 147 -64 306 176 -73 347 -109 85 -1 403 -15 -14 235 123 216 29 -123 226 -66 -2 -83 -352
6495 -352 194 -69 197 408 -129 323 51 406 42 -228 20 63 300 -182 -235 158 -243 -69 -187 92 -70
6516 -70 -242 -39 60 -183 24 35 -217 -56 42 175 -189 267 -32 56 -295 -130 -122 -150 -81 176 -169 -273 -79
6539 -79 -97 -91 110 -54 102 412 -217 18 -77 232 -17 -110 -61 -178 -16 -2 -231 -103 1 -27 -26 15 143 -152
6563 -152 69 20 82 83 -70 -218 -105 -149 129 224 109 168 264 -139 -12 213 -60 -88 5 120 222 -93 -199
6586 -199 197 -186 -199 132 135 329 370 185 76 52 208 -77 28 -37 92 170 35 66 14 112 -213 114 -57
6609 -57 -246 149 154 -257 -95 -264 81 154 -24 86 -95 -423 139 8 43 100 -301 142 48 -71 -264 -36
$$ packed form
6447A35n6K4NJ53m58O0K09j74Q1M6Qo5J81m3J93j54k46Q3J79j24l0j7j27J62K4
6472D9J21k3k11L70j30k49M20m56J94q6M04m18JK49j12R3j87j52L49k92O4q1k69
6495c52N46k63K66K11n37M52k72L55l64k70K48M3K37m82n3L93m01J74j18K79j62
6516g0j72K03R9k43K07J1k52J61R8J33l64M56k99Q8l51J65Qk8O9K57l45j04J94
6539g9j8OK01j64J56L10o29K35r5L09k49r3M9j17J62J4k29J28J04k8JM1J28k95
6563a52K21m9O2Jj53j48J13m4K78R5j15N9R6m03J27K25k73k8R3J15J02l15j06
6586a99L96l83j3L31LJ94M1j85j09k4J56k85J05o5J29P8j35L1n2R8l25L27j71
6609e7j89L95Nm11J62j69L45P3j78J10j81l28N62j31L5N7m01M43r4j19j93K28
$$ plain form
6631 -36 137 131 159 -219 104 175 -19 -40 256 177 24 -135 -69 -91 -45 -67 2 316 100 7 82 -17 8 295 -190
6656 -190 -199 75 -69 21 -53 69 33 -50 -100 -7 -146 -69 30 223 205 66 -77 5 94 -105 8 37 93 -117 -12
6681 -12 -11 127 219 -63 307 -38 263 56 -103 -38 23 102 230 77 51 -38 -507 151 6 126 196 29 98 -297
6705 -297 67 -139 -127 -157 35 201 251 -220 -18 43 -118 116 132 -127 -178 46 46 171 187 -141 359 101 -73
6728 -73 39 -110 -96 -30 118 153 213 3 33 -63 156 -288 126 115 -21 139 -376 -148 238 352 -80 1 -34
6751 -34 -133 107 95 33 -200 -73 32 -109 -85 251 219 4 -74 -42 -43 234 44 -274 58 -7 88 -119 260 -37
6775 -37 126 115 179 -5 105 240 -51 -159 -178 -282 -71 27 -280 72 -82 -65 58 101 -161 46 -135 -90 -2
6798 -2 -61 -120 178 -90 -276 140 61 263 172 -109 87 -109 -203 1 90 70 85 -25 13 50 138 -80 149 -91
$$ packed form
6631c6J73oK8l78L23P1j94k1K96p9j53j59O6k2M6k2O9L14k16r3P5r9K5K87m85
6656a90rK74j44R0p4J22l6q3n0R3j39P7R9J93j8j39j43Q2Q9j99J13K9N6k10J05
6681a2JJ38R2k82L70l45L01k07j59O5O1P9J28j53k6q9m69O58j45J20P0j67O9l95
6705b97L64k06J2l0J92J66N0m71K02O1j61K34J6k59n1K24%J25J6l28N00k58j74
6728g3J12j49J4O6J48L5O0k10L0r6K19m44M14j1j36J60n15K28L86J14m32Q1l5
6751c4r9K40j2o2k33J27J05j41K4L36l2k15p8L2jK77j90l18L32o5R5k07L79k97
6775c7J63j1O4j84J10J35k91j08j9j04K11R8l07L52j54J7J23M3k62K07j81M5Q8
6798bn9n9K98k68j86M16p9K02r1k81J96j96r4K04Q9k0J5j10L8L7Q8k18K29k40
$$ plain form
6822 -91 168 -506 -286 47 119 -86 -114 -121 117 151 210 -75 8 76 -205 192 -83 -137 -29 -107 -2 -111 -170 -28
6846 -28 -37 33 55 -90 -155 -20 137 -125 -250 395 12 -16 -272 178 116 -62 162 -60 -69 -264 -137 -174 -319 142
6870 142 -17 -271 -155 -118 -32 -143 -201 22 -96 -146 13 -138 -123 -267 -132 -286 -6 -18 -66 36 323 -211
6892 -211 -75 -129 138 -178 161 9 52 47 -144 -44 -149 -192 -20 -42 -189 -36 -110 179 324 162 11 68 152
6915 152 50 -139 131 280 14 9 247 -280 -109 -118 125 100 216 22 18 287 125 -244 61 -39 131 -153
6937 -153 -152 -125 -29 48 50 -20 225 131 -109 -59 102 -204 -211 55 -119 -95 -28 126 170 18 -203 -33 -12 -156 5
6962 5 1 -39 -3 -141 -177 -166 40 -60 -315 -356 100 163 -137 167 0 272 145 -18 -90 141 -149 124 13 181
6986 181 -7 254 160 30 95 -71 72 12 -148 -251 -280 -58 -250 13 -171 -63 -56 -65 -64 172 12 38 233 -9
$$ packed form
6822i1K59o74K20L33P2k05k8pK38L4N9k85Q3O8k81L97k75n4J08p8J05j09n9J42
6846b8rP0K2j45o5J35J57k62j25O45l83k8k56M50o2j78K24k22rj95J27l7j45M61
6870A42j59k54J16L7Q6j11n8K23j18n0J59j51J5j44J35j54K80j2m8J02K87n34
6892b11J36n4K67l16L39j52M3nj91J00j05m3J72k2j47J53p4K89J45j62j51N7Q4
6915A52j02j89K70J49k66nK38n27J71rK43k5J16j94mK69j62l69L05j00J70k84
6937a53JK7R6P7Kp0K45r4k40N0J61l06pK66j74K4O7J54M4j52k21J70K1j44J61
6962Emm0L6j38l6J1K06j00k55m1M56O3l00L04j67K72j27j63p2K31k90K73j11J68
6986A81j88K61r4j30O5j66J43o0j60j03k9K22j92K63j84J08PrJK36j60K6J95k42
$$ plain form
7010 -9 -190 -53 105 -38 -67 -151 -118 -207 55 86 8 53 184 -209 -298 398 -43 9 -273 -132 96 -1 -237 -189
7034 -189 179 169 -159 -284 294 225 126 -137 -327 10 135 131 -122 206 -2 192 203 -25 99 -316 -217 289
7056 289 37 130 -203 305 -31 -225 173 -213 -114 299 174 -129 227 -57 -121 50 93 -4 -81 -66 -228 -85
7078 -85 143 103 29 -40 31 138 99 -88 115 -107 74 4 58 44 53 -21 5 6 32 101 -417 -29 -58 -125 273 5
7104 5 85 231 -28 -241 65 -126 71 13 27 -171 97 -122 -18 -115 208 17 44 21 114 107 -35 -166 -11 -395
7128 -395 -292 -214 119 -1 74 -248 5 84 15 137 -21 -127 104 -50 -65 -30 -34 46 -174 266 -238 107 112 1
7152 1 -234 8 -90 154 10 2 -10 -207 220 24 -12 111 -21 133 140 62 228 -117 71 277 80 -117 111
7175 111 -70 246 -123 153 55 -204 -176 -179 262 -34 -91 196 -61 63 -170 -51 22 -362 231 -174 -126 74
$$ packed form
7010ij81J37J58j43k9q4L3q9K62L1p8M5J31l93q9O96m41N2k82J41K28r7k36M8
7034a89L68j0l28j25N78o9r9k63j90L37J25mk53L28k08J94J1k28J24m15R9N06
7056B89k52R3l33N08l36j94L98l86R9M13j25l03L56k84o4J71M3r7p7J5j62J43
7078h5K28m0p4o9P1J07l9j87K03k22J81p0N4j4Rp4K6JK6O9n18L88k9o7L98k68
7104EQ0J46k59k13L06j91J97n8J4j98K68k19J04r7L23j91K7k3R3pj42j31J55l84
7128c95J03P8L33j20P5l22K53P9o9J22j58j06K31j54j5L5mQ0k20M40n04L45Nj11
7152Ak35K42r8K44j44qj2j97M27j96l6J23j32J54Pp8J66l45J88K06j97j97K28
7175A11j81L16l69K76r8k59K8lM41k96n7K87k57J24k33J19P3l84N93m05M8K00
$$ plain form
7197 74 -73 -82 -295 -300 64 6 -205 -114 168 -183 -140 -85 139 139 83 238 -310 270 -39 -22 139 76 -268 -158 72
7222 72 -204 -105 31 30 -175 -2 -285 82 126 140 392 134 115 70 -242 -26 -183 386 387 165 27 -39 65 -126
7246 -126 89 -9 -214 -21 -6 190 149 116 -53 197 90 76 135 294 44 -70 66 -113 161 142 59 -111 -43
7269 -43 -121 -102 100 56 27 -46 241 46 96 -123 -65 -17 25 224 177 78 87 292 87 -173 69 279 -116 13 -26
7294 -26 168 95 221 -9 -120 136 -295 -189 -77 134 -73 -74 -18 -55 71 -51 -84 293 189 16 54 -266 -24
7317 -24 -47 -86 23 -163 262 135 -57 186 22 27 -247 -146 -62 259 -88 144 47 -26 220 -18 -151 20 285
7340 285 389 94 58 19 -359 -44 -53 69 54 159 -87 14 -63 43 220 -343 -117 74 79 -88 -118 -330 -5
7363 -5 260 102 -209 -266 125 157 2 -63 -122 54 -83 250 -57 -43 -328 112 195 121 42 235 46 -1 9 -195
$$ packed form
7197G4j47rk13nL64n8k11R1K82l51M3N5K24%n6J55n48N80l09J7J61o3l44J10K30
7222G2k76R9J36jk05J73k83L67M4J4K52k58j9m5l12K16j57N69Jk22j38o6J04j91
7246a26K15r8k05J93J5J96m1l3j69K50j07j4N9J59k50j14J36j79K74j9q3j70O8
7269d3p8J9K02m4k9p3K87j95N0k19N8M8M2J99m7r9RK05k05k60K42K10l95J29l9
7294b6J94p3J26k30j11K56m31J06J12K11k07jN6l7J26j22l3L77j04j73L8l20K42
7317b4k3l9J09j86M25j27j92K43j64Nk74J01Q4L21l47K32r7p3K46k38j33J71K65
7340B85J04k95l6l9l78L15rJ22j5J05k46J01p7J06J77n63K26J91Nj67l0k12L25
7363eK65j58l11n7L91L2j55o5n9J76j37L33l07J4k85M40Q3p4p9J93j89m7J0k04
$$ plain form
7387 -195 -79 200 106 -84 100 -463 72 43 213 69 -70 146 393 174 154 132 130 -34 -11 229 -118 155
7409 155 31 287 -81 14 -81 89 24 -127 -121 92 6 -151 114 -176 -59 211 -167 94 34 -27 110 188 -98
7432 -98 93 -115 -158 -204 5 203 -203 7 -171 -50 117 -42 138 44 12 -51 -47 59 22 14 5 -25 -13 104 57
7457 57 -32 -107 -81 35 502 13 -134 -133 -167 -7 -64 -155 81 218 116 79 -7 -91 -190 125 -173 122 23 109 -57
7482 -57 156 -40 117 99 -201 197 -263 -89 118 -349 116 21 -69 -155 -36 428 226 91 36 -162 64 32
7504 32 -434 -87 -209 -257 -58 -134 60 83 -55 245 54 120 -558 -99 214 6 70 -116 122 -67 124 170
7526 170 -128 -13 107 -11 160 104 -272 101 -162 424 -217 -58 -200 -2 1 -62 38 343 -180 -139 195 -202
7548 -202 90 -121 25 -395 46 107 -227 161 -46 -173 266 -413 -100 -251 13 285 -181 -168 -64 77 -227
$$ packed form
7387a95J16K79r4j90J84n63N35k9J70j44j39K16K47k19k0k2kj64K3K40l47K73
7409A55j24K56l68R5r5J70o5j51OK13q6j57K65k90J17K70l78K61o0o1J37P8k86
7432i8J91k08m3m6K09J98m06K10j78J21J67j59J80r4l2o3MJ06l7qrl0J2J17m7
7457E7q9p5K6J16M67m89j47Jl4J60n7r1K36J37j02l7q6q4r9L15k98K95r9Q6j66
7482e7K13j96J57j8l00L98m60J74K07m67M65r5r0q6J19M64k02j35n5j98K26l2
7504C2m66L47j22m8J99p6J94K3j38L00j91O6o78M59L13k08O4j86K38j89J91M6
7526A70k98J15J20j18J71n6l76L73k63N86o41J59j42J98Lo3J00L05n23M1L34l97
7548b02K92k11J46m20M41O1l34L88k07j27M39o79L13j51K64K72m66J3J04J41l04
$$ plain form
7569 -227 5 51 120 -227 168 284 -43 -14 45 -89 196 -306 50 88 27 -72 -244 109 -8 61 340 42 -219
7592 -219 -124 -18 104 -191 -27 -43 -203 66 172 -34 -97 -52 49 -103 104 11 29 70 -373 2 290 -36
7614 -36 -226 182 17 144 242 -93 145 126 24 -156 -155 154 96 29 31 89 -259 220 185 239 -123 -27 9 291 -143
7639 -143 -217 205 -75 145 -141 2 -46 -88 -18 -92 -345 112 -73 -82 404 -37 235 183 -118 -42 30 249 174 154
7663 154 239 14 62 -100 37 -33 160 -22 -106 306 376 -180 -345 -583 -144 55 -307 -22 -102 -4 163 150 5
7686 5 -264 8 -54 -10 31 -1 129 -353 30 283 85 87 231 -31 162 -79 -11 -146 -50 -190 201 61 -110
7709 -110 -82 292 -43 -73 94 41 -96 -236 -32 -194 64 -23 -163 -37 227 97 156 43 -159 -153 2 -169
7731 -169 273 -18 -88 -49 -286 -97 -87 115 241 -203 69 -59 91 -94 105 180 142 -8 84 160 -77 158
$$ packed form
7569b27K32M6O9l47L95J16l27K9N9j34K85n02L56L8o1r9j72L53j17O9K79k98k61
7592b19R5J06J22k95J64j6j60K69J06k06o3M5J01j52K07r3J8M1m43L75K88l26
7614c6j90M08j65J27R8l35K38j9j02j80JL09n8o7KN8l48M79l5N4l62R6L6K82m34
7639a43p4M22k80K20k86J43m8m2P0p4k53M57j85rM86m41K72n2l01P6P2K19p5k0
7663A54Q5k25M8j62J37p0J93j82q4M12P0n56j65k38M39J99l62K85q0R8J67j3j45
7686Ek69K72o2M4M1l2J30m82L83K53j98KJ44k62J93k41O8j35R6j40L91j40j71
7709a10K8L74l35l0J67n3j37j40K04j62K58q7j40J26K64j30N9j13k02OJ55j71
7731a69M42k91p0L9k37J89J0K02J26m44K72j28J50j85J99P5l8j50R2P6k37K35
$$ plain form
7753 158 223 -79 -359 54 -31 137 -6 -132 -62 78 -73 -135 -180 -63 66 25 -31 -44 -42 35 47 -107 2 -184
7777 -184 -74 -155 217 -146 -72 190 145 50 132 -3 -297 -19 25 -38 -200 7 -154 139 -59 11 4 -156 324
7800 324 18 47 -110 265 -68 -119 197 -53 53 -252 467 -91 -67 -7 20 52 184 111 12 192 -75 274 -266
7823 -266 -30 125 138 -269 2 -393 209 -22 -48 100 40 19 93 134 -21 241 -222 -233 3 54 44 -87 -242
7846 -242 19 -29 45 -86 47 -172 -58 -182 50 51 -94 92 -304 -186 222 -11 72 -28 -335 214 -163 -144
7868 -144 309 -81 135 -66 402 78 229 382 -25 73 32 -173 -245 130 194 -69 118 20 152 121 -427 -217
7890 -217 169 24 143 243 -132 -204 -372 -311 92 -327 0 -125 -160 -282 126 -57 424 170 229 13 355
7911 355 -241 -90 -125 -132 198 92 372 153 -155 -21 135 4 161 -101 2 -48 42 124 -180 9 -43 -102 -117
$$ packed form
7753A58O5l02k80M13q5J68j43j26P0J40j51o2m5J17J29m1n6j3KP7J2j54J09j86
7777a84J10q1L72l63P4K62m5r5Q2j35k94K78M4o3j62K07j61K93j98P0pj60M80
7800C24l06K9j57L75l33n1L16k50J06l05P19n58K4O0K7L2J32p3r9J80k67L49n40
7823b66K36J55J3m07K71l95O02k31k6J48o0k1P4M1j55K62m63j1K36N1j0j31j55
7846b42K61m8P4j31J33k19J14j24K32Jj45J86l96J18M08k33Q3j00l07N49l77J9
7868a44M53l90K16k01M68l24J51J53m07R8m1k05p2L75O4k63J87r8J32l1n48K10
7890b17L86j45J19J00l75p2j68O1M03m19L27j25l5j22M08j83M81k54N9k16L42
7911C55n96J51l5pL30j06K80k19l08J34J56j31J57k62J03n0R0Q2l04J89n2n9j5
$$ plain form
7934 -117 -81 -137 -215 112 98 30 -258 -90 136 106 70 -100 -19 160 13 -183 93 2 129 -17 -240 251 44
7957 44 32 -30 83 -129 211 321 -77 184 -165 -76 63 50 -111 -47 -118 -155 29 -134 147 101 -149 -149 -232 54
7981 54 102 -291 -287 -225 -223 165 -33 -252 118 157 -128 116 72 -24 176 -171 119 29 -50 -109 -7 -208 -56 -45 360
8006 360 67 98 -142 -136 140 96 -9 -143 -146 1 -88 -23 -25 241 -162 180 199 148 -224 61 41 134 272 -229 185
8031 185 84 -14 -40 50 -15 91 12 -171 113 135 -118 -165 226 82 -163 36 110 363 -38 261 -118 -41 21
8054 21 -46 -108 -80 -65 -84 -59 217 109 211 139 159 201 -137 -4 -29 36 -131 107 -107 195 -145 14 162 -40
8078 -40 -55 -34 137 -317 -53 -75 333 -99 -255 -75 -189 66 -122 137 -86 101 -55 21 -114 -45 -303 -223
8100 -223 -51 306 -194 2 -78 287 -149 3 30 34 -29 -29 -11 424 195 78 -79 53 -117 -105 79 -101 -38
$$ packed form
7934a17L6n6p8L27j4o8k88J68K26l0l6j70Q1J79j47j96K76r1J27j46k23M91k07
7957D4j2o2J13k12L40J10l98K61l49Q9J39j3j61O4p1l7J84j63K81m6k50%q3K86
7981E4M8l93MO2KL88j98k19L70L9k85K44m4r6K00l47K90r0p9n9J02k01J52J1M05
8006C60k93L1k40OK76m4j05j34lJ47q9O5kK66m03L42J9n1l72K85k0R3J38n01M14
8031A85j01r8k6R0o5J06p9j83K84K2k53m7L91j44k45J99P4K53m01K99l79P7O2
8054B1o7o2K8J5j9K5K76j08J02p2K0M2l38J33k5O5j67K38k14L02l40J59J48k02
8078d0j5K1J71m54K64k2M08m32j56J80j14K55j88K59k23J87j56P6j35O9k58Q0
8100b23J72L57n00J96q0L65m36J52K7Mo3%J8M35k29j17j57J32j70J2J84j80O3
$$ plain form
8123 -38 -257 416 -240 289 408 116 -56 -44 -215 -71 97 -74 -233 -121 83 156 48 27 147 192 -65 2
8145 2 96 156 32 -209 50 -185 -23 -6 -111 -9 27 119 -170 55 169 -193 282 -61 -31 228 -290 -108 243
8168 243 48 106 -188 -200 128 -162 -217 235 -124 37 -206 -260 -140 -29 -500 139 235 53 -139 -346 3 113
8190 113 -137
$$ packed form
8123c8k19O73o56N29J19k92j72J2j71J44J68j71j59J12K04P3j08k1J20M5k57O7
8145BR4O0j24k41K59k35J62J7j05J02L6R2k89K25J14l62M75l43L0K59n18J82L51
8168B43j95N8k94j2L28k90n5M52l59J61k43n4J20J11m71O39R6j82j92k07L49J10
8190A13k50
8191a37
$$ Imaginary data points
##PAGE= N=2
##DATA TABLE= (X++(I..I)), XYDATA
$$ plain form
0 0 0 0 0 0 0 0 0 0 0 0 0 0 -8 8 -8 8 -8 9 -16 16 -16 21 -24 26 -32 36 -41 49 -53 59 -67 76 -86 95 -107
35 -107 118 -133 145 -161 180 -199 221 -245 270 -300 333 -370 412 -462 520 -587 668 -770 897
54 897 -1071 1305 -1659 2249 -3400 6533 -32623 -107961 -52465 33237 66540 13868 -44762 -50222
68 -50222 -5994 24040 17074 -7503 -16071 -13626 -12504 -12008 1278 17353 12769 -19565 -40561 -18278
82 -18278 29488 44398 6126 -42298 -43015 4075 45649 34712 -13562 -44537 -25195 17724 37509
95 37509 17969 -14168 -26066 -11217 9112 15729 8861 -1781 -10898 -14483 -7666 8246 19399
108 19399 11817 -12653 -30416 -18666 14424 32965 12631 -26740 -40977 -11108 30694 37342
120 37342 1207 -34867 -31483 4167 30315 21768 -7353 -24150 -14868 5033 14871 11346 2453
$$ packed form
0@%%%%%%%%%%%%qJ6j6J6j6J7k5L2l2L7m5N0n8O8p7R0j02J12j26J43j62J81k02
35a07K25k51K78l06L41l79M20m66N15n70O33p03P82q74R82j107J255j438J667
54H97j968K376k964L908n649R933l9156p5338N5496Q5702L3303n2672n8630n460
68e0222M4228L0034o966k4577q568K445J122M96J3286J6075m584l2334k0996K2283
82a8278M7766J4910l8272m8424p17M7090M1574j0937m8274l0975J9342M2919J9785
95C7509j9540l2137j1898J4849K0329O617o868j0642r117l585O817J5912J1153
108A9399p582k4470j7763J1750L3090J8541k0334l9371j4237K9869M1802O648
120C7342l6135l6074L384L5650K6148q547k9121j6797R282J9901R838l525q893
$$ plain form
133 2453 -5705 -11953 -10471 2705 18624 18507 -3576 -27869 -23744 8408 34170 22812 -15432
146 -15432 -38131 -20193 19816 37155 12999 -24346 -33524 -7700 22358 24913 2358 -19043
158 -19043 -18875 -2316 11094 12580 5658 -4214 -12680 -14375 -4299 13461 21189 5662 -21535 -29145
172 -29145 -4187 28794 31052 -2884 -35625 -29171 10497 37643 21754 -16572 -33451 -12482
184 -12482 18951 26111 6599 -14303 -15398 -2788 6804 8363 7066 3556 -5299 -14152 -10657 7484
198 7484 23142 14605 -13847 -30208 -12759 21484 32476 6190 -28734 -31744 886 31248 25135
211 25135 -7481 -28327 -17169 9490 22257 10854 -7905 -13806 -6839 1684 5746 8220 7374
224 7374 -1894 -14305 -15399 2478 22679 19208 -8448 -30614 -17854 16438 32940 11873 -23388
$$ packed form
133B453q158o248J482J3176J5919j17k2083k4293M125L2152K5762j1358l8244
146a5432k2699J7938M0009J7339k4156l7345r178K5824L0058K555k2555k1401
158a9043J68J6559J3410J486o922r872q466j695J0076J7760P728j5527k7197p610
172b9145K4958L2981K258l3936l2741O454L9668K7146j5889l8326j6879K0969
184a2482L1433P160j9512k0902j095J2610R592J559j297l510q855q853L495J8141
198G484J5658q537k8452j6361J7449L4243J0992k6286l4924l010L2630L0362o113
211B5135l2616k0846J1158K6659J2767j1403j8759n901O967Q523M062K474q46
224G374r268j2411j094J7877K0201l471k7656k2166J2760L4292J6502k1067l5261
$$ plain form
237 -23388 -31337 -3500 26934 24620 -3548 -23132 -15116 5956 15682 8302 -2671 -5891 -4941 -4384
251 -4384 -1003 7915 13562 4239 -14227 -21051 -2775 22221 23674 -3891 -29570 -21672 10555 30758
265 30758 15899 -16539 -28835 -8921 18715 22929 3255 -15736 -15441 -446 10564 9381 2157
278 2157 -2978 -5003 -6969 -4211 6545 14621 7411 -11041 -20661 -7378 16867 24231 3195 -23096
292 -23096 -23684 3127 26213 19456 -8755 -25448 -13180 11554 19949 6955 -9591 -12917 -3723
305 -3723 4887 6971 5023 1668 -3517 -8724 -7747 3618 14763 10987 -7476 -20762 -11228 12447
319 12447 23444 7903 -17318 -23197 -3363 19089 20068 -282 -18877 -15844 3617 16846 11100
332 11100 -3211 -11300 -7343 1374 6530 6784 3822 -1895 -8777 -9194 1125 12654 12588 -2437 -17292
$$ packed form
237b3388p949K7837L0434k314k8168j9584Q016K1072R726p380j0973l220R50N57
251d384L381Q918N647r323j8466o824J8276K4996J453k7565k5679P898L2227K0203
265C0758j4859l2438j2296J9914K7636M214j9674j8991K95J4995J1010j183p224
278B157n135k025j966K758J0756Q076p210j8452r620J3283K4245P364k1036k6291
292b3096n88K6811K3086o757k8211j6693J2268K4734Q395j2994j6546l326R194
305c723Q610K084j948l355n185n207R77J1365J1145l776j8463j3286R534K3675
319A2447J0997j5541k5221n879J9834K2452R79k0350j8595L033J9461J3229n746
332A1100j4311q089L957Q717N156K54k962n717o882m17J0319J1529o6j5025j4855
$$ plain form
347 -17292 -14545 5794 21217 12610 -10872 -22638 -8934 14205 19905 3355 -14816 -15232 61
360 61 11975 9181 -404 -6375 -5791 -2432 1261 5094 6916 2987 -7002 -13171 -4375 11692 16483
375 16483 2184 -16479 -17612 1399 19383 15674 -5880 -20236 -11877 8599 18999 8538 -9506
388 -9506 -14755 -3875 8608 10519 2747 -4283 -5663 -2980 329 3575 6654 4775 -3430 -11319 -7667
403 -7667 5868 15539 8079 -10012 -19339 -5846 14534 18256 698 -17129 -15063 3055 15871
416 15871 10363 -5246 -12588 -5990 4000 7335 4089 -207 -2898 -4528 -4769 634 7874 9041 -1474
431 -1474 -13080 -11003 4429 16328 10114 -8230 -17809 -7513 10939 16667 3508 -12109 -13405
444 -13405 -510 11342 10325 -349 -7968 -6455 -133 4647 5247 3125 -1115 -5291 -6033 -1290 6833
$$ packed form
347a7292K747K0339J5423q607k3482j1766J3704K3139N700j6550j8171m16J5293
360F1J1914k794r585n971N84L359L693L833J822l929r989o169Q796J6067M791
375A6483j4299j8663j133J9011J7984l709k1554j4356Q359K0476J0400j0461j8044
388i506n249J0880J2483J911p772p030j380K683L309L246L079j879q205p889L652
403g667J3535R671p460j8091r327J3493K0380L722j7558j7827K066J8118J2816
416A5871n508j5609p342O598R990L335l246m296k691j630k41N403P240J167j0515
431a474j1606K077J5432J1899o214j8344r579J0296J8452N728j3159j5617j296
444a3405J2895J1852j017j0674p619J513O322M780O00k122m240m176p42M743Q123
$$ plain form
459 6833 9605 1517 -10380 -12153 -242 12894 12091 -2682 -15629 -11055 5538 15006 7008 -7830
473 -7830 -13027 -4419 7198 9168 2078 -5370 -5371 -2027 1027 3612 5089 2912 -3678 -8311 -4865 5907
489 5907 11822 4860 -9266 -13803 -2790 11430 13241 540 -13349 -11258 2519 12471 8425 -3566
503 -3566 -9907 -5702 3221 7590 4584 -1457 -4687 -3975 -1074 2694 5224 3717 -1947 -7140 -6050
518 -6050 2093 9426 7390 -3892 -11903 -7624 5760 12771 5717 -8093 -12535 -3481 8890 10776
532 10776 1466 -7962 -7875 -456 6197 5868 1422 -2965 -4779 -3546 1225 5793 6165 289 -6855 -7881
548 -7881 207 9436 8654 -1624 -10530 -8100 3616 10774 6522 -4752 -10075 -4328 4543 8116 3610
563 3610 -3321 -6377 -3456 2157 4979 3936 209 -4230 -5576 -2084 4444 6987 3063 -5332 -9131
$$ packed form
459F833K772q088j1897j773J1911J3136q03j4773j2947M574J6593R468p998j4838
473g830n197Q608J1617J970p090p448jL344L054K585J477k177o590m633L446J0772
489E907N915o962j4126m537J1013J4220J811j2701j3889K091J3777R952m046j1991
503c566o341M205Q923M369l006o041l230P12K901L768K530j507n664n193J090
518f050Q143P333k036j1282q011M279J3384P011p054j3810m442R054J2371J886
532A0776r310r428Q7P419O653l29m446m387j814J233M771M568L72n876p144j026
548g881Q088R229p82j0278q906K430J1716P158m252j1274n323N747Q871L573m506
563C610o931l056K921N613K822j043l727m439j346L492O528K543l924q395l799
$$ plain form
578 -9131 -3359 6647 10131 1967 -8406 -10197 -1091 9365 9407 -942 -9403 -7275 2129 8124 5217
593 5217 -1958 -5421 -3947 553 3608 4443 1901 -1753 -5533 -3911 2198 7196 5444 -2714 -9040
608 -9040 -5707 4611 10449 4248 -6420 -9871 -3239 6502 8449 2049 -6228 -6694 -1510 4545 5836
623 5836 1683 -3381 -4706 -2334 1600 4868 4076 -416 -5099 -5287 3 6047 6489 -156 -7310 -7424
639 -7424 778 8452 7157 -2374 -9088 -6165 3483 9045 4944 -3821 -7264 -3058 3427 5944 3389
654 3389 -1432 -4424 -3520 90 3988 5224 1602 -4545 -6472 -1890 5521 7219 1608 -6513 -7944
669 -7944 -464 6943 6470 -618 -6469 -6313 -40 5656 5115 236 -4342 -4994 -911 3816 5397 2020
685 2020 -3252 -5815 -2838 3471 6811 3620 -3217 -6914 -3245 4036 7558 3609 -4305 -8039 -3576
$$ packed form
578i131N772J0006L484q164j0373j791R106J0456M2j0349q461K128R404N995k907
593E217p175l463J474M500L055Q35k542l654l780J622O109M998j752q158o326
608i040L333J0318N838o201j0668l451O632R741J947o400q277m66N184O055J291
623E836m153n064j325K372L934L268p92m492m683j88N290O044M42o645p154j14
639g424Q202P674j295r531o714K923R648N562m101q765l443M206O485K517k555
654C389m821k992R04L610L898J236l622o147j927M582P411J698n611q121j431
669g944P480P407m73p088n851J56O273N696n41m879m578o52M083M727J581l377
685B020n272k563K977O309L340l191o837l697L669P281L522l949p914l734M463
$$ plain form
700 -3576 4995 7738 2302 -5440 -6990 -1800 5149 6054 1077 -3704 -5022 -1688 2543 4158 2624
715 2624 -1312 -4194 -3740 335 5044 5318 -242 -6550 -6062 1091 6977 5335 -2006 -7323 -5210 2214
731 2214 6497 4206 -2365 -6165 -4241 1720 5368 4092 -909 -5138 -4187 589 5375 5234 -165 -4989
747 -4989 -5118 -331 4959 5682 574 -5076 -5549 -916 4990 6145 624 -5725 -5922 -673 5387 5941
763 5941 155 -5434 -5897 -93 5228 4824 569 -3651 -4583 -824 3254 5025 2198 -2922 -5422 -3023
779 -3023 2998 6254 2952 -3743 -6576 -3062 3833 6459 2149 -4267 -5931 -2251 3376 5411 2209
794 2209 -2903 -5252 -2720 2555 5754 3525 -1877 -5661 -3685 2427 6173 3955 -2107 -5625 -3689
809 -3689 2211 6376 3924 -2400 -5812 -3992 1898 6147 4103 -2152 -5998 -3915 1972 5741 3837
$$ packed form
700c576Q571K743n436p742j550N190O949R05m977m781j318L334M231J615j534
715B624l936k882M54M075M709K74n560o308M88P153N886j642p341n317K113P424
731B214M283k291o571l800J924N961L648j276n001m229R51M776M786j41n399m824
747d989j29M787N290P23n108n650m73M633N906J155n521o349j97N249O060N54
763E941n786n589m63N804N321m04m255m220r32L759M078J771k827n120k500K399
779c023O021L256l302o695k833L514O895K626m310o416j664L680N627K035l202
794B209n112k349K532N275L199k229n402l784J976O112L746k218o062l518J936
809c689N900M165k452o324l412J820N890M249k044o255l846K083N887L769j904
$$ plain form
824 3837 -2075 -5450 -3468 1472 4541 3735 -116 -4004 -3929 -407 3798 4796 1054 -4532 -5796 -776
840 -776 5160 5717 528 -5764 -5915 -541 5549 5531 100 -5174 -4913 -541 4555 5083 867 -4044 -5303
857 -5303 -877 4285 5568 1205 -4112 -5257 -835 3984 4977 1157 -3934 -4970 -1345 3520 4645
872 4645 1584 -2762 -5352 -2416 2906 5276 2173 -3145 -5468 -2792 3151 5461 2410 -3119 -5001
887 -5001 -2201 2151 5381 3101 -2045 -5167 -3314 1673 5231 3812 -2136 -5884 -3756 2138 5849
902 5849 3446 -2252 -5670 -3001 2097 5002 2956 -1544 -4478 -3350 1226 4806 4160 -979 -4634
917 -4634 -3764 701 5292 4253 -709 -5019 -4066 630 4673 3946 -827 -4788 -4066 270 4352 3845
933 3845 111 -4304 -4992 -428 4312 4363 81 -4593 -4566 -308 4148 4492 574 -3814 -3961 -1031 3579
$$ packed form
824C837n912l375J982M940L069q06l851l888P5L522M205R98l742n586j264N020
840g76N936N57n189o292j51N374O090j8n431n274K61M372N096N28m216m911j259
857e303M426N162J283m363n317j145M422M819R93l820n091j036L625M865J125
872D645l061m346k590K936N322K370l103n318k323K676N943K310l051n529j882
887e001K800M352L230k280n146l122J853M987L558j419n948l748K128N894L711
902E849k403n698l418K669N098K905k046m500k934J128M576L580o46n139l655
917d634Q70M465M591j039m962m310R53M696M043p27m773l961P22M336M082n07
933C845l734m415o88M564M740N1m282m674K7M258M456L44l918m388j47K930M610
$$ plain form
950 3579 4516 1209 -3309 -4907 -1804 3139 5355 1967 -3664 -5407 -1926 3702 5420 1519 -3736
965 -3736 -5182 -1028 3484 4724 1624 -3194 -4705 -1956 3159 4680 2112 -2589 -4634 -1966 2979
980 2979 4987 1911 -2649 -4493 -2095 2201 4478 2186 -1881 -4457 -2907 858 4268 2986 -1421
995 -1421 -4772 -3823 1152 5145 3450 -1419 -4870 -3536 1448 4848 3261 -933 -4419 -3481 1117 4408
1011 4408 3685 -292 -4644 -3870 920 4746 3701 -1311 -4800 -3415 1007 4191 3215 -1078 -4016 -3103
1027 -3103 564 3536 3697 248 -3224 -3779 -104 3764 4223 680 -3702 -4347 -420 3608 4075 652
1043 652 -3470 -4290 -820 3074 3781 634 -3126 -4483 -1384 3377 4233 1663 -3313 -4677 -1112 3083
1059 3083 4484 1266 -3113 -4462 -1144 2911 3964 1775 -2330 -4102 -1686 2056 4191 1995 -2124
$$ packed form
950C579R37l307m518j598L103M943K216l388n631j743L481N628J718l901n255
965c736j446M154M512J240l100m818j511K749N115J521k568m701k045K668M945
980B979K008l076m560j844K398M296K277k292m067k576J550L765L410j282m407
995a421l351R49M975L993j695m869l451J334M984L400j587m194l486R38M598L291
1011D408p23l977m352P74M790L826j045n012l489J385M422L184r76m293k938R13
1027c103L667K972J61l449l472n55L675L868M59l543m382o45L927M028M67l423
1043F52m122q20L470L894P07l147l760j357L099M761Q56k570m976j364L565M195
1059C083J401l218m379j349L318M055J053k189m105j772K416L742K135k196m119
$$ plain form
1074 -2124 -4391 -2581 2387 4281 1978 -2664 -4281 -2040 2194 4218 2094 -1912 -3766 -2266 1298
1089 1298 3598 2944 -1297 -4227 -3102 1341 4237 2583 -1277 -4214 -2710 1273 3983 2448 -733
1104 -733 -3661 -3102 549 3465 2875 -345 -3572 -3485 -60 3742 3604 -291 -4151 -3693 235 4154 3545
1121 3545 -79 -3793 -3217 447 3630 3576 8 -3744 -3536 61 3389 3792 313 -3184 -3956 -66
1137 -66 3253 3381 -261 -3200 -3233 -602 2588 2925 461 -2273 -3175 -1188 2049 3809 1691 -2305 -3663
1154 -3663 -1658 2397 4066 1767 -2511 -4062 -1383 2072 3915 1660 -2271 -3843 -1711 2147 3687
1169 3687 1979 -2362 -4241 -2203 2401 4141 1766 -2309 -3844 -1397 2096 3576 1484 -1611 -3157
1184 -3157 -1770 1288 2991 2098 -699 -3583 -2634 572 3314 2861 -813 -3777 -2503 1038 3244 2108
$$ packed form
1074b124k267J810M968J894k303m642j617K241M234K024k124m006j854J500L564
1089A298K300o54m241k930J125M443K896j654l860k937J504L983K710j535l181
1104g33k928N59L651K916n90l220l227Q7L425L802j38l895l860M58L928L919o09
1121C545l624l714N76L664L183n4l568l752K08L597L328M03l479l497p72L890
1137f6L319J28l642k939l3K631L190L37k464k734r02J987L237J760k118l996j358
1154c663K005M055J669k299m278j551K679L455J843k255l931j572K132L858J540
1169C687j708m341j879K038M604J740k375m075j535K447L493J480k092l095j546
1184c157J387L058J703q93k797k884R49L206K742m53l674k964J274L541K206j136
$$ plain form
1200 2108 -674 -3269 -2632 639 3142 2507 -69 -2808 -2951 -61 3502 3436 -265 -3428 -3342 170 3244
1217 3244 3400 -352 -3139 -2609 123 2811 2940 -48 -2967 -3064 -412 2811 3247 490 -2903 -3417 -285
1234 -285 3031 3296 712 -2524 -2918 -476 2603 2892 741 -1962 -3081 -1128 1963 3589 1123 -2051
1250 -2051 -3535 -1319 2456 3577 572 -2457 -3385 -929 1922 3041 1017 -1598 -2638 -1227 1514
1265 1514 2999 2030 -682 -2998 -1855 1226 3348 2163 -1371 -3872 -2153 1401 3504 1892 -1355
1280 -1355 -3384 -1971 1119 3175 2029 -1283 -3311 -2242 824 3118 2127 -1227 -2942 -2146 1122
1295 1122 2720 1450 -525 -2564 -1583 527 2072 2019 206 -2391 -2448 -150 2615 2751 -129 -2833
1311 -2833 -3177 -31 2966 2513 -503 -2708 -2662 56 2479 2522 61 -2247 -2260 -605 2196 2993 944
$$ packed form
1200B108k782k595O37L271K503o35k576k739j43K890L563o6l701l163Q6L512L074
1217C244J56l752k787N30K732K688J29k988k919r7K652L223M36k757l393n14L132
1234b85L316K65k584l236l94K442L079K89k151k703j119J953L091J626k466l174
1250b051j484K216L775J121l005l029r28K456K851J119k024k615j040J411K741
1265A514J485r69k712k316J143L081K122j185l534k501J719L554K103j612l247
1280a355k029J413L090K056j146l312k028J069L066K294r91l354j715P96L268
1295A122J598j270j975k039R81K110J545n3j813k597n7K298K765J36k880k704
1311b833l44L146K997m53l016k205M6K718K423M3k461k308j3J655K801P97k049
$$ plain form
1328 944 -2314 -3274 -460 2787 3147 387 -2470 -2941 -246 2598 2593 465 -2144 -2403 -440 1803 2407
1345 2407 808 -1782 -2687 -1040 1387 2576 726 -1427 -2722 -734 1416 2335 1652 -1072 -2368 -1630
1361 -1630 844 2586 1755 -948 -3226 -2320 1168 3418 1824 -1378 -2808 -1600 1447 2912 1527
1376 1527 -1265 -2295 -1139 967 2292 1388 -403 -2225 -1728 283 2501 2363 -128 -2584 -2211 325
1392 325 2601 1940 -864 -2825 -2155 718 2252 1755 -378 -2356 -2113 132 2228 1854 -322 -2160
1408 -2160 -1964 345 2314 1844 36 -1866 -1708 -21 1754 1956 741 -1358 -2054 -648 1928 2265
1424 2265 1148 -1676 -2747 -901 1723 2647 289 -2146 -2630 -455 2198 2238 592 -1241 -1778 -466
1440 -466 1273 2472 931 -1200 -2362 -1162 1478 2847 1433 -1879 -2407 -751 1341 2386 767
$$ packed form
1328I44l258r60K814L247L60k760k857m71K695K844nk128k609k59J963K243O04
1345B407j599k590r05J647K427J189j850k153j295J988K150R19o83k724j296P38
1361a630K474J742q31k703k278R06L488K250j594l202j430J208L047J465j385
1376A527k792j030J156K106J325r04j791j822M97K011K218j38k491k456L73K536
1392C25K276o61k804j961O70K873J534m97k133j978K43K245K096l74k176j838
1408b160J96K309J969m70j808j902J58J687J775K02j215k099o96J406K576L37
1424B265j117k824j071J846K624R24k358k435m84K175K653M0j646j833n37J312
1440d66J739J199j541k131j162J200K640J369j414l312n28J656K092J045j619
$$ plain form
1455 767 -1682 -2151 -786 1207 1913 469 -848 -1502 -1258 649 1799 1384 -387 -2052 -1275 588 2264
1472 2264 1514 -25 -1921 -1595 267 1927 1913 -16 -2291 -2293 244 2435 2186 -486 -2599 -2032 751
1489 751 2386 1991 -907 -2326 -1289 592 1633 1372 -367 -1194 -1327 101 1663 1688 597 -1446 -1912
1506 -1912 -547 1943 2028 286 -1910 -1961 -156 1559 1790 179 -1371 -1731 -644 1441 1846 434 -1442
1523 -1442 -1901 -969 1559 1954 1009 -1261 -2040 -289 1519 2147 643 -1304 -1859 -846 894 2066 966
1540 966 -968 -2149 -1136 1066 2617 933 -1412 -2499 -1020 1091 2082 706 -1149 -1686 -895 829
1556 829 1381 844 -447 -1591 -1473 843 2126 1491 -597 -2540 -1723 641 2025 1185 -577 -1733 -1506
1573 -1506 468 1576 1126 -230 -1369 -1375 -136 1446 1420 -134 -1665 -1437 135 1937 1815 125 -1598
$$ packed form
1455G67k449m69J365J993P06j444j317o54K44J907J150m15j771j665P77J863J676
1472B264p50j539j896L26J862J660j4j929k275kK537K191k49k672k113N67K783
1489G51J635l95k898j419J037J881J041k61j739q27j33J428J562K5j091k043m66
1506a912J365K490Q5j742k196n1J805J715K31j611j550l60J087K085M05j412j876
1523a442m59R32K528L95r45k270p79J751J808O28j504j947n55J013J740J172j100
1540I66j934j181J013K202J551j684k345j087J479K111R91j376j855n37P91J724
1556H29N52n37j291j144J18K316J283o35k088j943Q17K364J384q40j762j156K27
1573a506J974J108m50j356j139oJ239J582k6j554j531K28J572J802j22j690j723
$$ plain form
1590 -1598 -1196 135 1610 1666 143 -1409 -1987 -584 1676 1572 386 -2051 -2206 -135 1832 1808 155
1607 155 -1863 -1787 132 1321 1382 -113 -1111 -1193 -750 767 1493 612 -580 -1570 -685 763 1735 1154 -1148
1626 -1148 -2017 -653 1064 1812 841 -1173 -1841 -937 770 1580 1095 -961 -1990 -1044 940 1819 700
1643 700 -1267 -2150 -496 1196 1899 1017 -1049 -1470 -716 959 1591 823 -596 -1504 -981 456 1606
1660 1606 1212 -707 -1610 -1041 486 1590 870 -597 -1496 -885 487 1098 929 -126 -933 -1398 -203
1677 -203 1442 1674 283 -1417 -1485 103 1667 1966 38 -1321 -1634 313 1165 1475 11 -1539 -1144
1694 -1144 -194 941 1373 485 -1306 -1824 -286 1521 1551 373 -1390 -1680 -97 1469 1273 23 -1054
1711 -1054 -1287 -388 1280 1370 476 -988 -1280 -748 908 1689 372 -1407 -1651 22 892 1207 201 -750
$$ packed form
1590a598M02J331J475N6j523j552n78J403K260j04j186k437j55K071J967k4j653
1607A55k018P6J919J189O1j495r98q2M43J517P26q81j192r90Q85J448R72n81k302
1626a148q69J364J717P48r71k014o68R04J707Q10m85k056j029R46J984Q79j119
1643G00j967q83J654J692P03q82k066m21P54J675O32p68j419r08N23J437J150
1660A606l94j919r03N69J527J104p20j467q99O11J372O11j69j055q07m65J195
1677b03J645K32j391j700o8J588J564K99j928j359l13J947Q52L10j464j550L95
1694a144R50J135M32q88j791n18J538J807L0j178j763k90J583J566j96j250j077
1711a054k33Q99J668R0q94j464k92N32J656P81j317j779k44J673Q70L15j006r51
$$ plain form
1729 -750 -1366 -684 669 1118 847 -111 -1402 -744 537 1784 1369 -476 -1610 -1018 541 1753 644
1746 644 -919 -1504 -507 358 1057 939 -825 -1232 -771 447 1625 1569 -259 -1867 -1570 504 1750 1128
1764 1128 -263 -1310 -480 540 1332 941 -281 -717 -706 107 1030 959 210 -1289 -1377 -179 1150 1315
1782 1315 -264 -1254 -962 -464 925 915 389 -1032 -1073 -438 935 1400 730 -894 -1642 -418 1376 2080
1800 2080 413 -1171 -1751 -357 1152 1360 306 -1451 -1257 -106 740 941 89 -1264 -1302 -733 781
1817 781 1373 586 -846 -1182 -345 779 1731 745 -625 -969 -378 460 1252 937 165 -1249 -1221 314 1201
1836 1201 961 -455 -1634 -939 483 1528 856 -579 -1298 -621 438 754 969 -307 -978 -833 310
1853 310 1193 1208 -215 -991 -946 403 1763 1048 -125 -1201 -826 239 1138 685 -391 -1073 -913 -159
$$ packed form
1729g50o16O82J353M49k71r58j291O58J281J247m15j845j134N92J559J212j109
1746F44j563n85R97Q65O99j18j764m07M61J218J178n6j828j608K97K074J246o22
1764A128j391j047Q30J020P92l91j222m36J1Q13R23p1p49j499q8J198J329J65
1782A315j579r90K92M98J389j0n26j421m1O35J373M65o70j624p48J224J794P04
1800B080j667j584n80J394J509K08j054j757J94J151Q46K01q52j353l8N69J514
1817G81N92p87j432l36Q37J124R52r86j370l44N91Q38P92l15p72j414K8J535Q87
1836A201k40j416j179O95J422J045o72j435p19O77J059L16K15j276o71J45J143
1853C10Q83J5j423p76M5J349J360p15j173j076L75J065Q99m53j076o82J60P54
$$ plain form
1871 -159 1126 958 -53 -1093 -1408 -219 1021 1201 -242 -985 -917 348 922 1042 -412 -858 -1022 -289
1889 -289 832 943 392 -611 -1404 -450 759 1096 444 -968 -1595 -281 1242 1124 366 -1067 -1319 -458
1907 -458 446 1216 639 -747 -1376 -636 924 1883 711 -736 -1471 -318 1034 1178 449 -916 -1119 -371
1925 -371 816 666 576 -613 -426 -679 621 1004 980 10 -1156 -830 516 739 922 -271 -1030 -726 312
1944 312 970 556 -253 -941 -1011 30 825 1398 -291 -1319 -962 -100 1246 1350 -408 -1506 -1058 406
1962 406 1080 716 -204 -934 -659 -62 925 745 113 -914 -1072 -127 1108 1102 53 -995 -1143 -14 1150
1981 1150 674 -425 -616 -871 -204 535 569 247 -438 -1068 -344 267 1318 487 -723 -1032 -368 902 994
2000 994 190 -811 -1043 -68 1150 1236 290 -604 -1015 -350 363 1003 610 -633 -1124 -676 421 1100 480
$$ packed form
1871a59J285j68j011j040l15J189J240J80j443p43O8J265N74J20j454m46j64P33
1889b89J121J11n51j003p93R54J209L37o52j412o27J314J523j18p58j433k52Q61
1907d58R04P70n77j386o29P40J560R59j172j447p35J153J352J44p29j365k03P48
1925c71J187j50r0j189J87k53J300L83k4r70j166L26J346K23J83j193p59L04J038
1944C12O58m14q09o88p0J041P95N73j689j028L57Q62J346J04j758j098M48J464
1962D06O74l64r20p30K75N97R87j80o32j027j58R45J235oj049j048j48J129J164
1981A150m76j099j91k55O67P39L4l22o85o30P24O11J051q31j210l09O64J270R2
2000I94q04j001k32R75J218Q6r46q94m11O65P13O40l93j243m91M48J097O79o20
$$ plain form
2019 480 -425 -834 -449 481 368 591 -209 -828 -748 -18 1012 1052 -271 -1036 -1022 807 1389 996 -429 -1193
2039 -1193 -332 756 697 324 -225 -689 -587 -95 578 572 41 -603 -829 -270 554 1200 118 -1125 -583 -162
2059 -162 1135 714 -52 -881 -829 -213 847 924 2 -1127 -1173 47 1112 1036 -23 -1028 -807 -52 689
2078 689 620 -244 -714 -267 -64 313 423 311 -325 -870 -595 630 946 621 -593 -1086 -98 696 1147 29
2098 29 -794 -752 -358 633 807 72 -73 -927 -623 189 690 688 -271 -1029 -895 735 1355 515 -489 -956 -611
2119 -611 567 975 894 -498 -1015 -412 634 1067 305 -710 -704 -125 712 553 96 -247 -390 -7 344 397
2139 397 150 -114 -274 -733 -452 938 927 428 -996 -1392 -43 961 1487 -210 -1491 -1190 377 1075
2157 1075 667 -538 -845 -214 153 320 437 79 -514 -460 -148 213 885 329 -425 -957 -478 730 1097
$$ packed form
2019D80r05m09L85R30j13K23q00o19Q0P30J030M0j323p65J4J829N82l93j425p64
2039a193Q61J088n9l73n49m64J02M92O73on31o44k26N59Q24O46j082j243N42M21
2059a62J297m21p66q29N2O16J060P7r22j129m6J220J065p6j059j005K21P55P41
2078F89o9q64m70M47K03L77J10j12o36n45K75J225L16l25j214m93R88P94M51j118
2098B9q23M2L94R91J74p35j45q54L04Q12N01kr59p58J34J630O20q40j004m67L45
2119f11J178M08q1j392n17O03J046M33p62j015ON79Q37j59m57l43j43L83L51N3
2139C97k47k64j60m59K81J390j1m99j424l96J349J004N26j697j281L01J567O98
2157A075m08j205l07O31L67J67J17l58n93N4L12L61O72n56p54n32M79J208L67
$$ plain form
2176 1097 602 -890 -637 -215 942 1001 329 -697 -599 118 872 613 -241 -739 -784 -78 789 670 -110 -502
2196 -502 -457 203 -5 285 417 129 -807 -852 79 1061 1001 -77 -1026 -767 654 1288 443 -815 -558 -441
2216 -441 673 566 188 -220 -487 -244 -108 316 514 521 -615 -502 -266 671 859 216 -967 -1024 203 1132
2236 1132 628 -260 -1126 -702 324 1117 519 -322 -699 -492 106 362 276 -435 -676 -143 226 240 379 218
2256 218 73 -621 -725 48 701 846 -356 -1374 -540 930 1352 670 -1086 -1252 145 1207 903 -606
2274 -606 -866 -387 574 658 -16 -209 -113 -113 -548 -46 -43 596 43 -708 -688 148 914 920 -735 -962 -464 721
2296 721 1032 129 -385 -1058 -46 543 536 -91 -328 -566 40 368 76 95 -399 -177 -250 -506 329 673 606
2317 606 -446 -887 -288 868 1210 163 -1013 -1076 216 1069 693 -533 -1390 -304 1018 924 -285 -730
$$ packed form
2176A097m95j492K53M22J157N9o72j026R8P17P54k59q54m98m5P06Q67j19p80l92
2196e02M5O60k08K90J32k88r36m5R31R82o0j078r49K59J421O34q45j258K57J17
2216d41J114j07l78m08k67K43J36M24J98Pj136J13K36R37J88o43j183n7J227R29
2236A132n04q88q66M24J026P93n98q41l77K07N98K56q6p11k41N33L69J4J39j61
2256B18j45o94j04P73O53J45j202j018Q34J470M22o82j756j66J397J062l04j509
2274f06k60M79R61Q4o74j93R6%m35N02LO39n53p51K0Q36P66Oj655k27M98J185
2296G21L11r03n14o73J012N89po27k37k38O06L28k92J9m94K22p3k56Q35L44o7
2317F06j052m41N99J156L42j047j176o3J292Q53l76j226q57J086J322r4j209m45
$$ plain form
2335 -730 -173 -20 118 -40 -342 -92 140 -663 -397 231 963 624 -566 -878 -427 827 939 18 -979
2354 -979 -983 249 945 221 -372 -754 -395 408 515 -124 -177 -453 4 228 -72 -33 191 399 -366 -764 -151
2375 -151 411 1217 54 -1231 -929 234 1588 750 -846 -1712 -134 1119 856 -182 -1432 -903 575
2392 575 1102 -63 -644 -203 -22 378 -108 -303 238 640 -376 -1165 -459 840 928 118 -693 -617 288 1146
2412 1146 1044 -588 -954 -40 658 763 162 -440 -441 144 358 536 -197 130 -200 7 -123 -283 405 712
2432 712 250 -644 -494 273 1117 601 -743 -1063 -127 1469 1210 -524 -1105 -510 1038 1160 -85 -815
2450 -815 -627 380 591 -308 -765 157 445 -80 -606 -417 148 960 316 -652 -877 477 1416 653 -627
2469 -627 -1384 -237 1215 1233 -57 -903 -249 677 751 472 -394 -583 -151 332 51 -187 -77 115 2 -525
$$ packed form
2335g30N57J53J38j58l02K50K32q03K66O28P32l39j190l12M51J254J12r21r97
2354i79mJ232O96p24n93l82L59Q03J07o39n3k76M57K24l00L9K24K08p65l98O13
2375a51N62Q06j163j285L02J163J354q38j596q66J578J253k63j038j250N29J478
2392E75N27j165n81M41J81M00m86j95N41M02j016p89P06J299Q8q10q11P6R05Q58
2412A146j02j632l66R14O98J05o01o02jN85K14J78p33L27l30K07j30j60O88L07
2432G12m62q94J50P67Q44n16j344l20R36J596k59j734n81N95J548J22j245p30
2450h15J88J007K11q99m57R22K88n25n26J89N65Q12o44r68k25J354R39p63j280
2469f27p57J147J452J8j290q46O54R26P4k79q66j89M32M83k81k38J10J92j13n27
$$ plain form
2489 -525 -461 78 739 238 -738 -1101 -90 1016 952 -480 -1425 -899 1042 1389 88 -1211 -1365 283
2507 283 869 513 -367 -716 279 417 -123 -521 17 545 125 -483 -991 -5 1086 478 -865 -1472 -196
2526 -196 983 828 -129 -1071 -575 749 1118 474 -791 -669 -211 516 -54 -76 -538 94 457 -5 -244
2545 -244 -5 316 136 -616 -842 -33 780 555 -540 -841 -709 1051 1267 209 -968 -940 476 1158 449
2564 449 -1216 -578 175 637 257 -436 -238 118 833 -654 -825 -138 744 675 -446 -969 -332 1085 1389
2583 1389 -66 -1233 -459 625 1084 499 -1058 -1271 341 881 684 -335 -688 -133 791 210 -106 -199
2601 -199 -94 326 -166 -459 -153 655 582 -154 -833 -182 794 1035 108 -1133 -890 395 1079 680 -834
2620 -834 -1074 -275 824 377 -79 -402 25 388 262 -672 -516 413 342 -453 -1022 -335 677 1371 -78
$$ packed form
2489e25O4N39O61n01r76l63J011J106o4j432r45N26J941L47j301j299j54J648
2507B83N86l56q80l49R95J38n40l98N38N28m20o08n08R86J091o08j343o07J276
2526a96J179j55r57r42M96J324L69o44j265J22M58P27n70k2m62O32L63m62k39
2545b44K39L21j80p52k26Q09Q13k25j095l01J32J760K16j058j177K8J416O82p09
2564D49j665O38P53M62l80o93J98L56P15j487j71O87Q82o9j121n23O37J417L04
2583A389j455j167P74J084M59n85j557k13J612N40j97j019l53N55R24n81l16r3
2601a99J05M20m92k93L06Q08p3p36o79O51R76K41r27j241K43J285O84l99j514
2620h34k40P99J099m47m56l23M27L63j26r34J56R29p1p95n69O87J012O94j449
$$ plain form
2639 -78 -1350 -833 1038 1267 334 -830 -1029 379 1336 749 -593 -1168 -67 722 530 -318 -551 24
2657 24 219 379 -361 -121 49 337 -265 -837 -646 380 818 129 -1138 -897 376 1175 692 -765 -1039
2676 -1039 -94 772 535 -264 -1168 163 633 582 -327 -729 -65 344 349 -505 -712 333 973 197 -857 -794
2696 -794 370 1151 735 -828 -1237 336 1400 555 -688 -1349 -149 1010 925 -516 -731 -131 728 490
2714 490 -335 -497 -4 210 64 -429 -758 -68 686 126 -413 -880 177 952 717 -501 -1088 -223 1087
2733 1087 1130 -143 -632 -327 753 927 -63 -643 -636 276 361 -101 -558 -211 364 192 -504 -813 332 908
2753 908 172 -802 -1327 20 1090 746 -953 -1215 88 858 909 -107 -934 -198 713 641 -322 -633 -69
2772 -69 513 561 -280 -20 250 599 -77 -621 -691 60 630 547 -501 -1001 40 722 891 -182 -781 -865 890
$$ packed form
2639g8j272N17J871K29r33j164j99J408R57n87j342n75J101P89j92q48k33N75
2657B4J95J60p40K40J70K88o02n72J91J026M38o89j267K41J273P99m83j457k74
2676a039R45Q66k37p99r04J331M70n1r09m02O64M09Nq54k07J045O40p76j054O3
2696g94J164P81m16j563m09J573J064q45j243o61J200J159q5j441k15O00Q59k38
2714D90q25j62M93K14j46m93l29O90P54n60n39m67J057P75k35j218n87Q65J310
2733A087M3j273m89L05J080J74r90n80PR12Q5m62m57L47N75j72o96l09J145N76
2753I08p36r74n25J347J070l44j699k62J303P70N1j016q27P36R11p2r63l11N64
2772f9N82M8q41K60K70L49o76n44p0P51N70q3j048n00J041O82J69j073n99q4J755
$$ plain form
2793 890 1025 -154 -840 -896 160 988 193 -507 -451 329 298 -209 -279 -175 847 504 -682 -1180 -55 906
2813 906 622 -370 -1178 -123 1051 975 -217 -1092 -409 873 919 264 -877 -397 398 593 -294 -398 -110
2832 -110 266 314 -324 -233 -251 471 175 -552 -689 -30 392 643 -109 -921 -721 457 976 162 -747 -844 111
2853 111 970 362 -245 -324 -99 541 3 -208 -578 301 396 -167 -207 -233 439 592 -383 -746 -351 606 444
2874 444 -30 -1054 -562 724 989 268 -908 -799 260 577 101 -404 -291 202 485 -296 -717 109 583
2893 583 493 -119 -718 -114 739 452 -130 -894 -375 449 1024 56 -731 -618 423 938 332 -69 -438 -103
2913 -103 480 587 -36 -555 -167 544 19 -514 -204 171 110 -133 -674 -403 492 720 1 -1239 -681 431
2933 431 1149 225 -780 -913 339 838 226 -671 -552 146 600 199 -316 -455 15 313 88 -442 -5
$$ packed form
2793H90J35j179o86n6J056Q28p95p00N6P80l1n07p0J04J022l43j186m98J125R61
2813I06k84r92q08J055J174p6j192q75O83J282M6o55j141M80P95J95q87j04K88
2832a10L76M8o38R1j8P22k96p27j37O59M22K51p52q12K00J178N19q14r09r7R55
2853A11Q59o08o07p9K25O40n38k11l70Q79R5n63m0k6O72J53r75l63L95R57j62
2874D44m74j024M92J286K65p21j176J09J059L17m76n05J13M93K83p81m21Q26M74
2893E83r0o12n99O04Q53k87n82p64N19Q24N75r68p87J13J041N15o06m01l69L35
2913a03N83J07o23n19L88P11n25n33L10L75o1k43n41K71Q95K28p19j240N58J112
2933D31P18r24j005j33J252M99o12q97J19O98M54m01n15j39M70K98k25n30M37
$$ plain form
2952 -5 273 585 -172 -285 -496 710 779 69 -421 -780 186 876 259 -233 -508 -124 712 445 -356 -173 48
2973 48 406 438 -406 -749 68 275 -146 -406 -313 315 647 -24 -434 -697 501 957 94 -856 -635 -64 948
2994 948 567 -441 -1097 9 553 84 -335 -524 75 651 -174 -183 -499 331 362 -333 -197 -275 523 539 -383
3015 -383 -223 -334 294 677 -182 -628 -489 390 526 544 -276 -729 -66 508 664 114 -473 -284 -351 271 -135
3036 -135 -262 -93 121 61 -553 -481 -73 502 5 -498 -1009 76 725 556 -128 -645 -409 472 516 -228 -519
3057 -519 -201 401 425 13 -109 -49 48 82 -117 82 -45 276 99 -396 -304 179 454 132 -449 -416 246 589
3079 589 350 -86 -521 -100 404 221 78 -324 -75 99 503 95 -305 11 85 264 170 -157 -61 286 260
3100 260 -401 -175 209 195 388 -368 -534 -161 434 457 62 -519 -233 339 665 -68 -256 101 248 415 -135
$$ packed form
2952eK78L12p57j13k11J206O9p10m90l59R66O90o17m92k75L84Q36k67q01J83K21
2973D8L58L2q44l43Q17K07m21k60R3O28L32o71m10k63J198M56q63r50K21N71J012
2994I48l81j008o56J106N44m69m19j89N99N76q25rl16Q30L1o95J36p8P98J6r22
3015c83J60j11O28L83q59m46J39Q79J36J8q20m53O63N74J56n50n87J89o7O22m06
3036a35j27J69K14o0o14P2M08N75m97n03n11J085O49j69o84n17K36Q81M4p44k91
3057e19L18O02K4m12j22O0R7L4j99J99j27L21j77m95R2M83K75l22n81L3O62L43
3079E89k39m36m35M21N04j83j43m02K49J74M04m08m00L16P4J79r4l27R6L47k6
3100B60o61K26L84j4J93p56j66L73N95K3l95n81K86N72L26p33j88L57J47J67n50
$$ plain form
3121 -135 -146 61 273 120 -162 -166 -23 278 -85 -754 -487 294 410 403 -117 -567 -33 279 498 77 -127 -283
3143 -283 -252 329 420 -201 -360 -18 183 448 -197 229 -4 357 -93 -416 47 251 78 55 -526 -193 352
3164 352 576 -136 -484 -406 91 1000 350 -294 -448 176 478 331 -418 -30 279 176 -263 -76 125 222 -136
3185 -136 -217 -301 399 453 294 -171 -470 225 481 235 -93 -39 60 -165 315 509 -372 -201 -114 114 49 379
3207 379 -193 -28 -107 -214 -332 262 64 -165 -241 98 -242 234 491 0 -200 -314 173 647 92 -393 -403
3228 -403 -71 375 133 -275 -382 -169 184 -84 206 -179 -38 7 -81 -8 -105 83 70 -86 -457 -65 398 326
3250 326 -197 -514 -158 170 704 82 126 -179 51 15 477 -222 -152 -146 -222 153 76 -45 -323 -65 -153 43 122
3273 122 396 -180 110 -283 -341 351 215 42 -134 -819 2 613 165 -159 -317 -117 442 287 -209 -306 -81
$$ packed form
3121a35j1K07K12j53k82mJ43L01l63o69K67P81J16pn20m50N34L12K19m21k04j56
3143b83L1N81R1o21j59L42K01K65o45M26k33L61m50l23M63K04j73k3n81L33N45
3164C52K24p12l48P8M97R09o50o44j54O24L02j47p49L88L09j03m39J87K01R7l58
3185a36q1q4P00N4j59m65k99O95K56k46l28N4R9k25M80J94q81J71Q7K28o5L30
3207C79n72J65p9j07j18N94j98k29p6L39l40M76K57m91k00j14M87M74n55m85j0
3228d03L32M46k42m08j07K13L53k68K90l85J41M5q8P3r7J88j3j56l71L92M63p2
3250C26n23l17L56L28N34o22M4l05K30l6M62o99P0Op6L75p7j21k78K58q8J96P9
3273A22K74n76K90l93n8O92j36j73j76o85Q21O11m48l24j58K00N59j55m96r7K25
$$ plain form
3294 -81 148 -104 108 -191 55 143 -162 -10 16 174 409 -38 -429 15 211 341 424 -51 -219 217 333
3315 333 127 276 -330 -143 -277 342 133 379 325 -238 -206 -240 181 -13 -111 199 -211 -187 137 38 101 -41
3337 -41 -239 237 346 -162 -76 -449 97 225 460 405 -286 -160 141 -65 404 -55 54 251 141 -25 -190
3358 -190 17 33 15 -256 -354 27 336 -101 -602 -324 -120 369 366 -131 -297 38 257 66 173 -63 -416 -336
3380 -336 13 66 86 33 114 -206 77 159 13 -148 41 -250 -14 42 -67 118 -189 -297 -32 -141 89 106
3402 106 -465 119 178 196 248 -245 -190 12 -157 -6 70 -33 -33 48 -188 158 16 -26 -122 -239 -160 -135 35 -30
3426 -30 -234 -327 324 317 151 70 -91 -393 -88 50 462 -65 -58 126 -173 199 69 -98 -59 -227 -247 244 231
3449 231 290 94 -77 240 248 22 258 130 -165 -163 -62 310 -110 -92 -80 -352 292 64 106 -29 -259 4 -33
$$ packed form
3294h1K29k52K12k99K46Q8l05J52K6J58K35m47l91M44J96J30Q3m75j68M36J16
3315C33k06J49o06J87j34O19k09K46n4n63L2l4M21j94r8L10m10K4L24r9O3j42
3337d1j98M76J09n08Q6l73N46J28K35n5o91J26L01k06M69m59J09J97j10j66j65
3358a90K07J6j8k71r8L81L09m37n01K78K04M89lm97j66L35K19j91J07k36l53Q0
3380c36L49N3K0n3Q1l20K83Q2j46j61J89k91K36N6j09J85l07j08K65j09K30J7
3402A06n71N84N9J8N2m93N5K02j69J51P6j03%Q1k36L46j42m2r6j17P9K5J70o5
3426c0k04r3O51pj66q1j61l02L05J38M12n27PJ84k99L72j30j67L9j68k0M91j3
3449B31N9j96j71L17Qk26K36j28k95KJ01L72m20J8J2k72O44k28M2j35k30K63l7
$$ plain form
3472 -33 145 -82 146 -151 -200 -64 339 350 -150 -177 -226 -166 170 46 -118 -123 -216 77 195 -204 140 -160 -77
3495 -77 -26 8 166 150 -56 -520 -138 320 103 -124 -151 -204 -119 -72 124 -62 107 -62 -255 -208 165 177 81 -91
3519 -91 -200 99 513 343 -167 23 185 125 132 -94 -18 66 -74 48 -191 124 40 -173 -269 229 442 128 -151
3542 -151 -394 -94 147 338 39 102 -36 131 278 410 484 169 -318 -341 251 64 299 -100 -132 -152 -21 -80
3564 -80 -198 -68 -16 -337 -107 171 130 -15 79 -159 -209 204 187 -426 -176 -251 -34 -184 96 150 -334 267 163
3587 163 45 180 -101 -40 204 -189 14 -30 227 -244 -298 183 262 384 -69 -128 -247 -5 111 -95 -318 -273
3609 -273 -105 144 303 37 335 -7 42 104 -31 25 -175 -113 -134 25 -35 -88 -278 -84 -175 -335 3 44 -44
3632 -44 80 -234 -381 -44 95 118 255 -21 -116 -186 -79 72 179 -295 5 -94 224 219 92 -88 -128 -102 288
$$ packed form
3472c3J78k27K28k97m9J36M03J1n00k7m9O0L36j24j64nr3K93J18l99L44l00Q3
3495g7N1L4J58j6k06m64L82M58k17k27k7n3Q5M7J96j86J69j69j93M7L73J2r6j72
3519i1j09K99M14j70n10J90J62o0Pk26P6Q4j40J22k39L15q4k13r6M98K13l14k79
3542a51k43L00K41J91k99O3j38J67J47J32P4l15m87k3N92j87K35l99l2k0J31n9
3564h0j18J30N2l21K30K78m1j45R4k38n0M13j7o13K50p5K17j50K80N4m84O01j04
3587A63j18J35k81O1K44l93K03m4K57m71n4M81P9J22m53n9j19K42J16k06k23M5
3609b73J68K49J59k66K98l42M9O2j35N6k00O2k1J59o0n3j90J94r1j60L38M1q8
3632d4J24l14j47L37J39K3J37k76r5p0J07J51J07m74L00r9L18nj27j80m0K6L90
$$ plain form
3655 288 202 -160 -193 -85 107 59 -70 -148 -132 220 -284 218 5 82 -124 -113 21 -66 34 182 147 -286 10
3678 10 223 287 -417 69 -145 71 170 -5 -141 36 -284 -298 -41 127 23 -249 -142 -19 188 305 -94
3699 -94 -249 -251 -177 208 177 -24 172 -192 -5 85 151 82 -24 -177 -128 -121 143 45 9 -259 -6 -89 130 -38 -89
3724 -89 2 -41 272 51 6 188 -90 -258 77 108 -128 186 -139 -299 120 14 -59 -26 -376 8 156 -177
3746 -177 5 -18 -103 -326 27 124 111 -143 -533 -655 102 -32 134 -85 -72 -145 -81 422 -348 46 29 -57 3
3769 3 -128 429 -110 177 63 -58 25 236 -121 -124 244 -109 433 56 39 37 158 -189 -50 0 55 31 36 -10 29
3794 29 35 -76 -297 -195 225 41 -29 13 -82 62 -262 -85 250 164 184 33 106 -317 30 147 -274 -114 10
3817 10 284 -277 50 24 -296 20 104 -120 180 195 -263 -336 -131 207 99 -176 -266 56 110 98 -65 -253 -208
$$ packed form
3655B88q6l62l3J08J92m8j29p8J6L52n04N02k13P7k06J1J34q7J00J48l5m33K96
3678A0K13O4p04M86k14K16R9j75j36J77l20j4K57J68j04k72J07J23K07J17l99
3699i4j55kP4L85l1k01J96l64J87R0O6o9j06j53M9PK64r8l6k68K53q3K19j68n1
3724h9R1m3L13k21m5J82k78j68L35L1k36L14l25j60M19j06p3L3l50L84J48l33
3746a77J82k3q5k23L53R7j3k54l90j22P57j34J66k19J3p3O4N03p70L94j7q6O0
3769Cj31N57n39K87j14j21Q3K11l57lL68l53N42l77j7kJ21l47J39N0N5k4Nm6L9
3794B9Oj11k21J02M20j84p0M2r5J44l24J77L35q6K0j51P3m23L47J17m21J60J24
3817A0K74n61L27k6l20L16Q4k24L00J5m58p3K05L38j08k75r0L22N4j2j63j88M5
$$ plain form
3840 -208 208 -194 -76 107 38 -22 76 -148 -43 458 -44 141 -355 -127 158 -196 -285 141 -216 2 240
3861 240 -1 439 51 -196 -233 179 -28 54 61 -101 -91 -65 153 120 -47 -220 -15 64 58 231 -50 103 -76
3884 -76 23 228 -15 -295 -449 -140 -226 168 254 -391 -135 -77 57 -14 227 -200 -78 60 -25 405 -132 -128 12
3907 12 -138 -28 169 422 95 202 -54 -47 28 -75 -200 -104 29 -230 -166 231 2 -69 -248 -58 39 -160 149
3930 149 -39 -155 106 321 11 -37 73 73 -85 -364 -107 25 44 60 -63 206 122 -196 78 -327 13 137
3952 137 -60 -166 -72 145 387 -30 144 -114 199 -129 27 104 285 -21 191 -296 172 -208 -121 -119 -252 -324
3974 -324 125 255 -19 -215 -19 146 -225 -119 266 67 -112 -169 -490 -85 141 -50 -123 -221 261 297 -168
3995 -168 -19 -41 221 -210 162 118 146 -95 -25 -277 -68 99 393 -119 -65 165 -144 272 70 -145 6 -155
$$ packed form
3840b08M16m02J18J83o9o0R8k24J05N01n02J85m96K28K85l54q9M26l57K18K38
3861B40k41M40l88k47l7M12k07Q2Pj62J0K6K18l3j67j73K05P9oJ73k81J53j79
3884g6R9K05k43k80j54L09q6L94Q6o45K56N8J34p1K41m27J22J38q5M30n37MJ40
3907A2j50J10J97K53l27J07k56PP5j03j25R6J33k59O4L97k29p1j79J90R7j99L09
3930A49j88j16K61K15l10m8J10%j58k79K57J32J9J6j23K69q4l18K74m05L40J24
3952A37j97j06R4K17K42m17J74k58L13l28J56P7J81l06K12m87M68l80Q7Kj33p2
3974c24M49J30k74j96J96J65l71J06L85j99j79n7l21M05K26j91p3r8M82L6m65
3995a68J49k2K62m31L72m4K8k41P0k52K09J67K94n12N4K30l09M16k02k15J51j61
$$ plain form
4017 -155 180 -33 93 78 -170 -101 135 -333 375 36 -407 -50 9 144 -249 -2 -210 40 49 94 60 189
4039 189 99 -104 -9 -10 226 -70 128 188 -78 -102 -42 119 45 109 64 395 -33 27 -29 -240 99 253 3 375
4063 375 15 -96 -307 31 68 60 -260 -162 213 127 71 -310 -165 117 134 69 130 -35 -182 -205 -121 226 300 -220
4087 -220 -138 -245 -53 104 160 177 166 -74 35 -87 -178 -98 -370 -277 -215 -73 36 319 21 -138 -92 -132 64
4110 64 55 -150 162 -151 -98 -26 -24 -14 -50 -172 -301 117 410 21 -400 -52 -47 96 26 -15 -238 -20 239 -125
4134 -125 128 -28 49 -69 -98 -36 -70 -4 117 -220 -47 201 8 1 24 -25 -319 -90 -37 108 12 35 187 -285
4158 -285 278 200 -274 -159 -30 204 282 180 186 -174 80 153 -245 131 -128 -32 280 -643 101 -163 22 -237
4180 -237 80 -221 192 267 -146 -204 37 -195 117 -43 -88 -33 -347 72 166 134 -121 -4 -73 76 -125 -79 211
$$ packed form
4017a55L35k13J26j5k48O9K36m68P08l39m43L57N9J35l93K47k08K50RM5l4J29
4039A89r0k03R5jK36k96J98O0k66k4O0J61p4O4m5L31m28O0n6k11L39J54k50L72
4063C75l60j11k11L38L7ql20R8L75q6n6l81J45K82J7o5O1j65j47k3Q4L47P4n20
4087b20Q2j07J92J57N6J7j1k40J09j22r1Q0k72R3O2J42J09K83k98j59M6m0J96
4110F4rk05L12l13N3P2KJ0l6j22j29M18K93l89m21L48NJ43p0m1k23K18K59l64
4134a25K53j56P7j18k9O2l4O6J21l37J73K48j93pK3m9k94K29N3J45r6K3J52m72
4158b85N63p8m74J15J29K34P8j02Ol60K54P3l98L76k59R6L12r23P44k64J85k59
4180b37L17l01M13P5m13n8K41k32L12j60m5N5l14M19R4l2k55J17o9J49k01M6K90
$$ plain form
4203 211 238 -223 190 68 -81 -121 -204 -94 -85 261 194 170 -6 -224 -122 66 238 49 -160 94 65 -55 -136
4226 -136 -27 -255 -66 352 -246 -54 2 -5 12 -458 10 13 77 -55 -186 161 141 77 -140 -20 139 -300 60
4249 60 245 -155 -133 -159 56 -217 124 110 -82 41 -191 -75 16 312 -124 -208 -295 -118 30 -124 77 53 20
4272 20 -99 -89 186 168 56 -39 -75 440 167 -300 -31 -182 63 -26 -41 74 340 205 -297 74 4 -83 -97
4295 -97 -59 212 -57 -4 -33 -138 -43 80 229 164 117 -96 -34 105 51 171 -176 -94 -105 -157 184 -14 -37 127
4319 127 -12 127 202 -105 -91 -213 33 648 -170 223 84 34 -61 -50 27 94 136 -49 -162 -129 -17 148 217
4342 217 312 66 44 92 -67 133 112 -34 -33 49 -430 269 -206 240 -197 37 57 -172 -24 84 -126 -406 93
4365 93 34 -83 -155 25 -2 124 78 -11 10 266 -206 -113 30 112 -159 142 205 133 387 -361 101 -84 215 141
$$ packed form
4203B11K7m61M13j22j49m0q3J10RL46o7k4j76k18J02J88J72j89k09K54k9j20q1
4226a36J09k28J89M18n98J92N6pJ7m70M68LO4j32j31L47k0o4k17J20J59m39L60
4249F0J85m00K2k6K15k73L41j4j92J23k32J16R1K96m36q4q7J77J48j54K01k4l3
4272B0j19J0K75j8j12r5l6N15k73m67K69j51K45q9j5J15K66j35n02L71p0q7j4
4295i7L8K71k69N3k9j05R5J23J49o5m7k13O2J39n4J20l47Q2j1n2L41j98k3J64
4319A27j39J39P5l07J4j22K46O15q18L93j39n0r5J1P7O7M2j85j13L3J12J65O9
4342B17R5k46k2M8j59K00k1j46JQ2m79O99m75M46m37K34K0k29J48J08k10k80M99
4365I3n9j17p2J80k7J26m6q9K1K56m72R3J43Q2k71L01O3p2K54p48M62j85K99p4
$$ plain form
4389 141 126 127 -101 72 44 18 475 152 -90 -209 83 -24 68 219 81 352 -145 -311 107 -206 -26 -383
4411 -383 130 -23 -169 -54 33 -240 -196 336 266 -23 -38 122 -77 136 223 -32 401 -67 -21 -66 -132 117 274
4434 274 -91 63 137 130 -411 -114 -14 299 276 -232 -169 -67 -45 -99 -30 187 116 25 -140 -159 -3 52 -34 -95 162
4459 162 57 151 36 71 -144 86 91 57 96 39 -45 252 -107 102 78 16 -89 -74 -469 -138 -33 8 -102 227
4483 227 -240 43 152 -47 83 -371 -110 107 -293 -18 84 -187 -140 266 113 -145 70 -324 29 -73
4503 -73 133 -363 119 -167 292 -65 -234 213 -34 16 87 -210 99 357 -198 133 -24 60 -22 -181 -219 22
4525 22 201 336 -41 25 -130 143 -174 -223 144 486 52 108 -123 -278 218 113 -118 -203 -67 70 47 35
4547 35 183 -181 198 219 128 258 77 -128 -223 -148 159 -134 -13 -391 319 -38 -21 144 -29 164 -122 -138
$$ packed form
4389A41j5Jk28J73k8k6M57l23k42j19K92j07R2J51j38K71m97j66M18l13J80l57
4411c83N13j53j46J15Q7k73M4N32p0k89j5J60j99K13Q7k55M33m68M6m5o6K49J57
4434B74l65J54P4pn41K97J00L13k3n08O3J02K2n4O9K17p1r1j65j9J56N5q6o1K57
4459A62j05R4j15L5k15K30Nl4L9n7q4K97l59K09k4o2j05J5l95L31J05M1j10L29
4483B27m67K83J09j99J30m54K61K17m00K75J02k71M7M06j53k58K15l94L53j02
4503g3K06m96M82k86M59l57j69M47k47N0P1k97L09K58n55L31j57Q4q2j59l8K41
4525B2J79J35l77O6j55K73l17m9L67L42m34N6k31j55M96j05k31q5J36J37k3j2
4547C5J48l64L79K1r1J30j81k05r5P5L07k93J21l78P10l57J7J65j73J93k86j6
$$ plain form
4569 -138 199 60 -159 -60 -279 -231 -202 168 31 -383 -160 -210 125 101 60 -146 18 -82 42 -46 54 -64
4591 -64 -394 267 -213 147 -119 231 -158 66 130 -74 21 122 -185 -138 115 275 427 158 40 163 -132
4612 -132 111 211 -148 43 217 17 -8 -124 21 -15 85 62 9 86 89 239 168 -18 188 143 -170 -24 -114
4635 -114 161 -387 -2 -160 -182 -56 168 73 47 -137 -129 -299 58 -33 -166 135 64 162 -287 -59 26 -202 -37
4658 -37 76 90 49 17 33 65 52 -91 192 190 131 39 -96 11 -128 210 56 -330 -183 179 18 30 54 11 -189
4683 -189 -245 88 115 52 -140 114 92 -149 201 157 233 75 135 -10 -211 75 -74 -87 -121 60 -20 -122 -84 -280
4707 -280 -161 -132 20 50 -232 36 -172 49 390 112 -148 -28 81 53 44 115 144 142 354 -138 103 69 -258
4730 -258 -221 51 -309 -2 254 232 22 -150 123 -149 -125 96 172 13 -4 110 -85 -15 -283 -160 165 302
$$ packed form
4569a38L37j39k19R9k19M8K9L70j37m14K23n0L35k4m1k06J64j00J24q8J00j18
4591f4l30O61m80L60k66L50l89K24O4k04R5J01l07M7K53J60J52k69j18J23k95
4612a32K43J00l59J91J74k00k5j16J45l6J00k3n3P7LJ50p1j86K06m5l13J46r0
4635a14K75n48L85j58k2J26K24r5k6j84Qj70L57r1j33L01p1R8m49K28Q5k28J65
4658c7J13J4m1l2J6L2j3j43K83kn9r2j35J07j39L38j54l86J47L62j61J2K4m3k00
4683a89n6L33K7o3j92K54k2k41L50m4P6j58O0j45k01K86j49j3l4J81q0j02L8j96
4707b80J19K9J52L0k82K68k08K21L41k78k60J20J09k8rP1K9kK12m92K41l4l27
4730b58L7K72l60L07K56k2k10j72K73k72K4K21P6j59j7J14j95P0k68J23L25J37
$$ plain form
4752 302 117 -30 227 -61 0 -176 -160 -163 270 93 87 -154 116 16 -97 -131 -83 285 137 4 -202 180 376
4775 376 149 -181 55 -109 67 -78 170 102 -118 223 77 -161 -156 167 295 -81 78 112 -39 211 64
4796 64 220 -119 -4 85 34 -190 -241 70 -56 227 -79 264 70 -60 216 22 -47 13 134 123 123 154 -217
4819 -217 85 -39 -147 -144 -7 -142 237 -6 -21 174 146 39 -175 -90 -294 -2 35 390 -219 57 137 81 -307
4842 -307 -44 -140 106 139 -21 -142 -35 356 330 145 -291 -204 -79 -282 -125 -23 -120 174 -100 -256 -309 -5
4864 -5 -223 -4 -30 -180 -291 -27 389 69 27 -50 99 -227 -16 202 336 208 -297 -139 -121 9 155 -321
4886 -321 -113 -39 -127 137 400 88 -21 -26 -229 -9 141 29 -29 16 62 -57 -4 109 102 -149 2 -51 -157 16
4910 16 393 -87 57 252 32 12 158 184 140 77 -63 -234 219 223 -21 -18 -206 -343 -59 -48 -459 -192 226
$$ packed form
4752C02j85j47K57k88O1j76J6lM33j77ok41K70j00j13l4M8L68j48j33k06L82J96
4775C76k27l30K36j64J76j45K48o8k20L41j46k38NL23J28l76J59L4j51K50j47
4796F4J56l39J15Q9n1k24n1L11j26K83l06L43j94j30K76j94o9O0J21j1%L1l71
4819b17L02j24j08LJ37j35L79k43j5J95k8j07k14Q5k04K92L7L55o09K76Q0n6l88
4842c07K63r6K46L3j60j21J07L91k6j85m36Q7J25k03J57J02r7K94k74j56n3L04
4864ek18K19k6j50j11K64M16l20m2p7J49l26K11K18J34j28n05J58J8J30J46m76
4886c21K08P4q8K64K63l12j09nk03K20J50j12n8M5M6j19N3J13pk51J51n3j06J73
4910A6L77m80J44J95k20k0J46K6m4o3j40j71M53Mk44Lj88j37K84J1m11K67M18
$$ plain form
4933 226 121 256 -24 194 387 86 71 -156 53 -28 -212 56 263 -303 -343 -160 -112 -179 200 -28 10 -143
4955 -143 -54 -5 -7 -214 349 136 -162 97 69 -144 94 -249 -319 -118 142 -86 244 -391 339 345 -47 -54 -3 5
4979 5 -307 191 -79 129 96 144 -392 36 54 -231 257 -34 33 -294 -109 -5 173 146 14 -173 -74 36 72
5002 72 -28 134 -59 -182 -104 -109 21 -11 25 21 -163 -129 -243 30 262 -61 130 158 416 -4 -113 114 209 -159
5026 -159 -97 -56 -182 -173 279 25 -59 21 -74 299 163 173 -143 -223 52 19 -240 12 442 332 -100 -177 -99 55
5050 55 -63 -263 -66 -11 -12 49 -66 -40 -375 -216 90 67 -184 153 -92 27 -91 191 236 -72 44 186 -156
5073 -156 -196 291 172 38 -188 90 139 577 159 -140 38 81 1 68 95 -73 194 134 -52 17 136 150 -27
5096 -27 241 -105 -130 55 -126 -24 -134 125 -200 -150 -148 -8 -249 -374 -59 3 -247 38 186 -88 -11 -234
$$ packed form
4933B26j05J35k80K18J93l01j5k27K09q1j84K68K07n66m0J83M8o7L79k28L8j53
4955a43Q9M9kk07N63k13k98K59k8k13K38l43p0K01K60k28L30o35P30Ol92pN1Q
4979El12M98k70K08l3M8n36M28J8k85M88k91O7l27J85J04J78k7j32j87R9J10L6
5002G2j00J62j93j23P8nJ30l2L6mj84L4j14K73K32l23J91K8K58m20j09K27R5l68
5026a59O2M1j26RM52k54q4Q0r5L73j36J0l16q0K75l3k59K52M30j10m32p7P8J54
5050E5j18k00J97N5jO1j15K6l35J59L06k3k51L37k45J19j18K82M5l08J16J42l42
5073a56m0M87j19j34k26K78M9M38m18k99J78M3q0O7K7j68K67o0j86O9J19J4j77
5096b7K68l46k5J85j81J02j10K59l25N0KJ40k41j25L15O2k50K85J48k74P7k23
$$ plain form
5118 -234 -337 59 47 14 307 -112 -132 206 111 -14 -124 73 69 87 37 -3 63 236 102 -268 -103 22 321
5141 321 89 -194 -223 197 -64 -67 46 -53 86 -30 13 135 -20 108 -22 -254 -98 -38 342 -69 -76 187 38
5164 38 447 170 187 66 104 240 268 117 -16 2 -24 -140 -127 118 -155 132 186 -523 44 -35 -54 -159 -46
5187 -46 -141 53 151 -78 206 136 -165 16 247 -95 228 -308 -360 -212 -184 -188 4 -141 -151 -158 234 48 -230 75
5211 75 -68 136 112 165 132 -128 -283 -460 116 95 -160 -227 171 428 103 -51 -259 82 -77 -47 -14 -166 -165
5234 -165 -32 438 120 -44 32 66 76 -178 -3 -312 11 308 71 -279 265 78 157 -115 37 -304 -118
5255 -118 81 66 369 -196 369 191 152 -233 -342 -288 300 -13 -216 -444 129 83 116 186 -6 -17 -35 -18 -94
5278 -94 -85 -217 81 -21 -166 -108 169 230 24 -223 -125 -224 237 -220 -130 -122 -88 110 -33 24 83 -155 46 135 -169
$$ packed form
5118b34j03L96j2l3K93m19k0L38r5j25j10J97mJ8n0m0O6J73j34l70J65J25K99
5141C21k32k83k9M20k61lJ13r9J39j16M3J22j55J28j30k32J56O0L80m11pK63j49
5164C8M09k77J7j21L8J36K8j51j33J8k6j16J3K45k73K87N4p09N67p9j9j05J13
5187d6r5J94R8k29K84p0l01J81K31l42L23n36n2J48K8mJ92j45j0pL92j86k78L05
5211G5j43K04k4N3l3k60j55j77N76k1k55o7L98K57l25j54k08L41j59L0L3j52J
5234a65J33M70l18j64P6L4J0k54J75l09L23K97k37l50N44j87P9k72J52l41J86
5255a18J99j5L03n65N65j78l9l85j09N4N88l13k03k28N73m6L3P0j92j1j8J7p6
5278i4Rj32K98j02j45N8K77O1k06k47R8r9M61m57R0QL4J98j43N7N9k38K01Q9l04
$$ plain form
5303 -169 -328 -173 -211 -55 -91 66 -21 231 153 -80 -230 233 364 -127 -124 -278 106 143 191 -175 -393 -230 -148
5326 -148 119 -59 -316 -190 259 33 -401 -144 153 -182 191 223 -146 -296 -21 88 206 165 -85 238 -66
5347 -66 -101 -91 114 73 3 -132 -216 286 -291 -182 -26 -151 -207 43 -149 -250 -170 -138 -50 114 47 -99 -360 163
5371 163 261 88 -62 -40 79 -61 -119 48 -97 267 247 -56 -383 -72 121 193 -113 -270 -98 58 211 -286
5393 -286 -162 12 371 307 -96 78 -297 334 114 -193 215 31 15 132 -19 42 53 69 237 -25 94 50
5415 50 -333 76 -132 -22 269 -148 35 52 5 316 -39 -63 119 203 16 -6 -21 -208 58 -83 -351 -102
5437 -102 -31 -141 -49 58 -48 20 -18 117 23 158 8 -48 123 59 348 123 124 -90 177 298 -233 -176 -43
5460 -43 174 261 303 -18 -489 -131 95 -141 166 84 -106 -20 84 63 138 -165 -80 211 -192 174 -11 109 -161
$$ packed form
5303a69j59J55l8J56l6J57q7K52p8k33j50M63J31m91Lj54L84L7M8l66k18J63Q2
5326a48K67j78k57J26M49k26m34K57K97l35L73L2l69j50K75J09J18m1k50L23l04
5347f6l5J0K05m1p0j35q4N02n77J09J56j25n6K50j92j01Q0L2Q8J64o7j46k61N23
5371A63R8j73j50K2J19j40n8J67j45L64k0l03l27L11J93P2l06j57J72J56J53m97
5393b86J24J74L59o4m03J74l75O31k20l07M08j84j6J17j51O1J1J6J68k62J19m4
5415E0l83M09k08J10K91m17J83J7m7L11l55k4J82Q4j87k2j5j87K66j41k68K49
5437a02P1j10R2J07j06O8l8J35r4J35j50n6J71o4K89k25Jk14K67J21n31N7J33
5460d3K17Q7M2l21m71L58K26k36L07q2j90Q6J04k1P5l03Q5K91m03L66j85J20k70
$$ [...]
8191B8
##END NTUPLES=NMR FID
##END=
