##TITLE=1H_EC-3195(X)
 CDCl3, 8 sc, 
 7.5.2019
##JCAMPDX= 6.0         $$ Bruker NMR JCAMP-DX V2.0
##DATA TYPE= NMR FID
##DATA CLASS= NTUPLES
##ORIGIN= UXNMR, Bruker Analytische Messtechnik GmbH
##OWNER= root
$$ XWIN-NMR		Version 3.5
$$ Tue May  7 12:14:54 2019 Russian Standard Time (UT+4h)  she@DPX200
##.OBSERVE FREQUENCY= 200.1315
##.OBSERVE NUCLEUS= ^1H
##.DELAY= (6, 6)
##.ACQUISITION MODE= SIMULTANEOUS
##.ACQUISITION SCHEME= undefined
##.AVERAGES= 8
##.DIGITISER RES= 18
##SPECTROMETER/DATA SYSTEM= spect
##.PULSE SEQUENCE= zg30
##.SOLVENT NAME= CDCl3
##.SHIFT REFERENCE= (INTERNAL, CDCl3, 0, 15.7039)
##AUDIT TRAIL= $$ (NUMBER, WHEN, WHO, WHERE, WHAT)
$$ ##TITLE= Audit trail, XWIN-NMR		Version 3.5
$$ ##JCAMPDX= 5.01
$$ ##ORIGIN= Bruker BioSpin GmbH
$$ ##OWNER= she
$$ F:/spectra/data/she/nmr/H-F/1/audita.txt
$$ ##AUDIT TRAIL=  $$ (NUMBER, WHEN, WHO, WHERE, WHAT)
(   1,<2019-05-07 12:13:31.35 +0400>,<she>,<DPX200>,
      <created by zg, POWCHK disabled, PULCHK disabled
       configuration hash MD5:
       00 E9 B6 7A A2 85 ED C7 34 08 36 98 17 FE 4E 26
       data hash MD5: 16K
       91 26 7A 09 C9 3A 72 EC 02 71 C2 CC 6A C4 03 73>)
$$ ##END=
$$ 
$$ hash MD5
$$ 74 FB D1 60 F6 4F 80 4B B2 F3 00 B4 BB 5A D8 CA
##$RELAX= 
##$RELAX= 
##$RELAX= 
##$RELAX= 
##$RELAX= 
##$RELAX= 
$$ Bruker specific parameters
$$ --------------------------
##$DU= <F:/spectra>
##$EXPNO= 1
##$NAME= <H-F>
##$PROCNO= 1
##$TYPE= <nmr>
##$USER= <she>
##$AMP= (0..31)
100 100 100 100 100 100 100 100 100 100 100 100 100 100 100 100 100 100 
100 100 100 100 100 100 100 100 100 100 100 100 100 100 
##$AQSEQ= 0
##$AQ_mod= 1
##$AUNM= <au_zg>
##$AUTOPOS= <>
##$BF1= 200.13
##$BF2= 200.13
##$BF3= 200.13
##$BF4= 200.13
##$BF5= 200.13
##$BF6= 200.13
##$BF7= 200.13
##$BF8= 200.13
##$BYTORDA= 1
##$CFDGTYP= 0
##$CFRGTYP= 5
##$CHEMSTR= <none>
##$CNST= (0..31)
1 1 145 1 1 1 1 1 1 1 1 1 1 1 1 1 1 1 1 1 1 1 1 1 1 1 1 1 1 1 1 1 
##$CPDPRG= <>
##$CPDPRG1= <>
##$CPDPRG2= <>
##$CPDPRG3= <>
##$CPDPRG4= <mlev>
##$CPDPRG5= <mlev>
##$CPDPRG6= <mlev>
##$CPDPRG7= <mlev>
##$CPDPRG8= <mlev>
##$CPDPRGB= <>
##$CPDPRGT= <>
##$D= (0..31)
0 1.2 0 0 0 0 0 0 0 0 0 0.03 0 0 0 0 0 0 0 0 0 0 0 0 0 0 0 0 0 0 0 0 
##$DATE= 1557216810
##$DBL= (0..7)
120 120 120 120 120 120 120 120 
##$DBP= (0..7)
150 150 150 150 150 150 150 150 
##$DBP07= 0
##$DBPNAM0= <>
##$DBPNAM1= <>
##$DBPNAM2= <>
##$DBPNAM3= <>
##$DBPNAM4= <>
##$DBPNAM5= <>
##$DBPNAM6= <>
##$DBPNAM7= <>
##$DBPOAL= (0..7)
0.5 0.5 0.5 0.5 0.5 0.5 0.5 0.5 
##$DBPOFFS= (0..7)
0 0 0 0 0 0 0 0 
##$DE= 6
##$DECBNUC= <off>
##$DECIM= 24
##$DECNUC= <off>
##$DECSTAT= 4
##$DIGMOD= 1
##$DIGTYP= 9
##$DL= (0..7)
0 120 120 120 120 120 120 120 
##$DP= (0..7)
150 150 150 150 150 150 150 150 
##$DP07= 0
##$DPNAME0= <>
##$DPNAME1= <>
##$DPNAME2= <>
##$DPNAME3= <>
##$DPNAME4= <>
##$DPNAME5= <>
##$DPNAME6= <>
##$DPNAME7= <>
##$DPOAL= (0..7)
0.5 0.5 0.5 0.5 0.5 0.5 0.5 0.5 
##$DPOFFS= (0..7)
0 0 0 0 0 0 0 0 
##$DQDMODE= 0
##$DR= 18
##$DS= 0
##$DSLIST= <SSSSSSSSSSSSSSS>
##$DSPFIRM= 0
$$ [...]
##$SUBNAM2= <"">
##$SUBNAM3= <"">
##$SUBNAM4= <"">
##$SUBNAM5= <"">
##$SUBNAM6= <"">
##$SUBNAM7= <"">
##$SUBNAM8= <"">
##$SUBNAM9= <"">
##$SW= 24.9337058887773
##$SWIBOX= (0..15)
0 0 2 0 0 0 0 0 0 0 0 0 0 0 0 0 
##$SW_h= 4990.01996007984
##$TD= 16384
##$TD0= 1
##$TE= 0
##$TE2= 300
##$TE3= 300
##$TEG= 300
##$TL= (0..7)
0 120 120 120 120 120 120 120 
##$TP= (0..7)
150 150 150 150 150 150 150 150 
##$TP07= 0
##$TPNAME0= <>
##$TPNAME1= <>
##$TPNAME2= <>
##$TPNAME3= <>
##$TPNAME4= <>
##$TPNAME5= <>
##$TPNAME6= <>
##$TPNAME7= <>
##$TPOAL= (0..7)
0.5 0.5 0.5 0.5 0.5 0.5 0.5 0.5 
##$TPOFFS= (0..7)
0 0 0 0 0 0 0 0 
##$TUNHIN= 0
##$TUNHOUT= 0
##$TUNXOUT= 0
##$USERA1= <user>
##$USERA2= <user>
##$USERA3= <user>
##$USERA4= <user>
##$USERA5= <user>
##$V9= 5
##$VALIST= <valist>
##$VCLIST= <CCCCCCCCCCCCCCC>
##$VD= 0
##$VDLIST= <DDDDDDDDDDDDDDD>
##$VPLIST= <PPPPPPPPPPPPPPP>
##$VTLIST= <TTTTTTTTTTTTTTT>
##$WBST= 1024
##$WBSW= 4
##$XGAIN= (0..3)
0 0 0 0 
##$XL= 0
##$YL= 0
##$YMAX_a= 542680
##$YMIN_a= -795076
##$ZGOPTNS= <>
##$ZL1= 120
##$ZL2= 120
##$ZL3= 120
##$ZL4= 120
##$ABSF1= 10
##$ABSF2= 0
##$ABSG= 5
##$ABSL= 3
##$ALPHA= 0
##$AQORDER= 0
##$ASSFAC= 0
##$ASSFACI= 0
##$ASSFACX= 0
##$ASSWID= 0
##$AUNMP= <proc_1d>
##$AZFE= 0.1
##$AZFW= 0.1
##$BCFW= 1
##$BC_mod= 2
##$BYTORDP= 1
##$COROFFS= 0
##$CY= 11.3945322036743
##$DATMOD= 1
##$DC= 2
##$DFILT= <>
##$DTYPP= 0
##$F1P= 18.9103706918063
##$F2P= -1.10871071338519
##$FCOR= 0.5
##$FTSIZE= 0
##$FT_mod= 4
##$GAMMA= 1
##$GB= 0.15
##$INTBC= 1
##$INTSCL= 1
##$ISEN= 128
##$LB= 0.24
##$LEV0= 0
##$LPBIN= 0
##$MAXI= 10000
##$MC2= 0
##$MEAN= 0
##$ME_mod= 0
##$MI= 1.114404
##$NCOEF= 0
##$NC_proc= 0
##$NLEV= 6
##$NOISF1= 3.799351
##$NOISF2= 2.8
##$NSP= 1
##$NTH_PI= 0
##$NZP= 0
##$OFFSET= 15.70392
##$PC= 1
##$PHC0= -8859.63
##$PHC1= 23.40026
##$PH_mod= 1
##$PKNL= yes
##$PPARMOD= 0
##$PSCAL= 0
##$PSIGN= 0
##$REVERSE= no
##$SF= 200.130013532006
##$SI= 16384
##$SIGF1= 3
##$SIGF2= 2
##$SINO= 400
##$SIOLD= 16384
##$SREGLST= <1H.CDCl3>
##$SSB= 0
##$STSI= 0
##$STSR= 0
##$SW_p= 3612.71676300578
##$SYMM= 0
##$S_DEV= 0
##$TDeff= 0
##$TDoff= 0
##$TI= <>
##$TILT= no
##$TM1= 0
##$TM2= 0
##$TOPLEV= 0
##$USERP1= <user>
##$USERP2= <user>
##$USERP3= <user>
##$USERP4= <user>
##$USERP5= <user>
##$WDW= 1
##$XDIM= 8192
##$YMAX_p= 0
##$YMIN_p= 0
$$ End of Bruker specific parameters
$$ ---------------------------------
##NTUPLES= NMR FID
##VAR_NAME=  TIME,          FID/REAL,        FID/IMAG
##SYMBOL=    X,             R,               I
##VAR_TYPE=  INDEPENDENT,   DEPENDENT,       DEPENDENT
##VAR_FORM=  AFFN,          ASDF,            ASDF
##VAR_DIM=   8192,          8192,            8192
##UNITS=     SECONDS,       ARBITRARY UNITS, ARBITRARY UNITS
##FACTOR=    0.0002004,     1,               1
##FIRST=     0,             0,               0
##LAST=      1.6414764,     0,               0
##MIN=       0,             -795076,         0
##MAX=       1.6414764,     542680,          0
$$ Real data points
##PAGE= N=1
##DATA TABLE= (X++(R..R)), XYDATA
$$ plain form
0 0 0 0 0 -8 8 -8 8 -17 24 -24 40 -48 56 -72 89 -105 128 -153 179 -210 249 -289 335 -388 447 -511 582
27 582 -662 749 -848 954 -1074 1202 -1346 1501 -1674 1863 -2069 2296 -2547 2817 -3122 3456
43 3456 -3825 4238 -4701 5223 -5816 6500 -7290 8222 -9342 10714 -12441 14695 -17768
56 -17768 22238 -29376 42622 -75599 330749 334973 -437809 -335512 151620 542680 302544
67 302544 -104315 -248090 50558 279019 190590 -85043 -139193 19848 187216 116611 -91469
78 -91469 -223464 -134574 2037 47112 -8705 -74737 -132405 -111364 -15628 62300 10639 -122199
90 -122199 -205378 -116160 74735 137700 -49284 -258772 -207284 63680 238282 118001 -164057
101 -164057 -268742 -54943 208683 180897 -80203 -222389 -78220 158757 198790 -4540
$$ packed form
0@%%%qJ6j6J6k5M1m8O4q8J04j28J61j94K33k81L32l89M59n38O24p23Q35r58J093
27E82j244J411j597J802k028K276k548K847l175L537l932M365m843N364n939O578
43C456p281Q063q939R924j1039J2316j3790J5512j7564K0056k3155K7136l2463
56a7768M0006n1614P1998j18221M06348M224p72782J02297M87132L91060k40136
67C02544m06859j43775K98648K28461q8429k75633n4150J59041J67368p0605k08080
78i1469j31995Q8890J36611M5075n5817o6032n7668K1041R5736P7928n1661j32838
90a22199q3179Q9218J90895O2965j86984k09488N1488K70964J74602j20281k82058
101a64057j04685K13799K63626k7786k61100j42186J44169K36977M0033k03330
$$ plain form
111 -4540 -188129 -105293 132368 211104 45429 -151207 -162024 13237 174654 128701 -68617
122 -68617 -165984 -57572 101292 132305 18757 -120057 -140877 -21692 90610 63120 -59609
133 -59609 -142195 -106111 15669 91559 22043 -109756 -136745 -42119 49830 45259 -50257 -135333
145 -135333 -94120 41845 99814 9527 -107036 -110362 4127 119278 100523 -42816 -130171
156 -130171 -46898 99933 143057 54833 -61241 -71157 49980 156941 110227 -21298 -65632
167 -65632 16339 116050 120623 20172 -65363 -21156 91599 119898 39323 -43057 -44715 27172
179 27172 89148 54933 -43412 -78145 -14577 49941 44200 -13439 -67070 -62888 -2701 38635
191 38635 12739 -36978 -61315 -51067 -11589 23887 5531 -42561 -51257 -19386 10408 18133
$$ packed form
111d540j83589Q2836K37661P8736j65675j96636j0817J75261J61417m5953j97318
122f8617r7367J08412J58864L1013j13548j38814k0820J19185J12302k7490j22729
133e9609q2586L6084J21780P5890o9516j31799k6989R4626R1949m571r5516q5076
145a35333M1213J35965N7969r0287j16563l326J14489J15151j8755j43339q7355
156a30171Q3273J46831M3124q8224j16074r916J21137J06961m6714j31525m4334
167f5632Q1971R9711M573j00451q5535M4207J12755K8299q0575q2380j658P1887
179B7172O1976l4215r8345l4733O3568O4518n741n7639n3631M182O0187M1336
191C8635k5896m9717k4337J0248L9478L5476j8356m8092q696L1871K9794P725
$$ plain form
203 18133 -1318 -34393 -30141 18879 42893 12168 -22059 -17945 19101 56203 47501 -6729 -29857
216 -29857 14684 59735 52146 14953 -12326 -8580 28902 51809 24701 -9477 -4560 11472 11032
229 11032 3738 -3181 -7075 -2244 -7317 -31150 -34435 -6459 1762 -27545 -51321 -47543 -26522 -2810
243 -2810 -10432 -55729 -75912 -38275 868 -7544 -43120 -65368 -48996 -2933 14967 -24583 -60554
256 -60554 -36873 10865 28248 6392 -34065 -48072 -1827 55366 48197 -6103 -35797 -14915
268 -14915 33921 67729 42898 -15713 -31080 13862 58550 58634 18125 -30567 -28748 32925 74526
281 74526 35847 -32219 -50512 -6962 52493 58989 -10992 -76783 -47787 36795 66873 9456
293 9456 -72508 -88524 -6688 81428 55659 -55619 -107770 -42054 58834 85428 7111 -90715
$$ packed form
203A8133j9451l3075M252M9020K4014l0725l4227M114L7046L7102q702n4230k3128
216b9857M4541M5051p589l7193k7279L746L7482K2907k7108l4178M917J6032m40
229A1032p294o919l894M831n073k3833l285K7976Q221k9307k3776L778K1021K3712
243b810p622m5297k0183L7637L9143q412l5576k2248J6372M6063J7900l9550l5971
256f0554K3681M7738J7383k1856m0457j4007M6245N7193p169n4300k9694K0882
268a4915M8836L3808k4831n8611j5367M4942M4688Q4m0509m8692J819O1673M1601
281G4526l8679o8066j8293M3550N9455O496o9981o5791K8996Q4582L0078n7417
293I456q1964j6016Q1836Q8116k5769j11278n2151O5716J00888K6594p8317r7826
$$ plain form
305 -90715 -81911 30336 103465 52569 -47642 -80126 -8943 92488 104593 7315 -72765 -33302
317 -33302 68199 114110 61870 -32647 -62537 19164 116671 103378 -1540 -70269 -30992 72110
329 72110 124610 54975 -65797 -88266 12136 106546 86163 -24986 -109735 -67001 60086
340 60086 110160 12194 -110055 -111857 -1840 92195 60537 -70097 -143005 -62815 67477
351 67477 85370 -21588 -125563 -107429 19214 107835 42471 -97307 -132929 -25622 93821
362 93821 95048 -20893 -124391 -85574 56215 127173 45741 -80139 -105643 -5081 111056
373 111056 103820 -26662 -117041 -55053 75923 119963 34158 -86720 -105482 7552 115955
384 115955 79379 -54247 -122148 -53808 67150 101312 -89 -122675 -112021 17283 102824
$$ packed form
305i0715Q804J12247P3129n0896j00211l2484P1183J01431J2105r7278q0080L9463
317c3302J01501M5911n2240r4517k9890Q1701R7507j3293j04918o8729L9277J03102
329G2110N2500o9635j20772k2469J00402R4410k0383j11149q4749M2734J27087
340F0086N0074r7966j22249j802J10017R4035l1658j30634p2908Q0190J30292
351F7477J7893j06958j03975J8134J26643Q8621o5364j39778l5622J07307J19443
362I3821J227j15941j03498L8817J41789P0958q1432j25880k5504J00562J16137
373A11056p236j30482r0379O1988J30976M4040q5805j20878j8762J13034J08403
384A15955l6576j33626o7901O8340J20958L4162j01401j22586J0654J29304Q5541
$$ plain form
395 102824 47876 -79396 -139337 -61189 72843 97668 -20959 -132032 -103426 23132 103233
406 103233 48356 -82099 -129819 -27989 98881 96634 -21290 -112084 -71899 60208 133179
417 133179 53684 -79684 -95278 20857 125779 104381 -14915 -96316 -36746 96735 136965
428 136965 37128 -74633 -70878 37502 128225 93074 -33123 -96153 -20633 90440 104052
439 104052 12733 -82903 -77456 27398 104703 54290 -59565 -98218 -26247 69584 81970 -10132
451 -10132 -102266 -78896 30738 87992 31781 -65937 -96426 -22394 76704 79500 -21153 -94775
463 -94775 -52202 47718 90728 32416 -63134 -78565 12263 96802 71900 -21619 -71814 -27009
475 -27009 63970 96728 25021 -63400 -55494 30940 86480 52806 -28919 -69390 -19421 62474
$$ packed form
395A02824n4948j27272n9941P8148J34032K4825j18627j11073K8606J26558Q0101
406A03233n4877j30455m7720J01830J26870k247j17924r0794M0185J32107P2971
417A33179p9495j33368j5594J16135J04922k1398j19296q1401N9570J33481M0230
428A36965r9837j11761L755J08380R0723l5151j26197o3030P5520J11073J3612
439A04052r1319r5636N447J04854P7305n0413j13855l8653P1971R5831J2386r2102
451a0132r2134K3370J09634N7254n6211r7718l0489P4032R9098K796j00653p3622
463i4775M2573R9920M3010n8312r5550j5431R0828Q4539k4902r3519n0195M4805
475b7009R0979L2758p1707q8421P906Q6434N5540l3674q1725m0471M9969Q1895
$$ plain form
487 62474 69713 -6095 -68802 -53557 12958 56275 23689 -53248 -80009 -24226 36052 30116
499 30116 -27210 -73656 -61138 810 37970 -354 -64323 -74583 -27606 22128 24614 -25374
511 -25374 -70199 -48577 13905 37486 1920 -43672 -50331 -9351 38933 34782 -18881 -47107
523 -47107 -14319 33776 44954 13882 -26373 -25926 19075 48959 25878 -12606 -19938 3471 32487
536 32487 36777 5462 -22811 -9757 20288 25489 8387 -10072 -17744 -5475 13712 10983 -7781
549 -7781 -15605 -9579 -2990 4520 3611 -11060 -18633 -7070 2281 151 -2475 -6211 -11114 -3727 7967
564 7967 6085 -448 1636 4558 5274 11690 13282 8100 9121 14353 11428 13334 23479 22925 11423
579 11423 9355 17196 23741 28629 23011 5556 746 19314 32346 22537 4279 -6379 -116 21987
$$ packed form
487F2474P239p5808o2707J5245O6515M3317l2586p6937k6761N5783O0278n936
499C0116n7326m6446J2518O1948L7160l8324o3969j0260M6977M9734K486m9988
511b5374m4825K1622O2482K3581l5566m5592o659M0980M8284m151n3663k8226
523d7107L2788M8095J1178l1072m0255M47M5001K9884k3081l8484p332K3409K9016
536C2487M290l1315k8273J3054L0045N201j7102j8459p672J2269J9187k729j8764
549g781p824O026O589P510r09j4671p573J1563R351k130k626l736m903P387J1694
564G967j882o533K084K922P16O416J592n182J021N232k925J906J0145n54j1502
579A1423k068P841O545M888n618j7455m810J8568J3032r809j8258j0658O263K2103
$$ plain form
593 21987 30363 4490 -21904 -15390 8971 21053 9878 -18387 -36593 -16551 16770 15848 -16084
606 -16084 -39555 -32915 -3019 19965 2357 -40272 -49853 -13410 20845 16595 -18876 -50155 -37016
619 -37016 14125 39419 3937 -43126 -44151 -1208 39902 33340 -19138 -52527 -19259 38844
631 38844 49396 6419 -40175 -40606 10787 56623 34204 -29711 -52576 -12486 39109 45902 -1137
644 -1137 -54370 -47323 15013 51713 18037 -43775 -65478 -24466 37780 45569 -18540 -75640 -53850
657 -53850 15104 49977 14280 -54777 -77737 -18939 53466 46019 -28225 -75944 -43686 33125
669 33125 69576 19069 -59934 -63598 13459 74441 51525 -22825 -63350 -20213 62942 83519
681 83519 14219 -54127 -39555 36149 86956 57039 -24282 -61057 -3776 74496 78239 8207
$$ packed form
593B1987Q376k5873k6394O514K4361J2082j1175k8265j8206K0042L3321r22l1932
606a6084k3471O640K9896K2984j7608m2629r581L6443L4255m250l5471l1279J3139
619c7016N1141K5294l5482m7063j025M2943M1110o562n2478l3389L3268N8103
631C8844J0552m2977m6594m31N1393M5836k2419o3915k2865M0090N1595O793m7039
644a137n3233P047O2336L6700l3676o1812k1703M1012O2246P789o4109n7100K1790
657e3850O8954L4873l5697o9057k2960N8798P2405p447p4244m7719L2258P6811
669C3125L6451n0507p9003l664P7057O0982k2916p4350m0525M3137Q3155K0577
681H3519o9300o8346J4572P5704N0807k9917q1321l6775N7281P8272L743p0032
$$ plain form
693 8207 -54868 -42657 33811 87305 46594 -41535 -67730 -5389 67546 68050 -6841 -75293 -52694
706 -52694 37551 80516 23527 -60885 -76639 -6733 71227 62150 -30087 -90057 -41604 51892
718 51892 78271 12777 -70246 -73929 12053 85215 54170 -39321 -79039 -23267 61732 81364
730 81364 10167 -68800 -55090 32957 84968 44075 -36890 -68567 -13543 67799 74926 -4903
742 -4903 -70790 -46511 33311 76163 32496 -52180 -78588 -10850 65184 55024 -25369 -82745
754 -82745 -55174 27537 68879 12811 -74835 -84546 -9957 55771 40061 -38264 -90189 -50729
766 -50729 35464 60162 -4797 -75352 -69792 2472 61299 37579 -44824 -82319 -25990 52154
778 52154 60609 -3251 -65290 -54058 23166 75074 36633 -41553 -62911 -6895 60336 64570
$$ packed form
693H207o3075J2211P6468N3494m0711q8129k6195O2341P2935N04p4891o8452K2599
706e2694R0245M2965n6989q4412j5754O9906P7960r077r2237n9970M8453R3496
718E1892K6379o5494q3023l683Q5982P3162l1045r3491l9718N5772Q4999J9632
730H1364p1197p8967J3710Q8047N2011m0893q0965l1677N5024Q1342P127p9829
742d903o5887K4279P9822M2852m3667q4676k6408O7738P6034j0160q0393n7376
754h2745K7571Q2711M1342n6068q7646r711P4589O5728j5710p8325n1925L9460
766e0729Q6193K4698o4959p0555N560P2264N8827k3720q2403l7495N6329P8144
778E2154Q455o3860o2039J1232P7224N1908l8441p8186k1358N6016O7231M234
$$ plain form
790 64570 -1166 -62150 -39691 37328 71613 27401 -38370 -53936 -2205 58699 53277 -15423
802 -15423 -59591 -28284 34090 55699 13636 -46338 -53913 4395 54656 34441 -25730 -56035
814 -56035 -25773 31573 52093 6345 -49845 -44342 12832 51127 31997 -20476 -47981 -14809
826 -14809 42714 52150 4674 -36576 -24722 22413 54238 33988 -17344 -33243 7806 50758
838 50758 44403 2257 -27587 -13198 32049 54083 21942 -22536 -24938 10916 41231 35144 -3690
851 -3690 -32850 -14847 25489 34335 4898 -25130 -27397 -2114 24483 17832 -17254 -34483 -15777
864 -15777 10299 15253 -3687 -28204 -29624 -2875 15571 1679 -21508 -26305 -12348 7326 12437
877 12437 -7237 -26650 -17938 5359 12942 3183 -11573 -18124 -6451 12188 12157 -3850 -11053 -5884
$$ packed form
790F4570o5736o0984K2459P7019L4285m4212o5771j5566N1731O0904n422o8700
802a5423m4168L1307O2374K1609m2063n9974p575N8308N0261k0215o0171l0305
814e6035L0262N7346K0520m5748n6190N503N7174L8295j9130n2473k7505L3172
826a4809N7523R436m7476m1250J1854M7135L1825k0250n1332j5899M1049M2952
838E0758o355m2146k9844J4389M5247K2034l2141m4478k402L5854L0315o087l8834
851c690k9160J8003M0336Q846k9437l0028k267K5283K6597o651l5086j7229J8706
864a5777K6076M954j8940k4517j420K6749J8446j3892k3187m797J3957J9674N111
877A2437j9674j9413Q712K3297P583r759j4756o551J1673J8639l1j6007p203N169
$$ plain form
891 -5884 2095 8036 5983 -4876 -8727 338 5053 106 -2080 -2830 -4794 -2816 -475 -4872 -8234
906 -8234 -4191 -4509 -8853 -7090 -4155 -7509 -8342 -8274 -11108 -9049 -1466 -3322 -13699 -15069 -6762 -826
922 -826 1723 -3986 -15720 -15362 2265 12262 3591 -8827 -13769 -4810 13173 20386 3472 -13633
936 -13633 -6440 13194 22967 16814 -1518 -11747 3990 27676 26529 4396 -9681 -2368 19012
949 19012 33207 18794 -10816 -14943 11344 32709 25216 -1525 -21723 -10885 23470 37000
961 37000 8841 -24324 -23788 5396 31892 25722 -11927 -36631 -14394 24779 31435 1825 -29719
974 -29719 -29590 6089 37124 21451 -22432 -37163 -6500 30760 34442 -652 -37789 -27872 20862
987 20862 46280 18850 -25528 -36532 -2635 41680 42542 -5922 -43687 -22623 27561 47307
$$ packed form
891e884P979N941k053j0859l851R065M715m947k186p50j964J978K341m397l362
906h234M043l18m344J763K935l354q33O8k834K059P583j856j0377j370Q307N936
922h26K549n709j1734L58J7627R997q671j2418m942Q959J7983P213j6914j7105
936a3633P193J9634R773o153j8332j0229J5737K3686j147k2133j4077P313K1380
949A9012J4195j4413k9610m127K6287K1365p493k6741k0198J0838L4355J3530
961C7000k8159l3165N36K9184K6496o170l7649k4704K2237L9173O656k9610l1544
974b9719J29L5679L1035j5673m3883j4731L0663L7260L682l5094l7137R917M8734
987B0862K5418k7430m4378j1004L3897M4315Q62m8464l7765K1064N0184J9746
$$ plain form
999 47307 17128 -31399 -43436 -36 46644 35200 -18066 -48534 -25274 24469 43747 5276
1011 5276 -48186 -48359 4130 40984 20049 -32405 -58789 -27055 29606 39981 -11654 -60240
1023 -60240 -47729 7242 43039 19916 -39855 -64432 -20142 37580 38968 -12260 -55548 -42236
1035 -42236 15022 51758 20349 -40674 -53446 -4537 45963 42278 -10577 -53614 -30698 33907
1047 33907 58181 14064 -42011 -45338 6290 56835 44599 -20682 -58127 -20351 43592 56785
1059 56785 8383 -47858 -47483 12458 60422 34817 -30775 -56157 -15865 41614 51909 427
1071 427 -54446 -41692 21799 56216 23968 -33514 -52622 -8991 49313 50591 -9103 -53602
1083 -53602 -29378 30663 58904 24288 -36059 -49276 5590 60530 48831 -10746 -47471 -21648
$$ packed form
999D7307l0179m8527j2037M3400M6680j1444n3266l0468K3260M9743J9278l8471
1011E276n3462j73N2489L6854k0935n2454k6384L1734N6661J0375n1635m8586
1023f0240J2511N4971L5797k3123n9771k4577M4290N7722J388n1228m3288J3312
1035d2236N7258L6736l1409o1023j2772M8909N0500l685n2855m3037K2916O4605
1047C3907K4274m4117n6075l327N1628N0545j2236o5281l7445L7776O3943J3193
1059E6785m8402n6241L75N9941M7964k5605o5592k5382M0292N7479J0295n1482
1071D27n4873J2754O3491L4417l2248n7482j9108M3631N8304J278n9694m4499
1083e3602K4224O0041K8241l4616o0347j3217N4866N4940j1699n9577l6725K5823
$$ plain form
1095 -21648 38978 64704 20996 -38510 -39571 15996 58785 41940 -13708 -45515 -13718 45121
1107 45121 54920 4418 -41653 -32932 17388 52660 29235 -28886 -50708 -9209 41810 40140
1119 40140 -7217 -48390 -37453 15721 47262 15420 -39019 -49848 -9538 34496 33770 -13307
1131 -13307 -53026 -33578 20214 40561 6545 -38385 -44432 -4644 37908 29080 -21350 -48604
1143 -48604 -19961 26189 36974 3230 -39119 -38695 8258 41610 20773 -24530 -40708 -13958
1155 -13958 26708 35642 -1853 -39976 -30330 11104 32519 14215 -22741 -38271 -12449 24760
1167 24760 25305 -10236 -35697 -23848 7314 24783 8281 -27015 -35374 -5159 22707 16395 -12784
1180 -12784 -31498 -19781 12392 27082 3830 -26152 -24578 2099 23179 19235 -7100 -24847
$$ packed form
1095b1648O0626K5726m3708n9506j061N5567M2789j6845n5648l1807L1797N8839
1107D5121R799n0502m6071Q721N0320L5272k3425n8121k1822M1499N1019j670
1119D0140m7357m1173J0937N3174L1541l1842n4439j0829M0310M4034p26m7077
1131a3307l9719J9448N3792K0347l4016m4930o047L9788M2552q828n0430k7254
1143d8604K8643M6150J0785l3744m2349M24M6953L3352k0837m5303j6178K6750
1155a3958M0666Q934l7495l8123R646M1434K1415j8304l6956j5530K5822L7209
1167B4760N45l5541k5461J1849L1162J7469j6502l5296q359L0215K7866o312k9179
1180a2784j8714J1717L2173J4690k3252k9982J574K6677K1080l944k6335j7747
$$ plain form
1192 -24847 -9242 20750 25981 5167 -13302 -11963 7945 26182 19409 -4678 -12685 3169 20625
1205 20625 21647 7924 -7174 -6002 13557 24636 12182 -4249 -6692 3527 15787 18252 3795
1218 3795 -10662 -4191 10292 14225 7112 -2740 -8320 -1277 10579 9781 -1705 -5736 -2112 1714
1232 1714 5522 4798 -2944 -5412 1074 4335 1619 970 127 -1870 425 3926 1592 -671 1527 609
1248 609 -949 3037 5215 1195 -1112 72 49 2409 6716 2440 -5590 -4989 865 3959 4718 -612
1264 -612 -9697 -9332 2161 6954 -875 -9987 -12711 -7405 4140 6759 -7902 -20297 -13674 804
1278 804 5994 -1735 -16216 -21899 -7608 9978 4882 -14435 -22261 -12726 4390 12610 -1663 -23362
1292 -23362 -21448 2156 16323 7670 -12213 -23517 -10653 15404 20998 -1940 -21943 -15566 7025
$$ packed form
1192b4847J5605K9992N231k0814j8469J339J9908J8237o773k4087q007J5854J7456
1205B0625J022j3723j5098J172J9559J1079j2454j6431k443J0219J2260K465j4457
1218C795j4457O471J4483L933p113r852n580P043J1856p98j1486m031L624L826
1232A714L808p24p742k468O486L261k716o49q43j997K295L501k334k263K198r18
1248F09j558L986K178m020k307J184k3K360M307m276q030O01N854L094P59n330
1264f12r085L65J1493M793p829r112k724N306J1545K619j4661j2395O623J4478
1278H04N190p729j4481n683J4291J7586n096j9317p826R535J7116Q220j4273k1699
1292b3362J914K3604J4167q653j9883j1304J2864K6057N594k2938k0003O377K2591
$$ plain form
1305 7025 22813 14818 -11638 -24011 -3354 23362 22260 -1337 -20677 -15916 11204 30071 13633
1318 13633 -18372 -24326 895 25906 24262 -4221 -28661 -17188 19139 32976 7731 -22691
1330 -22691 -25877 1536 30897 25990 -11034 -33361 -11617 24097 32537 6723 -25238 -26404 9106
1343 9106 38942 22956 -15615 -29443 -5412 29869 37125 4857 -30018 -21412 19865 42106
1355 42106 20559 -17151 -30144 -1953 38007 38187 -2426 -33074 -17294 22309 41465 18149
1367 18149 -24335 -35046 1906 39089 30084 -11072 -36535 -19976 21213 39477 8398 -35151
1379 -35151 -35871 3628 34682 23147 -18453 -44324 -20636 25687 35434 -2264 -39417 -35256 4190
1392 4190 35403 20222 -26663 -46451 -13334 28853 31488 -5504 -40387 -32909 11682 39942
$$ packed form
1305G025J5788p995k6456j2373K0657K6716j102k3597j9340M761K7120J8867j6438
1318A3633l2005n954K5221K5011j644k8483k4440J1473L6327J3837k5245l0422
1330b2691l186K7413K9361m907l7024k2327K1744L5714Q440k5814l1961j166L5510
1343I106K9836j5986l8571j3828K4031L5281P256l2268l4875Q606M1277K2241
1355D2106k1547l7710j2993K8191L9960J80m0613l0648J5780L9603J9156k3316
1367A8149m2484j0711L6952L7183r005m1156k5463J6559M1189J8264l1079m3549
1379c5151p20L9499L1054j1535m1600k5871K3688M6323R747l7698l7153M161L9446
1392D190L1213j5181m6885j9788L3117M2187K635l6992l4883P478M4591K8260
$$ plain form
1404 39942 14799 -30641 -40676 -7250 30738 31065 -8648 -42837 -26408 19790 37872 8004
1416 8004 -31516 -38241 -3189 35290 28512 -16826 -43624 -20169 21240 34538 5055 -35729
1428 -35729 -38971 3101 36619 20537 -22065 -41328 -17184 24283 35404 -785 -39974 -31963
1440 -31963 10467 35717 17525 -22321 -38910 -9742 31929 33082 -5870 -34901 -21637 16304
1452 16304 37975 17856 -22669 -32354 2282 36377 30686 -4275 -28731 -15438 23144 40436
1464 40436 13704 -22303 -23475 7951 35051 29164 -5752 -29495 -10321 27343 35393 7416
1476 7416 -21945 -21430 8473 34300 23177 -13595 -28533 -5539 24611 27975 2754 -25116 -21292
1489 -21292 11306 31646 13419 -17102 -24852 -4288 22341 24456 -2648 -26446 -15408 14192
$$ packed form
1404C9942k5143m5440j0035L3426L7988L27l9713l4189J6429M6198J8082k9868
1416H004l9520o725L5052L8479o778m5338k6798K3455M1409J3298k9483m0784
1428c5729l242M2072L3518j6082m2602j9263K4144M1467J1121l6189l9189Q011
1440c1963M2430K5250j8192l9846j6589K9168M1671J153l8952k9031J3264L7941
1452A6304K1671k0119m0525r685L4636L4095n691l4961k4456J3293L8582J7292
1464D0436k6732l6007j172L1426K7100n887l4916k3743J9174L7664Q050k7977
1476G416k9361N15K9903K5827j1123l6772j4938K2994L0150L364k5221k7870L824
1489b1292L2598K0340j8227l0521p750K0564K6629K115k7104k3798J1038K9600
$$ plain form
1501 14192 25547 9241 -15966 -23025 -2261 24090 20189 -7533 -22840 -11051 12093 22693
1513 22693 7401 -18153 -21224 2523 20565 12428 -8862 -20654 -11169 11132 18557 -251 -19873
1526 -19873 -16359 1517 12907 7226 -11442 -21873 -9542 9535 9702 -6303 -17605 -15290 -2135
1539 -2135 9459 3479 -13707 -18664 -6494 4920 4994 -4440 -15096 -13833 403 8438 63 -10870
1553 -10870 -11719 -4371 4282 6669 -2644 -11482 -6131 4219 5801 1306 -4440 -6618 -1315 6972 5432
1568 5432 -2555 -4229 -331 2598 4722 3879 -1029 -2868 1879 3787 2267 2493 1540 -1383 88 4130
1584 4130 3104 1388 1439 -534 -1419 3462 6309 1972 -1011 -567 673 3880 7040 2941 -3120 -743
1600 -743 4772 6315 5626 2070 -2980 -329 8696 10191 3232 -2309 -1700 3694 11525 11281 -52 -6740
$$ packed form
1501A4192J1355j6306k5207p059K0764K6351l901k7722j5307J1789K3144J0600
1513B2693j5292k5554l071K3747J8042q137k1290j1792R485K2301P425j8808j9622
1526a9873L514J7876J1390n681j8668j0431J2331J9077J67j6005j1302K315J3155
1539b135J1594n980j7186m957J2170J1414P4r434j0656J263J4236Q035q375j0933
1553a0870q49P348Q653K387r313q838N351J0350J582m495n746k178N303Q287j540
1568E432p987j674L898K929K124q43m908j839M747J908j520K26r53k923J471M042
1584D130j026j716N1j973q85M881K847m337k983M44J240L207L160m099o061K377
1600g43N515J543o89l556n050K651R025J495o959n541O09N394P831k44j1333o688
$$ plain form
1616 -6740 863 11232 12321 5329 -5029 -7106 4914 16510 9972 -4644 -9633 -1750 10323
1629 10323 14631 2744 -12652 -10555 6169 14484 5753 -8506 -14720 -4697 12288 13197 -5449
1642 -5449 -18138 -10871 5272 13756 4538 -14884 -20580 -3193 14843 10284 -8570 -20677 -14132
1655 -14132 6562 17926 2801 -19718 -20813 -605 15467 11363 -9195 -24280 -13043 12654
1667 12654 18912 -1358 -20974 -19378 1027 19269 12200 -14411 -26959 -8324 15884 17470 -3095
1680 -3095 -23728 -21351 5888 23635 8895 -18896 -25826 -6465 17053 19449 -4728 -27614 -19221
1693 -19221 10812 23626 6618 -18852 -25159 -4028 22267 20302 -8449 -27356 -13302 14612
1705 14612 25569 7750 -20627 -24475 4228 29091 18848 -10264 -24856 -8869 20714 30654
$$ packed form
1616f740P603J0369J089o992j0358k077J2020J1596o538j4616m989P883J2073
1629A0323M308j1887j5396K097J6724Q315q731j4259o214J0023J6985R09j8646
1642e449j2689P267J6143Q484r218j9422n696J7387J8036m559j8854j2107O545
1655a4132K0694J1364j5125k2519j095K0208J6072m104k0558j5085J1237K5697
1667A2654O258k0270j9616J596K0405J8242p069k6611j2548J8635K4208J586k0565
1680c095k0633K377K7239J7747j4740k7791o930J9361K3518K396k4177k2886Q393
1693a9221L0033J2814j7008k5470o307K1131K6295j965k8751j8907J4054K7914
1705A4612J0957j7819k8377l848K8703K4863j0243k9112j4592J5987K9583R940
$$ plain form
1717 30654 5971 -23334 -19371 11643 31288 19433 -10328 -25069 -5093 27222 30324 1192
1729 1192 -22574 -15441 12929 31934 17815 -14941 -24975 267 28122 25395 -2054 -23799
1741 -23799 -15581 16102 32224 11251 -19950 -23561 1782 26861 23649 -6140 -28331 -13684
1753 -13684 19209 29124 6092 -21461 -23866 2227 28089 20334 -12111 -28035 -9252 19122
1765 19122 25396 3325 -24156 -23299 6721 28073 13547 -16147 -26518 -7782 19613 24294 -2646
1778 -2646 -27972 -19519 9761 24127 9097 -18512 -28413 -6968 21355 19383 -9396 -28544 -17558
1791 -17558 8718 21778 5904 -23148 -28647 -2340 19777 13402 -11620 -27479 -16238 11073
1803 11073 21235 -102 -24865 -22416 918 18920 12087 -12836 -27135 -11427 15266 18875
$$ packed form
1717C0654k4683k9305L963L1014J9645j1855k9761j4741J9976L2315L102k9132
1729A192k3766P133K8370J9005j4119l2756j0034K5242K7855k727k7449k1745
1741b3799Q218L1683J6122k0973l1201l611K5343K5079l212k9789k2191J4647
1753a3684L2893R915k3032k7553k405K6093K5862p755l2445j5924J8783K8374
1765A9122O274k2071k7481Q57L0020K1352j4526k9694j0371J8736K7395M681k6940
1778b646k5326Q453K9280J4366j5030k7609r901K1445K8323j972k8779j9148J0986
1791a7558K6276J3060j5874k9052n499K6307K2117o375k5022j5859J1241K7311
1803A1073J0162k1337k4763K449K3334J8002o833k4923j4299J5708K6693L609
$$ plain form
1815 18875 -1620 -20997 -18326 3089 21131 12070 -13426 -22225 -4645 15652 17305 -240 -18463
1828 -18463 -14889 8858 21751 7956 -12648 -16262 -1358 16547 16849 -2716 -17920 -8501 12562
1841 12562 18676 6399 -10569 -14142 1187 18596 14247 -5343 -14096 -4814 10964 17141 6431
1854 6431 -10823 -11299 5580 16782 10253 -3167 -10393 -3505 11405 16210 3313 -9340 -5672
1867 -5672 6959 14067 9713 -2522 -9877 -318 13230 12664 1108 -7121 -4340 5572 13441 8154
1881 8154 -4937 -7891 1680 9407 8567 1351 -6452 -5521 4257 9373 3044 -4208 -5013 -1239 3977
1896 3977 5554 -959 -7173 -3997 1775 2874 44 -3754 -6418 -3258 2583 1555 -3791 -5663 -4034
1911 -4034 -2028 389 221 -4503 -6459 -2781 -535 -1222 -1488 -2813 -5682 -3612 -246 -878 -2345 -2891
$$ packed form
1815A8875k0495j9377K671K1415J8042r061k5496q799J7580K0297J653j7545j8223
1828a8463L574K3747J2893j3795k0604l614J4904J7905L02j9565j5204R419K1063
1841A2562O114j2277j6968l573J5329J7409m349j9590q753R282J5778O177j0710
1854F431j7254m76J6879J1202o529j3420p226O888J4910M805j2897j2653L668
1867e672J2631P108m354j2235p355R559J3548n66j1556q229K781R912P869n287
1881H154j3091k954R571P727q40p216p803R31R778N116o329p252q05L774N216
1896C977J577o513o214L176N772J099k830l798k664L160N841j028n346j872J629
1911d034K006K417j68m724j956L678K246o87k66j325k869K070L366o32j467n46
$$ plain form
1927 -2891 -4778 -4749 -1050 1232 -1861 -4458 -4187 -3268 -607 1802 -2015 -6661 -4436 -50 1226 -461
1943 -461 -3772 -6833 -3256 3174 3023 -3614 -6711 -4399 -77 4918 2909 -5994 -8442 -1006 6051
1958 6051 5148 -919 -7265 -6656 3228 10021 4007 -5842 -7223 -512 7657 9387 1026 -8696 -5319
1973 -5319 7165 11913 5099 -4383 -7253 985 12889 12223 -1317 -9232 -2323 9447 13904 6394
1987 6394 -7055 -9500 4582 16328 11718 -2428 -9839 -3328 11024 17625 4470 -11126 -9223
2000 -9223 5851 15964 10908 -4582 -13361 -3791 14257 15948 46 -12678 -9067 6152 17079
2013 17079 9570 -9806 -15974 -667 15052 13555 -2013 -15329 -10953 7903 18693 5718 -13121
2026 -13121 -15756 -775 14748 13665 -4391 -18946 -11125 9926 16931 2764 -14648 -16993 -1296
$$ packed form
1927b891j887K9L699K282l093k597K71R19K661K409l817m646K225M386J276j687
1943d61l311l061L577O430j51o637l097K312M322M995k009q903k448P436P057
1958F051r03o067o346O09R884O793o014r849j381O711Q169J730q361r722L377
1973e319J2484M748o814r482k870Q238J1904o66j3540p915O909J1770M457p510
1987F394j3449k445J4082J1746m610j4146p411O511J4352O601j3155j5596J903
2000i223J5074J0113n056j5490q779R570J8048J691j5902j2724L611J5219J0927
2013A7079p509j9376o168J5307J5719j497j5568j3316M376J8856J0790j2975j8839
2026a3121k635J4981J5523j083j8056j4555P821K1051P005j4167j7412k345J5697
$$ plain form
2039 -1296 16153 12311 -9508 -20615 -8880 9957 15257 858 -19142 -19134 2603 17314 7467
2052 7467 -13565 -21879 -8442 11671 15754 -3365 -22612 -17006 4622 16156 5981 -14339 -22386
2065 -22386 -6634 14921 14159 -6540 -20678 -13461 6489 17395 5795 -16366 -20486 -1023 17383
2078 17383 12801 -6645 -20059 -12118 10741 20465 3786 -17479 -16977 2479 18585 14365 -7297
2091 -7297 -20614 -7579 15511 20085 2048 -16079 -14594 5378 21373 13043 -10251 -17836 -2370
2104 -2370 16558 18346 1069 -15667 -12337 9555 21732 9626 -10833 -15255 -693 17841 18633
2117 18633 -867 -16996 -8857 12007 20520 8495 -9971 -14823 1399 20073 16885 -3958 -15366
2130 -15366 -6396 11788 19280 6855 -11873 -13479 5020 18790 12574 -5352 -14592 -5340 13239
$$ packed form
2039a296J7449l842k1819j1107J1735J8837N300j4399k0000QK1737J4711r847
2052G467k1032q314J3437K0113M083j9119j9247N606K1628J1534j0175k0320q047
2065b2386J5752K1555p62k0699j4138P217J9950J0906j1600k2161m120J9463J8406
2078A7383m582j9446j3414P941K2859R724j6679k1265N02J9456J6106m220k1662
2091g297j3317J3035K3090M574j8037j8127J485J9972J5995q330k3294p585J5466
2104b370J8928J788j7277j6736L330K1892J2177j2106k0459m422J4562J8534P92
2117A8633j9500j6129Q139K0864Q513j2025j8466m852J6222J8674l188k0843j1408
2130a5366Q970J8184P492j2425j8728j606J8499J3770o216j7926r240R252J8579
$$ plain form
2143 13239 18186 1462 -14488 -11156 5768 16321 9943 -8226 -16841 -4210 13415 13614 -2068
2156 -2068 -14281 -11260 4046 14800 6411 -11584 -16066 -2609 10602 9633 -3422 -15359 -11125
2169 -11125 4803 12231 1724 -12292 -13460 -2124 9099 7986 -6123 -15821 -8066 5856 8909
2182 8909 -235 -11481 -12967 -1908 9783 6240 -7536 -13549 -6423 4158 7995 145 -11237
2195 -11237 -11462 471 7874 3240 -5984 -10538 -5502 4616 7421 -1918 -10092 -6764 1714 6242
2209 6242 3525 -5153 -9584 -2555 6766 5590 -1971 -6774 -4515 2302 7621 3544 -4861 -6042 516
2224 516 5413 5334 654 -4151 -3122 3799 7072 2986 -1908 -2134 829 4972 6362 1866 -2414 97
2240 97 4697 5500 3927 751 -1429 1313 5720 5972 1216 267 815 2511 4929 4936 1089 -512 1651
$$ packed form
2143A3239M947j6724j5950L332J6924J0553o378j8169q615J2631J7625J99j5682
2156b068j2213L021J5306J0754q389j7995m482J3457J3211r69j3055j1937M234
2169a1125J5928P428j0507j4016j168J1336J1223j113j4109r698P755J3922L053
2182H909r144j1246j486J1059J1691l543j3776o013P126J0581L837p850j1382
2195a1237k25J1933P403m634r224m554N036J0118K805r339q174L328Q478M528
2209F242k717q678m431P029R321j176p561m803K259O817N319m077q405j181O558
2224E16M897p9m680m805J029O921L273m086m894k26K963M143J390m496m280K511
2240I7M600Q03j573l176k180K742M407K52m756r49N48J696K418Pl847j601K163
$$ plain form
2257 1651 3637 3515 3166 1451 -1028 636 3897 2953 1425 998 -160 14 3311 3932 694 -1137
2273 -1137 -349 705 2648 3247 -346 -3241 -1022 2737 2693 586 -2300 -3809 -748 4293 2837 -2586
2289 -2586 -4907 -2584 1323 3696 1368 -5594 -6630 -221 3793 1722 -3173 -6894 -5701 1363 5089
2304 5089 -998 -8004 -6896 -1239 3321 2742 -4248 -9755 -5850 2911 4404 -1799 -8169 -8486 -1749
2319 -1749 5588 3369 -6764 -10655 -4181 3492 5142 -1020 -9644 -9687 974 8187 2837 -6656 -9605
2334 -9605 -4149 5513 8049 -1185 -10607 -7399 3747 8794 4102 -6081 -10464 -2033 9335 9427 -2220
2349 -2220 -9834 -5937 5053 11633 5112 -7622 -10496 1119 11759 9049 -1689 -9915 -5457 8190
2363 8190 13921 3875 -8751 -8063 2994 12794 10086 -2764 -11025 -3010 11065 13639 2354 -8464
$$ packed form
2257A651J986j22l49j715k479J664L261r44j528m27j158J74L297O21l238j831
2273a137P88J054J943N99l593k895K219L759m4k107k886j509L061N041j456n423
2289b586k321K323L907K373k328o962j036O409M014k071m895l721J193P064L726
2304E089o087p006J108N657M560n79o990n507L905Q761J493o203o370l17O737
2319a749P337k219j0133l891O474P673J650o162q624m3J0661P213n350r493k949
2334i605N456R662K536r234r422L208J1146N047m692j0183m383Q431J1368R2j1647
2349b220p614L897J0990O580o521j2734k874J1615J0640k710j0738q226M458J3647
2363H190N731j0046j2626O88J1057R800k708j2850q261Q015J4075K574j1285j0818
$$ plain form
2377 -8464 -7827 4700 14835 9777 -5460 -11006 -574 11895 12927 2409 -9834 -8415 6823
2390 6823 15559 7203 -6936 -10598 -1027 12403 13415 -615 -12489 -6822 7630 13784 5298 -8101
2404 -8101 -11627 -378 13476 11205 -4343 -12625 -6272 7052 13097 3668 -11458 -12519 1453
2417 1453 12360 7602 -5950 -13609 -7182 7811 12512 -249 -13669 -11737 2145 11316 6519
2430 6519 -8159 -15778 -5745 9041 9955 -3169 -13605 -11131 1865 11583 4499 -11311 -14841
2443 -14841 -2887 8812 8332 -3795 -14652 -10235 4602 11571 1749 -11217 -12747 -2405 9397
2456 9397 8480 -5389 -14865 -7621 6386 10105 1369 -10112 -11936 -218 11035 7121 -6415 -12386
2470 -12386 -4959 6790 10237 1492 -10647 -10306 2726 11455 5951 -5522 -10631 -3655 8896 11600
$$ packed form
2377h464O37J2527J0135n058j5237n546J0432J2469J032j0518j2243J419J5238
2390F823Q736q356j4139l662R571J3430J012j4030j1874N667J4452O154q486j3399
2404h101l526J1249J3854k271j5548q282O353J3324O045r429j5126j061J3972
2417A453J0907m758j3552p659O427J4993M701j2761j3420J932J3882R171m797
2430F519j4678p619J0033J4786R14j3124j0436K474J2996R718p084j5810l530
2443a4841J1954J1699m80j2127j0857M417J4837O969r822j2966j530J0342J1802
2456I397r17j3869r476P244J4007L719q736j1481j824J1718J1253l914j3536n971
2470a2386P427J1749L447q745j2139L41J3032Q729n504j1473n109O976J2551K704
$$ plain form
2484 11600 390 -9758 -6462 4752 11118 6561 -4809 -9480 -519 10842 10008 -785 -7540
2497 -7540 -4522 5531 11893 5901 -5675 -7135 2198 10040 8886 199 -7224 -3905 7056 11364
2511 11364 3706 -5123 -5233 1844 9136 8427 -1165 -7550 -1603 7363 8992 2452 -4445 -5194 2047
2526 2047 9417 6161 -3159 -6020 -1146 5502 7360 1677 -5816 -5082 2946 7070 3139 -3250 -5673
2541 -5673 -2298 4382 5837 -963 -6614 -4058 1392 4210 2345 -3479 -6696 -2165 4053 2891 -2278
2556 -2278 -5482 -4347 -353 3447 676 -4871 -5876 -1978 1643 1251 -1876 -5481 -4995 -173 2107
2571 2107 -1136 -4248 -4404 -2565 221 1316 -2351 -4809 -3521 -499 122 -821 -2301 -4148 -2807 383
2587 383 752 -1713 -3060 -2430 -1532 408 1222 -1921 -3193 -1360 242 556 611 -1362 -2768 -656 1901
$$ packed form
2484A1600j1210j0148L296J1214O366m557j1370m671Q961J1361q34j0793o755
2497g540L018J0053O362n992j1576j460R333P842j154q687p423L319J0961M308
2511A1364p658q829j10P077P292p09r592o385N947Q966J629o540o897p49P241
2526B047P370l256r320k861M874O648J858n683p493P34Q028M124l931o389k423
2541e673L375O680J455o800n651K556N450K818j865n824l217M531O218j162n169
2556b278l204J135L994L800k771n547j005L898L621l92l127l605M86M822K280
2571B107l243l112j56J839K786J095l667k458J288L022O21r43j480j847J341L190
2587C83L69k465j347O30Q98J940Q14l143j272J833J602L14N5j973j406K112K557
$$ plain form
2604 1901 1331 -359 -888 -1214 -124 2177 2270 -667 -1288 -144 1506 2668 2448 -492 -1854 786 3727
2621 3727 2801 1212 -599 -1019 1491 5138 3458 -620 -1526 1124 3553 4814 2536 -1637 -1306 3432
2637 3432 5197 3250 -195 -1890 -6 4735 6179 1068 -2714 -1175 3103 5414 4466 -819 -3958
2652 -3958 163 5613 5477 61 -3313 -2749 2255 6750 3868 -3523 -4801 481 4841 4817 -187 -5327
2668 -5327 -3978 3281 6530 1290 -4604 -5198 -809 4920 4519 -2569 -7757 -3956 3505 4889 937
2683 937 -5434 -7276 -1118 5684 3609 -4290 -8112 -4268 2181 5253 538 -7851 -8078 -20 5420
2698 5420 2644 -4625 -8922 -5000 3503 6160 -1800 -9026 -7287 696 5548 2895 -5348 -9820 -3583
2713 -3583 5416 5558 -2345 -8339 -6606 1340 7412 2938 -7037 -8591 -1088 6045 5452 -1580 -8323
$$ packed form
2604A901n70j690n29l26J090K301R3k937o21J144J650J162k20k940j362K640K941
2621C727r26j589j811m20K510L647j680m078r06K650K429J261k278m173L31M738
2637C432J765j947l445j695J884M741J444n111l782J539M278K311r48n285l139
2652c958M121N450j36n416l374N64N004M495k882p391j278N282M360k4n004n140
2668e327J349P259L249n240n894n94M389N729m01p088n188L801P461J384l952
2683I37o371j842O158O802k075p899l822L844O449L072m715q389k27Q058N440
2698E420k776p269m297L922Q503K657p960p226J739P983M852k653q243m472O237
2713c583Q999J42p903n994J733P946O072m474r975j554P503P133n93p032o743
$$ plain form
2728 -8323 -5942 3655 8204 1952 -6071 -7169 -362 7235 6840 -2421 -8609 -3846 5583 8145 1973
2743 1973 -5998 -6792 1460 9794 6895 -3205 -7463 -2044 6430 9325 2346 -6258 -5935 4066 9883
2758 9883 5680 -2759 -6341 -1195 8150 9937 972 -6337 -3672 4693 9628 5793 -3525 -7077 -1
2773 -1 8884 7868 -337 -5776 -3593 4391 9855 4478 -5236 -6416 1842 7719 6875 -914 -6843 -4036
2789 -4036 5386 8862 1832 -5858 -5774 1036 7188 5811 -2646 -8019 -2877 5724 6396 503 -6347 -6400
2805 -6400 962 7316 3711 -4818 -7529 -2362 4401 5500 -565 -7974 -6541 1790 5905 1597 -5189
2820 -5189 -7736 -3361 4381 4877 -2713 -8226 -5408 1477 4449 1018 -5742 -8160 -1760 4222 3191
2835 3191 -3400 -7386 -4812 1359 4726 531 -6509 -6792 -496 3838 2475 -2695 -6667 -4063 2847
$$ packed form
2728h323K381R597M549o252q023j098O807P597l95r261o188M763R429K562o172
2743A973p971p94Q252Q334k899j0100m258N419Q474K895o979q604L23J0001N817
2758I883m203q439l582N146R345J787q965p309K665Q365M935l835r318l552P076
2773aQ885j016q205n439K183P984N464n377r714j180Q258N877q44p789n929K807
2789d036R422L476p030p690Q4O810O152j377q457n373N142Q601O72n893o850n3
2805f400P362O354l605q529k711N167O763J099o065p409J433Q331M115m308o786
2820e189k547M375P742M96p590n513K818O885K972l431o760k418O400N982j031
2835C191o591l986K574O171L367m195p040k83O296M334j363n170l972K604O910
$$ plain form
2850 2847 4467 -281 -5273 -5004 -542 3776 3501 -2545 -5816 -2028 3774 3673 329 -3480 -3886 762
2866 762 5484 2969 -2392 -3743 -485 3259 4401 732 -3393 -2618 2817 5001 2254 -709 -2345
2881 -2345 76 4092 5017 686 -2791 -607 2735 3890 3061 -727 -2318 859 4463 3656 627 -1324
2897 -1324 -273 2410 4820 2851 -993 -1085 1657 3342 3047 1228 -963 -997 2190 3783 1595 -114
2913 -114 -819 122 1976 2981 635 -1875 -813 1215 1934 1367 64 -1754 -916 1725 1897 -164 -1043
2930 -1043 -1276 -485 1172 1289 -1264 -2344 -1004 372 529 72 -1323 -2799 -1249 739 64 -1438
2946 -1438 -2115 -2127 -1152 735 151 -2723 -3116 -1468 -232 -59 -235 -2898 -3754 -976 723 -262 -1773
2963 -1773 -2448 -2619 -585 1035 -761 -3483 -3236 -793 282 558 -1639 -3591 -2826 786 1618 -787
$$ packed form
2850B847J620m748m992K69M462M318k75o046l271L788N802j01l344l809m06M648
2866G62M722k515n361j351L258L744J142l669m125P75N435K184k747k963j636
2881b345K421M016R25m331l477K184L342J155q29l788j591L177L604q07l029j951
2897a324J051K683K410j969l844r2K742J685k95j819k191l4L187J593k188j709
2913a14p05R41J854J005k346k510J062K028P19n67j303j818Q38K641J72k061q79
2930a043k33P91J657J17k553j080J340J376J57m57j395j476J550J988o75j502
2946a438o77j2R75J887n84k874l93J648J236J73j76k663q56K778J699r85j511
2963a773o75j71K034J620j796k722K47K443J075K76k197j952P65L612Q32k405
$$ plain form
2979 -787 -2444 -2632 -1082 1638 1994 -1854 -3442 -1494 1075 2118 934 -2128 -3271 -95 3402 2193
2995 2193 -1199 -2690 -1252 1545 3971 1524 -2565 -2278 1234 3671 2863 -139 -2718 -1053 3641
3010 3641 4802 791 -2276 -1518 1848 4794 4024 -753 -2894 593 4736 4433 1278 -2004 -2156 2017
3026 2017 5748 3457 -1480 -2256 713 4383 4933 1628 -2923 -1985 3257 5327 2428 -1746 -2675 -78
3042 -78 4555 4828 -198 -4014 -1623 2720 4740 2185 -2631 -4323 -135 4951 3566 -1585 -4139 -2634
3058 -2634 2031 4544 1139 -4390 -4605 289 3985 2373 -1941 -5221 -3176 2776 3982 -414 -4769
3073 -4769 -4380 -135 3753 2394 -3368 -6275 -1932 2810 2991 -1330 -5149 -5184 169 3720 1091 -4575
3089 -4575 -5743 -2120 2388 2967 -1067 -6350 -4556 1154 3823 148 -4180 -5385 -1658 3117 2991
$$ packed form
2979g87j657j88J550K720L56l848j588J948K569J043j184l062j143L176L497j209
2995B193l392j491J438K797K426k447m089K87L512K437q08l002k579J665M694
3010C641J161m011l067P58L366K946p70m777k141L487M143l03l155l282j52M173
3026B017L731k291m937p76K969L670N50l305m551R38N242K070k899m174r29K597
3042g8M633K73n026l816K391M343K020k555m816j692M188N086j385n151k554J505
3058b634M665K513l405n529k15M894L696j612m314l280K045N952J206m396m355
3073d769L89M245L888j359n762k907M343M742J81m321l819l5N353L551k629n666
3089d575j168L623M508N79m034n283J794N710K669l675m328j205L727M775j26
$$ plain form
3104 2991 -2412 -6064 -2923 1856 3442 828 -3998 -5453 -299 4071 2662 -2396 -4467 -2425 2455
3119 2455 4709 1128 -4254 -3851 1090 4373 2557 -1111 -4149 -1894 3673 5001 599 -3301 -2585
3134 -2585 1551 4852 3629 -1410 -4066 252 4647 4352 794 -2660 -2006 2727 5845 2914 -1999
3149 -1999 -2597 940 4141 4557 1052 -3162 -1699 3308 5161 1992 -1543 -2528 409 4435 4435 -240
3165 -240 -3072 -839 2934 4111 1956 -1871 -2984 1042 4391 2944 -833 -2669 -1075 2330 3589
3180 3589 1069 -3269 -2595 1430 3162 1685 -1306 -3292 -1504 2418 2770 -531 -3090 -2162 -289 2347
3196 2347 1655 -2188 -3846 -1321 1690 1384 -884 -3265 -3276 -489 2152 338 -2800 -3467 -1405 463
3212 463 1171 -1000 -4049 -2740 247 1028 -614 -2405 -3069 -1906 555 1065 -1579 -3388 -2188 -134
$$ packed form
3104B991n403l652L141M779J586k614m826j455N154M370j409n058k071K042M880
3119B455K254l581n382M03M941L283j816l668l038K255N567J328m402l900P16
3134b585M136L301j223n039k656M318M395k95l558l454O54M733L118k931m913
3149a999n98L537L201M16l505m214J463N007J853l169l535r85K937M026%m675
3165b40k832K233L773J177k155l827j113M026L349j447l777j836J594L405J259
3180C589k520m338O74M025J732j477k991j986J788L922L52l301k559R28J873K636
3196B347o92l843j658K525L011l06k268k381j1K787K641j814l138o67K062J868
3212D63P08k171l049J309K987P81j642j791o64J163K461N10k644j809J200K054
$$ plain form
3228 -134 538 -166 -1878 -3160 -919 978 630 -1260 -2311 -1843 -140 1326 324 -1876 -2136 -178
3244 -178 636 690 9 -1694 -1509 761 1829 833 -894 -1057 -277 1195 2048 398 -1445 -201 1229
3261 1229 1585 1605 325 -813 310 1941 1913 357 137 134 767 2031 1941 174 -189 704 1786 1908 1726
3280 1726 189 -310 1075 2396 1739 609 -6 307 1232 2676 1895 -294 -307 938 1523 2064 1050
3297 1050 -386 -505 1592 2289 815 -279 -597 55 1497 1918 435 -1570 -436 787 1346 808 -391
3314 -391 -1916 -727 1434 1093 -737 -1225 -1048 2 1227 814 -1992 -2242 -446 729 513 -703 -2163
3331 -2163 -2565 -126 1401 -228 -2218 -2234 -1195 273 1200 -883 -3266 -2335 77 678 -402 -2129
3347 -2129 -3032 -1552 1296 1242 -1694 -2871 -1998 -396 1102 64 -2599 -3480 -716 1395 107 -1458
$$ packed form
3228a34O72p04j712j282K241J897l48j890j051M68J703J466j002k200k60J958
3244a78Q14N4o81j703J85K270J068r96j727j63P80J472Q53j650j843J244J430
3261A229L56K0j280j138J123J631k8j556k20lO33J264r0j767l63Q93J082J22j82
3280A726j537m99J385J321o57j130o15L13R25J444p81k189j3J245N85N41j014
3297A050j436j19K097O97j474j094l18O52J442M21j483k005J134J223N59n38j199
3314c91j525J189K161l41j830m88J77J050J225m13k806k50J796J175k16j216j460
3331b163m02K439J527j629j990j6J039J468R27k083k383R31K412O01j080j727
3347b129r03J480K848n4k936j177Q73J602J498j038k663q81K764K111j288j565
$$ plain form
3363 -1458 -2663 -1995 431 2439 246 -2624 -2353 -80 1363 1267 -802 -2688 -1493 1885 2333 244
3379 244 -1604 -1839 321 2923 2159 -818 -2383 -131 2069 2580 1098 -1317 -1577 1217 3599 2058
3395 2058 -563 -1342 -79 2084 3541 654 -1547 -1039 2000 3360 1896 -176 -1481 109 3062
3410 3062 3480 349 -2007 -562 2145 3248 2623 -779 -1938 658 3376 2820 249 -1277 -1011 1890
3426 1890 3511 1474 -1338 -1536 1001 2396 2687 184 -2435 -1123 2058 2676 392 -1774 -2214 336
3442 336 2539 1617 -1253 -2686 -828 1771 1867 143 -2166 -2628 443 2303 733 -1967 -2722 -1563
3458 -1563 795 1937 -424 -2964 -2746 -64 1313 392 -1758 -3227 -1737 1085 1269 -1435 -2952 -2210
3474 -2210 -255 1168 310 -2531 -3318 -1351 1118 679 -1360 -2729 -2641 -210 2078 143 -2564 -2425
$$ packed form
3363a458j205O68K426K008k193k870K71K273J443r6k069j886J195L378M48k089
3379B44j848k35K160K602p64k977j565K252K200N11j482k415k60K794K382j541
3395B058k621p79J263K163J457k887k201N08L039J360j464k072j305J590K953
3410C062M18l131k356J445K707J103o25l402j159K596K718n56k571j526K66K901
3426A890J621k037k812j98K537J395K91k503k619J312L181O18k284k166m40K550
3442C36K203r22k870j433J858K599R6j724k309m62L071J860j570k700p55J159
3458a563K358J142k361k540K18K682J377r21k150j469J490K822J84k704j517P42
3474b210J955J423q58k841p87J967K469m39k039j369Q8K431K288j935k707J39
$$ plain form
3490 -2425 -682 914 1143 -906 -2884 -1746 815 1491 -150 -1699 -2046 -504 1687 1484 -1062 -1983
3506 -1983 -498 1278 1873 790 -1331 -1790 477 2106 1471 -773 -1076 -451 1205 2436 886 -1212
3522 -1212 -988 1382 2334 1537 262 -1168 -57 2295 2454 604 -578 -127 1361 2054 2182 -41 -951
3539 -951 600 2223 2094 536 -493 -498 962 2549 1763 -332 -377 442 1604 2078 601 -533 -669 1353
3557 1353 2037 1063 243 -438 -99 1502 1757 116 -826 -60 492 1333 757 -393 -1301 -249 1208 961
3575 961 -176 -1076 -1227 24 867 243 -1355 -1402 -336 37 424 -228 -1584 -1756 -335 397 -390 -743
3593 -743 -1524 -1510 -306 283 -1047 -1969 -1411 -276 -113 -265 -1323 -2095 -1340 172 143 -730 -1498 -1323 -451
3612 -451 168 125 -1460 -1978 -833 118 217 -245 -1189 -1370 -561 780 -166 -1003 -1309 -850 -34 891 75 -1441
$$ packed form
3490b425J743J596K29k049j978J138K561O76j641j549l47J542K191k03k546r21
3506a983J485J776N95j083k121m59K267J629o35k244l03O25J656J231j550k098
3522a212K24K370R52p97j275j430J111K352J59j850j182M51J488O93J28k223r10
3539i51J551J623j29j558j029nJ460J587p86k095m5Q19J162M74j477j134j36K022
3557A353O84r74q20o81L39J601K55j641r42P66N52Q41n76j150r08J052J457k47
3575I61j137r00j51J251Q43o24j598m7J066L73L87o52j356j72J421P32p87l53
3593g43p81J4J204N89j330r22N58J135J63j52j058p72P55J512k9q73p68J75Q72
3612d51O19m3j585n18J145R51R9m62r44j81Q09J341r46q37l06M59Q16R25q16j516
$$ plain form
3632 -1441 -678 170 577 948 -199 -1203 -273 969 1257 109 -686 -172 315 1061 1114 -507 -1058 175
3650 175 1385 1557 732 -312 -523 498 1761 1367 16 -206 861 1119 1535 844 -286 -69 1297
3667 1297 1751 1332 457 -463 276 1583 1969 385 -470 -14 1012 1534 1382 29 -557 289 1728 1364
3685 1364 431 -211 -159 597 1817 1298 -639 -546 310 953 1160 435 -908 -845 639 1249 154 -666 -1074
3704 -1074 -647 665 1249 -481 -1789 -958 303 549 357 -1342 -1839 -692 860 276 -969 -1495 -1176
3721 -1176 -240 780 -290 -1678 -1753 -292 140 20 -1087 -1718 -1663 232 621 -634 -1773 -1866 -699 263
3739 263 443 -1303 -2053 -1201 237 585 -286 -1419 -1534 -317 747 111 -1084 -1796 -739 120 738 218
3757 218 -1418 -1393 109 1030 326 -259 -574 -405 857 1354 -127 -1269 -353 491 1278 975 -160 -1000
$$ packed form
3632a441P63Q48M07L71j147j004R30J242K88j148p95N14M87P46N3j621n51J233
3650A75J210J72q25j044k11J021J263l94j351k22J067K58M16o91j130K17J366
3667A297M54m19q75r20P39J307L86j584q55M56J026N22j52j353n86Q46J439l64
3685A364r33o42N2P56J220n19j937R3Q56O43K07p25j343O3J484O10j095q20m08
3704a074M27J312N84j730j308Q31J261K46j92j699m97J147J552n84j245n26L19
3721a176R36J020j070j388p5J461M32j20j107o31N5J895L89j255j139r3J167R62
3739B63J80j746p50Q52J438L48q71j133j15J217J064o36j195p12J057Q59O18n20
3757B18j636K5J502R21p04n85l15J69J262M97j481j142R16Q44P87l03j135q40
$$ plain form
3775 -1000 75 1511 1370 220 -379 -161 963 1882 1239 -173 -833 522 1652 1442 767 -329 -299
3792 -299 1414 2003 1064 -173 -91 779 1310 1688 421 -694 296 1650 1595 912 -89 -606 676 1944
3810 1944 1322 219 -357 105 940 1536 924 -310 -976 550 1649 845 165 -948 -312 876 1368 80
3828 80 -736 -739 232 592 142 -292 -1559 -700 705 447 -132 -695 -1040 -418 244 293 -871 -1377 -648 77
3848 77 152 -234 -1452 -1627 -354 464 -353 -970 -1051 -752 -262 39 -765 -1415 -1261 -600 -39 -35 -795 -1503 -1054
3869 -1054 163 14 -629 -1181 -930 -699 26 173 -1089 -1458 -534 296 -85 -221 -928 -1017 -76 574 -263
3888 -263 -547 -801 -369 460 694 -230 -559 -607 308 949 243 -233 -549 -109 587 1373 222 -501 18 909
3908 909 1099 1305 -86 -436 660 1045 968 555 71 -253 716 1932 872 -102 -79 436 715 1233 734
$$ packed form
3775a000J075J436j41j150n99K18J124R19o43j412o60J355J130k10o75j096L0
3792b99J713N89r39j237Q2Q70N31L78j267j115R90J354n5o83j001n17J282J268
3810A944o22j103n76M62Q35N96o12j234o66J526J099q04o80j113O36J188M92j288
3828H0q16lR71L60m50m34j267Q59J405k58n79n63l45O22O62M9j164n06P29P25
3848G7P5l86j218j75J273Q18q17o17q1K99M90L01q04o50J54O61N61Mp60p08M49
3869a054J217j49o43n52K51K31P25J47j262l69R24Q30l81j36p07q9R41O50q37
3888b63k84k54M32Q29K34r24l29m8R15O41p06m76l16M40O96P86j151p23N19Q91
3908I09J90K06j391l50J096L85p7m13m84l24R69J216j060r74K3N15K79N18m99
$$ plain form
3927 734 108 -51 1033 1509 1049 233 -102 108 937 1373 216 -62 270 1009 898 812 -1 -577 61 883
3947 883 609 112 -244 -247 555 1056 430 -711 -601 124 511 768 126 -871 -842 31 697 -124 -772 -815 -347
3968 -347 231 203 -627 -1003 -747 -147 61 -219 -1040 -1600 -660 454 -269 -967 -981 -502 -1 115 -562 -1249
3988 -1249 -1294 -247 51 -321 -849 -985 -713 -27 141 -836 -1364 -726 -195 75 15 -826 -1361 -235 320 230
4008 230 -426 -956 -954 -215 387 -8 -527 -1021 -102 196 207 -140 -402 -602 251 671 85 -460 -362 -219 486
4029 486 753 291 -282 15 564 674 635 234 -166 162 1162 1247 306 175 438 388 1021 513 206 -354 771
4050 771 1221 879 369 396 72 898 1221 605 41 356 1028 656 1028 631 -57 420 992 864 632 392
4070 392 163 -225 764 862 170 -137 206 530 394 210 69 -616 237 583 310 74 -445 -298 97 707
$$ packed form
3927G34o26j59J084M76m60q16l35K10Q29M36j157k78L32P39j11q6q13n76O38Q22
3947H83k74m97l56lQ02N01o26j141J10P25L87K57o42r97K9Q73O66q21o48m3M68
3968c47N78k8q30l76K56O00K08k80q21n60R40J114p23o98j4M79N01J16o77o87
3988a249m5J047K98l72n28j36K72O86J68r77n28O38N31K70o0q41n35J126N55r0
4008B30o56n30KP39O02l95n19m94R19K98J1l47k62k00Q53M20n86n45R8J43P05
4029D86K67m62n73K97N49J10l9m01m00L28J000Q5r41j31K63n0O33n08l07n60J125
4050G71M50l42n10K7l24Q26L23o16n64L15O72l72L72l97o88M77N72j28k32k40
4070C92k29l88R89R8o92l07L43L24j36j84j41o85Q53L46k73k36n19J47L95O10
$$ plain form
4090 707 -31 -227 -423 -201 190 -110 -507 -799 -436 230 189 -450 -547 -435 -372 -239 -110 -577 -889 -409 -44
4111 -44 -165 -557 -849 -1043 -352 -152 61 -788 -1001 -660 -787 -222 -616 -1056 -799 -238 -104 -519 -738 -696 -653
4132 -653 -216 181 -591 -911 -629 -284 -135 294 -386 -947 -243 215 39 -472 -429 -344 -222 111 156 -658 -506
4153 -506 523 164 451 447 -294 -169 293 436 283 192 -48 -87 549 688 442 -13 422 489 485 854 456 306
4175 306 340 868 717 553 582 111 583 735 846 367 304 413 583 466 770 286 226 715 822 470 258
4196 258 290 331 336 800 296 -241 19 580 377 424 71 -473 136 540 899 21 -259 -206 -14 227 363 -580
4218 -580 -496 -19 228 344 -35 -701 -834 -74 317 -178 -731 -706 -315 -11 175 -325 -911 -713 -365 115 -171
4239 -171 -575 -907 -834 52 134 -704 -779 -528 -494 -29 -587 -897 -1070 -494 -217 -200 -818 -658 -797 -100 118 -235
$$ packed form
4090G07p38j96j96K22L91l00l97k92L63O66m1o39r7J12O3J33J29m67l12M80L65
4111d4j21l92k92j94O91K00K13q49k13L41j27N65l94m40K57N61J34m15k19M2M3
4132f53M37L97p72l20K82L45J49M29o80n61P04M58j76n11M3Q5J22L33M5q14J52
4153e06J029l59K87mp41J25M62J43j53r1k40l9O36J39k46m55M35O7mL69l98j50
4175C06L4N28j51j64K9m71M72J52J11m79o3J09J70j17L04m84o0M89J07l52k12
4196B58L2M1NM64n04n37K60N61k03M7l53n44O09M04L59q78k80N3J92K41J36r43
4218e80Q4M77K47J16l79o66j33P60L91m95n53K5L91L04J86n00n86J98L48M80k86
4239a71m04l32P3Q86Q2q38p5K51L4M65n58l10j73N76K77J7o18J60j39O97K18l53
$$ plain form
4261 -235 -490 -635 -260 -137 -5 -175 -789 -685 64 180 -135 -498 -607 -465 397 260 -428 -581 237 420
4281 420 495 93 -195 -556 205 1164 485 105 -487 -15 447 777 377 -192 -71 599 805 719 551 -118 251
4302 251 852 897 208 94 328 643 884 606 -176 67 728 932 458 375 326 59 512 1137 575 -195 50
4323 50 752 482 877 408 -166 -79 869 723 583 13 -242 -22 496 673 83 -238 -98 561 187 8 -162
4344 -162 -348 146 545 144 -335 -168 -218 -298 443 -44 -581 -334 172 -68 -262 -435 -735 -757 279 72 -432
4365 -432 -540 -480 -398 -200 -458 -905 -679 -324 40 -365 -540 -664 -656 -355 171 -554 -569 -805 -21 -22 -199 -586
4387 -586 -652 -559 -212 -178 -523 -524 -375 -239 47 378 -290 -416 -166 223 -7 -38 -114 41 110 513 -8 -194 -107
4410 -107 255 316 253 254 -395 264 188 336 9 107 -51 326 698 570 49 154 312 440 189 813 268 137
$$ packed form
4261b35k55j45L75J23J32j70o14J04P49J16l15l63j09J42Q62j37o88j53Q18J83
4281D20P5m02k88l61P61R59o79l80n92M72M62L30m00n69J21O70K06q6j68o69L69
4302B51O01M5o89j14K34L15K41k78p82K43O61K04m74q3m9k67M53O25n62p70K45
4323E0P02k70L95m69n74Q7R48j46j40n70k55K20N18J77n90l21J40O59l74j79j70
4344a62j86M94L99m01m79J67n0q0P41m87n37K47N06k40j94j73l00k2J036k07n04
4365d32j08O0Q2J98k58m47K26L55L64m05j75j24QL01N26p25j5k36P84jj77l87
4387e86o6R3L47L4l45jJ49J36K86L31o68j26K50L89k30l1p6J55O9M03n21j86Q7
4410a07L62O1o3Jo49O59p6J48l27R8j58L77L72j28n21J05J58J28k51O24n45j31
$$ plain form
4432 137 496 656 365 183 356 44 730 612 359 216 347 322 490 317 396 -60 200 603 399 451 211
4453 211 526 82 410 473 172 225 357 71 250 273 119 131 177 77 -95 -75 356 104 -342 -7 -76 -246
4475 -246 -527 22 -151 -337 -220 -174 -315 -7 28 -205 81 37 -275 -425 -215 -221 -247 -39 -359 -475 -395 79
4497 79 -232 -440 -349 -432 -46 -212 -329 -881 -473 -142 -503 -334 -445 -197 -554 -413 -284 -266 -366 -72 -417
4518 -417 -326 -299 -600 -427 239 -70 -375 -147 -348 -118 36 149 -442 -476 -25 116 -133 -122 -62 -142 55 453
4540 453 85 -148 -196 209 65 97 399 83 357 515 546 -14 47 270 86 209 81 292 183 295 340 595
4562 595 80 270 291 615 710 421 -16 332 135 528 597 319 -131 123 842 435 450 220 205 221 488 521
4584 521 40 -82 85 346 608 284 -118 -14 397 496 96 157 -113 -271 231 458 -305 -355 38 139 389
$$ packed form
4432A37L59J60k91j82J73l12O86j18k53j43J31k5J68j73P9m56K60M03k04N2k40
4453B11L15m44L28O3l01N3J32k86J79K3j54J2M6j00j72K0M31k52m46L35o9j70
4475b46k81N49j73j86J17M6j41L08L5k33K86m4l12j50K10ok6K08l20j16Q0M74
4497G9l11k08R1q3L86j66j17n52M08L31l61J69j11K48l57J41J29J8j00K94l45
4518d17R1K7l01J73O66l09l05K28k01K30J54J13n91l4M51J41k49J1O0q0J97L98
4540D53l68k33m8M05j44L2L02l16K74J58L1n60O1K23j84J23j28K11j09J12M5K55
4562E95n15J90K1L24R5k89m37L48j97L93O9k78m50K54P19m07J5k30j5J6K67L3
4584E21m81j22J67K61K62l24m02J04M11R9m00O1k70j58N02K27p63n0L93J01K50
$$ plain form
4605 389 110 -407 -469 -266 91 209 -681 -304 -426 -306 237 -157 -749 -492 -54 -7 -509 -393 -941 -542 -246
4626 -246 266 -667 -486 -368 -305 113 -72 -463 -741 -550 262 106 -474 -461 -379 129 64 -439 -838 -701 -20
4647 -20 -277 194 -489 -468 -572 173 140 -142 -388 -492 -81 148 183 -252 -607 -37 336 241 -25 -204 -192 298
4669 298 737 330 -380 -400 349 581 493 -137 -95 19 615 449 269 67 -30 348 635 735 -60 132 289
4690 289 270 681 392 -11 78 718 1176 661 141 -80 407 718 965 197 -126 57 570 528 7 43 78 217
4712 217 443 545 124 -293 -24 217 432 208 -158 -6 248 305 -259 -269 -334 -52 20 207 -92 -347 -57
4733 -57 64 62 -155 -220 -497 -186 -262 -205 -349 -251 -143 -373 257 -283 -512 -255 -18 -406 -309 -497 -796 -423 -170
4756 -170 -225 -417 -259 -272 -421 -219 -220 -567 -415 -115 -95 -390 -369 -441 -267 -147 109 -266 -407 -304 -52 -162
$$ packed form
4605C89k79n17o2K03L57J18q90L77j22J20N43l94n92K57M38M7n02J16n48L99K96
4626b46N12r33J81J18O3M18j85l91k78J91Q12j56n80J3Q2N08o5n03l99J37O81
4647b0k57M71o83K1j04P45l3k82k46j04M11K29L5m35l55N70L73r5k66j79J2M90
4669B98M39m07p10k0P49K32q8o30M2J14N96j66j80k02r7L78K87J00p95J92J57
4690B89j9M11k89m03Q9O40M58n15n20k21M87L11K47p68l23J83N13m2n21L6L5J39
4712B17K26J02m21m17K69K41K15k24l66J52K54N7n64j0o5K82P2J87k99k55K90
4733e7J21kk17o5k77L11p6N7j44R8J08k30O30n40k29K57K37l88R7j88k99L73K53
4756a70n5j92J58j3j49K02jl47J52L00K0k95K1p2J74J20K56l75j41J03K52j10
$$ plain form
4778 -162 -155 -370 -121 -72 -10 -76 -308 -509 -72 -147 193 383 -540 -245 463 204 135 -84 -236 -6 317 65
4800 65 -128 -23 306 297 1 507 103 197 290 489 235 89 244 378 293 462 422 21 245 603 283 109
4822 109 203 107 117 369 550 249 123 396 587 184 -91 201 80 393 316 258 -239 217 171 216 328 219
4844 219 87 178 225 153 -214 -130 -158 29 135 -294 -357 -160 360 -17 146 31 -439 -170 12 27 -25 -513 -446
4867 -446 -321 45 -216 -597 -509 -291 72 -57 -183 -220 -701 2 -140 -21 -561 -359 -72 -80 -227 -798 -496
4888 -496 -119 253 -241 -134 -373 -384 -220 137 -483 -751 -307 -112 -54 129 -49 -416 -41 224 -99 -353 -509
4909 -509 -11 40 105 250 -235 -322 -29 252 276 3 -209 -83 296 571 5 -320 3 117 187 209 115 -451
4931 -451 -35 564 178 29 48 84 391 724 321 194 -48 144 555 490 292 85 65 433 539 168 107 -135
$$ packed form
4778a62Pk15K49M9O2o6k32k01M37p5L40J90r23K95P08k59o9k19j52K30L23k52
4800F5j93J05L29rk96N06m04R4R3J99k54j46J55J34q5J69m0m01K24L58l20j74
4822A09R4r6J0K52J81l01j26K73J91m03k75K92j21L13p7n8m97M56m6M5J12j09
4844B19j32R1M7p2l67Q4k8J87J06m29o3J97N20l77J63j15m70K69J82J5n2m88O7
4867d46J25L66k61l81Q8K18L63j29j26l7m81P03j42J19n40K02K87qj47n71L02
4888d96L77L72m94J07k39j1J64L57o20k68M44J95N8J83j78l67L75K65l23k54j56
4909e09M98N1O5J45m85q7K93K81K4k73k12J26L79K75n66l25L23J14P0K2r4n66
4931d51M16N99l86j49J9L6L07L33m03j27k42J92M11o5j98k07k0L68J06l71o1k42
$$ plain form
4953 -135 386 280 374 290 -210 417 424 398 298 -28 -92 373 703 259 26 -431 258 497 366 233 -229 205
4975 205 -52 441 -111 -556 -330 103 372 512 -312 -574 -162 -9 -35 -59 -384 -596 39 255 161 -578 -194
4996 -194 -37 -27 618 -128 -654 -586 -2 143 -99 -478 -428 -464 -295 195 -566 -691 -333 145 -68 -406 -759
5017 -759 -315 -168 251 -95 -342 -422 -81 114 18 -254 -742 -166 105 -140 -206 -261 -334 -156 267 445 -179 -166
5039 -166 155 463 428 276 -218 -147 -21 385 297 89 -149 -145 547 628 -55 -141 94 81 246 488 21 -296 34
5062 34 704 185 199 21 384 514 546 522 -205 40 315 640 432 -85 -161 170 789 545 179 74 98 370
5084 370 585 72 143 -98 400 508 354 116 -266 32 186 366 104 -197 275 413 286 39 -169 -603
5104 -603 58 384 245 -477 -352 15 -12 127 -37 -356 -642 21 -33 198 -301 -289 -328 -69 0 -432 -517 -285
$$ packed form
4953a35N21j06R4q4n00O27Pk6j00l26o4M65L30m44k33m57O89K39j31j33m62M34
4975B05k57M93n52m45K26M33K69J40q24k62M12J53k6k4l25k12O35K16r4p39L84
4996a94J57J0O45p46n26O8N84J45k42l79N0l6J69M90p61j25L58M78k13l38l53
5017g59M44J47M19l46k47q0L41J95r6k72m88N76K71k45o6n5p3J78M23J78o24J3
5039a66L21L08l5j52m94P1J26M06q8k08k38MO92Q1o83q6K35j3J65K42m67l17L30
5062C4O70n19J4j78L63J30L2k4p27K45K75L25k08n17p6L31O19k44l66j05K4K72
5084C70K15n13P1k41M98J08j54k38l82K98J54J80k62l01M72J38j27k47k08m34
5104f03O61L26j39p22J25L67k7J39j64l19k86O63n4K31m99J2l9K59O9m32q5K32
$$ plain form
5126 -285 310 -54 -201 -552 -383 -195 21 -131 -467 -395 -184 -294 -150 -116 -586 -391 -183 137 -140 -441 -470
5147 -470 -528 164 -32 -149 -416 -78 -119 103 -238 -340 -254 -113 -32 -120 -442 1 -278 -105 418 -242 -327 -497
5169 -497 263 348 205 52 -273 -39 421 241 -342 -49 -57 248 228 394 -73 66 366 535 145 306 75
5190 75 -114 711 560 34 90 173 605 352 241 -132 -256 371 444 -8 165 -90 561 527 587 75 66 -138 386
5213 386 674 363 92 2 57 453 477 -17 -348 205 226 236 -6 66 -175 104 380 36 -390 -134 76 120
5235 120 391 -466 -539 -382 59 478 -100 -294 -401 -315 194 89 -399 -687 -186 -83 40 137 -776 -503 131
5256 131 561 -248 -312 -630 150 194 12 -214 -762 -225 -128 -248 -69 -750 -652 166 25 -57 -457 -259 -227 128
5278 128 343 -66 -526 -516 240 260 -67 -536 -350 -108 343 450 -317 -406 -192 407 122 102 -481 -313 248
$$ packed form
5126b85N95l64j47l51J69J88K16j52l36P2K11j10J44L4m70J95K08L20k77l01k9
5147d70n8O92j96j17k67L38m1K22l41j02Q6J41Q1q8l22M43k79J73N23o60q5j70
5169d97P60Q5j43j53l25K34M60j80n83K93qL05k0J66m67J39L00J69l90J61k31
5190G5j89Q25j51n26N6Q3M32k53j11l73j24O27P3m52J73k55O51l4O0n12rk04N24
5213C86K88l11k71r0N5L96K4m94l31N53K1J0k42P2k41K79K76l44m26K56K10M4
5235A20K71q57p3J57M41M19n78j94j07Q6N09j05m88k88N01J03J23R7r13K73O34
5256A31M30q09o4l18P80M4j82k26n48N37R7j20J79o81R8Q18j41q2m00J98L2L55
5278A28K15m09m60J0P56K0l27m69J86K42M51J07p67q9K14N99k85k0n83J68N61
$$ plain form
5299 248 393 484 -17 -279 75 462 587 69 -196 -159 395 422 666 -61 -310 202 718 492 -104 -211 238
5320 238 399 815 374 -304 -77 690 671 460 -259 -412 -149 644 848 19 -335 81 394 644 216 -358
5340 -358 -208 158 1046 645 44 -62 50 406 605 54 -299 -382 327 397 246 -217 -189 -103 403 23 -309
5361 -309 -108 -165 149 305 59 -346 -528 66 523 70 -361 -477 -166 107 551 -240 -789 -604 2 259
5381 259 227 -225 -561 -220 255 138 -371 -729 -640 -55 261 -407 -442 -443 -120 -47 126 -289 -800 -290 272 44
5403 44 -421 -485 -250 -22 300 84 -301 -664 -95 394 453 -328 -659 -99 42 485 165 -483 -441 291 561
5424 561 276 -150 -247 -564 712 512 100 -413 -374 300 684 417 71 -165 340 638 390 -100 -53 -22 359
5445 359 776 610 -144 -110 523 874 445 -132 -180 61 572 592 287 -59 -87 337 758 425 -15 -91 467 400
$$ packed form
5299B48J45R1n01k62L54L87J25n18k65L7N54K7K44p27k49N12N16k26n96j07M49
5320B38J61M16m41o78K27P67j9k11p19j53K63P93K04q29l54M16L13K50m28n74
5340c58J50L66Q88m01o01j06J12L56J99n51l53q3P09P0j51m63K8Q6N06l80l32
5361c09K01n7L14J56k46m05j82N94M57m53m31j16L11K73M44p91n49J85O06K57
5381B59l2m52l36L41M75j17n09l58Q9N85L16o68l5jL23P3J73m15n11N10N62k28
5403D4m65o4K35K28L22k16l85l63N69M89N9p81l31N60J41M43l20o48M2P32K70
5424E61k85m26r7l17J276k00m12n13L9O74L84k67l46k36N05K98k48m90M7L1L81
5445C59M17j66p54L4O33L51m29n77m8K41N11K0l05l46k8M24M21l33m40p6N58o7
$$ plain form
5467 400 352 95 -280 150 494 759 164 -293 -167 151 614 214 -174 -315 -45 570 544 -47 -568 -327 -78
5488 -78 543 -180 -193 -423 -5 409 -14 -374 -699 -333 432 249 -233 -516 -417 76 116 27 -798 -966 79
5509 79 464 333 -235 -733 -673 89 425 21 -817 -617 9 5 292 -612 -1035 -537 284 97 -408 -519 -577 -128
5531 -128 503 274 -698 -831 -201 453 231 -169 -440 -508 283 429 15 -388 -308 47 349 460 -135 -561 -17
5552 -17 537 325 138 -310 -549 290 506 363 -493 -313 221 460 534 275 -429 -269 810 864 78 -522 -124
5573 -124 85 644 531 -190 -256 259 615 729 -124 -102 -382 314 1096 370 -419 -147 115 674 500 7 -625
5594 -625 -14 484 702 179 -216 -139 -80 393 659 -159 -368 70 475 381 -286 -235 -392 319 423 148 -488
5615 -488 -339 253 164 339 -383 -430 58 134 182 10 -490 -774 134 349 150 -658 -537 24 305 430 -292
$$ packed form
5467D00m8k57l75M30L44K65n95m57J26L18M63m00l88j41K70O15k6n91n21K41K49
5488g8O21p23j3k30M18M14m23l60l25L66P65j83m82k83R9M93M0q9q25j68J045
5509G9L85j31n68m98O0P62L36m04q38K00O26mK87r04m23M98Q21j87n05j11n8M49
5531a28O31k29r72j33O30O54k22m00k71o8P91J46m14m03Q0L55L02J11n95m26N44
5552a7N54k12j87m48k39Q39K16j43q56J80N34K39P4k59p04J60J079N4p86o00L98
5573a24K09N59j13p21o6N15L56J14q53K2k80O96P82p26p89K72K62N59j74m93o32
5594f25O11M98K18n23l95P7N9M73K66q18k09M38M05r4o67N1j57P11J04k75o36
5615d88J49N92q9J75p22m7M88P6M8j72n00k84R08K15j99q08J21N61K81J25p22
$$ plain form
5636 -292 -750 -440 -19 242 -48 -577 -571 -173 335 38 -637 -907 -456 241 27 -172 -623 -761 -225 302 181
5657 181 -631 -656 -82 227 291 -356 -662 -305 26 491 236 -785 -297 62 711 277 -473 -345 -336 314 470
5678 470 -120 -425 18 380 581 142 -291 -264 -19 481 395 -303 -592 132 635 717 103 -150 -32 378 779
5699 779 469 -69 -226 335 585 688 -62 -469 101 609 787 203 -231 -85 326 680 519 -295 -246 188
5719 188 472 835 40 -314 -80 610 656 475 -262 -569 77 551 698 -130 -847 -94 675 414 294 -712
5739 -712 -591 77 359 148 -273 -491 -298 418 385 79 -710 -617 567 895 -235 -625 -465 -113 532 512
5759 512 -437 -802 -261 220 209 89 -755 -788 63 365 77 -745 -816 -305 257 603 -14 -824 -536 292 477
5780 477 -179 -654 -735 -263 460 272 -667 -918 -223 180 340 -145 -855 -587 308 789 369 -856 -450 -49
$$ packed form
5636b92m58L10M21K61k90n29OL98N08k97o75k70M51O97k14j99m51j38N36N27j21
5657A81q12k5N74L09O4o47l06L57L31M65k55j021M88L59O49m34p50J28RO50J56
5678D70n90l05M43L62K01m39m33K7K45N00q6o98k89P24N03Q2o14k53J18M10M01
5699G79l10n38j57N61K50J03p50m07N70N08J78n84m34J46M11L54j61q14M9M34
5719A88K84L63p95l54K34O90M6j81p37l07O46M74J47q28p17P53P69k61j20j006
5739g12J21O68K82k11m21k18J93P16l3l06p89R3J184L28j130l90J60L52O45k0
5759E12r49l65N41M81j1j20q44l3Q51L02k88q22p1N11N62L46o17q10K88Q28J85
5780D77o56m75q1M72P23j88r39k51O95M03J60m85p10K68Q95M81m20j225M06M01
$$ plain form
5800 -49 657 738 -234 -852 -351 450 763 496 -532 -755 9 576 500 -348 -595 53 457 831 517 -485
5820 -485 -508 266 638 479 -292 -501 37 1085 898 148 -550 128 494 607 485 -228 -658 116 849 603
5840 603 -372 -255 -10 234 704 289 -460 -572 543 917 550 -42 -499 -246 821 823 -116 -567 -323 253
5860 253 565 260 -469 -577 -150 605 334 -368 -703 -417 278 815 54 -716 -769 252 348 191 -587 -754
5880 -754 -549 642 585 -497 -880 -567 261 405 110 -656 -1101 -77 542 109 -254 -909 -698 28 634
5899 634 -26 -791 -323 -215 379 217 -476 -1008 -615 626 276 -316 -673 -276 254 394 241 -797 -575
5918 -575 72 335 455 -36 -626 -670 207 967 159 -781 -332 -87 397 -26 -146 -984 -267 554 523 -15 -380
5939 -380 -254 441 730 372 -164 -262 298 719 457 122 -371 34 258 657 139 -543 -80 302 815 446
$$ packed form
5800d9P06Q1r72o18N01Q01L13k67j028k23P64N67p6q48k47O48M04L74l14j002
5820d85k3P74L72j59p71k09N38J048j87p50o98O78L66J13j22p13m30P74P33k46
5840F03r75J17K45K44M70m15p49j12J115L74l67n92m57K53J067Kr39m51K44N76
5860B53L12l05p29j08M27P55k71p02l35K86O95N37p61p70n3J021R6j57p78j67
5880g54K05J191n7j082l83L13Q28J44k95p66m45J024O19m33l63o55K11P26O06
5899F34o60p65M68J08N94j62o93n32L93J241l50n92l57L97N30J40j53j038K22
5918e75O47K63J20m91n90m4Q77P60q08r40M49K45M84m23j20q38P17Q21l1n38l65
5939c80J26O95K89l58n36r8N60M21k62l35m93M05K24L99n18o82M63L82N13l69
$$ plain form
5959 446 -103 -410 251 704 436 -173 -266 -99 604 641 262 -154 -483 504 717 387 36 -748 -140 567 760
5980 760 -427 -296 -66 182 747 225 -540 -322 120 395 405 -186 -584 -201 500 307 -273 -300 -179 75
6000 75 373 38 -555 -656 107 672 324 -142 -277 -402 135 458 0 -806 -214 193 285 32 -255 -680 -406
6021 -406 328 379 -261 -733 -681 -128 426 -22 -733 -568 47 416 272 -397 -574 -423 1 518 -172 -1028 -379
6042 -379 447 276 29 -528 -561 29 632 413 -415 -449 -280 262 714 358 -830 -412 147 506 266 14
6062 14 -591 -255 502 572 102 -333 -266 256 1109 624 -295 -687 0 950 344 -300 -442 -269 817 835 470
6083 470 -641 -203 612 871 544 -331 -773 -71 995 676 -125 -494 -280 310 1023 456 -399 -756 126
6102 126 972 812 -45 -376 -430 621 1219 296 -964 -744 457 1026 609 -372 -774 -302 987 626 -81
$$ packed form
5959D46n49l07O61M53k68o09r3J67P03L7l79m16l29R87K13l30l51p84O08P07J93
5980G60j187J31K30K48N65n22p65K18M42K75J0n91l98L83P01j93n80k7J21K54
6000G5K98l35n93j01P63N65l48m66j35j25N37L23m58q06N92M07R2k53k87m25K74
6021d06P34N1o40m72N2N53N54m48p11J65O15L69j44o69j77J51M24N17o90q56O49
6042c79Q26j71k47n57l3N90O03k19q28l4J69N42M52l56j188M18N59L59k40k52
6062A4o05L36P57P0m70m35O7N22Q53m85r19l92O87R50o06o44j42J73J086J8l65
6083D70j111M38Q15K59l27q75m42P02J066l19q01l69K14N90P13n67q55l57Q82
6102A26Q46j60q57l31n4J051N98r23j260K20J201N69m17r81m02M72J289l61p07
$$ plain form
6121 -81 -970 -455 68 699 372 -951 -1107 -125 853 371 -219 -670 -788 -1 703 -168 -859 -668 -55 833
6141 833 489 -374 -1080 -555 775 519 -479 -942 -1096 239 794 341 -813 -1061 -370 649 626 -478 -1148
6160 -1148 -809 368 1190 -75 -618 -914 -69 766 503 -621 -954 -320 583 587 -12 -1039 -979 455 1153
6179 1153 489 -1017 -782 -346 737 1240 -103 -1094 -531 480 903 545 -593 -634 -86 1052 751 -266
6197 -266 -684 -134 776 857 523 -739 -687 315 930 715 -442 -506 65 670 1196 -178 -473 -182 682 1159
6217 1159 390 -438 -707 132 1047 724 -332 -382 -233 711 1140 384 -746 -558 346 1015 467 -171 -759
6236 -759 -332 674 907 -205 -1007 -268 551 882 438 -649 -692 18 873 651 -376 -900 -215 573 556
6255 556 9 -730 -517 348 537 276 -135 -954 -361 704 696 -257 -860 -411 10 256 289 -708 -1080 51
$$ packed form
6121h1q89N15N23O31l27j323j56R82R78m82n90m51j18P87P04q71o91J91O13Q88
6141H33l44q63p06N25J330k56r98m63j54J335N55m53j154k48O91J019k3j104o70
6160a148L39J177Q22j265n43k96Q45Q35k63j124l33O34R03Mn99j027O0J434O98
6179A153o64j506K35M36J083N03j343r91N63J011M23l58j138m1N48J138l01j017
6197b66m18N50R10Q1l34j262N2J002O15k15j157o4N71O05N26j374k95K91Q64M77
6217A159p69q28k69Q39R15l23j056n0J49R44M29p56j130J88R04O69n48o38n88
6236g59M27J006K33j112q02P39Q19L31m44j087m3P10Q55k22j027n24O85P88j7
6255E56n47p39K13Q65J89k61m11q19N93J065qr53o03M49M21K46L3r97l72J131
$$ plain form
6275 51 302 169 -345 -1178 -777 165 466 -214 -874 -421 30 335 137 -420 -896 -458 499 375 -329 -879
6295 -879 -392 5 822 67 -906 -534 313 329 128 -337 -528 -457 293 489 -141 -750 -378 366 675 289 -263
6316 -263 -497 170 815 466 -102 -412 -152 525 776 -90 -312 -342 539 366 359 -341 -394 93 854 565 -284
6337 -284 -199 -58 311 1087 385 -375 -447 500 875 94 -52 -194 184 695 686 -54 -524 50 585 508 360 11
6359 11 -285 161 795 526 -340 -311 -97 687 573 200 -836 -281 393 541 114 -306 -433 -66 960 437
6379 437 -319 -726 -12 698 363 -77 -801 -541 176 650 216 -525 -954 -152 307 467 -427 -1291 -167 149
6399 149 754 -118 -827 -1026 -197 668 455 -486 -1133 -504 432 498 -194 -1048 -747 406 933 54 -727 -885
6419 -885 -245 643 664 -359 -1070 -605 217 939 207 -760 -1239 36 939 526 -269 -994 -724 777 813 182
$$ packed form
6275E1K51j33n14q33M01R42L01o80o60M53M51L05j98n57m76M38R57j24p04n50
6295h79M87L97Q17p55r73L72Q47J6k01m65j91P1P50J96o30o09L72P44L09l86n52
6316b63k34O67O45l49n68l10K60O77K51q66k22l0Q81j73pp00n3M87P61k89q49
6337b84Q5J41L69P76p02p60p2R47L75p81j46j42L78N11rp40m70N74N35p7j48l49
6359A1k96M46O34k69q66K9K14P84j14l73j036N55O74J48m27m20j27L67J026n23
6379D37p56m07P14P10l35m40p24K60P17M74m34p41m29Q02M59J60q94q64J124L16
6399A49O05q72p09j99Q29Q65k13r41o47O29R36O6o92q54L01J153N27q79p81j58
6419h85O40Q88K1j023p11M65Q22P22p32r67m79J275R03m13p95p25K70J501L6o31
$$ plain form
6439 182 -1104 -737 167 867 288 -611 -975 -264 1044 945 -18 -822 -146 601 1098 611 -536 -616 259 1230
6459 1230 593 -82 -600 -255 512 1349 206 -1248 -731 921 1178 808 -379 -1078 -273 1332 985 50
6477 50 -684 -173 406 1303 798 -530 -847 405 1091 848 104 -1092 -831 904 1283 166 -806 -592 266
6496 266 1060 599 -428 -1453 -458 1308 742 286 -784 -873 360 1059 730 -860 -1063 -122 819 695
6514 695 -196 -1137 -799 495 914 223 -1124 -1216 -2 891 852 -486 -1496 -690 586 909 -589 -880
6532 -880 -1205 98 858 498 -652 -1375 -60 815 563 -150 -1269 -828 290 885 -56 -857 -1070 -61
6550 -61 682 551 -711 -1225 -404 410 517 -178 -513 -993 -148 1145 575 -793 -940 -288 876 907 86
6569 86 -1081 -909 655 1123 91 -375 -880 235 1048 841 -265 -855 -92 476 587 -19 -379 -591 577
$$ packed form
6439A82j286L67R04P00n79q99l64P11J308r9r63q04O76P47M97m87j147q0Q75R71
6459A230o37o75n18L45P67Q37j143j454N17J652K57l70j187o99Q05J605l47r35
6477E0p34N11N79Q97n05j328l17J252O86k43p44j196K61J735L79j117r72K14Q58
6496B66P94m61j027j025R95J766n66m56j070q9J233O99l29j590k03R41R41j24
6514F95q91r41L38J294M19o91j347r2J214Q93l9j338j010Q06J276L23j498k91
6532h80l25J303P60l60j150p23J315Q75k52p13j119M41J118N95r41q01k13J009
6550f1P43j31j262n14Q21Q14J07o95l35m80Q45J293n70j368j47O52J164L1q21
6569H6j167J72J564M68j032m66n05J115Q13k07j106n90P63N68J11o06l60k12J168
$$ plain form
6588 577 973 1076 -198 -576 -199 544 822 211 -629 -484 419 950 291 -196 -330 131 660 811 -402
6607 -402 -664 -135 567 720 25 -379 -518 316 916 385 -417 -325 26 804 667 83 -543 -366 508 706
6627 706 312 -444 -776 63 534 255 -396 -647 -241 232 397 -178 -845 -593 446 463 256 -157 -290 -266
6647 -266 209 90 -406 -686 -304 -65 291 -144 -705 -534 -412 654 -218 -705 -653 -352 437 95 -156 -908
6667 -908 -656 243 58 -346 -534 -310 234 578 28 -657 -707 -86 207 319 8 -786 -650 142 381 -144
6687 -144 -827 -262 113 574 318 -323 -803 -130 657 754 -41 -410 -420 262 865 98 -569 -305 -98 662 673
6708 673 -183 -319 162 861 632 153 -274 -320 148 1026 505 -401 -587 313 787 481 225 -530 -315 405
6728 405 1075 201 -379 -219 251 805 688 83 -708 -189 1080 921 -79 -372 -371 375 1185 481 -507 -350
$$ packed form
6588E77L96J03j274l78L77P43K78o11q40J45R03N31o59m87j34M61N29J51j213
6607d02k62N29P02J53o95m04j39Q34O00n31q02R2L51P78j37n84o26J77Q74J98
6627G06l94p56l32Q39M71k79o51k51M06M73J65n75o67K52J039J7k07m13j33K4
6647b66M75j19m96k80L82K39L56m35n61J71J22J066q72m87N2L01P89l42k51p52
6667i08K52Q99j85m04j88K24N44L44n50o85n0O21K93J12l11p94J36P92K39n25
6687a44o83N65L75M61k56o41m80O73P87R7p95l69j0O82O03p67o67K64K07P60J1
6708F73q56j36M81O99k29m79m27m6M68Q78n21r06j86R00M74l06k56p55K15P20
6728D05O70q74n80J60M70N54j17o05p91N19J269j59j000k93JP46Q10p04r88J57
$$ plain form
6748 -350 347 671 934 -171 -688 -425 719 1026 124 -1149 -779 234 1058 596 -308 -1065 -277 655 843
6767 843 19 -1093 -825 140 946 25 -990 -1067 -311 750 793 -394 -1289 -677 522 825 194 -1096 -1117
6786 -1117 -18 1058 405 -745 -1513 -622 782 669 -314 -1283 -1419 203 963 268 -893 -1564 -517
6803 -517 650 936 -368 -1074 -815 470 978 31 -897 -1077 -365 894 727 -437 -1051 -493 521 1141
6821 1141 -102 -945 -730 305 1105 447 -555 -1379 -648 947 1278 -126 -1090 -715 315 1173 518 -380
6839 -380 -1046 -47 1554 1135 -278 -749 -485 738 1397 459 -1126 -924 556 1621 921 -256 -753 -442
6857 -442 760 1110 1 -797 -761 331 1354 738 -283 -1200 -146 1217 996 -28 -672 -700 696 1218
6875 1218 478 -782 -982 66 943 841 -172 -1042 -456 917 1140 178 -886 -759 188 1042 593 -540
$$ packed form
6748c50O97L24K63j105n17K63J144L07r02j273L70J013Q24m62r04p57P88R32J88
6767H43q24j112K68R65Q06r21j015p7P56J061M3j187q95O12J199L03o31j290k1
6786a117J099J076o53j150p68Q91J404j13r83r69j36J622P60o95j161o71J047
6803e17J167K86j304p06K59J285N08r47r28j80P12J259j67j164o14N58J014O20
6821A141j243q43K15J035Q00o58j002q24P31J595L31j404r64L75J030Q58o55q98
6839c80o66R99J601m19j413m71K64J223O59r38j585K02J480J065p00j177m97L11
6857d42J202L50j109p98L6J092J023o16j021r17J054J363k21j024o44k8J396N22
6875A218p40j260k00J048Q77j02j013q70N86J373K23r62j064J27R47Q54m49j133
$$ plain form
6893 -540 -1195 -534 735 826 -355 -931 -857 1 1308 223 -981 -1121 -465 501 414 -435 -897 -919 236
6912 236 794 59 -708 -1157 -210 858 594 -741 -1359 -583 157 431 24 -1172 -885 258 868 293 -563
6931 -563 -910 -340 136 567 -182 -947 -513 536 728 -54 -579 -664 -365 790 797 -807 -824 -99 319 729
6951 729 -63 -600 -312 291 742 601 -278 -776 -68 618 712 -57 -288 -210 389 595 476 -564 -528 197 830
6972 830 889 -25 -695 92 522 871 -37 -555 -275 752 599 284 -21 -109 24 698 282 52 -112 323
6992 323 157 373 223 -653 -263 520 583 401 -219 -87 290 752 537 -140 -410 47 572 171 44 -272
7012 -272 -214 256 972 49 -299 -267 242 305 281 -178 -367 -331 452 184 -523 -635 -502 265 371 265 -723 -602
7034 -602 -24 539 -117 -482 -789 -285 419 485 -303 -497 -334 -156 116 128 -483 -818 -259 496 153 -314 -878
$$ packed form
6893e40o55O61J269R1j181n76P4Q58J307j085j204j40O56R66q7q49m62k2J155
6912B36N58p35p67m49R47J068k64j335o18P76P40K74m07j196K87J143O10n75q56
6931e63l47N70M76M31p49p65M34J049J92p82n25q5K99J155Pj604j7P25M18M10
6951G29p92n37K88O03M51j41q79m98P08O86R4p69k31P8N99K06j19j040L6P25O33
6972H30N9r14o70P87M30L49r08n18K80J027j53l15l05q8J33O74m16k30j64M35
6992C23j66K16j50q76L90P83O3j82o20J32L77M62k15o77k70M57N25m01j27l16
7012b72N8M70P16r23l48L2N09O3k4m59j89L6P83k68p07j12J33P67J06j06r88J21
7034f02N78N63o56l65l07N04P04O6p88j94J63J78K72J2o11l35N59P55l43m67n64
$$ plain form
7055 -878 -476 -15 617 -152 -812 -785 249 572 44 -498 -1080 -459 434 491 -498 -1233 -620 286 691 236
7075 236 -806 -729 155 1040 445 -236 -861 -540 431 984 84 -673 -514 305 995 358 -176 -769 -238 1128
7095 1128 941 -250 -685 -526 623 1154 614 -791 -983 41 975 665 35 -710 -676 726 1195 597
7113 597 -641 -684 364 1165 1009 -153 -977 -202 1187 1176 132 -607 -601 631 1496 490 -748 -982 166
7132 166 1293 944 -189 -1085 -690 632 1499 -13 -1040 -671 110 799 958 -331 -996 -466 878 1092
7150 1092 293 -1052 -828 172 1240 595 -899 -1283 -474 665 806 -2 -1411 -1160 554 1095 91
7167 91 -807 -1392 -515 831 945 -774 -1370 -816 686 787 466 -915 -1313 -65 988 874 -716 -1563
7185 -1563 -850 576 987 -117 -1415 -1374 251 1070 652 -709 -1340 -320 794 1343 -326 -1707 -822
$$ packed form
7055h78M02M61O32p69o60K7J034L23n28n42n82O21Q93N7r89p35O13R06M05m55
7075B36j042P7Q84Q85n95o81o25L21R71N53r00p57J59Q19O90o37n34n93N31J366
7095A128j87j191m35J59J149N31n40j405j92J024R34l10o30p45L4J402M69n98
7113E97j238m3J048Q01j56j162q24P75J389j1j044p39OJ232Q65j006j238k34J148
7132A66J127l49j133q96L95J322Q67j512j027L69P81O89J59j289o65N30J344K14
7150A092p99j345K24J000J068o45j494l84Q09J139J41q08j409K51J714N41j004
7167I1q98n85Q77J346J14j719n96N54J502J01l21j381l98J248J053j14j590q47
7185a563P13J426M11j104j298M1J625Q19m18j361o31J020J114N49j669j381Q85
$$ plain form
7202 -822 432 1254 662 -936 -1162 20 997 927 -769 -1179 -519 609 991 305 -976 -776 420 1001
7220 1001 759 -459 -1124 -166 1286 1145 -42 -927 -335 250 1306 492 -725 -739 139 1482 1009 -163
7238 -163 -925 -582 636 1476 489 -846 -647 156 929 900 -417 -1040 -259 897 1190 415 -224 -945 266
7257 266 1136 687 -463 -641 -20 655 531 161 -651 -577 574 1111 242 -684 -577 -68 976 510 -189
7276 -189 -1014 -338 596 614 34 -491 -856 148 450 560 -451 -489 -391 260 646 135 -963 -571 144 405
7296 405 219 -365 -544 -215 289 467 -489 -661 -324 151 139 -108 -843 -656 -163 609 -179 -559 -714 20
7316 20 132 489 -206 -941 -594 363 195 -194 -140 -414 -219 425 118 -749 -383 71 371 93 110 -503 -238
7337 -238 237 326 -57 -615 -81 -228 257 264 -243 -315 234 503 158 -173 -169 156 682 866 253 -468 -5 444
$$ packed form
7202h22J254Q22n92j598k26J182R77p0j696m10O60J128L82o86j281K00J196N81
7220A001k42j218o65R58J452j41j187q85N92N85J056q14j217j4Q78J343m73j172
7238a63p62L43J218Q40r87j335J99Q03P73k9j317o23P81J156K93p75o39p21J211
7257B66Q70m49j150j78O21O75j24l70q12P4J151N37q69r26J07N09J044m66o99
7276a89q25O76R34J8n80n25l65J004L02J10j011l8R8O51L86n11j098L92P15K61
7296D05j86n84j79L29N04J78r56j72L37M75j2k47p35J87M93P72p88l80j55P34
7316B0J12L57o95p35L47R57j68l89N4k74J95O44l07q67L66M54L00k78J7o13K65
7337b38M75Q9l83n58N34j47M85Pn07p2N49K69l45l31ML25N26J84o13p21M63M49
$$ plain form
7359 444 646 359 -311 -338 158 606 616 -176 -80 -8 554 844 131 -289 -304 502 657 222 -137 -485 10 620
7381 620 630 -234 -536 -229 508 967 457 -349 -614 -45 912 280 -461 -329 -131 854 1030 -78 -934 -388
7401 -388 499 811 -9 -530 -752 -130 677 524 -707 -1029 -536 313 839 200 -876 -896 308 624 196
7420 196 -562 -944 -506 556 772 -175 -1294 -752 395 613 -200 -799 -1321 -308 882 348 -874 -1100
7438 -1100 -560 330 689 -17 -1162 -995 24 855 432 -619 -1093 -884 573 903 -253 -1283 -810 172
7456 172 1046 441 -718 -1045 -282 1201 1022 -250 -1069 -804 630 1073 213 -1165 -1165 -8 1009 526
7474 526 -163 -1350 -708 1198 1493 151 -1123 -784 131 1203 912 -518 -1491 8 1035 1150 108
7491 108 -888 -701 705 1571 337 -570 -1018 279 1229 1115 -172 -1290 -201 1225 1391 387 -860
$$ packed form
7359D44K02k87o70k7M96M48J0p92R6P2N62K90p13m20j5Q06J55m35l59l48M95O10
7381F20J0q64l02L07P37M59n10q06k65N69R57o32p41J32J98R85J76j108q56N46
7401c88Q87L12q20n21k22O22Q07j53j231l22M93Q49N26o39j076k0J204L16m28
7420A96p58l82M38J062K16r47j119N42J147K18q13n99n22J013J190n34j222k26
7438a100N40Q90L59p06j145J67J019Q31m23j051m74K09J457L30j156j030M73R82
7456A72Q74o05j159l27P63J483j79j272q19K65J434M43q60j378%J157J017m83
7474E26o89j187O42J906K95j342j274L39R15J072k91j430r73J499J027J15j042
7491A08r96J87J406Q66j234r07m48J297R50j14j287j118J089J426J66j004j247
$$ plain form
7508 -860 -1086 142 1377 1198 -586 -1209 -133 606 1200 141 -851 -1064 575 1488 395 -504 -1123 -77
7526 -77 799 1336 -367 -1154 -802 716 1178 448 -815 -1284 -471 1260 679 -529 -1331 -749 422 1334
7544 1334 459 -956 -1115 -42 790 577 -691 -1147 -817 711 832 -108 -969 -834 223 814 308 -665
7562 -665 -1389 -722 882 822 -242 -1217 -820 229 943 357 -1162 -1141 -6 631 774 -187 -1263 -697 506
7581 506 690 -198 -823 -822 250 714 570 -547 -1242 -323 772 840 -260 -573 -309 125 928 498 -700
7600 -700 -778 252 849 668 72 -828 -564 660 1161 199 -551 -393 20 978 1172 -223 -706 0 812
7619 812 776 313 -474 -486 370 1358 428 -276 -459 149 469 768 271 -413 -257 463 763 302 -341 -173 -137
7640 -137 830 971 -186 -571 142 733 779 179 -486 -525 44 805 83 -486 -131 -30 216 563 -143 -379
$$ packed form
7508h60k26J228J235j79j784o23J076P39N94j059r92k13J639R13j093q99o19J046
7526g7Q76N37j703p87L52J518M62p30j263m69Q13J731n81j208q02N82J171R12
7544A334q75j415j59J073Q32k13j268m56L30J528J21r40q61J35J057N91n06r73
7562f65p24O67J604o0j064r75L97J049P14n86j519K1J135O37J43r61j076N66J203
7581E06J84q88o25JJ072M64j44j117o95R19J095O8j100l13K64M34Q03m30j198
7600g00p8J030N97j81n96r00K64J224N01r62p50J58M13R58J94j395m83P06Q12
7619H12l6m63p87j2Q56R88r30p04j83O08L20K99m97o84J56P20L00m61o43J68L6
7640a37R67J41j157l85P13N91M6o00o65l9N69P61p22n69L55J01K46L47p06k36
$$ plain form
7660 -379 30 408 284 188 -350 -372 259 479 247 -624 -436 -22 210 266 -180 -634 -91 -28 163 -402 -519
7681 -519 -104 -145 -144 -232 -473 -409 -1 27 37 -495 -379 -347 188 300 -229 -841 -83 116 3 -308 -539 -600 -95
7704 -95 97 -220 -512 -552 -356 100 173 73 -725 -403 323 609 -100 -581 -55 -275 352 302 -374 -370 19 505
7726 505 344 96 -576 -576 471 804 109 -491 -559 213 651 835 -42 -353 -294 627 621 108 -370 -576 348 1238
7748 1238 642 -474 -442 335 576 633 558 -669 -515 628 1489 436 -315 -384 -65 810 975 200 -961
7767 -961 -317 855 1055 290 -537 -596 358 904 774 -288 -1050 60 869 764 81 -912 -744 634 862
7786 862 284 -832 -973 56 926 1109 -128 -1253 -279 463 958 204 -686 -1436 -194 861 815 -525
7804 -525 -1469 -512 378 959 -178 -1152 -1116 412 738 166 -788 -1253 -545 626 708 -320 -1132 -652 61
$$ packed form
7660c79M09L78j24r6n38k2O31K20k32q71J88M14K32N6m46m54N43O3J91n65j17
7681e19M15m1Jq8k41O4M08K8J0n32J16L2N35J12n29o12P58J99j13l11k31o1N05
7704i5J92l17k92m0J96M56P3j00p98L22P26K86p09m81N26k20O27n0o76ML89M86
7726E05j61k48o72%J047L33o95o00o8P72M38J84q77l11N9R21on13m78k06R24Q90
7748A238n96j116L2P77K41N7p5j227J54J143Q61j053p51o9L19Q75J65p75j161
7767i61O44J172K00p65q27n9R54N46j30j062p62J110Q09j05o83r93J68J378K28
7786H62n78j116j41J029Q70J83j237j125R74P42M95p54q90p50J242J055m6j340
7804e25r44R57Q90N81j137r74L6J528L26n72r54m65P08J171Q2j028q12M80P13
$$ plain form
7823 61 1074 412 -1083 -1339 -8 746 284 -625 -1227 -798 389 1173 -5 -1171 -1230 169 787 863 -750
7842 -750 -1324 -703 553 982 33 -906 -958 274 1266 895 -916 -1156 -352 1039 816 44 -729 -852 500
7861 500 1531 420 -646 -811 110 1095 1047 -73 -1318 -220 842 1627 424 -817 -806 222 1583
7878 1583 1090 -569 -930 -169 846 1037 365 -1022 -408 764 1285 954 -299 -960 7 1176 1252 96
7896 96 -819 -506 609 1031 311 -676 -874 232 1522 1345 -84 -877 -482 392 754 254 -649 -739 56
7915 56 1059 535 -579 -1049 -414 353 1226 -76 -820 -914 389 450 183 -727 -662 -225 695 364 -89 -913
7935 -913 -710 314 912 219 -979 -1123 -160 458 108 -492 -890 -652 425 489 -362 -754 -666 103 169 11
7955 11 -598 -885 -294 382 389 -66 -643 -621 -245 481 -94 -785 -505 42 464 560 -301 -668 -640 107 471 -148
$$ packed form
7823F1J013o62j495k56J331P54m62r09o02M29J187P84j178j166n9J399O18P6j613
7842g50n74O21J256M29r49r39n2J232R92l71j811k40Q04J391k23p72p73j23J352
7861E00J031j111j066j65R21R85m8j120j245J098J062P85j203j241J1J028J361
7878A583m93j659l61P61J015J91o72j387O14J172N21l31j253o61R67J169P6j156
7896I6r15L13J115M22p20r87j98J106J290j77j429p93L95Q74L62n00r03r0P95
7915E6J003n24j114m70O35P67Q73j302p44r4J303O1k67r10O5M37R20l31m53q24
7935i13K03J024N98o93j198j44R63O18l50o00l98K38J077O4q51l92Q8P69O6j58
7955A1o09k87N91O76Pm55n77K2L76P26n75o91K80N47M22R6q61l67K8P47L64o19
$$ plain form
7977 -148 -255 -601 214 599 433 -327 -457 -76 464 618 69 -82 -12 224 375 164 -248 -7 213 354
7997 354 380 228 -339 -132 242 578 56 -63 -112 298 539 333 -95 -211 293 302 299 78 -258 32 609 392
8019 392 -338 62 84 190 14 472 -268 -219 602 469 -213 -64 211 187 309 323 -343 -253 31 387 129 82
8041 82 -190 -490 332 552 6 -352 -410 32 267 180 -97 -466 -271 439 186 -287 -675 -604 253 360 129
8062 129 -344 -708 67 198 -13 -238 -620 -796 197 423 -413 -858 -727 -115 356 -38 -712 -731 -473 506
8082 506 -16 -454 -452 -558 -29 733 62 -676 -788 119 566 216 -292 -757 -554 455 642 -413 -1074 -479
8102 -479 28 645 734 -629 -958 -181 886 562 146 -726 -542 497 1085 147 -557 -731 -114 748 773 -301
8122 -301 -771 -165 802 1155 51 -670 -504 223 1016 1239 -426 -938 -44 987 938 550 -542 -905 394
$$ packed form
7977a48j07l46Q15L85j66p60j30L81N40J54n49j51P0K36J51k11m12K41K20J41
7997C54K6j52n67K07L74L36n22j19m9M10K41k06m28j16N04Rlk21l36K90N77k17
8019C92p30M00K2J06j76M58p40M9Q21j33o82J49K75k4J22J4o66R0K84L56k58m7
8041H2k72l00Q22K20n46l58n8M42K35q7k77l69J95P10k53m73l88P1Q57J07k31
8062A29m73l64P75J31k11k25l82j76R93K26q36m45J31O12M71l94o74j9K58R79
8082E06n22m38Kj06N29P62o71p38j12R07M47l50n08m65K03J009J87j055o61N95
8102d79N07O17Q9j363l29P77J067l24m16q72J84J039N88r38p04j74O17Q62K5j074
8122c01m70O06R67L53j104p21J66P27P93K23j665n12Q94J031m9l88j092l63J299
$$ plain form
8141 394 1507 643 -342 -1207 -69 760 1210 -116 -968 -320 575 1124 803 -618 -501 -149 1215 1384
8159 1384 -225 -847 -446 902 1096 391 -639 -1157 478 1394 727 -499 -945 -668 883 1264 52
8176 52 -743 -696 -43 833 650 -784 -1376 -336 947 1010 -375 -1135 -929 94 861
$$ packed form
8141C94J113q64r85q65J138Q29M50j326q52O48Q95N49l21j421J17L52J364J69
8159A384j609o22M01J348J94p05j030n18J635R16o67j226m46K77J551L81j212
8176E2p95M7O53Q76j83j434n92J040J283O3j385p60K06J023P67
8191H61
$$ Imaginary data points
##PAGE= N=2
##DATA TABLE= (X++(I..I)), XYDATA
$$ plain form
0 0 0 0 0 8 0 0 -8 8 -8 16 -16 16 -24 32 -40 44 -56 64 -73 88 -104 119 -138 160 -182 208 -239 269 -304
29 -304 344 -387 435 -487 542 -605 676 -749 833 -924 1022 -1131 1255 -1387 1537 -1705 1894
46 1894 -2102 2348 -2629 2957 -3350 3825 -4414 5171 -6180 7594 -9730 13323 -20495 40456
60 40456 -211457 -795076 -431038 203711 427557 33000 -382871 -364447 17648 219015
70 219015 39961 -227992 -207128 14024 137083 10564 -187316 -224806 -54407 103244
80 103244 97947 -4351 -68066 -74303 -21451 61982 87901 -4083 -122554 -138009 -14796 126995
92 126995 104731 -104657 -248249 -115079 144792 204401 -15984 -270204 -264437 1752 202127
103 202127 75375 -204167 -266041 -47753 159229 109790 -121040 -238143 -82218 146796
$$ packed form
0@%%%Qq%qJ6j6K4l2L2m0N6p2Q4j00J20j37J61j92K23k57K98l42L90m47N08n73
29c04O48p31Q22r22J029j147J281j425J582j757J946k153K386k642K924l242L599
46A894l996M450m977N586o307P175q239R585j1351J3774j7324K3053l3818O0951
60D0456k51913n83619L64038O34749K23846l94557m15871J8424L82095K01367
70B19015j79054k67953K0864K21152J23059j26519j97880l7490J70399J57651
80A03244n297j02298o3715o237N2852Q3433K5919r1984j18471j5455J23213J41791
92A26995k2264k09388j43592J33170K59871N9609k20385k54220N767K66189K00375
103B02127j26752k79542o1874K18288K06982m9439k30830j17103J55925K29014
$$ plain form
113 146796 147734 -65972 -209980 -120149 90781 195078 82810 -108888 -134354 34600 178653
124 178653 139961 -9230 -104099 -53533 91552 168307 90602 -39785 -72011 14408 125628
135 125628 144312 35031 -83843 -66063 53322 116074 58932 -46289 -91770 -19983 96208
146 96208 100035 -27092 -125198 -79366 44398 106361 30249 -111918 -148391 -23069 106914
157 106914 86969 -40692 -128154 -84902 45865 112418 24549 -102175 -98990 18454 99980
168 99980 63119 -41547 -88103 -7788 101660 97365 -5162 -65290 -22780 61071 96335 39160
180 39160 -48151 -50176 36673 90232 52239 -17108 -46492 -15749 45359 63567 11782 -44409
192 -44409 -49243 -19740 14363 25600 -9488 -58470 -57319 -16397 3479 -11083 -40005 -64374
$$ packed form
113A46796R38k13706j44008Q9831K10930J04297j12268j91698k5466J68954J44053
124A78653l8692j49191r4869N0566J45085P6755p7705j30387l2226Q6419J11220
135A25628J8684j09281j18874J7780J19385O2752n7142j05221m5481P1787J16191
146I6208L827j27127r8106M5832J23764O1963p6112j42167l6473J25322J29983
157A06914j9945j27661q7462M3252J30767O6553q7869j26724L185J17444Q1526
168I9980l6861j04666m6556Q0315J09448m295j02527o0128M2510Q3851L5264n7175
180C9160q7311k025Q6849N3559l7993o9347k9384L0743O1108J8208n1785n6191
192d4409m834K9503L4103J1237l5088m8982J151M0922J9876j4562k8922k4369
$$ plain form
204 -64374 -52430 -8979 1182 -40966 -70814 -50346 -10495 8345 -14554 -61484 -66658 -10571
216 -10571 29888 5358 -36051 -43921 -18469 21163 36424 5443 -23712 -6102 22873 23083 13176
229 13176 11212 12147 18291 18999 5695 7156 33643 37675 5202 -13271 3001 25536 33007 14150
243 14150 -24929 -33361 8829 38728 11051 -31482 -41515 -15594 19689 18975 -28127 -57605 -23956
256 -23956 20014 15843 -21991 -52704 -46679 2624 42748 15067 -44092 -54222 -10082 37110
268 37110 47643 9872 -38315 -29912 30339 66463 44373 -139 -23891 2581 65082 87943
280 87943 33966 -24824 -12676 48286 90307 68727 -2976 -42563 10690 89856 87451 7541
292 7541 -55215 -34318 52162 103928 41125 -70223 -87126 6524 87269 62585 -38559 -108641
$$ packed form
204f4374J1944M3451J0161m2148k9848K0468L9851J8840k2899m6930n174N6087
216a0571M0459k4530m1409p870K5452L9632J5261l0981k9155J7610K8975K10r907
229A3176j964R35O144P08j3304J461K6487M032l2473j8473J6272K2535P471j8857
243A4150l9079q432M2190K9899k7677m2533j0033K5921L5283p14m7102k9478L3649
256b3956M3970m171l7834l0713O025M9303M0124k7681n9159j0130M4140M7192
268C7110J0533l7771m8187Q403O0251L6124k2090m4512k3752K6472O2501K2861
280H7943n3977n8790J2148O0962M2021k1580p1703l9587N3253P9166k405p9910
292G541o2756K0897Q6480N1766o2803j11348j6903R3650Q0745k4684j01144p0082
$$ plain form
304 -108641 -63924 48248 81570 -8449 -104428 -95561 -2243 70740 38727 -69060 -118384 -43789
316 -43789 57032 62582 -20057 -94685 -80429 18818 89900 40067 -68117 -95216 -13121 82487
328 82487 90653 -3616 -96834 -69001 53257 117752 51827 -61479 -95923 -11273 103553 105857
340 105857 -18421 -113431 -62993 61948 112379 32803 -92276 -116093 -3821 104476 68069
351 68069 -63712 -132596 -66132 57177 93905 -12427 -137720 -121491 12918 97400 39482
362 39482 -89632 -146516 -60998 74953 94371 -26133 -131871 -99560 26981 107133 50879
373 50879 -80904 -123062 -15210 108482 101954 -13366 -101493 -62278 68126 139073 59689
384 59689 -71166 -87081 24114 127466 109184 -12065 -97185 -36397 100346 140563 38092
$$ packed form
304a08641M4717J12172L3322r0019r5979Q867R3318P2983l2013j07787m9324P4595
316d3789J00821N550q2639p4628J4256R9247P1082m9833j08184k7099Q2095R5608
328H2487Q166r4269r3218K7833J22258O4495o5925j13306l4444Q4650J14826K304
340A05857j24278r5010N0438J24941N0431p9576j25079k3817J12272J08297l6407
351F8069j31781o8884O6464J23309L6728j06332j25293J6229J34409Q4482n7918
362C9482j29114n6884Q5518J35951J9418j20504j05738L2311J26541Q0152n6254
373E0879j31783m2158J07852J23692o528j15320q8127L9215J30404P0947p9384
384E9689j30855j5915J11195J03352j8282j21249q5120O0788J36743M0217j02471
$$ plain form
395 38092 -80357 -84918 26462 130698 98570 -41213 -118011 -40117 87627 114129 13460
406 13460 -103740 -101998 23408 117080 58737 -75553 -124251 -38105 83852 102019 -13475
417 -13475 -125439 -90098 46534 113670 40071 -81170 -112386 -12600 106880 98198 -26780
428 -26780 -107792 -50193 71759 121314 43942 -73922 -88358 22213 118555 86153 -25072
439 -25072 -85389 -32704 76369 115247 29433 -76363 -72400 27019 99192 64744 -40789 -99879
451 -99879 -38982 68936 85343 -7496 -94398 -82967 9183 78723 37654 -72842 -115783 -38919
463 -38919 54741 54632 -32348 -108115 -84443 17159 72847 10700 -85291 -98608 -21668 57459
475 57459 52407 -34386 -98068 -53351 44018 72821 9249 -63408 -65859 7209 75794 53919
$$ packed form
395C8092j18449m561J11380J04236l2128j39783p6798P7894J27744K6502j00669
406A3460j17200J742J25406R3672n8343j34290m8698Q6146J21957J8167j15494
417a3475j11964L5341J36632O7136p3599j21241l1216R9786J19480q682j24978
428b6780q1012N7599J21952M9555p7372j17864j4436J10571R6342l2402j11225
439b5072o0317N2685J09073L8878q5814j05796L963R9419P2173l4448j05533n9090
451i9879O0897J07918J6407r2839q6902J1431R2150O9540m1069j10496m2941P6864
463c8919R3660j09q6980p5767K3672J01602N5688o2147r5991j3317P6940P9127
475E7459n052q6793o3682M4717R7369K8803o3572p2657k451P3068O8585k1875
$$ plain form
487 53919 -30902 -68795 -18973 52699 69545 15798 -50360 -47473 24557 72316 38095 -27639
499 -27639 -51229 -14127 43776 56019 -246 -56576 -42591 16848 49028 23651 -32339 -59209
511 -59209 -21201 36778 37396 -16538 -54480 -39505 8337 39227 15419 -39559 -51346 -3793
523 -3793 38605 29251 -12295 -38915 -20302 27526 45862 11308 -23619 -14124 21203 42757 34011
536 34011 2225 -14086 10381 43299 40646 15438 1827 6514 22827 37628 29478 8094 3844
549 3844 15439 22581 22468 16282 1832 -3878 9257 16455 7512 -1004 -4284 -7109 -2687 5281 -1164
564 -1164 -12482 -12436 -8367 -10044 -8719 -8597 -15137 -15976 -10051 -11087 -11923 -5200 -5833 -16794 -16130 -4501
580 -4501 1481 246 -5426 -16031 -13794 7618 18212 3180 -12909 -12120 1769 20263 20793 -5023
$$ packed form
487E3919q4821l7893M9822P1672J6846n3747o6158K887P2030M7759l4221o5734
499b7639k3590L7102N7903J2243n6265n6330J3985N9439L2180k5377n5990k6870
511e9209L8008N7979O18n3934l7942J4975M7842L0890k3808n4978j1787M7553
523c793M2398r354m1546k6620J8613M7828J8336l4554l4927R495L5327K1554q746
536C4011l1786j6311K4467L2918k653k5208j3611M687J6313J4801q150k1384m250
549C844J1595P142j13o186j4450n710J3135P198q943q516l280k825M422P968o445
564a164j1318M6M069j677J325J22o540q39N925j036q36O723o33j0961O64J1629
580d501N982j235n672j0605K237K1412J0594j5032j6089P89J3889J8494N30k5816
$$ plain form
594 -5023 -23097 -5424 22472 24660 4173 -18849 -23462 2533 29092 16283 -20500 -34139 -14018
607 -14018 13931 21177 -6256 -43194 -39420 2776 25293 1980 -36991 -52117 -25460 19344
619 19344 25203 -22003 -60866 -41698 7894 31135 4839 -44415 -57601 -9341 41921 31288
631 31288 -22494 -52071 -26993 28617 54988 16092 -41507 -40533 17614 60110 43442 -9312
643 -9312 -41512 -10566 52890 68900 16171 -37085 -29991 26433 71700 52796 -17046 -52913
655 -52913 -6593 61019 66542 7958 -50206 -43686 25157 75760 38603 -41987 -65266 -8369
667 -8369 58726 60066 -10416 -73945 -48174 36405 71289 16352 -56723 -66165 -1446 66706 54398
680 54398 -27995 -75438 -29003 50561 71784 14814 -57013 -59215 17656 81472 53008 -27834
$$ packed form
594e023j8074J7673K7896K188k0487k3022m613K5995K6559j2809l6783j3639K0121
607a4018K7949P246k7433l6938L774M2196K2517k3313l8971j5126K6657M4804
619A9344N859m7206l8863J9168M9592K3241k6296m9254j3186M8260N1262j0633
631C1288n3782k9577K5078N5610K6371l8896n7599R74N8147M2496j6668n2754
643i312l2200L0946O3456J6010n2729n3256P094N6424M5267j8904o9842l5867
655e2913M6320O7612N523n8584n8164O520O8843N0603l7157q0590k3279N6897
667h369O7095J340p0482o3529K5771Q4579L4884n4937p3075r442O4719O8152j2308
680E4398q2393m7443M6435P9564K1223n6970p1827k202P6871O3816k8464q0842
$$ plain form
692 -27834 -63271 -17815 58760 81667 17468 -59416 -51397 30206 83777 48965 -32710 -71094
704 -71094 -18677 66222 76093 -5214 -75930 -54611 28426 77745 32718 -61226 -90525 -15077
716 -15077 66757 53845 -33830 -94366 -60893 29907 71667 7288 -83917 -88530 -7140 61425
728 61425 41866 -42836 -95957 -49219 42721 65139 -3829 -75898 -69557 6036 69386 43972
740 43972 -42258 -81584 -23189 57629 68878 2370 -66495 -56652 27030 83395 41384 -44178
752 -44178 -69974 -10158 65873 73342 -3311 -73939 -49327 38054 78828 29142 -50590 -71088
764 -71088 -7772 67523 58532 -24543 -77146 -39703 37961 66662 13503 -63427 -70785 4754
776 4754 68327 43021 -34413 -72769 -31421 45167 68534 6080 -63641 -53645 20950 70958
$$ packed form
692b7834l5437M5456P6575K2907o4199p6884Q019Q1603N3571l4812q1675l8384
704g1094N2417Q4899R871q1307p0716K1319Q3037M9319m5027r3944k9299P5448
716a5077Q1834j2912q7675o0536L3473R0800M1760o4379r1205m613Q1390O8565
728F1425j9559q4702n3121M6738R1940K2418o8968p2069O341P5593O3350k5414
740D3972q6230l9326N8395Q0818J1249o6508o8865R843Q3682N6365m2011q5562
752d4178k5796N9816P6031P469p6653p0628K4612Q7381M0774m9686p9732k0498
764g1088O3316P5295q991q3075n2603L7443P7664K8701n3159p6930p358P5539
776D754O3573k5306p7434l8356M1348P6588K3367o2454o9721R996P4595N0008
$$ plain form
788 70958 43818 -28318 -62696 -13332 62675 70680 5807 -48640 -32801 32051 74730 44243
800 44243 -26111 -47149 6600 64768 59375 2167 -43561 -25437 38872 69692 25956 -35706
812 -35706 -42387 5937 53074 46596 -10995 -54320 -27965 32926 50196 7713 -42893 -48781 -2927
825 -2927 43784 30290 -27460 -56187 -24236 24168 35622 -1211 -46729 -43934 6353 38821
837 38821 14050 -31453 -44252 -12919 29465 34329 -7394 -43168 -26435 18018 36713 14275
849 14275 -23102 -36094 -5092 32986 29065 -8814 -30721 -16939 13467 29367 11160 -23197
861 -23197 -29673 -1331 21704 13874 -11517 -28283 -19714 7029 17204 -5023 -28257 -24141 -4281
874 -4281 8395 3433 -18343 -31664 -16557 6787 6909 -11213 -23318 -21336 -6311 8269 2842
$$ packed form
788G0958k7140p2136l4378M9364P6007Q005o4873n4447J5839O4852M2679l0487
800D4243p0354k1038N3749N8168n393n7208m5728J8124O4309L0820m3736o1662
812c5706o681M8324M7137o478n7591m3325K6355O0891J7270m2483n0606n888M5854
825b927M6711j3494n7750k8727L1951M8404J1454l6833m5518K795N0287L2468
837C8821k4771m5503j2799L1333M2384M864m1723l5774J6733M4453J8695k2438
849A4275l7377j2992L1002L8078l921l7879k1907J3782L0406J5900j8207l4357
861b3197o476K8342K3035p830k5391j6766Q569K6743J0175k2227k3234M116J9860
874d281J2676m962k1776j3321J5107K3344J22j8122j2105J982J5025J4580n427
$$ plain form
887 2842 -14829 -18627 -6134 3374 5238 1095 -7091 -7202 4171 10236 3919 1272 4199 5142 7229
902 7229 10494 7309 4766 9591 11433 7510 8738 12574 9804 7039 8623 7979 8377 12769 9529 -458
918 -458 -105 9344 12679 8357 544 -7079 -3793 11604 15488 788 -11681 -10289 1681 13989
932 13989 12468 -6970 -19981 -6403 14354 16322 2108 -13430 -14777 4489 23834 14915 -9697
945 -9697 -16229 809 20865 24460 4990 -18233 -12053 18712 32422 13705 -12395 -19280 1991
958 1991 31242 32254 -2874 -28994 -14315 19667 33518 12816 -23455 -34473 -2306 31620
970 31620 22694 -16060 -37577 -22299 13283 29442 658 -41005 -40328 -269 27164 12317 -27695
983 -27695 -50267 -24874 21614 29939 -11673 -49439 -39744 3717 34384 16841 -33597 -53710
$$ packed form
887B842j7671l798J2493R508J864m143q186j11J1373O065o317k647K927R43K087
902G229L265l185k543M825J842l923J228L836k770k765J584o44L98M392l240r987
918d58L53R449L335m322p813p623L286J5397L884j4700j2469J392J1970J2308
932A3989j521j9438j3011J3578K0757J968j4214j5538j347J9266J9345q919k4612
945i697o532J7038K0056L595j9470k3223O180L0765J3710j8717k6100o885K1271
958A991K9251J012l5128k6120J4679L3982J3851k0702l6271j1018L2167L3926
970C1620q926l8754k1517J5278L5582J6159k8784m1663O77M0059K7433j4847m0012
983b7695k2572K5393M6488Q325m1612l7766R695M3461L0667j7543n0438k0113
$$ plain form
995 -53710 -14873 33648 33575 -10039 -46419 -35676 15516 47967 19039 -35150 -45434 -2615 41569
1008 41569 39603 -8559 -47794 -26913 30976 51125 11309 -37899 -41270 4882 49935 37553
1020 37553 -22538 -54632 -19441 36604 49244 5713 -46457 -47857 8675 53879 29906 -29936
1032 -29936 -53937 -18801 36103 48909 760 -52480 -41640 18659 53834 25347 -30595 -51504
1044 -51504 -8844 49929 51307 -7089 -50177 -27112 32392 62548 27611 -34796 -47917 8664
1056 8664 64188 51166 -9789 -48065 -20942 42757 68648 21838 -40861 -41247 16128 60905
1068 60905 44528 -15875 -52162 -17579 45985 57642 4283 -46520 -40109 14487 55633 31925
1080 31925 -33052 -57975 -13122 43279 45259 -7023 -55898 -44361 18199 55502 19111 -43782
$$ packed form
995e3710L8837M8521p3m3614l6380J0743N1192L2451k8928n4189j0284M2819M4184
1008D1569j966m8162l9235K0881N7889K0149l9816m9208l371M6152M5053j2382
1020C7553o0091l2094L5191N6045J2640m3531n2170j400N6532M5204k3973n9842
1032b9936k4001L5136N4904J2806m8149n3240J0840O0299L5175k8487n5942k0909
1044e1504M2660N8773J378n8396m3088K3065N9504L0156l4937o2407j3121N6581
1056H664N5524j3022o0955l8276K7123O3699K5891m6810o2699l86N7375M4777
1068F0905j6377o0403l6287L4583O3564J1657n3359n0803O411N4596M1146k3708
1080C1925o4977k4923M4853N6401J980n2282m8875J1537O2560L7303l6391o2893
$$ plain form
1092 -43782 -57454 -10555 43017 43085 -13656 -60247 -36620 26399 50694 11651 -41765 -49879 -1489
1105 -1489 47951 36636 -22590 -53050 -20791 32266 46146 6082 -44976 -44402 10363 49428
$$ packed form
1092d3782j3672M6899N3572O8n6741m6591K3627O3019K4295l9043n3416q114M8390
1105a489M9440j1315n9226l0460L2259N3057J3880m0064n1058N74N4765L9065
$$ [...]
8191A42
##END NTUPLES=NMR FID
##END=
