##TITLE=1H_EC-3195(62)
 CDCl3, 8 sc, 
 28.5.2019
##JCAMPDX= 6.0         $$ Bruker NMR JCAMP-DX V2.0
##DATA TYPE= NMR FID
##DATA CLASS= NTUPLES
##ORIGIN= UXNMR, Bruker Analytische Messtechnik GmbH
##OWNER= root
$$ XWIN-NMR		Version 3.5
$$ Tue May 28 13:49:18 2019 Russian Standard Time (UT+4h)  she@DPX200
##.OBSERVE FREQUENCY= 200.1315
##.OBSERVE NUCLEUS= ^1H
##.DELAY= (6, 6)
##.ACQUISITION MODE= SIMULTANEOUS
##.ACQUISITION SCHEME= undefined
##.AVERAGES= 8
##.DIGITISER RES= 18
##SPECTROMETER/DATA SYSTEM= spect
##.PULSE SEQUENCE= zg30
##.SOLVENT NAME= CDCl3
##.SHIFT REFERENCE= (INTERNAL, CDCl3, 0, 15.7039)
##AUDIT TRAIL= $$ (NUMBER, WHEN, WHO, WHERE, WHAT)
$$ ##TITLE= Audit trail, XWIN-NMR		Version 3.5
$$ ##JCAMPDX= 5.01
$$ ##ORIGIN= Bruker BioSpin GmbH
$$ ##OWNER= she
$$ F:/spectra/data/she/nmr/H-F/1/audita.txt
$$ ##AUDIT TRAIL=  $$ (NUMBER, WHEN, WHO, WHERE, WHAT)
(   1,<2019-05-28 13:48:00.53 +0400>,<she>,<DPX200>,
      <created by zg, POWCHK disabled, PULCHK disabled
       configuration hash MD5:
       00 E9 B6 7A A2 85 ED C7 34 08 36 98 17 FE 4E 26
       data hash MD5: 16K
       43 D5 1F A1 77 F3 C4 8B 1C 29 43 22 2D DD 28 42>)
$$ ##END=
$$ 
$$ hash MD5
$$ 25 BD B1 D0 1D 92 6A 5E 88 72 B5 9A 8B 61 A7 85
##$RELAX= 
##$RELAX= 
##$RELAX= 
##$RELAX= 
##$RELAX= 
##$RELAX= 
$$ Bruker specific parameters
$$ --------------------------
##$DU= <F:/spectra>
##$EXPNO= 1
##$NAME= <H-F>
##$PROCNO= 1
##$TYPE= <nmr>
##$USER= <she>
##$AMP= (0..31)
100 100 100 100 100 100 100 100 100 100 100 100 100 100 100 100 100 100 
100 100 100 100 100 100 100 100 100 100 100 100 100 100 
##$AQSEQ= 0
##$AQ_mod= 1
##$AUNM= <au_zg>
##$AUTOPOS= <>
##$BF1= 200.13
##$BF2= 200.13
##$BF3= 200.13
##$BF4= 200.13
##$BF5= 200.13
##$BF6= 200.13
##$BF7= 200.13
##$BF8= 200.13
##$BYTORDA= 1
##$CFDGTYP= 0
##$CFRGTYP= 5
##$CHEMSTR= <none>
##$CNST= (0..31)
1 1 145 1 1 1 1 1 1 1 1 1 1 1 1 1 1 1 1 1 1 1 1 1 1 1 1 1 1 1 1 1 
##$CPDPRG= <>
##$CPDPRG1= <>
##$CPDPRG2= <>
##$CPDPRG3= <>
##$CPDPRG4= <mlev>
##$CPDPRG5= <mlev>
##$CPDPRG6= <mlev>
##$CPDPRG7= <mlev>
##$CPDPRG8= <mlev>
##$CPDPRGB= <>
##$CPDPRGT= <>
##$D= (0..31)
0 1.2 0 0 0 0 0 0 0 0 0 0.03 0 0 0 0 0 0 0 0 0 0 0 0 0 0 0 0 0 0 0 0 
##$DATE= 1559036880
##$DBL= (0..7)
120 120 120 120 120 120 120 120 
##$DBP= (0..7)
150 150 150 150 150 150 150 150 
##$DBP07= 0
##$DBPNAM0= <>
##$DBPNAM1= <>
##$DBPNAM2= <>
##$DBPNAM3= <>
##$DBPNAM4= <>
##$DBPNAM5= <>
##$DBPNAM6= <>
##$DBPNAM7= <>
##$DBPOAL= (0..7)
0.5 0.5 0.5 0.5 0.5 0.5 0.5 0.5 
##$DBPOFFS= (0..7)
0 0 0 0 0 0 0 0 
##$DE= 6
##$DECBNUC= <off>
##$DECIM= 24
##$DECNUC= <off>
##$DECSTAT= 4
##$DIGMOD= 1
##$DIGTYP= 9
##$DL= (0..7)
0 120 120 120 120 120 120 120 
##$DP= (0..7)
150 150 150 150 150 150 150 150 
##$DP07= 0
##$DPNAME0= <>
##$DPNAME1= <>
##$DPNAME2= <>
##$DPNAME3= <>
##$DPNAME4= <>
##$DPNAME5= <>
##$DPNAME6= <>
##$DPNAME7= <>
##$DPOAL= (0..7)
0.5 0.5 0.5 0.5 0.5 0.5 0.5 0.5 
##$DPOFFS= (0..7)
0 0 0 0 0 0 0 0 
##$DQDMODE= 0
##$DR= 18
##$DS= 0
##$DSLIST= <SSSSSSSSSSSSSSS>
##$DSPFIRM= 0
$$ [...]
##$SUBNAM2= <"">
##$SUBNAM3= <"">
##$SUBNAM4= <"">
##$SUBNAM5= <"">
##$SUBNAM6= <"">
##$SUBNAM7= <"">
##$SUBNAM8= <"">
##$SUBNAM9= <"">
##$SW= 24.9337058887773
##$SWIBOX= (0..15)
0 0 2 0 0 0 0 0 0 0 0 0 0 0 0 0 
##$SW_h= 4990.01996007984
##$TD= 16384
##$TD0= 1
##$TE= 0
##$TE2= 300
##$TE3= 300
##$TEG= 300
##$TL= (0..7)
0 120 120 120 120 120 120 120 
##$TP= (0..7)
150 150 150 150 150 150 150 150 
##$TP07= 0
##$TPNAME0= <>
##$TPNAME1= <>
##$TPNAME2= <>
##$TPNAME3= <>
##$TPNAME4= <>
##$TPNAME5= <>
##$TPNAME6= <>
##$TPNAME7= <>
##$TPOAL= (0..7)
0.5 0.5 0.5 0.5 0.5 0.5 0.5 0.5 
##$TPOFFS= (0..7)
0 0 0 0 0 0 0 0 
##$TUNHIN= 0
##$TUNHOUT= 0
##$TUNXOUT= 0
##$USERA1= <user>
##$USERA2= <user>
##$USERA3= <user>
##$USERA4= <user>
##$USERA5= <user>
##$V9= 5
##$VALIST= <valist>
##$VCLIST= <CCCCCCCCCCCCCCC>
##$VD= 0
##$VDLIST= <DDDDDDDDDDDDDDD>
##$VPLIST= <PPPPPPPPPPPPPPP>
##$VTLIST= <TTTTTTTTTTTTTTT>
##$WBST= 1024
##$WBSW= 4
##$XGAIN= (0..3)
0 0 0 0 
##$XL= 0
##$YL= 0
##$YMAX_a= 378868
##$YMIN_a= -560516
##$ZGOPTNS= <>
##$ZL1= 120
##$ZL2= 120
##$ZL3= 120
##$ZL4= 120
##$ABSF1= 10
##$ABSF2= 0
##$ABSG= 5
##$ABSL= 3
##$ALPHA= 0
##$AQORDER= 0
##$ASSFAC= 0
##$ASSFACI= 0
##$ASSFACX= 0
##$ASSWID= 0
##$AUNMP= <proc_1d>
##$AZFE= 0.1
##$AZFW= 0.1
##$BCFW= 1
##$BC_mod= 2
##$BYTORDP= 1
##$COROFFS= 0
##$CY= 11.3945322036743
##$DATMOD= 1
##$DC= 2
##$DFILT= <>
##$DTYPP= 0
##$F1P= 18.9103706918063
##$F2P= -1.10871071338519
##$FCOR= 0.5
##$FTSIZE= 0
##$FT_mod= 4
##$GAMMA= 1
##$GB= 0.15
##$INTBC= 1
##$INTSCL= 1
##$ISEN= 128
##$LB= 0.24
##$LEV0= 0
##$LPBIN= 0
##$MAXI= 10000
##$MC2= 0
##$MEAN= 0
##$ME_mod= 0
##$MI= 1.114404
##$NCOEF= 0
##$NC_proc= 0
##$NLEV= 6
##$NOISF1= 3.799351
##$NOISF2= 2.8
##$NSP= 1
##$NTH_PI= 0
##$NZP= 0
##$OFFSET= 15.70392
##$PC= 1
##$PHC0= -8851.677
##$PHC1= 6.800261
##$PH_mod= 1
##$PKNL= yes
##$PPARMOD= 0
##$PSCAL= 0
##$PSIGN= 0
##$REVERSE= no
##$SF= 200.130013532006
##$SI= 16384
##$SIGF1= 3
##$SIGF2= 2
##$SINO= 400
##$SIOLD= 16384
##$SREGLST= <1H.CDCl3>
##$SSB= 0
##$STSI= 0
##$STSR= 0
##$SW_p= 3612.71676300578
##$SYMM= 0
##$S_DEV= 0
##$TDeff= 0
##$TDoff= 0
##$TI= <>
##$TILT= no
##$TM1= 0
##$TM2= 0
##$TOPLEV= 0
##$USERP1= <user>
##$USERP2= <user>
##$USERP3= <user>
##$USERP4= <user>
##$USERP5= <user>
##$WDW= 1
##$XDIM= 8192
##$YMAX_p= 0
##$YMIN_p= 0
$$ End of Bruker specific parameters
$$ ---------------------------------
##NTUPLES= NMR FID
##VAR_NAME=  TIME,          FID/REAL,        FID/IMAG
##SYMBOL=    X,             R,               I
##VAR_TYPE=  INDEPENDENT,   DEPENDENT,       DEPENDENT
##VAR_FORM=  AFFN,          ASDF,            ASDF
##VAR_DIM=   8192,          8192,            8192
##UNITS=     SECONDS,       ARBITRARY UNITS, ARBITRARY UNITS
##FACTOR=    0.0002004,     1,               1
##FIRST=     0,             0,               0
##LAST=      1.6414764,     0,               0
##MIN=       0,             -560516,         0
##MAX=       1.6414764,     378868,          0
$$ Real data points
##PAGE= N=1
##DATA TABLE= (X++(R..R)), XYDATA
$$ [...]
3669I855o498r429J417R388M458q823q216N190J0544p39j0779l729Q152P654l988
3684D457r665j302R768N521p775q444L367J0240J97q747m410N458P867k270r581
3699e319j644R436N225o710p906K829Q355J441p417n865N000Q674k081r625j355
3714f962Q460M721n829p840J877R023L013q646o568N489R589j936j0150j823P424
3729a58O549m402r258L42R729M415q828p830N529R702m67r503m754P088R206k779
3745D581j1543j052J0388N373p554q443K976R840K716q971p896O758J0809k073
3759E909j1389k705R228P492n019r767k13J0194M986q214q664M920J0377m72r702
3774c039m254P101Q229k622j0454j572R561O121p062q708K951R329J946p970o056
$$ plain form
3669 9855 3357 -6072 -4655 4733 9191 368 -7848 -2658 7886 7147 -3632 -7361 791 8445 4457
3684 4457 -5208 -6510 3258 8779 1004 -7440 -4073 6167 6364 -2383 -6793 -1335 6532 4262 -5319
3699 -5319 -6963 2473 7698 988 -6918 -4089 4266 5707 -1710 -7575 -2575 6099 4018 -5607 -6962
3714 -6962 1498 6219 390 -7450 -5573 3450 6463 -2183 -8751 -3262 6327 4391 -5759 -7582 -158
3729 -158 6391 1989 -7269 -6927 2802 7217 -1611 -9441 -3912 5790 5323 -4180 -8934 -1846 7360 4581
3745 4581 -6962 -8014 2374 7747 193 -8250 -5274 4566 7282 -1689 -9585 -2827 7982 5909
3759 5909 -5480 -8185 1043 8535 3516 -6251 -6464 3730 8716 502 -8162 -3242 7135 6663 -3039
3774 -3039 -7293 -192 8037 5415 -5039 -6611 2950 9071 2009 -6699 -3748 5581 7527 -443 -6499
3789f499M845R580j742r908k207Q531N957n925p793N30Q996M249p770p696M645
3804b207R543j167q845l017P038N781l751q083m87Q573M483p580p187M220Q648
3819E962n49p642m086N537P285k926q625j038Q963L986p175o208L351P854R65
3834E654q026n585O613Q322l338r804p76Q540M852n683p791J913Q540L004r009
3849b574o565O880Q846k721r391k609Q287P035m805r953LJ0620M258q558p571
3864h818M629R458J27q945n323P160R220l673j0968j032J0034O290p347q735K062
3879e861R996L329q831p549O203R872j831r955k869Q276O642m559q802o39J0277
3894C699M824q156p953M221R432O93q427m813N432Q279k119r636j328Q939N054
$$ plain form
3789 -6499 -1654 7926 6184 -3724 -5931 2600 8557 2632 -5161 -4631 4365 8614 844 -6852 -2207
3804 -2207 7336 6169 -2676 -5693 1345 7126 3375 -4708 -5195 3378 7861 281 -6906 -2686 5962
3819 5962 5413 -2229 -6315 -778 6507 3581 -5044 -6082 2881 6867 -308 -6516 -3165 4689 5654
3834 5654 -2372 -7957 -1344 6978 3640 -6164 -6940 1600 6452 769 -7022 -5109 3431 6435 -2574
3849 -2574 -9139 -2259 6587 3866 -5525 -8134 153 7188 2383 -7570 -7567 3053 7311 -1247 -8818
3864 -8818 -4189 5269 5396 -3549 -8872 -1712 7508 3835 -7133 -8165 1869 8159 812 -7923 -5861
3879 -5861 4135 7464 -1367 -8916 -2713 7159 5328 -4627 -7496 780 7422 2863 -5939 -6578 3699
3894 3699 8523 367 -7586 -3365 6067 6760 -1667 -6480 -1048 7231 5112 -4524 -5852 3087 8141
3909H141o724p460L153Q355J495p404n905N109Q679j895r165j294P273N078n238
3924B198o661P37P940L151p461o470N350Q433j699q849k109O474O016l742p858
3939d550j10Q188L624p233o211M669P415q34p695l302O137O909l221r371o63R286
3955C038M278p094o757K696Q067J723p900n645N895Q575l150r719q72Q578N107
3970F820n396q775J329R583L584q964o926N547Q783j283r035k995O608P568l730
3985B718r539n86J0042M560p956p563L610R225J270q534n952N946R200k219r953
4000e731j553Q285N525n617p570J353Q605L782q050p267M985R215p52r078k971
4015f839P076N587k612q202n01Q126M200o816o357M009P466P4p126l948N347P150
$$ plain form
3909 8141 1417 -6043 -2890 5465 6960 -444 -6349 -1240 7439 5544 -3621 -4915 2358 7436 2198
3924 2198 -4463 -3726 4214 7365 -96 -6566 -1216 7217 5518 -3331 -5440 1034 7050 3308 -4550
3939 -4550 -4660 3528 7152 -81 -6292 -1623 5792 4958 -2737 -6039 98 7007 3786 -5585 -6248 3038
3955 3038 7316 222 -6535 -3839 4228 5951 -1949 -7594 -1699 6876 3726 -5993 -6865 1713 6820
3970 6820 1424 -7351 -6022 3561 7145 -1819 -8745 -3198 5585 4302 -4733 -7728 -1120 6448 2718
3985 2718 -6821 -7407 2635 7195 -761 -8324 -4714 4511 5781 -2753 -8705 -2759 6441 4222 -5731
4000 -5731 -7284 1001 6526 909 -6661 -5308 3297 7079 -971 -8238 -3253 5962 5210 -3868 -6839
4015 -6839 237 5824 3212 -4990 -5491 2635 6835 19 -6338 -2329 5137 5211 -1915 -5863 -516 6634
4031F634k621q150j181P902M588o266n769K141P296J390o823m637N019P402k506
4046D419q419p04P458M173n091o186J209P123L080p276n614N091P446k205p747
4061c243j542O669N018l989q179Q51Q644L406q119n817M872P009k86p481m012
4076f199O185P283l745q996J26Q980L070o496p086L423Q122J693q189o038O038
4091a829Q497k617r086j584P361N586m713q417J129R297L134q362p058N243Q627
4106E208m83q348l859O153P492k839r558p04R101L836o556o425K875P472J443
4121D808p067n710N527Q471k235q776j627P217N157m164p178K22P828L209o688
4136a006n847M400P480j357p394j888N974N247l088p469l13Q009L837o743n776
$$ plain form
4031 6634 4013 -4137 -5318 2584 7172 906 -4863 -2722 4574 5964 -859 -5496 -477 6925 4419
4046 4419 -4000 -4704 2754 6927 1836 -4350 -3141 3982 7062 -214 -5828 -737 6709 4504 -3243
4061 -3243 -4785 1884 6902 2913 -5266 -4415 4229 7635 -484 -6301 -1429 5580 5294 -2187 -6199
4076 -6199 -14 7269 3524 -5472 -5346 3634 6704 208 -6878 -3455 4667 6360 -1829 -7867 -1829
4091 -1829 6668 4051 -5035 -6619 742 6328 1615 -6802 -5673 3624 6758 -1604 -8662 -3419 5208
4106 5208 4725 -3623 -7482 -1329 6163 3324 -6234 -6938 2163 5999 -557 -6982 -4107 3365 4808
4121 4808 -2259 -7969 -2442 6029 3794 -4982 -6609 608 5765 1601 -5577 -5355 2473 5682 -1006
4136 -1006 -6853 -2453 5027 3670 -3724 -5612 362 5609 2521 -4948 -5261 2748 6585 -158 -5934
4151e934L788O632%o398l210M850O796l027q022j62Q046L197n931n742K676P086
4167D645J251p169m523N141P433k520q044n16O883M540m771p092J319Q063K736
4182G376q022n745N453P685j891p696k487O115O222l607q421N17Q641K932o973
4197I9o155M163P331N01p746m757O142P394k506r383r18P934M755n741o982J732
4213d137Q013K288p336o228N439Q096j880q353k488O901N423l221q284j81Q396
4228B448L945p029o090L555P412j05p124l827N473P217k868q602o85P501M207
4243E428n488n942J503O939K200n984n489M221P197j641p259j225O245L782l620
4258H67o354R25P129K678o328n359M623O137j083o424j748N279M827l026p048
$$ plain form
4151 -5934 -2146 4486 4486 -1912 -5122 -272 6524 3497 -4525 -4687 3359 6556 625 -5117 -2441 4645
4167 4645 5896 -1273 -5796 -655 6778 4258 -3786 -4302 2581 7121 2350 -4742 -3423 4640 7376
4182 7376 -646 -6391 -938 6747 4856 -2840 -5327 788 7010 3403 -5018 -4501 4140 7072 99
4197 99 -6056 -1893 5438 5939 -1807 -6564 -422 6972 4466 -4917 -5835 2099 6854 1113 -5869 -4137
4213 -4137 3876 6164 -1172 -7400 -1961 6135 4255 -4098 -6586 315 5738 2517 -5767 -5948 2448
4228 2448 6393 -636 -6726 -3171 4241 4136 -2988 -6815 -1342 5875 3007 -5595 -6280 1221 5428
4243 5428 -60 -6002 -4499 2440 4640 -1344 -6833 -2612 4585 2944 -4315 -5540 705 4487 867
4258 867 -5487 -4562 2567 5245 -1083 -6442 -1819 4318 3235 -3189 -4937 342 5169 2143 -4905
4273d905O60P382K578o333n012M049O559n82o562l584N826O152k829q143L94P491
4289C141K886n569n500K985O752J213p465m780O071P575l265p840o93O637M554
4304F702m414o779J279P410K674p705m771M870O937j545p392k529O059O407l563
4319C640q634M40Q612K985o414o237K923P461R49p030m903N580P004k638p864
4334d126r14P349M155m860o884J359P478K464o812n877M916P301j777p256j813
4349e297N517N133l117p160m32Q000L132o750n562L421O945J52o330l754M365
4364a737O621k177p695k67O827L132n059n371J910O957J173n994n168M907O551
4379D610k208o990n47N830L403l700n468Q48O573K304o525m376M870O021j627
$$ plain form
4273 -4905 -4245 3137 5715 -618 -5630 -1581 4978 4396 -2166 -5750 76 6228 3399 -4744 -4350 3141
4289 3141 6027 458 -5042 -2057 4695 5908 -1557 -6337 -266 7309 4044 -3796 -4489 2148 6702
4304 6702 2288 -4491 -3212 4198 6872 -833 -5604 -734 6203 4658 -2734 -5263 796 7203 3640
4319 3640 -4994 -4554 4058 7043 629 -5608 -2685 4776 5725 -1305 -6208 -628 6376 3738 -4126
4334 -4126 -5040 2309 6464 1604 -5280 -3921 3557 6021 -791 -6668 -1752 5549 3772 -3484 -5297
4349 -5297 220 5353 2236 -4924 -5356 2644 5776 -974 -6536 -3115 3830 3982 -2348 -6102 -1737
4364 -1737 4884 2707 -4988 -5255 1572 4704 -355 -5726 -3816 3141 4314 -1680 -6848 -1941 4610
4379 4610 2402 -4588 -5135 695 4098 398 -5070 -4222 2351 4655 -1870 -6246 -1376 4645 3018
4394C018o752j588N409N312l515p380N63P986K597o941m295L941O222k97p209
4409b929k603N849O028l634p643M38P622K983n125o125J996P507J672p074m905
4424e943N208P201k589p591j121O642M857l897p550O06P959L077o994n471M365
4439a241O723l72o461l594N373O119k873q091P9P767K893n264o073K352P067J416
4455E820o578n001N015O384j643p614o96N622M057l854n914N82P010J948o056
4470i18n058M459O359j521o004k619N093N118k576o776K32O336K615n532m531
4485e323L172N574O5n795l406M908N634k810p129J73O435K565m560m722J689O186
4501B656R81n990l465M544N802k545o445k04N755L609m117n999R81P465J662o663
$$ plain form
4394 3018 -3734 -5322 87 5399 1884 -5496 -4933 3053 5650 -1291 -5586 -1645 4577 4280 -2929
4409 -2929 -5532 317 6345 2711 -4932 -4494 3128 6111 986 -5139 -3143 4364 6036 -1038 -5943
4424 -5943 -735 6466 3877 -3714 -4835 1807 6664 2767 -4783 -4177 3782 6859 -135 -5606 -1241
4439 -1241 5482 5110 -1351 -4945 428 6547 3674 -4417 -4338 3429 6322 1058 -5015 -2663 4404 5820
4455 5820 -758 -5759 -744 5640 3997 -3617 -4313 1309 5366 1512 -4402 -3820 3190 5138 -918
4470 -918 -5976 -1517 4842 3321 -2683 -5302 -209 4909 2333 -4443 -4211 2125 4740 -792 -5323
4485 -5323 -2151 3423 3488 -2307 -5713 -805 4829 2019 -5110 -4937 1498 4063 -497 -5219 -3530 2656
4501 2656 3637 -2353 -5818 -1274 4528 1983 -4462 -4666 1089 4698 581 -5418 -4437 3028 4690 -1973
4517a973l883M635N465j550o187j564N390M934l394p320J285P631K027o351m604
4532e459L233O601Lo547l630N491O143k794p301K40O766K748m763n529J903P308
4548D413J549p154m895N157O523j792o310j973N480N118l286p113M45P762K489
4563F413o279n125L197O691l9o279l535M907O360k563p113p79O669L308m864m954
4579c985J781N718J632o205m145M903N961k238o513j131N744L642l315n882N45
4594c488O585J715n722l875M038N260j446n829j800M759M492l091o316O82O672
4609B636K113n490m350K933N543j09n796k981N165N114l547n921P01N785K748
4624D544n116m951K225O496J090o382m046M705O081k520o201j025N991L750l682
$$ plain form
4517 -1973 -5856 -1221 4244 2694 -3493 -5057 333 5267 1873 -5447 -4162 3469 5496 -855 -5459
4532 -5459 -2226 4375 4378 -2169 -5799 -308 5835 3041 -4260 -4020 2746 5494 731 -4798 -2895 4413
4548 4413 5962 -1192 -6087 -930 5593 3801 -2509 -4482 998 6116 2830 -4283 -3838 3924 6413
4563 6413 134 -4991 -1794 4897 4858 -1421 -4956 -49 6311 3748 -3365 -4144 2525 5833 969 -3985
4579 -3985 -2204 3514 5146 -1059 -5204 -301 5660 3422 -3091 -4222 1522 5164 1849 -4033 -3488
4594 -3488 3097 4812 -910 -4785 -747 4513 3067 -2762 -4562 197 4689 1598 -4718 -4036 2636
4609 2636 4749 -741 -5091 -2158 3385 3276 -2520 -5501 -336 4778 1231 -4690 -3989 1796 4544
4624 4544 -572 -5523 -3298 3198 4288 -2094 -6140 -1435 4646 2126 -4075 -5100 891 4641 959
4639I59o405J298P022J937p000m091M838N833r87o680k363N377N342l258p096
4654e274Q91O716K670n383n095K921O396Q76o768m039N412O355k125p424n83O000
4670A546L788l806n997R72O971J962n899m586M036O323j665o126j631M779N078
4685E745k780o869K36O833K875n734m295K461N516M22n301l330M534N348k677
4700B984o604L9O037K796m173m785J554N734J300n626l817M278N026k165n516
4715b938n79M845K930k876n583J216O343J840o340l731L787N360j484n109k319
4730d638M539N008l430o096J377O086J139n091l613K773N319L53o293l121N174
4745e14N547l595n978PO016K552m137n336J915O500O86o292l412M912N386j913
$$ plain form
4639 959 -5446 -4148 2874 4811 -2189 -6280 -1442 4391 3404 -3276 -5639 -262 5080 1822 -5274
4654 -5274 -4383 2333 5003 -380 -5475 -2554 3842 4718 -2050 -6089 -677 5678 3553 -3871 -4454 1546
4670 1546 5334 1528 -4469 -3497 3474 5436 -463 -5049 -1013 5310 3645 -2481 -4112 667 5745
4685 5745 2965 -3904 -3668 3165 6040 306 -3989 -1528 3988 4410 -891 -4221 313 5661 2984
4700 2984 -3620 -3581 2456 5252 1079 -3706 -2152 3582 4882 -744 -4561 -283 4743 2578 -2938
4715 -2938 -3517 1328 4258 1382 -4201 -2985 3358 5198 -1142 -4873 -1086 4274 2790 -2319 -4638
4730 -4638 -99 4909 1479 -4617 -3240 2846 3985 -1106 -4719 -1946 3373 3726 -2567 -5688 -514
4745 -514 5033 1438 -4540 -4533 1483 4035 -102 -5438 -3523 2977 3663 -2629 -6041 -1129 4257 2344
4761B344o068j578N497M696l911o136N43P289J890o084m106L515N689p4o138l011
4777e643M988O046l240p270L53O999K642m912m758J940N784J866o453l682M752
4792e88N795k179o513o81N143M241l714n410M51O495K257o172l901L862N333o06
4808C813n779j959M452M712k731o218N75O224J849n078l740K511N405L05n433
4823a092k880L854N313k498n552J60M924K359l621m651J823O067O54o291l250
4838d681N101M571k214n382n97M490L692l214n695J341O010R19n715l148L793
4853g29N127j384n623k200N261M791l444o053M73O377J677m862m391K843N488
4868C351M11o071l226N336N019k906o200j95N677L125l945n586J361P024J224
$$ plain form
4761 2344 -3724 -5302 195 4891 980 -5156 -4613 2676 4566 -1518 -5624 -2109 3580 3506 -2632 -5643
4777 -5643 -655 5391 2151 -5119 -4766 2233 4875 -37 -4795 -2855 2929 4795 -1658 -5340 -588
4792 -588 5207 3028 -3485 -4166 977 5218 1504 -3906 -3455 3040 5297 -875 -4776 -914 4419 3813
4808 3813 -1966 -3925 527 5239 2508 -3710 -3135 3089 4938 -140 -3880 -1369 4036 4341 -1092
4823 -1092 -3972 -118 5195 2697 -2855 -2695 2229 4588 967 -3684 -1861 4206 4860 -1431 -4681
4838 -4681 420 4991 2777 -2605 -3202 1288 4980 1766 -3929 -2588 3422 4341 -1374 -4522 -729
4853 -729 4398 3014 -2609 -4809 452 5243 1799 -4254 -3781 2596 4273 -589 -4980 -2137 3351
4868 3351 3762 -2309 -5535 -199 4820 1914 -4286 -4481 1196 4321 376 -5210 -3849 3175 4399
4883D399o429l814M238N225j265o132j286N332M228l365o362J033O592J932n642
4898a316m013L080N472L56n701l306M962M738k037o428K21N932K312l975m986
4913d689J947N930R87n793l630M189N584j851n637r81M596L344k623m858P93N910
4929C218J128n203l466L849M397r02n029j901M523M361k796n422L69N478J602
4944D206m435l201K395N090l11n351k159M339M818l616m804K41N178K416l909
4959H97m455J479N818N06n657k630M575M409k407n328p25M969L723l461o124J563
4975b848O390J078n676l336L271M917n37n812j980M893M256l223n806J198N716
4990B501J869m798m407K429N755Q14o247l196M427N247k565n606m54N005L129
$$ plain form
4883 4399 -2030 -5844 -1606 3619 2354 -3778 -5064 268 4496 1131 -5231 -4198 2394 4326 -1316
4898 -1316 -5329 -2249 3223 3579 -2122 -5428 -466 4272 2235 -4193 -3972 1960 4272 297 -4689
4913 -4689 -2742 3188 4175 -1618 -5248 -1059 4525 2674 -2963 -3944 652 3996 1373 -3485 -2692 3218
4929 3218 4346 -857 -4323 -474 3923 3021 -2008 -3909 614 4975 2179 -3243 -2874 2604 4206
4944 4206 -229 -3430 -1035 4055 3744 -1607 -3766 573 5391 1775 -3029 -2788 2390 4806 897
4959 897 -3558 -2079 3739 4245 -1412 -4042 533 4942 2535 -2793 -3518 1451 5174 1713 -4411 -2848
4975 -2848 3542 4620 -1056 -4392 -1121 3796 3259 -2553 -4533 360 4616 1393 -4413 -3215 2501
4990 2501 4370 -428 -4835 -2406 3349 4163 -2084 -5280 -853 4394 1829 -3777 -4231 774 3903
5005C903l499n243J599O386J179o194l722M352M815j031n316k170M492M746k768
5020A529o014M39N892J574m332l762K483N204q4n096k990M715M918k873n421K67
5036c551M543K671l352m350J228N575P68n200k798L850M392j619n064p93M548
5051H48L264k846n254J412N409J398n006l077L216M411r41m867j549M450M153
5066E021l634n060J199N788Q72m359l360K441M878p6n322k504M662M478k985n304
5082c265L92N332K362m313m497K077N641R55n902l114M310M649j918n025j236
5097c552M886L821l414n872J331O041J224n280l754L511N014k06n721k773N213
5112D69M231k711n958M75N493J953l903m233J899N543M65n569l264M565M683k196
$$ plain form
5005 3903 404 -4839 -3240 3146 4325 -1869 -5591 -1239 3576 2545 -2771 -4941 -449 4297 1529
5020 1529 -4485 -4046 1846 3420 -912 -4674 -2191 3013 2929 -2167 -5157 -442 4476 1603 -3818 -3551
5036 -3551 992 3663 311 -4039 -2811 2764 3532 -1668 -4466 -616 3776 2157 -2907 -3700 848
5051 848 4112 1266 -3988 -2576 2833 4231 -775 -3852 -636 3775 2834 -2033 -3582 868 5021
5066 5021 1387 -3673 -2474 3314 4186 -173 -3533 -1092 3786 3710 -1612 -4116 546 5024 2039 -3265
5082 -3265 -2873 2459 4821 508 -3989 -1912 3729 4684 -1218 -4332 -22 4627 2709 -2316 -3552
5097 -3552 1334 5155 1741 -4131 -2800 3241 4465 -815 -4569 -1058 3956 3750 -1971 -4744 469
5112 469 4700 1989 -3969 -3494 1999 3952 49 -4184 -2285 3258 3723 -1846 -5110 -545 4138 1942
5128A942n186q36M594L422k884n350Q88N827J324n248l091L171M512p90n093j695
5144d493M454L976k734n466N90N375J613l904l540J752M957R4n189k133M557L691
5160C600k178n023L54M701K180l540m153J537N450P96n411k551L924L961j798
5175A849m697n58M471L110l518m885J357O177P69n532k873L955M178n53n391j692
5191c833M685L665k925n211J249N286J013m043l526K118N554J0n965k304M963
5206G36M270k524n306J02M900K499l656m730J763N602N64n522k932M258M615j519
5222C120n466j363M628M300l338n465P00N889J254m648l435K775M468O4n216k557
5238d290M593M510l030n754M68N351K102l505m448J232N893L60n214k789L814
$$ plain form
5128 1942 -3244 -4080 514 3936 1052 -4298 -3410 2417 3741 -1507 -4598 -1427 3085 2295 -2798 -4493
5144 -4493 -39 3937 1203 -4263 -3673 1702 3315 -589 -4129 -2377 2580 2674 -2515 -4648 -91 3600
5160 3600 1422 -3601 -3247 1454 3634 94 -4059 -2522 2928 3724 -1687 -4238 -314 3647 1849
5175 1849 -2848 -3406 1065 4175 657 -4228 -2871 3306 4075 -1457 -4330 -375 3803 3250 -2141 -3833
5191 -3833 852 4517 1592 -3619 -2370 2916 3929 -114 -3640 -1522 4032 4042 -1923 -4227 736
5206 736 5006 2482 -2824 -2722 2178 4677 1021 -3709 -1946 3656 4220 -1302 -4234 24 4639 3120
5222 3120 -2346 -3709 919 5219 1881 -3584 -2884 3005 4259 -389 -3824 -1049 3419 3483 -1733 -4290
5238 -4290 303 4813 1783 -3971 -3503 1848 3950 445 -4003 -2771 3122 3482 -1732 -4521 -707
5253g07M355j623m928m26M087L059l155m882J120N665P00m618l073K784M446p19
5269B085m567j994M429L365k676m746J238M837Q20l704l049K011M547K51n179
5284b332k448M520L544k190m487J66M066K677l319m442J946N035M60n090k392
5299d286M052L965k125m553o44M649L248l651m615J492N457M44m591k374K789
5314g43M353q62n213j707M986M111l516n131Q35N556J931m263m062K018N318N11
5330D122n503k445M324L874j961m987l58M805K540l131m697J150N659P64m948
5345g92k797L161M463r54m832j587M336L383k969m770P86N315J248l904l423J979
5361a357M796Qn019k008L769L890k506m527K18M481J902l417l760J192N054L99
$$ plain form
5253 -707 3648 2025 -2903 -3329 758 3817 662 -4220 -3100 2565 3265 -1353 -4426 -1642 2804 2085
5269 2085 -2482 -4476 -47 3318 642 -4104 -2866 1971 2791 -913 -3962 -1951 2596 2847 -2332
5284 -2332 -4780 -260 3284 1094 -3393 -3227 839 3516 197 -4245 -2299 2736 3196 -1894 -4286
5299 -4286 -234 3731 1606 -2947 -3591 1058 4306 655 -3960 -2468 2989 3433 -1158 -3532 -743
5314 -743 3610 2748 -2465 -4172 814 4925 1409 -3722 -2887 2669 4600 337 -3725 -1707 3611 4122
5330 4122 -1381 -3826 498 4372 2411 -2576 -2934 1871 4411 1280 -3417 -2267 3392 4156 -792
5345 -792 -3589 -428 4035 3081 -1751 -3338 998 4381 1412 -3358 -2572 2743 3991 87 -3336 -1357
5361 -1357 3439 3447 -1572 -3580 189 4079 1573 -2954 -2736 1745 3647 230 -3530 -2338 2716 3115
5377C115m794k409L969L345j519m277r80M130L189k977m566J370M947J12m351
5392a696k195L044L750j102m463j421M380L445k954m868J342M531Q89l381l056
5407c755J961M415k55m966j828M438L623k722m379R7M847J997l499m414J591N962
5423C113p1n045j904L496L884j525m655r99M713L165l287m789J190N511R17m538
5439h24l125L013M574l88n184j858M744L514l014m670R10M752J832l617m682K493
5455a530N295L03n417k351M054L801j705m647p56M477K909k879m890J184N095
5470B943J020m728k715K871M350o74m677j644L889L653k645m649O95M482J444
5485C615l572l137K186M227k82m881j620L778L634k410m095J01L897K175l151
$$ plain form
5377 3115 -1679 -4088 -119 3226 1707 -2570 -3550 580 3769 792 -3774 -2404 2543 2655 -1696
5392 -1696 -3891 -847 2903 1801 -2662 -4083 297 3742 788 -4080 -2738 1793 2682 -699 -3755
5407 -3755 -1794 2621 2366 -2600 -4428 10 3633 911 -3468 -3371 1476 3473 -26 -4440 -2849 3113
5423 3113 3042 -2003 -3907 -411 3473 1948 -2707 -3706 1007 4172 885 -3904 -2714 2797 3714 -824
5439 -824 -3949 -936 3638 3250 -1934 -3792 952 4466 1452 -3218 -2308 2444 4276 659 -4023 -1530
5455 -1530 3765 4068 -1349 -3700 354 4155 2450 -2197 -2953 1524 4433 1554 -3336 -2152 2943
5470 2943 3963 -765 -3480 -609 3741 3067 -1610 -3254 635 4288 1643 -3006 -2311 2171 3615
5485 3615 43 -3094 -908 3319 3037 -1844 -3464 314 3948 1538 -2557 -2456 1441 3616 465
5500D65l820J702M148L40m320k410L874K904j345m165n61M168K883l266m618J744
5516b277M585J88l979k177K895L237n72m406j348M682K538l236m013J325M465
5531A907J005m069k735J835M744m7m870k071M236L334k305m402K70M166K341l615
5547b76m121J962N290L46m830k836L673M190j456m621j270M509L222l229m090
5562c537J035M922R26m318k898K570M648j22n304j596M324L621k726m271L39M074
5578A687K011l295l764J543M680N82m941j802L527L832k251l804j111M185K842
5593C921k938m091J120M826M73l724k640K658L559o00m024j354L750L177k899
5608A214m173J197L999J182l464k865J595M301Km556j818L834L191k568l702K64
$$ plain form
5500 465 -3355 -1653 2495 2835 -1485 -3895 -21 2883 1538 -2627 -3188 980 3863 597 -4021 -2277
5516 -2277 2308 2496 -1483 -3660 -765 2472 1900 -2506 -3854 828 3366 130 -3883 -2558 1907
5531 1907 2912 -1157 -3892 -2057 2687 2640 -2230 -4301 -65 3269 964 -3438 -3168 998 3339 -276
5547 -276 -4397 -2435 2855 3201 -1629 -4465 -792 3398 1942 -2679 -3949 560 3782 553 -3537
5562 -3537 -2502 2420 3346 -972 -3870 -1300 3348 3226 -2078 -3674 650 4271 1545 -2726 -2387 1687
5578 1687 3698 403 -3361 -1818 2862 3444 -1497 -3299 228 4060 1809 -1995 -3106 1079 3921
5593 3921 983 -3108 -1988 2838 3311 -413 -3053 -395 3164 2564 -1460 -2814 936 4113 1214
5608 1214 -2959 -1762 2237 3419 -45 -2910 -1315 2986 2988 -1568 -3386 448 3639 1071 -2631 -2367
5624b367L819J937k901l884J557M832L2m699j596L075L510j491m205q17M157K936
5640C895l821m149J867M517L71l950k798K818M222p46m721j643M658K957k964
5655E13m182R56M278J337l449l825K678M442J02n446j441L751L633j790m534n35
5671c512M596K555l349m284J357N061L64m360k375L130L543k74m778j175L778
5686B77L747l215m425R91M637J173l547k673J557M123K4m205j530L629K865j837
5702A591m023k47M287J756k581m189J808M526L06m204k032L259K605q89l768n50
5718b345L737K518l278l481J245M403L05l451k396K386L576l69m344j345L827
5733I88K919k513l759R12L674O74l114k675J868M514p55m139j418L353K971k180
$$ plain form
5624 -2367 1452 3389 488 -3396 -1839 2993 3025 -1674 -3270 -195 3315 1824 -2381 -3198 959 3895
5640 3895 74 -4075 -2208 2309 2680 -1270 -4068 -1250 2972 2226 -2495 -4138 520 3477 513
5655 513 -3669 -2713 1565 2902 -547 -4372 -1694 2748 2850 -2596 -4037 -286 3347 1557 -2977 -3512
5671 -3512 1084 3639 290 -3994 -2637 2424 2788 -1572 -3947 -817 2726 2452 -2326 -3501 277
5686 277 4024 809 -3616 -2625 2012 3185 -362 -3035 -1478 2645 2669 -1536 -3066 563 3428 1591
5702 1591 -2432 -2679 1608 3364 783 -3406 -1598 2928 3234 -970 -3002 257 2862 1973 -1795 -2345
5718 -2345 1392 3910 632 -2849 -1604 2799 3104 -347 -2743 -357 3219 2850 -1494 -2839 988
5733 988 3907 1394 -2365 -1453 2221 2895 -219 -2894 -1026 3488 2733 -1406 -2824 529 3500 1320
5749A320l693o0L645K023k919l518J830M231j44m532j418L070L377j518m001j421
5765c728M585K996l163m115J592M045L18l371k593K362L831p62m736r77M412K694
5781C390k797l785O23L975J842l381m004K213M499k17m234j902L778K808j646
5796A162m025m86L791K773l032l894J460M541N24l954k240K351L321j97m031j456
5812c392L642L059k697l750J015L979O57k860k814J888L900m8m128j579L270K571
5828B713j609l477N32K730K353k951l388J720L928M26m331j676K868L325j276
5843A887l829p82L911K491l140l312J504L931Q7l337j911J981L465m39m187j194
5859b874L870K732k741l658P22M441Q72l306k776K009L757m74m112j345L484K774
$$ plain form
5749 1320 -2373 -2433 1212 3235 316 -3202 -1372 2859 2715 -1817 -3235 -165 3212 1694 -2307 -3728
5765 -3728 857 3853 690 -3425 -1833 2212 2530 -841 -3434 -1072 2759 1997 -2739 -3716 696 3390
5781 3390 593 -3192 -2569 1406 3248 -133 -4137 -1924 2575 2358 -1876 -3778 0 2808 1162
5796 1162 -2863 -3349 442 3215 183 -3711 -2251 2290 2814 -1140 -3380 -1029 2292 2095 -1936 -3392
5812 -3392 250 3309 612 -3138 -2123 1856 2513 -347 -3161 -1273 2627 2579 -1549 -3128 142 2713
5828 2713 1104 -2373 -1841 889 3242 291 -3097 -1377 2551 2977 -1354 -3030 -162 3163 1887
5843 1887 -1942 -2724 1187 3678 538 -2774 -1270 2661 2748 -589 -2500 -519 2946 2507 -1680 -2874
5859 -2874 996 3728 987 -2671 -1949 2492 3364 58 -2718 -709 3048 2574 -1538 -2883 601 3375
5875C375k151m069N05L977J961l030l974J920M420P6m289j671K293L594j122m207
5891b392p36M129K622l015l712Q67M050P16l318k725J899M145k72m270j661M097
5907D24K650k373l406ML548J788l050l277J779M149M43m285j960K943L256j156
5923A477l881r04L594K305k288l787J393L832N43l581k020K207L382j51m276j286
5939c441M040K345k097l716Q97L315J149k467k938J635L949n07m117j026L513
5954E34K570k088l006k9L442J679k862l152J776L352K82l578j538K862K665r29
5970A980l589n90L813J829k816l193J006M046L00k867k871K536L710q29m045r37
5986b517L664K081k119l230O01L377J749l401l055J617M533o91l672j507L107
$$ plain form
5875 3375 1224 -2845 -2340 1637 3598 568 -3406 -1486 2934 3010 -1279 -2950 -657 2937 1815 -2392
5891 -2392 -3128 1001 3623 608 -3104 -2237 1813 2529 -789 -3514 -1615 2530 2258 -2012 -3673 424
5907 424 3074 701 -2705 -2701 847 2635 -415 -3692 -1913 2236 2679 -1606 -3566 -623 2633 1477
5923 1477 -2404 -3308 286 2591 303 -3484 -2091 1741 2284 -1297 -3317 -1110 2272 2121 -2155 -3441
5939 -3441 599 2944 847 -2869 -1972 1343 2492 25 -2913 -1278 2671 2164 -1953 -2979 534
5954 534 3104 1016 -1990 -2019 1423 3102 240 -2912 -1136 2216 2498 -1080 -2618 244 2909 1980
5970 1980 -1609 -2199 1614 3443 627 -2566 -1560 2486 2786 -81 -2952 -416 3294 2465 -1580 -2517
5986 -2517 1147 3228 1109 -2121 -1520 1857 3606 205 -2850 -1233 3300 2609 -1063 -2570 537
6001E37K638j362l854l86L902J978l247l317J492M249K51m098j835K261L348j02
6017B455m186j447L696K919k636l588P93L197J280k825l277J933M174l11l889
6032a712j683L491K885k092l391J26L256J550k338l465J757L525J13l387j483
6047b848K433K652j177l160n16L079K296k984k925J245L750K76l026j877J687
6062a095L247n48l558r99L693K166k669k995O25L910P59k822k782J789M036p62
6078A995l710j186L343K017j771k870L21L406J516l171l026J866M360n94l671
6093a175j481K774K933j183l686p83L951K057k706l273J381L435K11k922k429
6108b896K294L634m63m122j378L681K759k450l337M36L549J423k700l014J364
$$ plain form
6001 537 3175 1813 -2041 -2427 1475 3453 206 -3111 -1619 2630 2881 -1217 -3052 -791 2557 2455
6017 2455 -1731 -3178 518 3437 801 -2787 -1994 1203 2483 -342 -3619 -1686 2488 2177 -1712
6032 -1712 -3395 96 2981 889 -2502 -2376 880 2430 92 -3373 -1616 1909 2022 -1365 -2848
6047 -2848 -415 2237 1060 -2100 -2616 463 2759 -225 -3150 -1905 1845 2121 -905 -2782 -1095
6062 -1095 2152 1604 -1954 -2953 740 2906 237 -2758 -2133 1777 2536 -286 -3068 -1279 2757 1995
6078 1995 -1715 -2901 442 2459 688 -2182 -1861 1545 3061 -110 -3136 -1270 3090 2496 -1175
6093 -1175 -2656 118 3051 1868 -1818 -2601 1350 3407 701 -2572 -1191 2244 2455 -467 -2896
6108 -2896 -602 3032 2569 -1553 -2931 750 3509 1059 -2278 -1842 1707 3130 430 -2584 -1220
6123a220L769K97l791j736L013K465q83l800p76L588K583k975l561J390L562N08
6139B433k620k352K019L341p71l796j110L669K043k301l242N73L520R96k822k363
6155b783J409L444l14l213j310K739K538j741l078RL093J607k642l097J628L595
6171A884j8l158j502K350K507n21l814n01L249K178k521l225J250L473N09k943
6187h03k339J995L428m17l827p73L229J833k057k749N51L078J384l050k479J720
6203a276L721n02l611j211K777K634j057l386n40L510J826k825l018J477L711
6218B230M4l155j844K549K824r78l436r69L901K201k388l557J178L231J158k825
6234A64k755K032L396l78l658j489L479K278k061k873j4L521J591k642l380J389
$$ plain form
6123 -1220 2549 2846 -945 -2681 332 2797 1914 -1886 -2662 926 3509 534 -3027 -1637 1925 2433
6139 2433 -187 -2539 -520 2821 2050 -1746 -2856 813 2856 555 -2687 -2114 1406 2402 -420 -2783
6155 -2783 -1374 2070 1756 -1457 -2767 -28 2510 769 -2309 -2300 793 2400 -242 -3339 -1711 1884
6171 1884 1866 -1292 -2794 -444 2063 1542 -2272 -2773 476 2654 133 -3092 -1842 1631 2140 -803
6187 -803 -3142 -1147 2281 1864 -1963 -2736 493 2326 269 -2480 -1929 1149 2533 -517 -2996 -1276
6203 -1276 2445 1943 -1668 -2879 -102 2532 1475 -1911 -2451 1059 2885 60 -2958 -1481 2230
6218 2230 2274 -881 -2725 -176 2648 1670 -1766 -2735 1166 3367 979 -2578 -1400 1831 2989 164
6234 164 -2591 -559 2837 2459 -1199 -2688 791 3069 1008 -1865 -1879 1642 3233 591 -2789 -1400
6250a400M068j49l559j429K360K726q47l407n74L458K028k801l527J745L457J32
6266B281k804k059J767K964j2l848j037L432K066k223l036Q54L058Q04k433k717
6282b943K058L391p18l546j092L005J985j448k642L8K770J536l059k123J589K992
6298A793j32l357j031K265K631j043l300p02L456K048k698k555J219K806O16k990
6314i74k036K225L157q20l378j100L655J983k457k710J70L453J211k768k649J874
6330a164L526l23l621j262K802K637j475l305n46M116J833k914l351J532L422
6345A907M58k941j945J793L346q41l411n68L041K437k298l376Q92L284R92k534
6361B36k739J974L056p7l490j304K685K194j032k659m33L124J438k564l001J389
$$ plain form
6250 -1400 2668 2519 -1040 -2469 -109 2617 1770 -1637 -2211 1247 3275 474 -3053 -1308 2149 2281
6266 2281 -523 -2582 -815 2149 2137 -1711 -2748 684 2750 527 -2509 -1655 1403 2207 -226 -2943
6282 -2943 -885 2506 1788 -1758 -2850 155 2140 692 -1950 -1912 858 2394 -665 -2788 -1199 1793
6298 1793 1661 -1696 -2727 -462 2169 1126 -2174 -2876 580 2628 -70 -2625 -1406 1400 2016 -974
6314 -974 -3010 -785 2372 1552 -1826 -2926 729 2712 255 -2455 -2285 1168 2379 -389 -3038 -1164
6330 -1164 2362 2039 -1582 -2844 -42 2595 1120 -2185 -2731 1385 3218 304 -3047 -1515 1907
6345 1907 2365 -576 -2521 -728 2618 1777 -1634 -2202 839 3276 978 -2398 -1506 1778 2770 236
6361 236 -2503 -529 2527 2450 -1040 -2344 341 2535 1503 -1156 -1589 1535 2973 409 -2592 -1203
6377a203L735J23l400j272J613K790r08k894j049L452J795k312k721Q66L193J61
6393A969k556j834J940K837n19l797o13K958K248k200k725Q22K831Q78k670j973
6409b404J463L170n36l105j112K695K238j487l177J2L241J488k586k716J351K924
6425A459K01l062j317K005K753q33l312m64L060K201k905k676J080L090P80k871
6441h11k114J486L556m62l530p41L264J839k117k803L33L434J053k681k578J741
6457a131L182j55l224j362K367K370p98l026o04L212J918k710k440R86L268M55
6473B308k661k227K040L123n81l703p77L058K267k047k821P47K322J483k479k341
6489b289J802K815l68l139m16K171J884j478k465l78K987J651k387k675J304L114
$$ plain form
6377 -1203 2532 2655 -745 -2017 -404 2386 1478 -1416 -2465 987 2782 470 -2251 -1385 1808 1969
6393 1969 -587 -2421 -481 2356 1837 -1960 -2573 385 2633 433 -2292 -1470 1361 2239 -431 -2404
6409 -2404 -941 2229 1693 -1412 -2524 171 2409 922 -2255 -2243 998 2486 -100 -2816 -1465 1459
6425 1459 1660 -1402 -2719 -714 2039 1206 -2106 -2570 490 2691 -214 -2890 -1810 1280 2060 -811
6441 -811 -2925 -1439 2117 1655 -1875 -2616 648 2487 370 -2433 -2100 1334 2387 -294 -2872 -1131
6457 -1131 2051 1896 -1328 -2690 -323 2047 1249 -1777 -2381 831 2749 39 -2401 -1415 1853 2308
6473 2308 -353 -2580 -540 2583 2002 -1701 -2478 580 2847 800 -2021 -1274 1048 2531 52 -2289
6489 -2289 -487 2328 1960 -1179 -1595 576 2460 982 -1483 -1861 1126 2777 390 -2285 -981 2133
6505B133j37k669j329K182K141o89l083n30K913J455k133k374J094K707O99k763
6521c83k140K147K793q18l217m75K921J207j543k471K85L156R80k869j947J509
6537h65L350r27l042j045K457K204j360k804K26K604J803k969k615J731L153K6
6553A927l180j667K322K985j010l020q27L027J606k303k419O66L096Q38k720k244
6569b923K079K868k61l756p13K755J818j199k766m33L617J405k706k559J692K920
6585A838kl296j201K480K593j184l168k89L212J606k282k830J289L014J02k456
6601e74j632J755K711n13l194r08L230J559j812k360L11K766J172k394k669K001
6617e51K772r1l113p95K327J759j193k774j46L086J602k798k673J975K406J53
$$ plain form
6505 2133 1996 -673 -2002 180 2321 1632 -1451 -1981 932 2387 254 -2120 -1026 1681 2380 -383
6521 -383 -2523 -376 2417 1599 -1618 -2093 828 2035 492 -1979 -1694 1462 2442 -427 -2374 -865
6537 -865 2485 1558 -1484 -2529 -72 2132 772 -2032 -1806 798 2601 -368 -2983 -1252 1901 1927
6553 1927 -1253 -2920 -598 2387 1377 -1643 -2470 557 2163 -140 -2559 -1893 1203 2041 -679 -2923
6569 -2923 -844 2024 1763 -1993 -2706 49 1867 668 -2098 -2531 1086 2491 -215 -2774 -1082 1838
6585 1838 1836 -1460 -2661 -181 2412 1228 -1940 -2229 983 2589 307 -2523 -1234 1780 1882 -574
6601 -574 -2206 -451 2260 1747 -1447 -2355 875 2434 622 -1738 -1427 1339 2511 117 -2552 -551
6617 -551 2221 2130 -983 -1778 549 2308 1115 -1659 -1805 1281 2883 85 -2588 -613 1793 1946
6633A946k509j437J990K172o51k838n78K805J758k112k655R05K987K64k557k028
6649b538K082L176j033l378j81K592J705j941k466L56K829R58k396k132J614L171
6665B418q97k954r07K606K165j343l185k89L336J565k633k436J086L120J51k969
6681a166j500K016K987r69l526n47L547J445j885k921M73K944J189k531k240J556
6697a128L040m97l090m42K114K143j400k656j83K805J550k702k520J730K955J46
6713A865k636j180J726K327q45l208k3K711J434j582k799J259K460Q65k615k149
6729b390J767K569k19l182l87K682J326j528k241M51K577R20k448j951J883K489
6745B318n50k713j083K573J631q42l025j40K904J549k828j905J478K600j07k421
$$ plain form
6633 1946 -563 -2000 -10 2162 1511 -1327 -1905 900 2658 546 -2109 -1204 1783 2047 -510 -2538
6649 -2538 -456 2720 1687 -1691 -1872 720 2425 484 -1982 -1626 1203 2161 -235 -2367 -753 2418
6665 2418 1521 -1433 -2340 266 2431 1088 -2097 -2386 950 2515 -118 -2554 -1468 1652 1803 -1166
6681 -1166 -2666 -650 2337 1368 -2158 -2705 842 2287 402 -2519 -2046 898 2087 -444 -2684 -1128
6697 -1128 1912 1415 -1675 -2117 -3 2140 740 -1916 -2099 706 2256 -446 -2966 -1236 1719 1865
6713 1865 -771 -1951 -225 2102 1257 -1951 -1974 737 2171 589 -2210 -951 1509 2374 -241 -2390
6729 -2390 -623 1946 1727 -1455 -1842 840 2166 638 -1603 -1152 1425 2345 -103 -2054 -171 2318
6745 2318 1768 -945 -2028 545 2176 1334 -1691 -1831 1073 2622 -206 -2111 -633 1967 1860 -561
6761e61j441J909K610p55l582j56K988J690k111k509R26K654J83k184j933J724
6777e48L048p28l435l11K728J646j516k692k14L179J231k747j903J741K799q09
6793A469k502j148K036K525j509k937j23K539K066k439k592J493K820l7k370j768
6809b477J398L299j022k956l88K889J338j921k178J16K907P84k438j970J956K729
6825B066o63k969q06J912K121j043k537r0K752J215k177k267J655K418j25k656
6841a194q89J763K476j178k599k45K724J521k116k353R74K379M78k352j653J924
6857c40K413o20k850j23K441J221j383k446J46K905J070k434k352J693K698k96
6873A743k979n04K102K119j476k483rL145J044k521k332J065L216j21k368j712
$$ plain form
6761 -561 -2002 -93 2517 1762 -1820 -1976 1012 2702 591 -1918 -992 1662 1845 -339 -2272 -548
6777 -548 2500 1772 -1663 -1974 754 2400 884 -1808 -2022 1157 2388 -359 -2262 -521 2278 1469
6793 1469 -1033 -2181 -145 2380 871 -2066 -2189 350 2416 -23 -2615 -1122 1698 1661 -709 -2477
6809 -2477 -1079 2220 1198 -1758 -2146 743 2081 160 -2018 -1902 1005 1789 -649 -2619 -663 2066
6825 2066 1403 -1566 -2372 -460 1661 618 -1919 -2009 743 1958 -219 -2486 -831 1587 1462 -1194
6841 -1194 -2083 -320 2156 978 -1621 -1866 858 2379 263 -2090 -1116 1263 1741 -611 -2264 -340
6857 -340 2073 1453 -1397 -1520 921 2142 759 -1687 -1541 1364 2434 0 -2352 -659 2039 1743
6873 1743 -1236 -1740 362 2481 1005 -1478 -1487 1658 2702 181 -2151 -1086 2130 2009 -359 -2071
6889b071K064K501j064k940k50L121J012k045k081O74K792L93k386k050J590L154
6905B414o45l009o76K364J972r24l216lK796J504k880k131J404K898j65k188j759
6922b244J742K618j034k666m22K759J003j794k256R47K825J31k305j529J711K277
6938A763j013k265p06K713J157j005k934M65K695O77k150j803J817K265m82k557
6954a363k78J553J787q40k867K4K600J238k241j689J217K441j08k416r28J729
6970a41K369q76l175j2K174J847k241k028Q49K592N34k250j857J848K315p39k477
6987a268p08K793J123j322k615N47L268L10k441j689J540K908q96k193j175K323
7003E05J570q60k419m48K800J410k465k183J452K454M22k505k114K287K774r89
$$ plain form
6889 -2071 -7 2494 1430 -1510 -1760 1361 2373 328 -1753 -1079 1713 2106 -280 -2330 -740 2414
6905 2414 1769 -1240 -1916 448 2420 1496 -1720 -1723 1073 2577 -303 -2434 -1030 1868 1703 -485 -2244
6922 -2244 -502 2116 1082 -1584 -2006 753 1756 -38 -2294 -1347 1478 1609 -696 -2225 -514 1763
6938 1763 750 -1515 -2221 492 1649 644 -2290 -1825 870 1547 -603 -2406 -589 1676 1194 -1363
6954 -1363 -1641 -88 1699 859 -2008 -1984 616 1854 -387 -2076 -859 1582 1474 -942 -1870 -141
6970 -141 2228 1352 -1823 -1835 339 2186 -55 -2083 -1234 1358 1892 -358 -2215 -367 1948 1209 -1268
6987 -1268 -1976 817 1940 618 -1997 -1450 1818 2128 -313 -2002 -462 2446 1550 -643 -1818 505
7003 505 2075 1215 -1204 -1652 1148 2558 93 -2090 -638 1816 2238 -267 -2381 -94 2680 1691
7019A691l036j00K416J208j634k320M91K751P10k317k157J861K911q47k959n89
7035a920K448J370q40k927K3L052J077k591j939J358K300R6k056j501J738K310
7051A998o95l137j70K997J396k321k138Q22K211Q35k235j758J606K625r21k742
7067a627k97K176J570j569k101L58K433Q88k419j930J631K352k88k662n21K202
7083A96J680r14k851j11K773J109k403j651J202K177K96k496j250J886K248r73
7099I18k594l60K325J596j744j974O82K571L77k510j657J609L216r25k880m52
7115a802K177J713j123k830N7L142P76k332k055J335L280p04k360j182K135K186
7131B413r20l183k8K614J450k184j988Q20K665K92k285j741J645K869j186k571
$$ plain form
7019 1691 -1345 -1445 971 2179 545 -1775 -1284 1467 2177 -140 -2297 -436 2475 1628 -1331 -1920
7035 -1920 528 1898 1058 -1869 -1846 1206 2283 -308 -2247 -889 1411 1507 -549 -2050 -312 1998
7051 1998 1303 -1834 -2004 993 2389 68 -2070 -1248 963 1798 -437 -2195 -589 2036 1115 -1627
7067 -1627 -1924 252 1822 253 -1848 -1490 943 1831 -588 -2518 -887 1465 1177 -1485 -2006 196
7083 196 1876 962 -1889 -2000 773 1882 -521 -2172 -970 1207 1503 -993 -2243 -357 1891 918
7099 918 -1676 -2036 289 1885 141 -1833 -1151 1420 1797 -713 -2370 -761 2455 1530 -1350 -1802
7115 -1802 375 2088 965 -1865 -1808 1334 2110 -222 -2277 -942 2338 1634 -726 -1908 227 2413
7131 2413 1493 -1690 -1718 896 2346 162 -1826 -1006 1659 1951 -334 -2075 -430 2439 1253 -1318
7147a318l79K452J594j381k675L84K639J003k331k167J682K454o05k300m36J672
7163B88J615j107k604J08K716R35k184j684J191K137L76k519r50J259K249p63
7179A063k683K6K408J129k037j815Q99K221O00k488j595J659K318q24k520j02
7195a741K043J602j874k097L82K578P62k229j719J650K248m48k683p55J954K398
7211B071j360k614M0K736J082k277j741J021K413J38k704j278K044K433q50k858
7227a704N3K155J699j882k140L01K606J113k651k064K188K160n36k570n14K040
7243B54J973j446k340J30K771J058k613j755J167K866m65j850j563J961K092p52
7259A488l040k8K701J022j804j979P82K646M35k360j821J792K219n47k616l29
$$ plain form
7147 -1318 -1697 755 2349 968 -1707 -1323 1316 2319 -12 -2179 -497 1957 1352 -948 -1384 288
7163 288 1903 796 -1808 -1700 1016 1951 -233 -1917 -726 1411 1787 -732 -1682 -423 1826 1063
7179 1063 -1620 -1594 814 1943 -94 -1909 -1010 1211 1811 -677 -2272 -613 1705 881 -1639 -1741
7195 -1741 302 1904 30 -2067 -1685 893 1655 -574 -2293 -643 1605 1157 -1526 -2281 -327 2071
7211 2071 711 -1903 -1863 873 1955 -322 -2063 -1042 1371 1509 -1195 -2473 -429 2004 1154 -1704
7227 -1704 -1651 504 2203 321 -1819 -1518 1088 2201 -450 -2514 -326 1834 1298 -1272 -1786 254
7243 254 2227 781 -1559 -1429 1342 2400 -213 -1968 -801 2065 1600 -250 -1813 148 2240 1488
7259 1488 -1552 -1580 1121 2143 339 -1640 -858 1788 2223 -137 -1958 -166 2053 1506 -1110 -1439
7275a439J784J780j610k050L89K493O11k018k094J910K167m62k433o58J865J935
7291B170j107k550K50K443R84k344j521J264J830r6k083j311K092K119j230k656
7307a746K02K262J085j574j878M18K172R16k532j356J453K624j211k348k19J958
7323B26J596j347k420L80K478Q01k266j830J820J982p2k854j94J697K092j396
7339F93k817N1K975J022k343j750J104K387K56k167k123K399K563j387k495N1
7355a581K341J165j605k201N58K332Q40k739j380J624K194l2k646m72J885J649
7371A932j003k645L06K914M38k187j711J425K230j02k143j425J862K284r38k548
7387a311M1K165R80j499j680M44K564K25k287j312J652K003p68k537J04K002J334
$$ plain form
7275 -1439 345 2125 515 -1535 -1146 1347 1958 -60 -2154 -244 1923 1461 -972 -1630 235 2170
7291 2170 1063 -1487 -1237 1206 2190 -154 -1675 -411 1419 1323 -760 -2071 21 2140 910 -1746
7307 -1746 -1544 718 1803 229 -1649 -1231 941 1857 -675 -2031 -578 2046 835 -1513 -1732 226
7323 226 1822 475 -1945 -1565 913 1714 -552 -2382 -562 1420 1348 -1506 -1700 -3 2089 693
7339 693 -2124 -2073 902 1924 -419 -2169 -1065 1322 1578 -589 -2712 -313 2250 863 -1632 -1581
7355 -1581 760 1925 320 -1881 -1323 1009 1849 -890 -2270 -646 1548 1516 -1130 -1602 283 1932
7371 1932 929 -1716 -1410 1504 1942 -245 -1956 -531 1699 1597 -546 -1971 -109 2175 1237 -1311
7387 -1311 -1270 895 1875 376 -1304 -860 1704 1929 -358 -1670 -18 1985 1217 -1320 -1216 786 2120
7404B120j411j941k1K349P22j969j443J377J940l46k143j066K012J684q72k634
7420a642K98K299R69j881j833J071K084N9k129j308J901J962j385j977k38K332
7436E82J281j815j955N91K600O57k710j081J362K216q36k111o20K129J407j399
7452B98k247L69K466Q96k235j646J430K086l03k267p76J800J927j188k383J24
7468a649K608N74j866j920J266J947P05k124j761J864K116q31k440n87K401J281
7484A584j086k037P7K725M22k025j506J643J993n16k173n99J601J661j086j852
7500a174k47K319R44j797j929J446K094j1k284q70J571J987q30k505mK300Q96
7517A906j285j962L87K163P98k228j393J315K412q08k310l03K072J117j216j900
$$ plain form
7404 2120 709 -1232 -1253 1096 1818 -151 -1594 -217 1723 1377 -766 -1832 180 1864 992 -1642
7420 -1642 -1344 955 1924 43 -1790 -719 1365 1424 -705 -2013 -112 1850 465 -1512 -1750 582
7436 582 1863 48 -1907 -1316 1284 1941 -769 -1850 -488 1728 892 -1219 -1839 290 1697 298
7452 298 -1949 -1580 886 1782 -453 -2099 -669 1417 1114 -1153 -1929 -129 1798 610 -1773 -1649
7468 -1649 959 1533 -333 -2253 -987 960 1665 -459 -2220 -356 1760 929 -1511 -2098 303 1584
7484 1584 498 -1539 -1462 1263 1685 -340 -1846 -203 1790 1274 -899 -1498 103 1764 678 -1174
7500 -1174 -1421 898 1842 45 -1884 -438 1656 1645 -639 -1509 62 2049 1219 -1286 -1290 1010 1906
7517 1906 621 -1341 -954 1209 2007 -221 -1614 -299 2113 1305 -1005 -1308 764 1881 665 -1235
7533a235n1K665N31k092j584J123K057k14j871p47J705J324p64k586L53K647M17
7550A678j722j890J325K236Q8k327j389J930J746r48k197l0K120J114j753j792
7566a811Q33J821O02j884j670J626K092m83k355o46J776K003j356k128J66J985
7582E71J281k162j668J105J896K29k328p15J585J842q88k600O1K303J161j567
7598A06k217Q42K256O06k556j280J853J852m90k415r3J924J061j105j881k31K729
7615I61P41k141j499J253K281l26k175q87K160J406j262j976L29K054O04j359
7631A64j613Q78J968j8j661j660K053J862j050k091l9K207P36j421j442K58K704
7648A835n5k301j215J622K080o95k236l39K086J164j411k065O27K325L08k059
$$ plain form
7533 -1235 -1286 1379 1910 -182 -1766 -643 1414 1200 -671 -1418 287 1611 847 -1739 -1386 1261 1678
7550 1678 -44 -1934 -609 1627 1715 -612 -2001 -71 1675 727 -1470 -1500 620 1734 -19 -1811
7566 -1811 -978 843 1445 -439 -2109 -483 1609 1126 -1229 -1875 -99 1904 548 -1580 -1414 571
7582 571 1852 -310 -1978 -873 1023 1252 -1076 -1791 -206 1636 748 -1852 -1791 512 1673 106
7598 106 -2111 -1269 987 1593 -963 -2243 -390 1462 972 -1443 -1536 388 1449 344 -1537 -1768 961
7615 961 1702 -439 -1938 -685 1596 1270 -905 -1792 368 1774 512 -1464 -1135 919 1523 164
7631 164 -1449 -571 1397 1379 -282 -1942 111 1973 923 -1168 -1207 1000 1736 315 -1127 -869 1835
7648 1835 1780 -521 -1736 -114 1966 1271 -965 -1304 782 1946 535 -1530 -903 1422 1730 -329
7664c29j472J148K450j56k444p92J945J585j088k366J18K350P66j703j621R68
7680f41J709Q00k330j277J626J823q79k253j4K193R20j492j810M61K533M00k227
7697d58j546J428J916o05j551r03J635J935j411j816J42K163L85j691j164O46
7713h95J912J84k094j145J858J386m32k194J65J708P69j285j723N85K346K62j829
7730d22j509J469J930q97j654j51J457J082o52k269K94K357M37j807j454J278
7746e11K062p10j825o09J465J840j179k092J58K222O57j844r31P71J817M9j847
7763e07j506K090J643q81k157l0K183J013j673j353L16K345L41k273j090J674
7779A35K056j070k086j71J535J399j420k100O00K293O05j929j231R56J852J42
$$ plain form
7664 -329 -1801 -653 1797 1641 -803 -1595 350 1935 847 -1519 -1401 949 1715 12 -1609 -641
7680 -641 1068 1868 -462 -1739 -113 1710 831 -1422 -1436 757 1677 185 -1625 -1164 1369 1769 -458
7697 -458 -2004 -576 1340 735 -816 -1719 -84 1851 440 -1376 -1234 929 1314 -377 -1541 -895
7713 -895 1017 1201 -893 -2038 -180 1206 774 -1420 -1255 453 1222 -63 -1786 -1201 1145 1407 -422
7730 -422 -1931 -462 1468 571 -1083 -1234 223 1305 653 -1616 -1322 1035 1472 -335 -1789 -511
7746 -511 1551 841 -984 -1593 -128 1712 533 -1559 -1401 821 1478 -366 -1297 -526 1291 1340 -507
7763 -507 -2013 77 1720 839 -1318 -1348 835 1848 175 -1178 -862 1483 1824 -449 -1539 135
7779 135 2191 1121 -965 -1136 399 1798 378 -1722 -1122 1171 1776 -153 -1384 -428 1424 1566
7795A566k248q30K021J547j203k253L48K215O34j481j824N09K448k2j849j200
7811a622J420J749o50k220j33J907J389j349k118M12K158J022k540j395J321K225
7827A576l79j946q41J675J581j098k093K26K039Q62k164j172Q64J809O51k402
7843h12j153J766K045j302j977J61J606R61j482j420N97J984J3j877j102J491
7859e01J660p26j650k35J635J063q01j897K31K056O66k099j150J229J901n51j467
7876f36j119J507J798j042k094M64K013O38j482j662J082J952p6j770q68J334
7892C9J680r03k163j1J810J021j055j936N35K289M02k120j316J733J671n31j613
7909d68q37J441J773j291j743K21K063K46j620j022J110J618j16j691j260J463
$$ plain form
7795 1566 -682 -1512 509 2056 853 -1400 -1052 1163 1797 316 -1508 -999 1449 1427 -422 -1622
7811 -1622 -202 1547 897 -1323 -1456 451 1840 491 -1627 -1215 943 1965 -575 -1970 -649 1576
7827 1576 1197 -749 -1590 85 1666 568 -1525 -1299 740 1602 -562 -1734 -870 939 1590 -812
7843 -812 -1965 -199 1846 544 -1433 -1272 334 1295 -187 -1607 -1010 974 987 -890 -1992 -501
7859 -501 1159 433 -1217 -1452 183 1246 445 -1452 -1221 835 1501 -598 -1748 -519 1382 831 -636
7876 -636 -1755 -248 1550 508 -1586 -1122 891 1529 47 -1615 -533 1419 1343 -427 -1295 39
7892 39 1719 816 -1347 -1358 452 1473 418 -1518 -983 1306 1708 -412 -1728 5 1676 1145 -468
7909 -468 -1305 136 1909 618 -1125 -904 1159 1405 -215 -1237 -127 1491 1375 -316 -1576 -113
7925a13J903q66j882j6J558R98j140j879O76K166N6k039j069J513J939q06j937
7942i38l98J301J790j264j881K34J973M51j504j202J124J419j97j649q49J557
7958c3J553r47k048j03K265O20j462j724J351J777J01j893j306J647J772j232
7974C38j632M9J481R87j325j581O35K153K5k081p34J511J422m21j812k85J387
7991A17J370j177j914N68J981L40j573j440J325J670k92j607r21J637J500j076
8007E08k115N31K072M71j289j638P96J757K05k102o93J508J821q53j851j72J868
8024H24Q62j253j651K08K088M59j734j249J082J794k86j878o37J758J424j026
8040G85j853K16K022K44j279j126O09J426J95j724j104J956J687j485j740j80
$$ plain form
7925 -113 1790 924 -958 -974 584 1582 442 -1437 -761 1405 1461 -578 -1647 -134 1805 999 -938
7942 -938 -1336 -35 1755 491 -1390 -1156 817 1268 -236 -1438 -314 1105 908 -741 -1590 -33
7958 -33 1520 573 -1475 -1578 687 1307 -155 -1879 -528 1249 1350 -543 -1849 -202 1570 338
7974 338 -1294 -1245 236 1223 -102 -1683 -1048 1105 1130 -951 -1685 -174 1248 827 -985 -1270 117
7991 117 1487 310 -1604 -1036 945 1285 -288 -1728 -403 1267 975 -632 -1553 84 1584 508
8007 508 -1607 -1076 996 1467 178 -1460 -664 1093 1298 -804 -1497 11 1832 979 -872 -1044 824
8024 824 1686 433 -1218 -1010 1078 1537 -197 -1446 -364 1430 1144 -734 -1371 387 1811 785
8040 785 -1068 -852 1170 1414 135 -991 -382 1044 1239 -485 -1589 367 2054 569 -1171 -1351
8056a351K145O37j261j270R8K123K35j777j059J709J079l82j567n56J457J386
8072A646j276j824M04K078N03k038q41Q49J628m5j847n29J513J115r24j943M15
8089a116J942M79j707j233P34J821j80j365j165J588J611r10j648j15J691O58
8105A085j030j800Q68J658M50k089j017J330J925m16j927n59J610J293j145j917
8121a681M79J896O34j774o85M81J883j70j844r45J975J447j320j528N5J870Q39
8138A612j471j527Q27J778J45j953r14J614J680j208j518m84K084R58j305j582
8154a264M56J948K95j758j194J773J082j99j630p26J508J293j128j614J67K054
8170A063j1r34j209N67J956k52j856o10J103J494l42j756j34J345J031r00j870
$$ plain form
8056 -1351 794 1431 170 -1100 -1002 1121 1356 -421 -1480 229 1308 926 -641 -1197 260 1646
8072 1646 370 -1454 -1050 1028 1531 -507 -1348 -499 1129 1084 -763 -1292 221 1336 412 -1531 -1116
8089 -1116 826 1305 -402 -1635 -901 920 740 -625 -1790 -202 1409 499 -1149 -1264 427 1085
8105 1085 55 -1745 -877 781 1231 -858 -1875 -545 1380 964 -963 -1522 88 1381 236 -1681
8121 -1681 -1202 694 1328 -446 -1131 -650 1233 1063 -781 -1726 249 1696 376 -1152 -1097 773 1612
8138 1612 141 -1386 -559 1219 1364 -589 -1503 111 1791 583 -935 -1419 665 1623 318 -1264
8154 -1264 -808 1140 1435 -323 -1517 256 1338 1139 -491 -1217 291 1584 456 -1158 -991 1063
8170 1063 1052 118 -1091 -524 1432 1180 -676 -1286 -183 1311 969 -787 -921 424 1455 555 -1315
8187a315Q21J095N04j774
$$ plain form
8187 -1315 -494 601 1105 -669
8191f69
$$ Imaginary data points
##PAGE= N=2
##DATA TABLE= (X++(I..I)), XYDATA
0@%%%%%%qJ6j6J6k4L2l2M0n6O4p2Q8j04J23j47J73j98K29k65L02l42L90m45N00
30B64n62O34p12P94q86R88j097J218j354J500j659J837k033K252k496K770l078
47a620L428l832M301m857N526o348P389q753J0627j3376J7806k6123M6983j91351
61a60200m00316L78094M58840l2930m35044j76418K61106L10907j00081l33480
71b29522p6872K90493J95064j73343k66041M2093K70587J10543k05603j95257
81b37858J16935K49881j1490k40763r8396J72599J67540o5731j85134k7190J72025
92A2418J12978j21027j65209L6088J58655L3906j22967r7154O2363J36624J8126
103F4801j24374o9302R0223Q9868n0120r1451O822Q2072M6964m0655o8424J5205
$$ plain form
0 0 0 0 0 0 0 0 -8 8 -8 8 -16 16 -16 24 -32 32 -40 48 -56 67 -80 93 -105 124 -141 161 -181 209 -236 264
30 264 -298 336 -376 418 -468 520 -577 641 -713 787 -872 965 -1068 1184 -1312 1458 -1620
47 -1620 1808 -2024 2277 -2580 2946 -3402 3987 -4766 5861 -7515 10291 -15832 31151 -160200
61 -160200 -560516 -182422 276418 243488 -191556 -367974 -106868 204039 103958 -229522
71 -229522 -306394 -15901 179163 5820 -260221 -218128 52459 163002 -42601 -237858
81 -237858 -120923 128958 117468 -123295 -221691 -49092 118448 52717 -132417 -159607 12418
92 12418 125396 4369 -160840 -124752 33903 67809 -55158 -152312 -89949 46675 64801
103 64801 -59573 -128875 -38652 51216 1096 -90355 -83533 -1461 45503 4848 -63576 -48371
115d8371Q6738J8209p5487l1976N3000K8144l6543j8440L2439L1227j4752m2026
127a7838k847N6105K8612o2772p0205K9191Q7318K6522p1793p1963M3005J17330
139I0665J0452j30366p1276R5855J04058l8329j00933j4313Q5422O8232m5306
150E4161r0859R920R4217J5537r1922n2596O0904P8407j4645q9882l5256Q8662
162B6648Q2346p3090j28762J9770J29434L0342j08939q0284O2286J20621O702
173H7074j23604p1182R4474J10833m8369j28491j7110J15236Q5508o0563j18690
184g4884L046J23745M7311j05417q9687N5790J02189j835r7430n5979P0090R9284
196G6223k6094j14825k2756Q9293M1274o3361n6239K9741O3529Q086n6900l1852
$$ plain form
115 -48371 38367 56576 -18911 -50887 2113 30257 -6286 -24726 7713 38940 24188 -17838
127 -17838 -20685 35420 64032 1260 -68945 -39754 47564 74086 2293 -69670 -26665 90665
139 90665 101117 -29249 -100525 -4670 99388 61059 -39874 -54187 31235 99467 54161
150 54161 -36698 -26778 67439 82976 -8946 -61542 -638 77769 63124 -26758 -62014 26648
162 26648 108994 35904 -92858 -73088 56346 86688 -22251 -102535 -40249 80372 87074
173 87074 -36530 -107712 -13238 97595 49226 -79265 -96375 18861 104369 43806 -74884
184 -74884 -71838 51907 99218 -6199 -95886 -40096 62093 60258 -37172 -93151 -23061 76223
196 76223 50129 -64696 -87452 1841 43115 -20246 -76485 -46744 16785 24871 -32029 -63881
208f3881N3200N2709m4377p0961J9364P4881J9113n4701m7645L1805P5928P704
220E3139q0219l7646O5851N0278n0509n9654K6709O7817R032o3474m1628N3476
232f828O9962l5051r2646k007Q8396L9175o2894o8616K9405R9028K7633j01129
244a5572q0684P5354J15492k8479j24147k8508J08611R3252n3079j24906p366
255g0032J32285O6964j09732j14531N4641J34365J6308j19887q2028Q2257J33982
266A24592j9856j53833n1158J27701J05713p4084j37400p58J38331Q1045r9182
277D1111j33557M1316J52990J9863j42723q3093R6086J29222k3158j41100n0887
288i3930J23075J13327p6882j49821M621J40218O3079j00442j15723L4867J40596
$$ plain form
208 -63881 -10681 42028 -2349 -73310 -53946 20935 40048 -14653 -62298 -30493 45435 53139
220 53139 -27080 -64726 1125 51403 894 -58760 -32051 35766 44798 -18676 -60304 -6828
232 -6828 63134 28083 -64563 -66570 21826 61001 -1893 -70509 -41104 57924 85557 -15572
244 -15572 -96256 -20902 94590 66111 -58036 -86544 22067 115319 62240 -62666 -70032
255 -70032 62253 129217 19485 -95046 -40405 93960 110268 -9619 -91647 -9390 124592
266 124592 104736 -49097 -100255 27446 133159 59075 -78325 -79083 59248 140293 41111
277 41111 -92446 -51130 101860 121723 -21000 -104093 -8007 121215 98057 -43043 -93930
288 -93930 29145 142472 65590 -84231 -79610 60608 123687 23245 -92478 -57611 82985
299H2985L7000j30410r7875Q3485J24824k8601j29332l7123J02815R0762n3980
310D4550j21006k650J23101N4017r6440r3708M1390J00657J4515q5830n8879O0772
322a9511R2637k4301j05404j8529Q9852N0579o0526p6393J6623Q5530L0122p3847
334a3168o3259N0417P8379k2330q1065j2567O3182L9976l9096n9741J4429P5856
346C1013J8143p6042m9135N5473O7423k3122p4823j7596O6289N8295l8874p9471
358f2427J0633Q6351J7968p8703m9378N0993P0945r750p5339k8917O9313O4807
370F6496m4983q3932J0534Q1474K4042o4130n5345L3627Q0349Q216q3950m5450
382g3052P1032P3565m1488q9138l688Q1500M9456n3690q0002J8487R5027K1644
$$ plain form
299 82985 119985 -10425 -108300 -24815 100009 71408 -57924 -95047 7768 98530 44550
310 44550 -76456 -79106 43995 98012 1572 -92136 -50746 49911 64426 -21404 -80283 -19511
322 -19511 73126 48825 -56579 -75108 14744 65323 4797 -71596 -54973 30557 60679 -13168
334 -13168 -76427 -26010 52369 30039 -51026 -63593 -411 39565 469 -59272 -44843 31013
346 31013 49156 -26886 -76021 -20548 46875 23753 -51070 -68666 -2377 55918 17044 -62427
358 -62427 -51794 34557 52525 -26178 -75556 -24563 46382 36632 -38707 -67624 1689 66496
370 66496 21513 -62419 -51885 29589 53631 -10499 -65844 -32217 48132 56348 -27602 -73052
382 -73052 -2020 71545 30057 -59081 -62769 18731 68187 14497 -65505 -47018 48009 69653
394F9653q6295n5432N4725P4149j3611p6146k9045O5206O9112l4731q8220l028
406e3663Q3703L6960o0610o2650K2341P2209J7928o5506m8694M8867O7564k4220
418C4229p2203p565N7563L2058l6312n1974J0124O4252K0415n9225m4036L7908
430a4766N2732j2315n0541j6271L8248L9247j7750m7471K839M9211Q257m5671
442a4251k0399L2962K7756j7030l5408p82L9674J9622l9759l5060L1230M3097
454C1652k1412n0827k002M8564L0365l4319n5722J1122P3391K1149p2732n5154
466g5925M7117P5621n246p6553l7152O3169P5872l0172r4855p910R0984M6147
478G1097o6135p6617K1660Q9802L2017p7968p4998M5222R7109m313r6073l9446
$$ plain form
394 69653 -16642 -72074 -17349 56800 43189 -32957 -62002 3204 72316 37585 -50635 -53663
406 -53663 30040 67000 6390 -56260 -33919 38290 56218 -9288 -57982 -9115 58449 34229
418 34229 -37974 -45539 12024 44082 7770 -44204 -34080 30172 50587 -8638 -52674 -14766
430 -14766 37966 25651 -24890 -41161 -2913 36334 18584 -28887 -26048 23163 31420 -14251
442 -14251 -34650 -1688 26068 9038 -26370 -27152 12522 32144 -7615 -42675 -11445 31652
454 31652 10240 -40587 -42589 5975 36340 2021 -53701 -42579 30812 51961 -20771 -75925
466 -75925 -28808 46813 41567 -34986 -72138 -8969 66903 36731 -58124 -66034 24950 71097
478 71097 4962 -71655 -49995 39807 71824 -6144 -81142 -35920 61189 56876 -39197 -78643
490g8643P0324P1133l2199r1090j0901R5958N8139p5157r2761L5081J05887J7099
502G2870r1628o6209N7138J04629k925j09215m7735Q8746Q5621m6456j01074o067
514f2305R3014N7352o4868r4180K3784J09045K4053r9026o7821O0213R0745j1763
526E8243r4257l8355P8207P8044m5058r7031O025R5489L4686p2279o8065L2845
538c1506Q7248J6615q1500n4516O1053Q2621k4970r0379j8837P4094N6336m2241
550C4018q0258K668Q4034L3788o9011o0197L6401O6309j357o0317l4827L7815
562a0934N5605j0128n9564j1394N1269K6610l5641l4505J6778L8088J777l8118
574a0157j6925M0219L5681l3510m9413J6751N4009N814m9520l4042K9773N4423
$$ plain form
490 -78643 -8319 62814 30615 -60475 -71376 24582 82721 7564 -85197 -50116 55771 72870
502 72870 -18758 -84967 -27829 76800 73875 -35340 -83075 5671 91292 44836 -56238 -62305
514 -62305 30709 88061 23193 -70987 -47203 61842 85895 -13131 -80952 -20739 70006 58243
526 58243 -36014 -74369 3838 81882 36824 -60207 -54182 41307 75993 3714 -64351 -31506
538 -31506 55742 72357 -9143 -63659 -2606 80015 55045 -35334 -54171 19923 76259 34018
550 34018 -46240 -43572 40462 74250 5239 -54958 -18557 47752 46395 -13922 -48749 -10934
562 -10934 44671 34543 -25021 -36415 14854 41464 5823 -28682 -11904 26184 27961 -10157
574 -10157 -27082 13137 48818 15308 -34105 -17354 36655 42469 -7051 -41093 -11320 43103
586D3103l544o3701k5583N5323M5447l7049o0584N527N8589K5950m6997n5076
598e8595K4310P3728P687p2249l9222N1604O2400j6311o9103k1428O2132N5906
610F0859l8953p2408J2061P5366J8483o2715m8232L1782O5616N453o7414m1129
622f1231N1310O4008k5261p3554j0360O2044M0908l9869o4729P575P3057K5659
634D9557o1260m8585L8461N9905n870n4184k5497L7169M7854j0053n0759p685
646c0947M6008K2330l3884k9903J8940L5487k181m0104j8745L8189L8038k7054
658A6174m9596P062M6535J1472l5672k9865J6684M0286L728m2644k0659L7685
670A190L4190k4814l7839Q046L6731J2382k8893k8687J8680M2852k128m4497j1809
$$ plain form
586 43103 39559 -24142 -49725 5598 51045 13996 -46588 -41061 17528 43478 -3519 -58595
598 -58595 -34285 39443 47130 -25119 -64341 -12737 49663 33352 -35751 -57179 4953 60859
610 60859 21906 -50502 -38441 36925 55408 -7307 -55539 -23757 41859 47312 -20102 -61231
622 -61231 -9921 54087 28826 -44728 -55088 6956 47864 7995 -56734 -49159 23898 49557
634 49557 -11703 -60288 -21827 38078 32208 -21976 -47473 -10304 37550 27497 -23262 -30947
646 -30947 15061 37391 3507 -26396 -7456 28031 25850 -14254 -32999 5190 43228 16174
658 16174 -33422 -26360 20175 31647 -4025 -33890 -17206 23080 26808 -15836 -36495 1190
670 1190 35380 10566 -27273 -19227 17504 29886 993 -27694 -9014 33838 31710 -12787 -24596
683b4596L8729K3440k8150l5924J0068M2805J1924m4840l5882L5035N0951j9474
695B4086n9882o609N2033L1314l5841n3428Q486O5233K2960o0079n0339L9215
707b2851O9113n099p0640l5167N4825P0800k1682q5477j5682Q0377M9810n5020
719A3307p1797J4714P3744K5250o1608n9847L4700P9216j644q2289l4987O2349
731h892O2785k9067q0021j5489P7503N7222n2612q1827J5978Q6009K5022o5895
743i284n7225L3700P5136P342p3317m1733N7587O6600k5475p2170j1110O0146
755A0197M1672l6629o1741O138O6919K2596n6851m4379L4211N3008o867n2639
767b4365k0887M2816M4372k5109n7908M027O0471K0265m5726l6696K4279M6202
$$ plain form
683 -24596 14133 37573 9423 -26501 -16433 26372 38296 -6544 -42426 -7391 43560 24086
695 24086 -35796 -42405 9628 40942 5101 -48327 -39841 25392 48352 -11727 -62066 -22851
707 -22851 46262 41163 -29477 -64644 -9819 60981 39299 -46178 -61860 18517 68327 13307
719 13307 -58490 -43776 29968 55218 -6390 -66237 -31537 47679 46035 -36254 -71241 -8892
731 -8892 53893 24826 -55195 -70684 6819 64041 11429 -70398 -54420 31589 56611 -9284
743 -9284 -66509 -32809 42327 49669 -23648 -65381 -7794 58806 33331 -38839 -49949 10197
755 10197 51869 15240 -46501 -40363 26556 49152 -7699 -52078 -17867 35141 28274 -24365
767 -24365 -45252 -2436 41936 16827 -41081 -37054 23417 43682 -2044 -38740 -14461 31741
779C1741J933m4685k2840L8500M2266k3752n0876M091N0575K0388l9456m3602
791c5717J7163N6175R109n5958l2499M2775M6928k1203n1692o131M3990K9094
803D2034l0155m6632J2341N5872R827n2968l0750L8249M7134j2051n4001j8230
815c9330M8972M5260l2107o0102R429O2807J6322n1945m1348K7441N5598J432
827D2429n9956l1941M9047N3387k7097o2837l971N5472L1120l7941n2988J1452
839c3824O2015J5453n6255l8802L9045N3147j1329n5559j9650M5251M5770k4746
851B0516n9727K98N8816K3864m3970l9962J9107M4993O094m2615k8050L1106M2236
864C2706j5517m7654k750M0798K1516k7050l5998N762M1953J4704l7359k8348
$$ plain form
779 31741 33674 -11011 -33851 4649 46915 23163 -27713 -23622 26953 47341 7885 -35717
791 -35717 -18554 37621 46730 -9228 -41727 1048 47976 26773 -24919 -31050 12940 42034
803 42034 11879 -34753 -22412 33460 43287 -9681 -40431 -2182 44952 32901 -21100 -39330
815 -39330 9642 54902 22795 -37307 -27878 34929 51251 -694 -42042 -14601 40997 42429
827 42429 -17527 -49468 -421 52966 25869 -36968 -40939 14533 45653 7712 -45276 -33824
839 -33824 28191 43644 -12611 -51413 -12368 40779 29450 -26109 -45759 -508 45262 20516
851 20516 -39211 -38913 19903 43767 -203 -40165 -21058 23935 30029 -12586 -40636 -9530 32706
864 32706 17189 -30465 -33215 7583 29099 2049 -33949 -28187 13766 28470 -8889 -37237
876c7237K6075L5624j0133l4047n069K7514K0094j6889k9235N088L5460O963l1824
889g616j6904K3564K4523r462k7666o647K5766K0297j9562k9481J1971L4122j596
902B1309l2630j1588K4903K4904j1189l4196n580L6995K1396l0403l1161J8630
914h610L6568j312l4852j7896K7108L5302j2733m5811n114M7292K4640l5146m0219
927c0783J2519M5981J3240m1364l6944K7297N1214q096n4391j3359M5604L2990
939D3908k8494m8948J740N4616K6653m7148n0489K6936O1197K382n7864l3479
951d8990L8508N5267r873o4510k1857N8337M7284l6998o2502M870O1445K8017
963D8998m6366n5306J9048O7398J1870o2267l8383M1055N3476j1057n6456k0028
$$ plain form
876 -37237 -11162 24462 14329 -19718 -24787 2727 22821 5932 -23303 -18215 17245 24208 -7616
889 -7616 -24520 -956 23567 14105 -13561 -20208 5558 25855 6293 -23188 -11217 22905 21309
902 21309 -11321 -22909 1994 26898 15709 -18487 -24067 12928 34324 3921 -27240 -8610
914 -8610 27958 26646 -8206 -26102 1006 36308 23575 -22236 -27350 19942 44582 9436 -30783
927 -30783 -18264 27717 40957 -407 -37351 -10054 41160 33064 -21327 -34686 10918 43908
939 43908 15414 -33534 -31794 22822 49475 2327 -48162 -21226 39971 42353 -15511 -48990
951 -48990 -10482 44785 34912 -29598 -51455 6882 54166 17168 -45334 -40464 20981 48998
963 48998 2632 -52674 -33626 33772 45642 -16625 -55008 -13953 39523 28466 -27990 -48018
975d8018M5296M4027k6606n7690L295N7602J9943m5547l8776K2278M9111M226
987B9141m9500k8538L9083M5085k1384n0545O10M6148K0795l3033l8068J4160
999b6046M7774Q020m7536k6851L7758M1441j7038m5508p242M0454K8999k6508
1011G717m4183R487M9886R222m4767k4986L1967L7527j1860m3635j1460M1169
1023F084L3136k9192m6471J1221N0016J1203m0305l0629K3065M4224J60m8046
1035a5534k1392M1923M0957k5197m9008J075M7500K3872l2864m3653J1797N1326
1047C0802J0735m6153k8600L1079L8615j1533m0950j0792L4711L0019k3866m3792
1059b9725P838M7725J1245m1233k8789K4499M1002j882m3607k1163L7481L8306
$$ plain form
975 -48018 -2722 41305 14699 -42991 -39696 17906 37849 -7698 -46474 -24196 24915 29141
987 29141 -20359 -48897 -9814 35271 13887 -36658 -36048 10100 30895 -2138 -40206 -26046
999 -26046 21728 29748 -17788 -44639 -6881 34560 17522 -27986 -35228 5226 34225 7717
1011 7717 -36466 -26979 22907 32129 -12638 -37624 -5657 31870 20010 -23625 -35085 6084
1023 6084 39220 10028 -36443 -25222 24794 35997 -4308 -34937 -11872 32352 32512 -15534
1035 -15534 -36926 4997 45954 20757 -28251 -27176 20324 44196 11332 -32321 -20524 30802
1047 30802 41537 -4616 -33216 -2137 36478 24945 -16005 -26797 7914 37933 14067 -29725
1059 -29725 -21887 25838 37083 -4150 -32939 -8440 32562 30680 -12927 -34090 3391 41697
1071D1697k2351m6652L275M5085J7909l3819l7151J3477M6721R554m5447l1219
1083c8921L1450M2455j0967m3258j3783L2433L1655j7150m2609k617M2534J7916
1095B9138l2792k9757J6643L3911K790l1375j9671K2162L1318r640l4163j708
1107b3144K9246J2732j9737j9820P705K4392M479k6032j6420K1797K4760j3431
1119F527k7961R15K4409J0964j7592k1220P524K6626J032k6740r234K4678J6117
1132A6045j7581k0071O524K4939Q472k4144k2063J9599L2993o149l6195p191L1672
1145F850K2460j8445l3985J253L9101J8158l5515l4109K2124M2521k161m1654
1157a3402j9710K9926L7739j1495m6520j0037M4550K8607l0839l9087J1279M2264
$$ plain form
1071 41697 19346 -27306 -24031 21054 38963 5144 -32007 -18530 28191 37745 -7702 -38921
1083 -38921 -7471 34984 24017 -19241 -33024 -591 31064 13914 -28695 -31312 11222 29138
1095 29138 -3654 -33411 -16768 17143 19933 -11442 -31113 -8951 22367 12727 -21436 -23144
1107 -23144 6102 18834 -903 -20723 -13018 11374 15853 -10179 -26599 -4802 19958 6527
1119 6527 -21434 -20519 3890 14854 -2738 -23958 -16434 10192 11224 -15516 -24750 -72 16045
1132 16045 -1536 -21607 -15083 9856 18328 -5816 -27879 -8280 24713 18564 -17631 -24822 6850
1145 6850 29310 10865 -23120 -21867 17234 35392 -123 -34232 -12108 30413 28252 -13402
1157 -13402 -33112 -3186 34553 23058 -23462 -33499 11051 39658 8819 -30268 -18989 23275
1169B3275J2675l6222l2240K3014M7784l433m9953j6833M1563L5053k2329m5042
1181b2688k112M4514K5087l5658m3458J8681N0387K147m7815k4918L2105M2183
1193C8455j0261n1401j7385M6503L9530k8836n1587L693M9578K2172l5827m0060
1205c5426J4681M9082P593m6919k6025L5185L8432j4891m2759q491L6803K8547
1217C5812k3618m3271M611M5164J2812l8215k7676K0489L4509j922l6113j7871
1229c5289K9602L1492j8816l9280L969L7936J2978k7698k5748J2747L3308M332
1241A9533l3233j7016K7967K7619j6925l1316K611L0207J2905k2757k7394J1705
1253a6094L5808J164l7142j5630K9790K6487j5725l3691k684L3733K0304k7893
$$ plain form
1169 23275 35950 -272 -32512 -9498 38286 34853 -15100 -31933 9630 44683 22354 -22688
1181 -22688 -24800 19714 44801 9143 -34315 -15634 34753 36900 -10915 -35833 -3728 38455
1193 38455 28194 -23207 -40592 5911 45441 16605 -34982 -31289 18289 40461 4634 -35426
1205 -35426 -20745 28337 35930 -10989 -37014 -1829 36603 21712 -21047 -29538 7265 35812
1217 35812 12194 -31077 -26466 18698 31510 -6705 -34381 -13892 20617 18695 -17418 -35289
1229 -35289 -5687 25805 6989 -32291 -28322 9614 22592 -5106 -30854 -18107 15201 19533
1241 19533 -13700 -30716 -2749 24870 7945 -23371 -20760 9447 22352 -405 -27799 -16094
1253 -16094 19714 20878 -16264 -31894 -2104 24383 8658 -25033 -27717 6016 26320 -1573
1265a573l4940J6794M2847R80m0770j9809K9711L6073p864m1755j4798L9153L4260
1278C8309k4126m3675N420M3614J6275l2166l4095J5338M3841M752m4881k3927
1290c5321L4842L7227j6205m2954o229L6807K7522k3531m1769N492M3994J3442
1302C3317l6584k6919K1590L6492j514l6963j7904L0611L4722j6966m1512N52
1314b1078L8981J6704k6426k9341R131L4123Q692l1860k3428K2401L0277j0557
1326A7619l1458m487K5268J7295j5537k7815J600L0086J0595k6423j9024J6982
1338e299K2293n106k1876o312J8851J7061j3661k3606O496K6736J780k3925j0782
1351a7350J6118J7786n087k2758o971K1893J5742j8287k2770J0295K3701r9k3503
$$ plain form
1265 -1573 -36513 -19719 23128 24108 -16662 -36471 -6760 29313 21449 -20306 -35104 4049 38309
1278 38309 14183 -29492 -24072 19542 35817 3651 -30444 -15106 28735 33487 -11394 -35321
1290 -35321 -479 36748 20543 -22411 -28640 8167 35689 12158 -29611 -24119 19875 33317
1302 33317 -3267 -30186 -8596 27896 26382 -10581 -28485 2126 36848 19882 -21630 -21078
1314 -21078 17903 34607 8181 -21160 -12029 22094 30786 -1074 -24502 -2101 28176 17619
1326 17619 -13839 -18326 6942 24237 8700 -19115 -17515 12571 23166 -3257 -22281 -5299
1338 -5299 16994 11888 -9988 -16300 2551 19612 5951 -17655 -11159 15577 17357 -6568 -17350
1351 -17350 -1232 16554 11467 -11291 -18262 3631 19373 1086 -21684 -11389 12312 12213 -11290
1364a1290j2494J7375K3836p773l1951n663L2160J8157k4477k6446J0941K9677
1376A2052O669k6803k2040J9353L3769o185l7217r150L3305K3322j9498l4032
1388b6455Q59L7052J9571l1167l5838J7025M2421R44l8941j9147K6624L3356q839
1401A7465m0872j0827L9232K8568k6878l9299Q767M0716J3382l1316l0582J5867
1413a5777M2476K986m1741j9827L2810L2696j5602l7051l831L4540K3153k4780
1425A0052l7596R884M2337P108l6664k3075K3145L1977l955l5105j4064K9783
1437C827K8640j9133l6467N643L5927J1440k8138k5899J4322L4874L002l6106
1449h068j8408K9164K9563j5741l2886j018K9374J6380k0854k8529Q402L4376
$$ plain form
1364 -11290 -23784 -6409 17427 9654 -22297 -27960 4200 22357 -2120 -28566 -17625 12052
1376 12052 18721 -8082 -30122 -10769 23000 16815 -20402 -29552 3753 27075 7577 -26455
1388 -26455 -25596 11456 31027 -140 -35978 -18953 23468 24412 -14529 -33676 -7052 26304 17465
1401 17465 -23407 -34234 4998 33566 6688 -32611 -23844 16872 30254 -1062 -31644 -15777
1413 -15777 26699 29685 -12056 -31883 927 33623 18021 -19030 -22861 11679 34832 10052
1425 10052 -27544 -17660 24677 31785 -4879 -27954 -4809 27168 23213 -11892 -25956 3827
1437 3827 32467 13334 -23133 -17490 18437 29877 1739 -24160 -9838 25036 28038 -8068
1449 -8068 -26476 2688 32251 16510 -16376 -17394 11980 28360 7506 -21023 -12621 21755
1461B1755L573l3634j6205K4689K5024j1054l0259o040K7973K0377k0965l1473
1473b6239J0228L4406K742l0990j5754K1165K7238p721l4112q361L3539K3522
1485B9663k5252l4163R317L6940Q917l0503k5779J6910L6437o09l9787j6177L3201
1498h85K8985j8582l6841j170L5478K1535k6180l6899J0105M2930P507l7336k3402
1511c4755K3922L3409m637l5541j4600L0320L0545j8502l8293K452L7339J5268
1523B6927k7352k8525J0424L5781Q689l3339k3618K3788L2146r669l2220o196
1535b3164K6529K0241j5304k8988K244L1865J0667k7260k0273J7288K6163l009
1547A6999k5184j1178J9659K2309j0690k7523J397K7685P508k1673j5967J2971
$$ plain form
1461 21755 25328 -8306 -24511 178 25202 14148 -16111 -22151 5822 26199 5234 -26239
1473 -26239 -16011 18395 21137 -9853 -25607 -4442 22796 15075 -19037 -27398 6141 29663
1485 29663 4411 -29752 -20435 16505 25422 -5081 -30860 -13950 22487 21878 -17909 -34086 -885
1498 -885 28100 9518 -27323 -28493 6985 28520 2340 -34559 -24454 18476 25983 -11353 -34755
1511 -34755 -10833 22576 17939 -17602 -32202 -1882 28663 10161 -28132 -25680 11659 26927
1523 26927 -425 -28950 -18526 17255 25944 -7395 -31013 -7225 24921 15252 -16968 -23164
1535 -23164 3365 23606 8302 -20686 -18442 13423 24090 -3170 -23443 -6155 20008 16999
1547 16999 -8185 -19363 296 22605 11915 -15608 -14211 13474 20982 -691 -16658 -3687
1559c687K2128K08k5262j2243K2405K1973j3927k6646L021K4676Q782j7488j8461
1572a4521P686K4102K415k5076j1320K0634J8455j2672k2216J506K0874J1021
1584B0888j6383k1248Q541K6027r6k5773q794K0439J5858j2007k1406J06K4129
1597A0281J2055k2403k2833J4874K8356k849k8080j0823K0863K2631r459l0396
1609a7783m625L1225J7017k5709k7790J3362L1826M013l0285k1641J9900L4284
1621B3794n360l8731j1345L3230K4095j9207l2304J468L2534J7200k6663l0904
1633c2193J4406L8257K286l6744j7832K5087L1056p212l5926j2651L2362K8110
1645B9006k0527l5194M239L4120J1520k4814k4412J1564L1277L434l1965j6080
$$ plain form
1559 -3687 18441 18649 -6613 -18856 3549 25522 11595 -15051 -12030 12646 21428 3940 -14521
1572 -14521 -6835 17267 19682 -5394 -16714 3920 22375 9703 -12513 -11007 9867 20888
1584 20888 4505 -16743 -8202 17825 17729 -8044 -16838 3601 19459 7452 -13954 -13848 10281
1597 10281 22336 -67 -22900 -8026 20330 17481 -10599 -21422 -559 22072 12613 -17783
1609 -17783 -22408 8817 25834 125 -27665 -14303 17523 21536 -8749 -30390 -10490 23794
1621 23794 18434 -20297 -31642 1588 25683 6476 -25828 -24360 8174 25374 -1289 -32193
1633 -32193 -17787 20470 22756 -13988 -31820 -6733 24323 17111 -18815 -31466 896 29006
1645 29006 8479 -26715 -22476 11644 23164 -1650 -26062 -14498 16779 20213 -11752 -27832
1657b7832K4698K5678j2043k8482k439K5504J6747j6701k6270O334L0242N221
1669B0657k7295j4009J9951K1286p764k4751n160K4559J7840j8431k6582Q876
1681a0823K8726L394k5303j4305J5879K3131l940k7875q589K6582J9894k0032
1693F739k7298P644K9304P269k4325k0970J4174L0281j089l2105j0934K6730K1107
1706B6527j5917k6513J839K6963J3258k2490k6141J3264L3004l45l3323j4351
1718b4225K3850K5744r673l1699p957K9786K1635k2324l0982R395L3080N390k8545
1731f525j9773J7200L0769k466l4163j3480K9782K5971j7867l1394N82L0223J5851
1744B4710k1790k8938R034L4923M601l3215j8237K3614K6926q482l1066q990K7131
$$ plain form
1657 -27832 -3134 22544 10501 -17981 -20420 5084 21831 5130 -21140 -14806 15436 20657
1669 20657 -6638 -20647 -696 20590 12826 -11925 -17085 7474 25314 6883 -19699 -10823
1681 -10823 17903 21297 -4006 -18311 -2432 20699 16759 -11116 -19705 6877 26771 6739
1693 6739 -20559 -12915 16389 23658 -667 -21637 -7463 22818 21729 -10376 -21310 5420 26527
1706 26527 10610 -15903 -14064 12899 26157 3667 -22474 -9210 23794 23449 -9874 -24225
1718 -24225 -375 25369 15696 -16003 -23960 5826 27461 5137 -25845 -16450 16630 22020 -6525
1731 -6525 -26298 -9098 21671 19205 -14958 -28438 1344 27315 9448 -21946 -21364 8859 24710
1744 24710 2920 -26018 -16984 17939 22540 -10675 -28912 -5298 21628 13146 -17920 -26910 221
1757B21K3686j7658l2652L565L2719J0205k4875k1014J2395K7580K203k7761j5816
1770b7202K3025K5996j1323k9432j705K6182J4848j6217k3362L707K7130P907
1782A9554k4370j5819J6590K0147p064k0580l381J7574J3972j2937k1114M208
1794a3220K4886M337k1811j2200J4367J7874l687j9490n982J9025J5012j4293
1806D818j9803P846K2345J175j9724j0613J4062J9212m708k3408o042K2829J4796
1819B2785j7205k0743P694K1279M314j9798j6076J3880K4760m749k8564o737K5305
1832F145J7083j6145k3578K850K5780J1673k2462k2926J4076K9606k351k8962
1844i211j0254K2387K1260j0632k8728m498K9257J8131k2365k8471Q981L0171
$$ plain form
1757 221 23907 6249 -26403 -22838 9881 20086 -4789 -25803 -13408 14172 16375 -11386 -27202
1770 -27202 -4177 21819 10496 -18936 -20641 5541 20389 4172 -19190 -15483 11647 19554
1782 19554 -4816 -20635 -4045 16102 9038 -11542 -14923 2651 16623 3686 -17428 -13220
1794 -13220 11666 16003 -5808 -18008 -3641 14233 10546 -8944 -14926 4099 19111 4818
1806 4818 -14985 -7139 15206 16381 -3343 -13956 106 19318 14610 -8798 -14840 7989 22785
1819 22785 5580 -15163 -7469 13810 18124 -1674 -17750 -3870 20890 16141 -12423 -19160 6145
1832 6145 23228 7083 -16495 -13645 12135 23808 1346 -21580 -7504 22102 19751 -9211
1844 -9211 -19465 2922 24182 13550 -15178 -19676 9581 27712 5347 -23124 -14143 16028
1856A6028N394k6028j9214J5124K8320k861l1728j0553K7180K1343j7424k7129
1868b1548J914K7702J3288k0481k5884R586L1428L689k8558j5072J9503K2447
1880A8014n855k5458p459K3297J8398j6568k5850O474K6754M982k2343j5940J2045
1893i509K2688p91k4219j0383K1060J8142j3732k1706L965K1445P000j7120j6426
1906a9586J0631K3531q79k5150q073K1149J6772j1988k1144R87K1635J1279j8504
1919F60k0527J2109K6057k520k6255q880K0801J8750r777k5707l563K5842J6685
1932B3675k0742k4514J0019K7569L321k4521j5200J6405K5966m788l0358p709
1944b0877K8809J9525j9289k6920N381K8133J0779k3058k3404J1981L0922J46
$$ plain form
1856 16028 21422 -4606 -23820 -8696 19624 16763 -14965 -25518 1662 23005 5581 -21548
1868 -21548 -19634 8068 21356 875 -25009 -15423 16005 19694 -8864 -23936 -4433 18014
1880 18014 12159 -13299 -20758 2539 20937 4369 -21481 -15007 11747 16729 -5614 -21554 -9509
1893 -9509 13179 12388 -11831 -22214 -1154 16988 3256 -18450 -14485 6960 13960 -3160 -19586
1906 -19586 -8955 14576 13697 -11453 -19526 1623 18395 6407 -14737 -13750 7885 19164 660
1919 660 -19867 -7758 18299 15779 -10476 -19356 1445 20195 10418 -15289 -18852 6990 23675
1932 23675 2933 -21581 -11562 16007 19328 -5193 -20393 -3988 21978 17190 -13168 -20877
1944 -20877 7932 27457 8168 -18752 -13371 14762 25541 2483 -20921 -8940 21982 22128
1956B2128l0788j2512K3269K2097j0659k8256m376K7251J8258k0681k8605R128
1968a3746L1595M160k6922j7558J6215K6435j971k8520j1962K4908K2046j5422
1980I258k7680K803K6963J1308k0657k3004Q945K8788M027k7618j5689J8684K2948
1993A9076p725k4317o172K0712J6668j3641k4346M079K5851N621k1510j4407J2374
2006g737K0039j128k1025r815J7353J7643j0012k0657K219J8895N846j4162j2598
2019a5139P716J7768l06j9796p773J7918J3708j1824j7186L221J7252N289j4205
2032c357j3735R240J8542j772k0674m707J8472J2167j2089j7659K542K0390R281
2045A6641j8180j8412J2422K3251k283k2659p834J7794J7118q229k3440k067K4273
$$ plain form
1956 22128 -8660 -21172 2097 24194 13535 -14721 -19097 8154 26412 5731 -22874 -13746
1968 -13746 17849 22009 -4913 -22471 -6256 20179 18208 -10312 -22274 2634 24680 9258
1980 9258 -18422 -15619 11344 22652 1995 -21009 -12064 16724 20751 -6867 -22556 -3872 19076
1993 19076 11351 -12966 -19138 1574 18242 4601 -19745 -15666 10185 15806 -5704 -20111 -7737
2006 -7737 12302 11174 -9851 -19666 -2313 15330 5318 -15339 -13120 5775 11621 -2541 -15139
2019 -15139 -7423 10345 10039 -9757 -17530 388 14096 2272 -14914 -11693 5559 10848 -3357
2032 -3357 -17092 -7852 10690 8918 -11756 -16463 2009 14176 2087 -15572 -13030 7360 16641
2045 16641 -1539 -19951 -7529 15722 13439 -9220 -17054 740 17858 9629 -13811 -15878 8395
2058H395J3160j9761k1718J0666K4879K376k2087j5098J4323K4017l085k7177
2070a1110p296K3523J6793j5036k2224L485K3050R975j9755k0703J2256K7383
2082B0341j048k7068j0773K0646J9628r014k4164l869K3030J5698j8014k2852
2094a7459P906K5365L136k2248j4321J3954K2768l375k5864r434K3267J8686j4742
2107G639k3474K789K2438R105j7711j8343Q989K3520R19k4288j0251J8985J6935
2120A7252r275k0545k432J9472J3062j4244k0997O531K2420K092j9678j0284J3187
2133c439J6172m841j9559n249J9750J2857j5509j8942P595K0476K796j8164j1602
2146a7659J1260J8491l627k1251m615K0650J1800j5351j7342O020K0111N471j9038
$$ plain form
2058 8395 21555 1794 -19924 -9258 15621 17997 -4090 -19188 -4865 19152 16067 -11110
2070 -11110 -18406 5117 21910 6874 -15350 -11865 11185 21160 1405 -19298 -7042 20341
2082 20341 19293 -7775 -18548 2098 21726 12712 -11452 -15321 7709 23407 5393 -17459
2094 -17459 -9553 15812 18948 -3300 -17621 -3667 19101 15726 -10138 -19572 3695 22381 7639
2107 7639 -15835 -13046 9392 18497 786 -17557 -8568 14952 15871 -8417 -18668 317 17252
2120 17252 7977 -12568 -15000 4472 17534 3290 -17707 -11176 11244 13336 -6342 -16626 -3439
2133 -3439 12733 7892 -11667 -16916 2834 15691 182 -18760 -11165 9311 12107 -6057 -17659
2146 -17659 -6399 12092 8465 -12786 -17401 3249 15049 -302 -17644 -11624 8487 13958 -5080
2159e080j6183J3405K4252l847k6786o427K2140J6524j2657k2586Q36K4278J1378
2172A9247k0446k1794J2883K6530K33k5620j2761J8370K3027n798k7858p027K5564
2185D550J8545j7457k4808N548K5700Q162k0797j9717J2152K7139o14k7494j0806
2198a9897K1501J9999r924k3971l091K2156J5590j5430k2902N738K5140M242k1839
2211b688j3072J3758K0039k947k2830q617J9984J7899j2815k2509K845K1983P102
2224A8132j6265j5519P849J9447J206j9600r621J6761J4873r665j8097j6J7595
2237G080R409j2975j7230N599K0951J344j9519q659J4088J3244o372j6561j891
2250a1492J5777J0202j3878j6038P527J8781m01j7112p968J1734J3770m116j7555
$$ plain form
2159 -5080 -21263 -7858 16394 12547 -14239 -20666 1474 17998 5341 -17245 -16409 7869 19247
2172 19247 -1199 -22993 -10110 16420 16653 -8967 -21728 -3358 19669 13871 -13987 -21014 4550
2185 4550 23095 5638 -19170 -13622 12078 20240 -557 -20274 -8122 19017 18403 -9091 -19897
2198 -19897 1604 21603 11679 -12292 -15383 6773 22363 6933 -15969 -10231 14909 19151 -2688
2211 -2688 -15760 -2002 18037 15090 -7740 -16357 3627 21526 8711 -13798 -10953 11030 18132
2224 18132 1867 -13652 -5803 13644 14850 -4750 -14371 2390 17263 7598 -10499 -10515 7080
2237 7080 16489 3514 -13716 -8117 12834 14178 -5341 -14000 88 13332 6960 -9601 -11492
2250 -11492 4285 14487 609 -15429 -7902 10879 10478 -6634 -14602 -2868 10902 6786 -10769
2263a0769m042J7878J0268j4167j5387P796J7684R64j7124j0403J2518J8674n442
2276H448k2244l589K0209J1813j4164j7270M532J9413N779j7471j5868J2829K1512
2289A3929l584k3623o624K0303J5481r967k2418j512K3253J3589j8638k1085R732
2302a1164K4210J848k1174j2494J4492K0536l753k4206o225K1755J6024j4391
2314E458k1323K890K1965R146j6917j8255Q668K2908P40k2062r767J7453J5845
2327A6749p666j9402k535J9203J2238j4212j8917P130K1311K107j7928j0316J1317
2340i21J5699k206j8135n855J7004J2607j2774j6688N232J8065L040j5129j2280
2353a2341R523J7969k436j9476o090J7201J1288j0844j5365K936J6003N483j4192
$$ plain form
2263 -10769 -14811 3067 13335 -832 -16219 -8423 9261 10225 -6899 -17302 -4784 13890 8448
2276 8448 -13796 -17385 2824 14637 473 -16797 -12265 7148 12927 -4544 -20412 -7583 13929
2289 13929 10345 -13278 -19902 401 15882 5915 -16503 -18015 5238 18827 189 -20896 -11164
2302 -11164 13046 14894 -6280 -18774 -4282 16254 12501 -11705 -17930 3825 19849 5458
2314 5458 -15865 -12975 8990 18136 1219 -17036 -8368 14540 15280 -6782 -16549 904 16749
2327 16749 9083 -10319 -12854 6349 18587 4375 -14542 -7412 13899 16006 -1922 -12238 -921
2340 -921 14778 12572 -5563 -11418 5586 18193 5419 -11269 -6037 12028 15068 -61 -12341
2353 -12341 -2818 15151 12715 -6761 -12851 4350 15638 4794 -10571 -7635 8368 13851 -341
2366c41j3259R631J8496l112j9469n167J6117J2218q756j7799K17J8303Q994j6058
2380A5j5750J0030J8752k277j8996p333J4572J5435p456k1041k164K1216J0984
2393A5987j6965j7681P554K0259L184j8216j3661J2596K0661l768k3671n581K1269
2406A967J4619j3382k0608J833K1814J0256j8274j9427J0363K3877n1k2030j0546
2419a9589J5812J7610n214k2187n305K1108J5045j5251k1075N966K2364N393j8123
2432c446j5171R989K1296J79k1348r279J7966J6157r935j8345O05J7390R843j3545
2446B356j6790O537K0793K061j9153r811J3400J5158m729j6866m016J5280J1774
2459A5994j1098j6832N344J7730J752j4861r452J0521J4658k577j7146n313J6263
$$ plain form
2366 -341 -13600 -3969 14527 11415 -8054 -13221 2896 15114 6358 -11441 -11224 7079 16073 15
2380 15 -15735 -5705 13047 10770 -8226 -15559 -987 14448 6992 -14049 -16213 5003 15987
2393 15987 -978 -18659 -11105 9154 12338 -5878 -19539 -6943 13718 9950 -13721 -19302 1967
2406 1967 16586 3204 -17404 -15571 6243 16499 -1775 -21202 -10839 13038 12987 -9043 -19589
2419 -19589 -3777 13833 8619 -13568 -18873 2235 17280 2029 -19046 -13080 9284 14677 -3446
2432 -3446 -18617 -8628 12668 12847 -8501 -17780 186 16343 6408 -11937 -11332 6058 15901 2356
2446 2356 -14434 -7897 12896 14957 -4196 -14007 -607 14551 9822 -7044 -11060 4220 15994
2459 15994 4896 -11936 -6592 11138 12890 -1971 -11423 -902 13756 11179 -5967 -11280 4983
2472D983J1233j0921j4309L688J4802L801j2410j0549Q082J5796k457j8002m029
2485a0292J5761R955j0329j4647K180J5314O365j4032j2972Q959J6809l329j7288
2498g546m040J4158J0308p879j5878K73J7920P999j6175j4923R600J8329o80j7638
2512f172q466J2442J6288o231k0287k500J9890J0148j5222j6641O679J8841M223
2525A2992j7886j4200J1397K0851k772k2478o074J7355J4122r155j8600j028J8976
2538C500J0919j5384j8141Q699K1206J003j9129j0148J2617J7233l461j9530n957
2551a6573J7834J3065j1848j6698L708J6801M879j3132j2471P663J7218o12j8134
2564h300o251J5494J1828q792j4225L72J4584P549j1583j3196P500J6404j602
$$ plain form
2472 4983 16216 5295 -9014 -5326 9476 13277 867 -9682 -1600 14196 11739 -6263 -10292
2485 -10292 5469 15424 5095 -9552 -7372 7942 14307 275 -12697 -3738 13071 9742 -7546
2498 -7546 -11586 2572 12880 5001 -10877 -10604 7316 15315 -860 -15783 -6183 12146 11466 -6172
2512 -6172 -14638 -2196 14092 7861 -12426 -14926 4964 15112 -110 -16751 -10072 8769 12992
2525 12992 -4894 -19094 -7697 13154 10382 -12096 -18170 -815 13307 4152 -14448 -15476 3500
2538 3500 14419 -965 -19106 -10407 10799 11802 -7327 -17475 -4858 12375 8914 -10616 -16573
2551 -16573 1261 14326 2478 -14220 -10512 6289 11168 -1964 -14435 -6772 10446 9834 -8300
2564 -8300 -14551 943 12771 3979 -10246 -9874 4710 12259 676 -12520 -5020 11384 9782
2577I782j5683m072J2366J0412o436j4186j210J5825Q346j3219j3608P519J6302
2590A2138r50j4338o531J0233J3172n198j6793j399J7378Q090j3817j3877P187
2603d705J6220J825j4921j0850J0734J6806l905j8947l361J6616R997j0831j4856
2616a0178K652J7088O284j5998j4366J0486J8822k650j9190o596J4734J3802p478
2629G412j8094j923J8933R485j5551j5893Q550J8428P16j7460j0728J1943J8148
2642A3966l929k0894n394J8814J2840j2216j7434K477J8041P361j5051j5911R090
2655h240J9687r58j9703p081J4577J4267o615j7499l699J6791J1966j1992j6658
2668a5157M881J7420K583j4191r721Q376J5090j551j6774n442J5380J1423j0274
$$ plain form
2577 9782 -5901 -9973 2393 12805 6369 -7817 -9027 6798 15144 1925 -11683 -4164 12138
2590 12138 11188 -3150 -9681 552 13724 8526 -8267 -9666 7712 15802 1985 -11892 -4705
2603 -4705 11515 13340 -1581 -12431 -1697 15109 11204 -7743 -11104 5512 15509 4678 -10178
2616 -10178 -7526 9562 15846 -152 -14518 -4032 14790 12140 -7050 -13646 1088 14890 7412
2629 7412 -10682 -12605 6328 15813 262 -15631 -7081 11347 12063 -5397 -16125 -4182 13966
2642 13966 10037 -10857 -16251 2563 15403 3187 -14247 -11770 6271 13632 -1419 -17330 -8240
2655 -8240 11447 10489 -9214 -16295 -1718 12549 5934 -11565 -15264 1527 13493 1501 -15157
2668 -15157 -10276 7144 9727 -4464 -14185 -5809 9281 7730 -9044 -14486 894 12317 2043
2681B043j4175K928J3998N156j1048j1007O244J4803n09j5516m166J2937Q261
2694I949p770j1468J679J2789N982j1480j1818Q186J4741j944j4904m139J2028
2707A831R362o053j3807n6J5740O705j4010j1555R169J4837j687j4889o644J1599
2721E42J3484n006j7466j907J7196Q314j2718j3476N721J5726L170j5175j1558
2734a3153J1121J7427m147j9249m168J6415J1506r446j6302O05J7165P983j4916
2747H41j4640R224J7448j243j7000p304J2569J4084n073j8743l366J8134J1110
2760A6041j3068j6368M722J7107M107j4603j1766Q860J6903k016j8705n214J5207
2773A207J1856r450j5332K08J5652Q384j1830j5489O177J7314Q61j5249p648J0281
$$ plain form
2681 2043 -12132 -9204 4794 9950 -1098 -12105 -5861 8942 8433 -7083 -11249 1688 9949
2694 9949 2179 -9289 -7610 5179 11161 -319 -12137 -3951 10790 8846 -6058 -10197 1831
2707 1831 11193 5140 -8667 -8723 7017 13722 -288 -11843 -2674 12163 10476 -4413 -11057 542
2721 542 14026 9020 -8446 -10353 6843 15157 2439 -11037 -5316 10410 13580 -1595 -13153
2734 -13153 -2032 15395 11248 -8001 -12169 4246 15752 6306 -9996 -9391 7774 15757 841
2747 841 -13799 -4575 12873 11630 -5370 -12674 -105 13979 8906 -9837 -13203 4931 16041
2760 16041 2973 -13395 -8673 8434 12541 -2062 -13828 -4968 11935 9919 -8786 -14000 1207
2773 1207 13063 3613 -11719 -11511 4141 12525 695 -14794 -8617 8697 9558 -5691 -13339 -3058
2787c058J2089l593j4481l263J4111R241j0780j3470N128J4333J737j1781q183
2800a1970P446J1967j270j3649m022J2847Q025q929j0920L712J1996K694j0779
2813b852r014P906J3362k981j4672k158J3016P209q121j0805K076J3245M147j2855
2827b497r528R939J3350l881j5102k640J2608J0001p215j4844M78J6703O685j4088
2841c1j2741Q867J5446q93j4740p983J2321J4120n868j8146j771J8030R134j2951
2855B794j4435L967J6936N475j5273j2531R678J7375k458j7855n455J4668J1585
2868A4471p194j6555j284J7132R791j4002j5387P045J7339P89j5115q839R674
2881b135J4522l044j6788m336J5548J0079j0934j3919L127J4828M945j2606j2114
$$ plain form
2787 -3058 9031 5438 -9043 -12306 1805 11046 266 -13204 -8076 6257 7994 -3787 -11970
2800 -11970 -4524 7443 6173 -7476 -11498 1349 9374 445 -10475 -6763 5233 7927 -2852
2813 -2852 -11866 -3960 9402 6421 -8251 -10409 2607 9816 1695 -9110 -7034 6211 10358 -2497
2827 -2497 -12025 -2086 11264 7383 -7719 -10359 2249 12250 5035 -9809 -9331 7372 14057 -31
2841 -31 -12772 -3905 11541 10648 -4092 -12075 246 14366 8498 -9648 -11419 6611 15745 2794
2855 2794 -11641 -7674 9262 14737 -536 -13067 -3389 13986 11528 -6327 -11782 2886 14471
2868 14471 7277 -9278 -10562 6570 16361 2359 -13028 -5983 11356 12145 -2970 -11809 -2135
2881 -2135 12387 9343 -7445 -11781 3767 13846 2912 -11007 -7880 6948 11893 -713 -12827
2894a2827O785J6196o39j6200n545J2645J0113o619j2850k25J2710P210j0931
2907a77j2310O593J4116n03j3265n687R134J0660l559j3238k509J2860P676j0739
2921i48j0631N808J1887L45j1364o596Q822J1385l881j4219j764J3999P317j0458
2935b98j0486M158J2038K911j1478q537Q402J3247m276j4521k002J3315Q067q182
2949B358j2882J504J5115N806j3405j1676R090J4765k366j4815m520J1705J1251
2962A1930o161j5619n49J6757P542j2920j3005O231J5294K452j3809j0261R526
2975b592J5549l015j7299l411J4991R408r280j3853K298J4393O460j3034j2560
2988a1945P785J6301j168j5537o105J1210J1467m223j4471k882J3959Q942j0955
$$ plain form
2894 -12827 -6042 10154 9515 -6685 -12230 415 10528 3909 -8941 -9166 3544 10754 -177
2907 -177 -12487 -5894 8222 7719 -5546 -11233 -2099 8561 5002 -8236 -10745 2115 9791 -948
2921 -948 -11579 -5771 6116 6461 -4903 -11499 -2677 8708 4827 -9392 -11156 2843 10160 -298
2935 -298 -10784 -6626 5412 8323 -3155 -11692 -3290 9957 5681 -8840 -10842 2473 10540 2358
2949 2358 -10524 -9020 6095 11901 -1504 -13180 -4090 10675 8309 -6506 -11026 679 11930
2962 11930 5769 -9850 -10399 6358 13900 980 -12025 -5794 9500 11952 -1857 -12118 -2592
2975 -2592 12957 9942 -7357 -10768 4223 13631 4351 -9502 -7204 7189 13649 615 -11945
2988 -11945 -4160 12141 10973 -4564 -10669 541 12008 7785 -6686 -9568 4391 13333 2378
3001B378j2731N263J4252J360j2658q297Q480J3060k616j4863l919J3459Q611
3014A1779q832j1391K238J1363M574r837j0058O329J3099k223j3312l566J1085
3027A248Q222o146j2005J61J2060N960j0402j0419O821J2440k325j1433l470R032
3041b56Q553m986j2350k32J3405N788j1735r827O367J2023Q2j1601o410Q717J1631
3056I169n164j4003o26J4181O450j0927j0919M747J3583L039j3446r844J0033
3069c727J4160l705j5319k955J2745R557p578j3327N23J5099O512j2929j2381
3082a3325Q354J5284o79j4711o822J0049J3665l777j6650k568J5380Q621j0607
3095B214j2661M010J3902L662j1989j0252P801J4708j826j5602l957J1895J0385
$$ plain form
3001 2378 -10353 -5090 9162 10522 -2136 -10433 -1953 11107 8491 -6372 -10291 3168 11779
3014 11779 2947 -8444 -6206 5157 9731 -106 -10164 -3835 9264 7041 -6271 -9837 1248
3027 1248 9470 3324 -8681 -8520 3540 9500 -902 -11321 -4500 7940 5615 -5818 -9288 -256
3041 -256 8297 3311 -9039 -9271 4134 9922 -1813 -11640 -5273 6750 6832 -4769 -11179 -2462 9169
3056 9169 4005 -9998 -10624 3557 10007 -920 -11839 -7092 6491 9530 -3916 -13760 -3727
3069 -3727 10433 6728 -8591 -11546 1199 10756 3178 -10149 -9626 5473 11985 -944 -13325
3082 -13325 -4971 10313 9634 -5077 -11899 -1850 11815 8038 -8612 -11180 4200 12821 2214
3095 2214 -10447 -6437 7465 11127 -862 -11114 -3313 11395 9569 -6033 -9990 1905 12290
3108A2290o474j3002o72J3237P285j0867j1995O687J3520p96j2603n148R470R702
3122A0634l434j3349k070J2951P549j0384j0949N082J1313J363j0043p161O945
3135a553J1503k885j3587j410J2039O591q919j0088K921J1374K980j0043q796
3148i873P221J1927k864j2592j739J0297O200o155j0643R22J2347M540j1453r690
3162a1555Q146J1726k404j2038l793R324R455n307j3092J64J3539N573j2235r106
3176a1603P023J1699Q3j2288p205R928J2735m860j5528j211J4230O894r375j1474
3190a0952K615J4046M047j2908j0646R616J4546l511j4824l680J2109J0224o054
3203D628j4647q51J5088P565j1875j1912O284J3817P29j2039p705Q617J2837l177
$$ plain form
3108 12290 5816 -7186 -7858 5379 12664 1797 -10198 -3511 10009 9213 -3390 -8538 932 10634
3122 10634 7200 -6149 -8219 4732 12281 1897 -9052 -3970 7343 8706 -1337 -8498 -1553
3135 -1553 9950 7065 -6522 -7932 4107 10698 1779 -8309 -5388 5986 8966 -1077 -9873
3148 -9873 -2652 9275 6411 -6181 -7920 2377 8577 2422 -8221 -7299 5048 9588 -1865 -11555
3162 -11555 -3409 8317 5913 -6125 -9918 -594 8861 3554 -9538 -9374 4165 9738 -2497 -11603
3176 -11603 -4580 7119 7202 -5086 -12291 -2363 10372 5512 -10016 -11227 3003 9897 522 -10952
3190 -10952 -8337 5709 9756 -3152 -13798 -4182 10364 6853 -7971 -11651 458 10682 4628
3203 4628 -10019 -10870 4218 11783 -92 -12004 -5720 8097 8826 -3213 -10918 -2301 10536 7359
3217G359j4821l020J3904Q521r010j1584J715J2543N130j0321j0231O488J2966
3230I639j529j2927l583J0389P833m985j1072n04J1638O407j0079r768N488J1851
3244H798r19j0422m417P586Q788l696j1054j049J1576N458r944q507N434R914
3258G546O02j0058o476P803J0601l894j2375j091J1451N163q167q841L436J0735
3272F435K412j0822q026Q555J1108l785j2578j900J0705O981o065j1386R50J2656
3286E240M006j1732q472Q240J0877k222j1997m165R494J0233n868j3421q7J3985
3300D111N719j0980j0070N234J1914K035j2071p929R235J2354m190j4755j116
3313a0509J2547P296q097j2051J977J3624N259j1744j1007P804J2767j351j2424
$$ plain form
3217 7359 -7462 -10482 3422 11943 2933 -8651 -6936 5607 10737 416 -9815 -3327 9639
3230 9639 8110 -4817 -8400 1989 9822 4837 -6235 -6739 4899 11306 1227 -8541 -3053 8798
3244 8798 7879 -2543 -6960 626 9414 5718 -5336 -6385 5191 10649 705 -7802 -2368 7546
3258 7546 8148 -1910 -8386 -583 10018 6124 -6251 -7342 4109 9272 1105 -7736 -4300 6435
3272 6435 8847 -1975 -10001 -1446 9662 5877 -6701 -8601 2104 9085 3020 -8366 -7416 5240
3286 5240 9246 -2486 -10958 -2718 8159 5937 -6060 -10225 -731 9502 3634 -9787 -9874 4111
3300 4111 9830 -1150 -11220 -5986 5928 7963 -4108 -12037 -2802 9552 5362 -9393 -10509
3313 -10509 2038 9334 1237 -10814 -8837 4787 10046 -1698 -12705 -4901 7866 6515 -5909
3326e909n000R960J0002m512j3074j190J3188P087j0195j1043M590J2522K211
3339H637j1054p844P179J2348k598j2723k464J1072O964p441r488J840J0885M197
3353I510r906q424O576J1313k029j1206k975Q998O939m450r797j91J0713M565
3367I636r763p600O542R479j752r728l251P946Q321m376j1634L49J1167M542r304
3382E74p784M873R594O54j0304n778Q373J0382n177j2475n9J1883M928q259r418
3397g993K766J1647K703j1156p684Q325J1233m114j2127j681J0033P410o625j1944
3411i207J148J3805M491j2055r392P452J1474n39j2039n597R213J0488m775j3596
3425i129n98J3445N657r795r864L703J1939K586j1163r203Q482J2609k755j3258
$$ plain form
3326 -5909 -10909 -949 9053 4541 -8533 -9723 3465 10552 357 -10686 -6096 6426 8637
3339 8637 -2417 -10261 -3082 9266 6668 -6055 -8519 2553 9517 2076 -7412 -5572 5313 9510
3353 9510 -396 -8820 -2244 9069 7040 -4166 -7141 1857 8796 4346 -5451 -5642 5071 9636
3367 9636 -127 -7727 -1185 8294 6542 -3186 -6437 1509 9830 5454 -6180 -5831 5336 9878 574
3382 574 -7210 -2337 7257 7911 -2393 -8171 202 10584 5407 -7068 -7127 4756 9684 1425 -7993
3397 -7993 -5227 6420 9123 -2033 -9717 -1392 9841 5727 -6400 -8081 1952 9362 2737 -9207
3411 -9207 -8059 5746 10237 -1818 -11210 -3758 7716 7177 -4862 -10459 -1246 9242 4467 -9129
3425 -9129 -9727 3718 9375 -420 -10284 -6581 5358 7944 -3219 -12422 -3940 8669 5914 -7344
3439g344l242J1127Q018o195j1426N70J2175N118j0332r709O543J2016q84j0876
3453d441n634P870J0024l352j1811j378J0766O308p884r156L728R888J750r006
3467b328o676O674J0480k561j1423j636J0011N754o710q023J712R318L427q979
3481i60o888O775R400k822j0207j630Q669O447n510r744J225J1005L705r456p628
3496g619O341R286j450r755l553Q206Q377n271j1470R78J2122M012r937p999M937
3511b795J0541J164j0759o972Q721J0454m234j2426q15J1158N820p486j0223J933
3525e919J2610L430j1991q580Q228J1539k334j1976l912R383R133n225j2101k02
3539g917J2094N401j0319q943N133J1064O97j0969o486P763J1296l562j2897j351
$$ plain form
3439 -7344 -10586 541 8559 2364 -9062 -8492 3683 8801 -1531 -11240 -4697 7319 6435 -4441
3453 -4441 -10075 -2205 7819 4467 -7344 -8722 2044 8352 468 -8688 -4960 4928 6678 -2328
3467 -2328 -9004 -2330 8150 5589 -5834 -7470 2541 8295 1585 -6438 -4726 4592 8019 -960
3481 -960 -7848 -1073 8327 5505 -4702 -6332 2337 8784 3274 -6470 -5245 5760 9465 9 -7619
3496 -7619 -1278 8008 6558 -3197 -6750 1456 9833 4562 -6908 -5930 6192 10204 267 -7732 -2795
3511 -2795 7746 8910 -1849 -8821 -100 10354 6120 -6306 -7121 4037 9857 2371 -7852 -5919
3525 -5919 6691 10121 -1870 -10450 -2222 9317 6983 -4993 -8905 478 9611 4386 -7715 -7917
3539 -7917 4177 9578 -741 -9684 -4551 6513 7210 -3759 -10245 -2482 8814 5252 -7645 -8996
3553h996J0842O451p375r510J830J0842L287r738p906O761J0455k222j0572k960
3567h811Q453P320m577r874m92J0190N118q567p832M828R690q37q770l895O886
3582a170P849l470r952n84J0081M434p461p391L610Q617J145q267n047O017Q906
3597G317m005r416o4R662L856o768p467K242J0424K272j0088o530P747R468l825
3612D825r534j483Q693N933n742r357J984J0759L123j0466o757O641R721j361
3626F979j0206m799Q881R495n394j1557J09J1664M650q846q536M438J0579J469
3640H926j0769p035Q760J0641m483j1782j397J0002P019o768j0498J584J1446
3653E646L990j0530q160O826J0521j294j1118m112Q455R169m632j1953o47J1807
$$ plain form
3553 -8996 1846 8297 922 -8588 -6758 4084 7371 -2367 -10273 -3512 6943 4721 -5851 -8811
3567 -8811 -358 6962 2385 -7489 -7981 2209 7327 -1240 -9072 -4244 5446 4609 -4161 -8056 -1170
3582 -1170 6679 3209 -6743 -7327 2754 7188 -273 -7664 -4054 4563 5708 -2559 -7606 -1589 7317
3597 7317 3312 -6104 -6168 3494 7350 582 -6885 -4643 5781 8053 -2035 -8565 -818 8650 4825
3612 4825 -4709 -6192 2501 8434 2692 -6665 -4681 6078 9201 -1265 -8022 -1381 8340 6979
3626 6979 -3227 -8026 855 10350 4956 -6601 -6492 5172 9822 976 -7560 -3122 7457 8926
3640 8926 -1843 -8878 -118 10523 6040 -5742 -7139 2863 9882 3114 -7384 -5800 5646
3653 5646 9636 -894 -9054 -2228 8293 6999 -4119 -8231 224 9393 4761 -7192 -7839 3968
3667C968M998r038q515M027J0061J173r046o603O816R802l269j1025j494R729
3681A584O088o527q891J240R865L417q996p013N673R746k058r038k784P431O115
3696E852m164r070L52R981L819q634o724N247Q129m29q097m424P221P006l517
3711B548r352L72R451L404p699o309M012Q677O03q876n494P444Q544l937r627
3726f239nR048M341n853q383K528R927K095r619o094P584Q775l002r996k200Q646
3742A553P448n611j0087P70J1256L526r309o924N361R478l60r604n067Q362Q784
3757I576m111j1437m42J1020N109p631q563K080J0273K949r660p149O828J0068
3771H910k826j0216k423Q522O700n029r691K95J0661L908q936p601N066R258m41
$$ plain form
3667 3968 8966 -72 -8587 -4560 5501 6674 -2372 -8975 -2159 7643 4374 -6651 -8145 1584
3681 1584 7672 1145 -7746 -6506 3359 6776 -2220 -9233 -3560 6186 4128 -4910 -7694 -263 5852
3696 5852 1688 -7382 -7030 2951 6770 -1864 -8588 -3341 4788 4359 -3738 -8162 -941 6065 2548
3711 2548 -6804 -6432 3019 6423 -1276 -7585 -3573 5104 5707 -3169 -8663 -1219 7325 3388 -6239
3726 -6239 -6244 2804 7145 1292 -7091 -4563 5364 7459 -2160 -8254 -670 8105 5103 -4893 -7093 1553
3742 1553 9001 3390 -6697 -5927 5329 8855 -454 -7378 -2017 7461 7101 -2503 -7570 792 9576
3757 9576 5465 -5972 -6414 4606 9715 2084 -6479 -4399 5874 8823 -837 -7986 -1158 8910
3771 8910 6084 -4132 -6555 1967 8667 3638 -6053 -5758 4903 8811 -125 -7726 -2660 6598 6157
3786F157q722m159O521P949l640j0153l99R752M671p862p297L125Q873J629q793
3801b348n583N878Q680k883q802j428Q037M328n407p036J557Q941K181q615n860
3816h360O135P863k310q456j937O803O076m342q168Q07R340K038p953n241N295
3831b410P609j401q136l065P267P000n047r096P83R745K879p331o331L770Q614
3846D850O83r212m652P632Q285m304r793J81Q958N140o794q446K327J0571K220
3861G646r782n887O855Q749k565q902l058Q652O720n030j0443J184J1680K827
3875H646q710p290M867R417O51r655n331P364Q788l508j0716m50R434N169o627
3890B049q053K076R817K402q883o864O362R368k415r233k304P006O575m324q839
$$ plain form
3786 6157 -2565 -6724 -203 7746 4106 -6047 -6446 3306 7977 115 -7182 -4057 4816 6445 -2348
3801 -2348 -7931 -2053 6627 3744 -5058 -6486 1551 5879 472 -6564 -5007 3934 6115 -2500 -8360
3816 -8360 -2225 5638 3328 -5128 -7065 -262 5814 1472 -6696 -5889 3451 5489 -2464 -7705 -2410
3831 -2410 5199 3798 -4338 -7403 -136 6864 1817 -7279 -6496 3249 6128 -1203 -7534 -3764 4850
3846 4850 5533 -3679 -8331 -699 7586 3282 -6511 -6330 2628 7768 974 -7472 -5145 5426 7646
3861 7646 -2136 -8023 -1168 7581 5016 -3886 -6944 1708 8428 3398 -7045 -5861 5819 8646
3875 8646 -64 -7354 -2487 6930 7581 -2074 -7405 -41 8747 5239 -5477 -5927 3507 8676 2049
3890 2049 -6004 -3928 5889 8291 -592 -7456 -1094 8274 5859 -3374 -5678 1328 7903 3579 -5260
$$ [...]
##END NTUPLES=NMR FID
##END=
