##TITLE=1H_EC-3195(60)
 DMSO, 8 sc, 
 28.5.2019
##JCAMPDX= 6.0         $$ Bruker NMR JCAMP-DX V2.0
##DATA TYPE= NMR FID
##DATA CLASS= NTUPLES
##ORIGIN= UXNMR, Bruker Analytische Messtechnik GmbH
##OWNER= root
$$ XWIN-NMR		Version 3.5
$$ Wed May 29 13:16:05 2019 Russian Standard Time (UT+4h)  she@DPX200
##.OBSERVE FREQUENCY= 200.13155
##.OBSERVE NUCLEUS= ^1H
##.DELAY= (6, 6)
##.ACQUISITION MODE= SIMULTANEOUS
##.ACQUISITION SCHEME= undefined
##.AVERAGES= 8
##.DIGITISER RES= 18
##SPECTROMETER/DATA SYSTEM= spect
##.PULSE SEQUENCE= zg30
##.SOLVENT NAME= CDCl3
##.SHIFT REFERENCE= (INTERNAL, CDCl3, 0, 15.7039)
##AUDIT TRAIL= $$ (NUMBER, WHEN, WHO, WHERE, WHAT)
$$ ##TITLE= Audit trail, XWIN-NMR		Version 3.5
$$ ##JCAMPDX= 5.01
$$ ##ORIGIN= Bruker BioSpin GmbH
$$ ##OWNER= she
$$ F:/spectra/data/she/nmr/H-F/1/audita.txt
$$ ##AUDIT TRAIL=  $$ (NUMBER, WHEN, WHO, WHERE, WHAT)
(   1,<2019-05-29 13:14:57.79 +0400>,<she>,<DPX200>,
      <created by zg, POWCHK disabled, PULCHK disabled
       configuration hash MD5:
       00 E9 B6 7A A2 85 ED C7 34 08 36 98 17 FE 4E 26
       data hash MD5: 16K
       32 11 8F 88 E6 A6 BA 68 DF F5 1E 6B AA E9 47 DF>)
$$ ##END=
$$ 
$$ hash MD5
$$ 5F B5 10 AD 1D 13 11 79 88 97 91 A8 92 D8 E7 9A
##$RELAX= 
##$RELAX= 
##$RELAX= 
##$RELAX= 
##$RELAX= 
##$RELAX= 
$$ Bruker specific parameters
$$ --------------------------
##$DU= <F:/spectra>
##$EXPNO= 1
##$NAME= <H-F>
##$PROCNO= 1
##$TYPE= <nmr>
##$USER= <she>
##$AMP= (0..31)
100 100 100 100 100 100 100 100 100 100 100 100 100 100 100 100 100 100 
100 100 100 100 100 100 100 100 100 100 100 100 100 100 
##$AQSEQ= 0
##$AQ_mod= 1
##$AUNM= <au_zg>
##$AUTOPOS= <>
##$BF1= 200.13
##$BF2= 200.13
##$BF3= 200.13
##$BF4= 200.13
##$BF5= 200.13
##$BF6= 200.13
##$BF7= 200.13
##$BF8= 200.13
##$BYTORDA= 1
##$CFDGTYP= 0
##$CFRGTYP= 5
##$CHEMSTR= <none>
##$CNST= (0..31)
1 1 145 1 1 1 1 1 1 1 1 1 1 1 1 1 1 1 1 1 1 1 1 1 1 1 1 1 1 1 1 1 
##$CPDPRG= <>
##$CPDPRG1= <>
##$CPDPRG2= <>
##$CPDPRG3= <>
##$CPDPRG4= <mlev>
##$CPDPRG5= <mlev>
##$CPDPRG6= <mlev>
##$CPDPRG7= <mlev>
##$CPDPRG8= <mlev>
##$CPDPRGB= <>
##$CPDPRGT= <>
##$D= (0..31)
0 1.2 0 0 0 0 0 0 0 0 0 0.03 0 0 0 0 0 0 0 0 0 0 0 0 0 0 0 0 0 0 0 0 
##$DATE= 1559121297
##$DBL= (0..7)
120 120 120 120 120 120 120 120 
##$DBP= (0..7)
150 150 150 150 150 150 150 150 
##$DBP07= 0
##$DBPNAM0= <>
##$DBPNAM1= <>
##$DBPNAM2= <>
##$DBPNAM3= <>
##$DBPNAM4= <>
##$DBPNAM5= <>
##$DBPNAM6= <>
##$DBPNAM7= <>
##$DBPOAL= (0..7)
0.5 0.5 0.5 0.5 0.5 0.5 0.5 0.5 
##$DBPOFFS= (0..7)
0 0 0 0 0 0 0 0 
##$DE= 6
##$DECBNUC= <off>
##$DECIM= 24
##$DECNUC= <off>
##$DECSTAT= 4
##$DIGMOD= 1
##$DIGTYP= 9
##$DL= (0..7)
0 120 120 120 120 120 120 120 
##$DP= (0..7)
150 150 150 150 150 150 150 150 
##$DP07= 0
##$DPNAME0= <>
##$DPNAME1= <>
##$DPNAME2= <>
##$DPNAME3= <>
##$DPNAME4= <>
##$DPNAME5= <>
##$DPNAME6= <>
##$DPNAME7= <>
##$DPOAL= (0..7)
0.5 0.5 0.5 0.5 0.5 0.5 0.5 0.5 
##$DPOFFS= (0..7)
0 0 0 0 0 0 0 0 
##$DQDMODE= 0
##$DR= 18
##$DS= 0
##$DSLIST= <SSSSSSSSSSSSSSS>
##$DSPFIRM= 0
$$ [...]
##$SUBNAM2= <"">
##$SUBNAM3= <"">
##$SUBNAM4= <"">
##$SUBNAM5= <"">
##$SUBNAM6= <"">
##$SUBNAM7= <"">
##$SUBNAM8= <"">
##$SUBNAM9= <"">
##$SW= 24.9336996594482
##$SWIBOX= (0..15)
0 0 2 0 0 0 0 0 0 0 0 0 0 0 0 0 
##$SW_h= 4990.01996007984
##$TD= 16384
##$TD0= 1
##$TE= 0
##$TE2= 300
##$TE3= 300
##$TEG= 300
##$TL= (0..7)
0 120 120 120 120 120 120 120 
##$TP= (0..7)
150 150 150 150 150 150 150 150 
##$TP07= 0
##$TPNAME0= <>
##$TPNAME1= <>
##$TPNAME2= <>
##$TPNAME3= <>
##$TPNAME4= <>
##$TPNAME5= <>
##$TPNAME6= <>
##$TPNAME7= <>
##$TPOAL= (0..7)
0.5 0.5 0.5 0.5 0.5 0.5 0.5 0.5 
##$TPOFFS= (0..7)
0 0 0 0 0 0 0 0 
##$TUNHIN= 0
##$TUNHOUT= 0
##$TUNXOUT= 0
##$USERA1= <user>
##$USERA2= <user>
##$USERA3= <user>
##$USERA4= <user>
##$USERA5= <user>
##$V9= 5
##$VALIST= <valist>
##$VCLIST= <CCCCCCCCCCCCCCC>
##$VD= 0
##$VDLIST= <DDDDDDDDDDDDDDD>
##$VPLIST= <PPPPPPPPPPPPPPP>
##$VTLIST= <TTTTTTTTTTTTTTT>
##$WBST= 1024
##$WBSW= 4
##$XGAIN= (0..3)
0 0 0 0 
##$XL= 0
##$YL= 0
##$YMAX_a= 95156
##$YMIN_a= -148039
##$ZGOPTNS= <>
##$ZL1= 120
##$ZL2= 120
##$ZL3= 120
##$ZL4= 120
##$ABSF1= 10
##$ABSF2= 0
##$ABSG= 5
##$ABSL= 3
##$ALPHA= 0
##$AQORDER= 0
##$ASSFAC= 0
##$ASSFACI= 0
##$ASSFACX= 0
##$ASSWID= 0
##$AUNMP= <proc_1d>
##$AZFE= 0.1
##$AZFW= 0.1
##$BCFW= 1
##$BC_mod= 2
##$BYTORDP= 1
##$COROFFS= 0
##$CY= 11.3945322036743
##$DATMOD= 1
##$DC= 2
##$DFILT= <>
##$DTYPP= 0
##$F1P= 18.9103706918063
##$F2P= -1.10871071338519
##$FCOR= 0.5
##$FTSIZE= 0
##$FT_mod= 4
##$GAMMA= 1
##$GB= 0.15
##$INTBC= 1
##$INTSCL= 1
##$ISEN= 128
##$LB= 0.24
##$LEV0= 0
##$LPBIN= 0
##$MAXI= 10000
##$MC2= 0
##$MEAN= 0
##$ME_mod= 0
##$MI= 1.114404
##$NCOEF= 0
##$NC_proc= 0
##$NLEV= 6
##$NOISF1= 3.799351
##$NOISF2= 2.8
##$NSP= 1
##$NTH_PI= 0
##$NZP= 0
##$OFFSET= 15.70392
##$PC= 1
##$PHC0= -8494.008
##$PHC1= 9.400249
##$PH_mod= 1
##$PKNL= yes
##$PPARMOD= 0
##$PSCAL= 0
##$PSIGN= 0
##$REVERSE= no
##$SF= 200.130013532006
##$SI= 16384
##$SIGF1= 3
##$SIGF2= 2
##$SINO= 400
##$SIOLD= 16384
##$SREGLST= <1H.CDCl3>
##$SSB= 0
##$STSI= 0
##$STSR= 0
##$SW_p= 3612.71676300578
##$SYMM= 0
##$S_DEV= 0
##$TDeff= 0
##$TDoff= 0
##$TI= <>
##$TILT= no
##$TM1= 0
##$TM2= 0
##$TOPLEV= 0
##$USERP1= <user>
##$USERP2= <user>
##$USERP3= <user>
##$USERP4= <user>
##$USERP5= <user>
##$WDW= 1
##$XDIM= 8192
##$YMAX_p= 0
##$YMIN_p= 0
$$ End of Bruker specific parameters
$$ ---------------------------------
##NTUPLES= NMR FID
##VAR_NAME=  TIME,          FID/REAL,        FID/IMAG
##SYMBOL=    X,             R,               I
##VAR_TYPE=  INDEPENDENT,   DEPENDENT,       DEPENDENT
##VAR_FORM=  AFFN,          ASDF,            ASDF
##VAR_DIM=   8192,          8192,            8192
##UNITS=     SECONDS,       ARBITRARY UNITS, ARBITRARY UNITS
##FACTOR=    0.0002004,     1,               1
##FIRST=     0,             0,               0
##LAST=      1.6414764,     0,               0
##MIN=       0,             -148039,         0
##MAX=       1.6414764,     95156,           0
$$ Real data points
##PAGE= N=1
##DATA TABLE= (X++(R..R)), XYDATA
0@%%%%%%%jRj6J6j6J7k5L2l8M6n6O5p4R0j06J22j39J61j85K12k43K76l11L49l94
32b09M43m96N54o17O88p67Q52r44J043j155J280j417J570j741J932k148K396k683
50a419L019l415L896m495N264o291P739r958J3831k2548Q0383l3151j42574M8669
64f1050J04049N2157p1322o9583m140N3322K1917j0040k0039o019j3442k568K0861
77e897L5535j634m6771m0698K8643O6995K2486n4061n9818O404O4348M1921k6277
90C1176o0150k0121L5495M6423P438l2454l6026l337K8542K8666K346k3233k6874
103b2109n156K3248K9713M635k6214l2235l059L2787L5945l127m3531l4301J5380
116b8024M9701K6716l0048n2886j0879M2784M2964o520m3002k8897J5694L6975
$$ y = [0, 0, 0, 0, 0, 0, 0, 0, -1, 8, -8, 8, -8, 9, -16, 16, -22, 24, -32, 33, -41, 49, -57, 65, -74, 87, -98, 114, -129, 147, -164, 185, -209, 234, -262, 292, -325, 363, -404, 448, -496, 547, -608, 672, -745, 825, -916, 1016, -1132, 1264, -1419, 1600, -1815, 2081, -2414, 2850, -3441, 4298, -5660, 8171, -14377, 66006, 32855, -109719, -61050, 42999, 95156, 23834, -45749, -49889, 3433, 25350, 15310, -4729, -10748, -24190, -26758, -5897, 29638, 28004, -18767, -59465, -30822, 36173, 58659, 4598, -55220, -48816, 15532, 57453, 31176, -28974, -49095, -13600, 32823, 40261, 7807, -28219, -31556, -3014, 25652, 27998, 4765, -22109, -27265, -4017, 25696, 30331, 4117, -28118, -31177, 1610, 37555, 34428, -9103, -43404, -28024, 21677, 48393, 18345, -34541, -45420, -2636, 40328, 33808, -9194, -38091, -22397, 14578]
128A4578J5728j7030k5802r288Q719J9064J5501k885k1948k3280K458L3572K9042
141C8429j5368m5976k1195L2363M8577N340m4932m1251J3441M9298K3441k6286
153A5881l9861p813K6830K7229j47k0221j6262k221R412J6693J1111q577k4717
166a2663j5838J4392L4727J4329k8398m0168j164M1335L4092j4890m5361k1036
178d0643K8084M1216M981l2970k8479N220K7306J8604p341k0529j2117L220J2910
191e38J4748L601j5024k2304m336K2686K7584j117l3062k8367J4283M2416J6821
204C7391k7410l9166l698L5892L0468j0738l4854j5881J6572K5922O822j4167
216G153j7427m170P360J1906R846j338j6531j7838L995K5632J9917j3278l4262
$$ y = [14578, 30306, 13276, -12526, -21814, -13095, 5969, 21470, 18585, -3363, -26643, -24185, 9387, 38429, 23061, -22915, -44110, -11747, 36830, 42170, -2762, -44013, -30572, 18726, 42167, 15881, -23980, -31793, -4963, 22266, 22119, 1898, -14364, -16585, -7173, 9520, 20631, 12054, -12663, -28501, -14109, 20618, 34947, 6549, -33619, -34783, 6552, 40644, 25754, -19607, -40643, -12559, 28657, 33638, 668, -27811, -22591, 4715, 23319, 15978, -4551, -16668, -13448, -538, 14210, 17811, 2787, -19517, -23853, -1167, 26417, 25300, -7762, -36129, -21846, 20570, 37391, 9981, -29185, -32883, 3009, 33477, 22739, -12115, -27996, -11424, 14498, 21320, 7153, -10274, -14444, -7084, 4822, 14668, 13330, -3201, -21039, -17044, 8588, 28505, 15227, -19035]
229a9035j4383K6919L5796m78l5289k6781J2919L5952J5152k2022k8473k641K1378
242i86J7181j365j3902j2308p24Q269J1513P007o519j8679j1126J3695K5553P069
256B4678k2607k7601J308L1732K3401j4816l3390j1508K2377K8465J238k5009
268a732j9916O914K0234J0939o536j3452q656K612J0195J0870J360j1417j6008
281a4593k253J8455J9540m321k4797j7521J2031K9506J0735k1689k7773M09K5553
294C282K0215q333k4886j1139J2858J8732M331j0482j2118m429O290J0742O556
307A1619l418j2271j1154M162J9180J2017j1438k3396p495J9018K4490r91k5685
320e362j8818J0759K5504R415j5517k0894k086J6356J4066k568j1523q500O0P225
$$ y = [-19035, -33418, -6499, 29297, 28819, -6470, -33251, -20332, 15620, 30772, 8750, -19723, -22364, -986, 16195, 14830, 928, -11380, -12104, -3835, 7678, 14685, 8166, -10513, -21639, -7944, 17609, 24678, 2071, -25530, -24222, 7510, 30911, 16095, -17295, -28803, -6426, 22039, 23277, -1732, -21648, -14734, 5500, 16439, 9903, -3549, -12205, -9593, 602, 11472, 12832, 1415, -14593, -16846, 1609, 21149, 16828, -7969, -25490, -13459, 16047, 26782, 5093, -22680, -22271, 3282, 23497, 15164, -9722, -20861, -8003, 10729, 15060, 4578, -7540, -11969, -5679, 5063, 11619, 8201, -4070, -15224, -11062, 8118, 20135, 8697, -14699, -22194, -3176, 21314, 20323, -5362, -24180, -13421, 12083, 21498, 5981, -14913, -16999, -643, 13423, 10855, -668, -9168, -9108, -1883]
334a883R365L316o552j2265o470R934J8315L857j7543j9345L701K2024J5504j0827
348A1131k4314q141J7672K0189j93j8462j4176N314J5955P681o010j0510n431
361i295K270Q053P732J43r098j0725l48J2820J3852l544j9136j1475J0904K0834
375A2987N775j6583j9364J430J9732J3493p739j7325p215R392J3437L132q385
388B767r344j854M807P487N258l333r972p476M858J3887P924r381j7472l646J4841
403f49J6261j877j8470j2705Q242J8773O221j2248j4286j070J1395R912j185r027
417g13o507M93N458O850K643n698r940l154Q247J2395K032j2774j3875L444J7127
432F028J0098r215j6890n090J2897J4615n59j3608r871L914J0920O131l669r092
$$ y = [-1883, 7482, 10798, 4246, -8019, -14489, -4555, 13760, 17617, 74, -19271, -15570, 6454, 21958, 11131, -13183, -21324, -3652, 16537, 16344, -2118, -16294, -10980, 4975, 12656, 6646, -3864, -9295, -7025, 1028, 8760, 8903, -195, -10920, -11268, 1552, 15404, 11860, -7276, -18751, -7847, 12987, 18762, 2179, -17185, -15755, 3977, 17470, 9731, -7594, -14809, -5417, 8020, 11152, 2767, -6577, -8431, -3624, 3863, 9121, 5788, -4184, -11660, -6802, 7085, 15009, 5628, -11844, -15490, -649, 15612, 13735, -4735, -17440, -9198, 9575, 15796, 3548, -10738, -11808, -413, 9499, 8314, -713, -7220, -6727, -1269, 5581, 8224, 2526, -7414, -10568, -2321, 10074, 12106, -668, -14543, -11099, 6028, 16126, 6911, -9979, -15069, -2172, 12443, 11884, -1724, -11595, -7681, 3239, 9370, 5701, -3391]
446c391m151K515O677N602l80p997q027J328J0583Q543l731j3292q154Q787J4969
461I881L751j2723j3070J181J3659R903n454j3106m916P267R243K796n610p825
475e023k466M754O402L299k778q033n057M372J0605M323p396j2211k361J1590
489B0J1821k408j3446q483O496J2789M512q373j1244o02Q523P281m14o600o092
504f220M36N196N626J173m811o959k243P020Q783N62j0105q726K559J2194P390
519A1875o922j2797k829R213J0198K22j0049p964K878Q823M683k722o653m440
533f484J940O243M503j252o162n936J455Q390O400m182j0122m735O887J0478K269
548I692r295j0005J897R899P014l733r554m687N560P804K364m727o001k174L480
$$ y = [-3391, -7542, -5027, 1650, 7252, 6872, -1125, -9152, -7824, 2759, 11302, 7571, -5721, -13875, -5088, 9881, 13632, 909, -12161, -10980, 2679, 12582, 7128, -5978, -10894, -3627, 5616, 8412, 2802, -5023, -7489, -2735, 3667, 6966, 4188, -3845, -8902, -4530, 6075, 10398, 3002, -9209, -11570, 20, 11841, 9433, -4013, -12496, -6000, 6789, 11301, 2928, -8316, -8918, -395, 6886, 6472, -128, -6220, -5784, -588, 5038, 6211, 1400, -5559, -7802, -782, 8001, 8563, -1542, -10268, -7709, 4485, 11875, 4953, -7844, -10673, -1460, 8738, 8960, -1089, -9053, -6175, 2648, 7331, 4609, -2044, -6484, -4544, 1699, 6202, 4950, -1212, -7148, -5693, 2697, 9097, 4915, -5207, -9942, -3055, 7423, 9692, 397, -9608, -7711, 2188, 9202, 5469, -4085, -8772, -3212, 4592, 6956, 2229, -3772, -5946, -2466]
563b466O101K646l728o239l406M244Q319K918p081q595o95Q548Q015j620j0251
578c290o456N184R825L312o223q167j453O559O791n81n554m827J8M620M936M50
594E144n036n233q42N951O829m35q218o269L246Q774M512m987r109k550P439P899
610G115m52p419n815J562O486M800k138o291l042J683N095L469j019o380l522
625e868J894O845M084l474q278k903N959P697O73o442o816O56P850N225l071p075
641c044l161L503O156K640m134n463j375L112M930J849l115n617j555L777O001
656D504J778n546o983M72P055N436k074p261m213L553P067L054n172n883j105
671e318M612N071N28m642m739L30M201M345O8m425m886M77N404M402j160o043
$$ y = [-2466, 3635, 6281, 2553, -3686, -7092, -2848, 5471, 8389, 1308, -7287, -7982, 566, 8581, 6961, -3290, -9746, -4562, 5263, 8575, 2352, -5815, -7268, -709, 6082, 5501, -53, -4880, -4862, -242, 4694, 5144, 108, -5125, -5967, -16, 6813, 6378, -1840, -8109, -4863, 3911, 8423, 3436, -5673, -8223, -784, 7115, 6663, -756, -6571, -5009, 1477, 6277, 4139, -2152, -5194, -3511, 1584, 5053, 4034, -2346, -5868, -3974, 2871, 6955, 3481, -4797, -7700, -1741, 5956, 6629, 187, -6629, -5973, 1877, 7102, 4031, -3044, -6205, -2702, 3454, 6094, 1960, -3503, -4878, -1766, 3164, 5013, 1898, -3719, -5274, -1497, 4504, 6282, 736, -6247, -5775, 1280, 6716, 4642, -2619, -6832, -3279, 3788, 6842, 1670, -4213, -5318, -706, 4365, 4893, 251, -4488, -4158, 43, 4388, 4456, 31, -4855, -4378, 1026, 5428, 4268, -1775]
687a775m345K730O741K858m180o107j764M751O146K74n820m711J142N110L681
702D731j448m611l146J339M900K934j709m728l445K568N341K474k959n745k206
717e710M615N700N16n543n126J408N565L867j812n827k477K506M869K093k758
732A886m690j645L165M105J481l095m618j196L807M975L04m673m441M21N198M302
748E286j981n472k949K787N128K515l658n070j004L625M391N92l896m071K09L743
764A75L589m44l743l701P71M641L383j689n248k866L023M752K369l380n309o99
780d376L808M529r7m131m147R25M332L102j170m386k378J544M192K387k079l973
796a918k310K297M489J893l323m274q69L568M446K79m876l661Q29M270L421j625
$$ y = [-1775, -6120, -3390, 3351, 6209, 2029, -4078, -5842, -1091, 5055, 5329, -491, -5202, -4060, 1050, 4731, 3283, -1328, -4474, -3135, 1765, 4699, 2990, -1738, -5183, -2615, 2726, 5200, 2241, -3504, -5710, -1095, 4605, 5121, -422, -5548, -4140, 1425, 5292, 3480, -2347, -4824, -2318, 2551, 4644, 1886, -2804, -4449, -1284, 2821, 4302, 1207, -3411, -4607, -800, 4175, 4479, -194, -4635, -4214, 984, 5286, 3305, -2167, -5116, -2329, 2799, 5314, 1656, -3414, -4418, -793, 3598, 4190, 294, -3777, -3568, 175, 3764, 3320, -423, -4124, -3353, 1288, 4671, 2982, -2266, -5132, -2109, 2643, 5012, 1632, -3677, -4376, -568, 3961, 3864, -267, -4414, -3489, 843, 3945, 2775, -1611, -3989, -2445, 1747, 4134, 2055, -1918, -4228, -1931, 2558, 4451, 1128, -3146, -4015, -447, 3999, 4278, -598, -4259, -3430, 840, 4261, 2636]
812B636m184k655K036M222J989k316m042j702K604M208R54k738m057o48L392L606
828C305J08l920l413J185M153K435j286m167k611K637M120J350k582l801j157
843c644K816L803J63l258k910j63L591L003n21l757k537J105L470K206j309l724
859a666k051K151L885J129k580m062n85L258L548J07l531k823K50L435K904r11
875B458l922j732J199L441J873j604l797j294K463L227Q80k250l370q26L042L229
891C017M2l548k767O63L266K619j013l735j874J875L169J350j637l407r06K016
907h70L226P96k752l285K49K831K871n37l098k471J083K806K239j433l158j218
923b721J489L437P41k368l071l27K454K962K8k500k606J98K665K676r53k937k010
$$ y = [2636, -1548, -4203, -2167, 2055, 4044, 1728, -2314, -4016, -1412, 2796, 3750, 1012, -3045, -3693, -301, 3305, 3413, -507, -3920, -2735, 1418, 3853, 2567, -1600, -4211, -1574, 2546, 3896, 1314, -2487, -3644, -828, 2975, 3138, -120, -3030, -3193, 398, 3401, 2880, -877, -3414, -2309, 1161, 3367, 2058, -1666, -3717, -1566, 2319, 3448, 868, -3194, -3779, -521, 3027, 3134, -397, -3220, -2970, 465, 3369, 2458, -1464, -3196, -1997, 1444, 3317, 1713, -2084, -3378, -915, 2312, 3192, 942, -2428, -3254, -212, 3017, 3059, -489, -3256, -2593, 673, 3292, 2279, -1456, -3330, -1455, 1714, 3064, 1427, -1980, -2886, -870, 2356, 3152, 400, -2885, -2636, 195, 3066, 2529, -569, -3040, -1957, 849, 3088, 1655, -1503, -2721, -1232, 2205, 2946, 578, -2493, -2820, -366, 2596, 2624, 124, -2482, -2284, 381, 3057, 2104, -833, -2843]
940b843J167K919J353j177k875j493J741L316O16k189k704k37K099K593K03k691
956b02k304P50K655J632o03k863j983J513K773J427j745k388j176J711K788M53
972B438k234k686k2K300K638j75k848k132J047K219K112j087k690j458J393K434
988A249J632j868k616j021K043K304L10j968k377R8K319K470p63k761j509Q59
1004a599K458J878j461k840q86J754K233P14j693k308q91K394K336q7k167k049
1020b214L86K304J776p96k326j333N95K732J358j632k320p55J463K502O84j963
1036D61k372l1K212J720k49k011j712J72K369J647p89k316j294J019K523O53j063
1053I39k330q66J786K359K97j898k453M27J973J454J8k036j436M96K347J064j283
$$ y = [-2843, -1676, 1243, 2596, 1419, -1456, -2949, -1208, 2108, 2724, 535, -2169, -2406, -307, 2286, 2489, -202, -2506, -1756, 899, 2531, 1928, -935, -2918, -1405, 1368, 2795, 1050, -1338, -2514, -803, 1985, 2438, 204, -2482, -2504, -204, 2434, 2259, -589, -2721, -1674, 545, 2657, 1570, -1120, -2578, -1185, 1249, 2881, 1013, -1603, -2624, -581, 1723, 2033, 65, -2312, -2214, 105, 2575, 1812, -949, -2458, -1599, 859, 2737, 1276, -1564, -2450, -696, 1537, 2251, 558, -1750, -2641, -247, 2089, 2002, -165, -2214, -1828, 476, 2252, 1456, -870, -2203, -1608, 1124, 2482, 850, -1470, -2225, -762, 1740, 2424, 461, -1911, -1942, 270, 1990, 1741, -270, -1982, -1810, 559, 2206, 1417, -899, -2193, -1174, 1349, 2002, 939, -1391, -2257, -471, 1888, 2185, 287, -2166, -1739, 234, 1688, 1706, -330, -1766, -1270, 1077, 2141, 858]
1070H58j885j032J316J924Q09j539j894l16J641J696J21j887j598M57J619J680
1086A970m08k217j485R80K213R83j320j943o76J515J889L43j767j577k4J500J700
1103A676j83j412j739K47K012J189o03j973j060J011J960R21j421k057k30J538
1119a24J498J27j486j590q2K098J209m12j649j248L46K104J115j073j910p75J282
1136e70J590O20j264j412p32J508J781J40j617j538J41J639J522o09j362j744
1152a907Q45J698R58j071j551j94Q02J418O46j356j560J01J206J258j89j347j042
1169a285J31J530J127o71j070j287O28J539J035j089j713m93J093J752L94j211
1185D10j834K87J085J174nj219j375N43J330J032p47j117r25M20K026K45j127
$$ y = [858, -1027, -2059, -743, 1181, 1990, 451, -1443, -1759, -118, 1578, 1699, -188, -1786, -1329, 290, 1970, 1562, -655, -2140, -1160, 1053, 2036, 716, -1227, -1903, -388, 1501, 1844, 77, -1500, -1524, -24, 1676, 1493, 81, -1658, -1411, 601, 1790, 1187, -786, -1846, -835, 1125, 2046, 625, -1432, -1662, -124, 1374, 1501, 15, -1575, -1657, 441, 1650, 1238, -411, -1659, -1313, 791, 1906, 833, -1077, -1852, -570, 1020, 1640, 376, -1036, -1768, -260, 1521, 1661, 44, -1494, -1353, 286, 1808, 1199, -163, -1907, -1062, 636, 1594, 523, -1028, -1222, -420, 998, 1644, 288, -1272, -1171, 35, 1293, 1104, -243, -1285, -1154, 376, 1503, 832, -238, -1525, -897, 642, 1677, 588, -1125, -1618, -525, 1227, 1621, 410, -1424, -1137, -52, 1122, 1117, -102, -1477, -934, 396, 1428, 681, -436, -1361, -941, 1085, 1330, 203]
1202B03j217m80R94J463M11j269j201N0J274J170k43j596j101Q41J367N97p49
1219E14j092n08O98J332J02j192n84m54R05J154K87j501q74K16J179J016o5j699
1237e66o05O81J006Q04p37j404m11R75P76N77q69j313n1Q82J412l08r36j100j15
1256a302J739O99k11j656m26L57J384O85q36j377m0R07J175l9r31j459J83J201
1274E3J175l25j129q84K71J315N11m18j234k19L68J061O36r98j072j26O34J609
1292A228l48o88q81O0J090L21j59j052m69J12J237O65p11r75n83P91J166r5n67
1311A42j050j54J159J003k41j093r34L03J315M85k31j094m69M87J157on57r65
1329g43l8O03Q87K6r73o66R7P97R36k57o21j078M04R11P81l32j128p67J107M26
$$ y = [203, -1014, -1494, -500, 963, 1374, 105, -1096, -1046, 228, 1398, 1155, -441, -1542, -701, 666, 1263, 514, -578, -1086, -388, 944, 1046, -146, -730, -1184, -279, 875, 1162, -339, -1213, -997, 182, 1198, 1133, -566, -1171, -490, 516, 1320, 583, -821, -1232, -257, 519, 1096, 227, -1086, -1137, -255, 1157, 849, -87, -1187, -1302, 437, 1136, 925, -731, -1157, -800, 584, 1269, 433, -944, -984, -77, 1098, 1059, 128, -1331, -1148, 53, 1228, 903, -226, -1110, -839, 476, 987, 569, -665, -884, -516, 545, 1181, 183, -889, -1015, -381, 1228, 880, 192, -689, -629, 461, 782, 623, -429, -898, -786, 451, 1116, 405, -570, -1153, -362, 804, 709, 142, -908, -1062, 97, 1100, 859, -234, -1168, -865, 450, 935, 704, -390, -859, -372, 785, 779, 222, -743, -781, -178, 709, 735, -238, -904, -807, -10, 926, 669, 48, -1030, -626, 285, 1066, 734, -394, -1161, -54, 372]
1349C72N85p41q33o75Q93J071j81m96p85j85J102Q19l01p59q03J08J378K13l26
1368D56r70k66K94J131J05m54p17l66Q23J104k32j107m14j80O84R10k19q23l97
1387f38J00P99P22o88j005k69Q37Q51p2r05n56j33J068N46j98m18o75Q2R16N25
1407H89n07o79n38N24R77N01r70r11j19P25P65k60m68o86L60N80J65L39p36n52
1427f01RJ232k30j98q12l08L90J027L74n02j030k58O90R48k25m74o14K67N88L04
1447E77n2n99o67K95J231l83j39l77n46M19O97K75q34l85n37O89J004l95o20m42
1467g89K45P88N56p18m15k62M68N41J02k89q42K27L26O50l04m24j81j62M07L88
1487C12P9l64n07J54R39Lm59q17J62J65P20L34m11n99k45N68M86j98k49n43k8
$$ y = [372, 957, 216, -617, -1292, -399, 672, 491, -5, -790, -975, 127, 946, 645, -114, -917, -809, 569, 782, 456, -514, -780, -486, 645, 750, 296, -421, -787, 36, 1140, 908, -199, -613, -793, -109, 801, 582, -241, -638, -538, 261, 983, 295, -710, -979, -142, 709, 637, -268, -824, -957, 111, 657, 459, 41, -634, -552, 364, 889, 382, -297, -835, -311, 666, 1167, 197, -714, -833, -108, 657, 397, -71, -757, -397, 183, 348, 687, -49, -601, -592, 640, 410, 212, -600, -908, -518, 509, 883, 381, -649, -907, -217, 731, 506, 32, -582, -315, 273, 577, 525, -74, -741, -446, 785, 402, 263, -114, -660, -241, 456, 731, -103, -488, -1025, -336, 668, 273, -347, -789, -544, 244, 800, 82, -333, -595, -127, 414, 516, 227, -615, -388, -62, 588, 284, -140, -321, -483, -76, 312, 391, 27, -480, -326, 613, 616, 157, -660, -498, -333, 387, 721, 310, -289, -534, 34, 520, 322, 73, -470, -498]
1508d98M95N24l86mn56P4J89P94q1j079k28N06M37N78m77j236K16Q41M52q1p34
1529b54l71K99M81J90n1o83J2J52N45M10l42q56k7M17K84L04m94j71m12O76M13
1550E22p3n79k28j14Q18N09m58q11r0L71L93K61l92m42j13K11P03K0k93o50k96
1571g31P41L21r0l82j35j86N05N15l41o75j51N89M36k47q5m80m8L31O79k17m83
1592a34m85J88M65K50Q4p02K1K18L33J79k50o62R1L30L93j20j31n08k63R64J72
1613D33J9p14j93K26N15j6l41j49l43K82N70k2l3k83k77K38L73l8m25k17K6M69
1635A00K92J45l47n37J26N26O2r4l70j69j3L59K05j18o46N07J6m8J93K28o75o4
1657c22N96Q7q3p01k66L62M54N68p56n4j92K73J43L75j54m24k38N5N14L12m52
$$ y = [-498, -3, 521, 135, 131, -425, -351, -162, 632, 551, -528, -756, -250, 187, 765, 288, -948, -732, 109, 561, 480, -254, -625, -326, 155, 345, 294, -389, -377, -225, 320, 730, 388, -468, -495, -78, 206, 510, 16, -155, -567, 109, 522, 449, -130, -358, -472, 346, 855, 397, -414, -504, -133, 260, 521, 129, -313, -426, -215, 488, 508, 215, -435, -731, 10, 331, 241, -141, -276, -462, 43, 558, 217, -458, -609, -20, 416, 169, 84, -396, -444, -113, 566, 349, -134, -619, -431, 34, 284, 368, -334, -313, -95, 238, 417, 167, -495, -404, -74, 319, 199, 68, -440, -703, 261, 433, 452, -262, -455, -229, 286, 270, -71, -220, -563, -281, 289, 267, 234, -49, -326, -88, 285, 247, -178, -395, -369, 100, 392, 537, 190, -347, -221, 305, 367, 273, -97, -266, -279, 80, 285, 167, -479, 28, 44, -4, 189, 417, -258, -322, 274, 361, 278, -423, -689, -327, 127, 695, -61, -115, -307, -34, 109, 484, 330, -94, -332, -277, 237, 549, 97]
1678I7n94J37M15L26m72R8l87K33O26K6o86J84k87%O13r5k11k81j10M23K20J87
1700D62n63k99K45J99J47Q8l08j73j63O38j7pp7n66L24M28L6m23j35k70M65M43
1722D74j04l99j08k09P49j80l65N7k54J20L65m1j6r4k85K67K74J42o25k5k09N67
1744A01L09j11n53P2J63J94K27k63m14n5L06J70J73l0l87r3M79j40k46o7L7k21
1766c49P60K63m71l25p8k5J39N47k38n04J41P8L08l0l18k60J46%O28j14l65l24
1788c91J44N48n6R1n73J53j18M60j03K06k58j93J05J95L32m51m97J00N26N23o45
1809I8k6n60L15L65K20j26m03j73M37J57n6l43l87P0K97K36R1j90j77j11N84Q0
1831C98k59k22k25K80M3J33k19m86K38L32Q8k41M50j77n33N44L1K07n28o8L14
$$ y = [97, -497, -360, 55, 381, -91, 7, -380, -147, 479, 505, -181, 3, -284, -284, 329, 234, 23, -258, -368, 55, 275, 462, -101, -400, -155, 44, 191, 279, -29, -202, -365, 273, 256, 249, 172, -394, -70, 358, 394, -29, -164, -434, 31, 474, 370, -29, -137, -346, 403, 223, -142, -85, -339, -219, 146, 105, 89, -5, -290, -23, 251, 393, -232, -257, -466, 101, 410, 299, -254, -182, -19, 175, 402, 139, -275, -330, -24, 146, 319, 289, -98, -191, 288, 148, -98, -165, -128, -349, 411, 674, 203, -122, -200, -225, -86, 461, 223, -281, -140, -62, 246, 216, -102, -362, -216, -216, 412, 298, -67, -391, -247, 301, 245, 336, -237, -84, -202, 258, 155, 361, 103, -90, 15, 210, 542, 91, -406, -306, 220, 743, 98, 72, -488, -173, 192, 412, 286, -117, -290, 147, 304, 248, -95, -482, -412, -115, 121, 212, 22, -155, -266, 318, 398, 139, -83, -308, -28, 15, 148, -71, -557, -319, 13, 101, -140, 310, 133, -400, 144, 175, 382, -146, -214, 100]
1852A00j79J48m7j83LJ88K26J71k27k91r5K40K91l47q7k36M45J80k29J62j9l86
1874a72N9J67L54k65m47M43l36O74l35j04P1m95L13K72Pj3k74J16J06J4q0l37
1896b62J95k1ON24o14kn7K04R9K25k63k62K50j21J43K14l41j8j26L21M6j43n4
1919e7o2p1O5J10J63k62M6M52l11L07k86p1k47K86k0Ok81L9J81K70N0n76M47k45
1943f7L8Q6j22K00j4j93J41l34K79k96m8M45j9K06k09l27J66K24l4q6Q0j87%K2
1967d9K49p5k81k24L15K5K49q5n09K05j8M56j6j47l33j63N40q1n3J74l59N0J24
1990fK72j46l31Q0N5K25j23J79k01m1nQ9J37j04n2J66m04K82n2o3k4j20L33n7
2014H9J42l39K2L7J93n9n2o5j64q1M64J77j40l54K80j73j50N28m33M6o7O5J95
$$ y = [100, -79, 69, 22, -161, -158, 30, 256, 427, 200, -91, -186, 54, 345, -2, -89, -325, 120, 300, 71, 233, 214, -172, -113, 54, 408, 143, -304, 139, -197, 477, 142, 38, 109, -386, -73, 199, 206, 193, -81, 35, 141, 155, 75, -262, -67, -88, -82, 442, -172, -174, -231, -27, 72, 297, 34, -228, 22, -99, 44, 258, -83, -101, -227, 94, 140, -3, -57, -119, -190, -125, -15, 148, -114, -68, 384, 73, 380, 94, 23, -224, 62, 42, 48, -233, -194, -13, 257, 307, -269, 178, -67, -29, 57, -65, 135, 121, -72, 69, -265, 14, -282, -330, 115, 96, 302, 93, -234, -68, 156, 122, 36, 116, -71, -71, -49, 200, 125, -156, -380, -65, -40, 209, 124, -385, -180, -198, 258, 242, 95, -238, -401, 139, 58, 5, 179, -180, -130, -6, 266, 120, -211, -131, -76, 149, 26, 205, 4, -37, -42, 47, 184, 80, 28, 194, -210, 72, 20, -43, -67, -187, 146, 89, 231, -108, -86, -49, 144, 85, 33, -32, -196, -277, 187, 364, 224, -130, 150, -23, -173, 355, -78, -32, -99, -34, 161]
2037A61n0l11K3K13J31l7j72k30L0L63Rj60q6J39k12M37j06j16J13j68p9J19K13
2060B24k4p1n96K54J75K62j32k21k3J87K50k25j85k3J97j97K46j82J82k15M7K45
2082A75R5k65l60M57j78J50q0n9L02m65K95J52k30P3q4J17J42k9j09J41l53J48
2104C5qP4n4J9k8K7J5k30J90r5J56l34L36l7l2m3o6k9o2J34J56m62N42o0j49K6
2130B1N7Oj32K6R6k21K66k04J25K7J98j64q8j43K10L34p99M66k55j60M71L9j47
2153B9q5J17r9K12j75K61l98k8J95ml23L57l8j05R0L5Q9j04O2k83L06j18j05R3
2177a9J40l21M34j27k16r5N3R0m0K86l72N7J47L01k23k22K29J32m2m54M09MM9
2200B00m89K89J73n7k63K19j51J87Q6j03N6k71Q9P1J46r0j10k49L29P4r2K5o5
$$ y = [161, 111, -200, -177, 36, 167, 130, -42, -272, -242, 121, 130, -30, -116, 23, -189, 248, 142, 26, 139, -29, -108, 11, 224, 200, 129, -467, -213, -38, 224, 92, -129, -152, 35, 285, 60, -125, -148, 49, -148, 98, -84, 98, -117, -70, 175, 270, 5, -355, 102, -76, 74, -6, -65, 237, -228, 67, 219, -11, 62, -22, 95, 237, 208, 99, 240, -113, 35, 27, 101, 47, 66, 38, 65, 80, -150, 40, -55, 101, -233, 103, 66, 34, -9, -75, -104, -166, -32, 124, -338, 204, 144, -5, 21, 78, 84, -48, -22, 74, -147, 119, -85, 40, 67, 265, 101, 13, -130, 80, 414, -385, 81, -174, -334, 137, 176, 29, -56, 61, -38, 174, -1, 260, -138, -166, 29, 25, -298, 59, 21, -84, 6, 41, 130, 26, 88, -195, 111, -7, -112, -19, 121, -200, 234, 107, -109, -204, -151, -61, -101, 185, -187, -130, 17, 318, 95, -127, 102, 234, 192, -262, 147, 151, 200, -289, 0, 173, 116, -147, 72, -79, 108, 194, 91, 147, -124, -35, 36, 182, 92, -18, -267, 62, 136, 44, 69, 4]
2223DK98j58Q9m13Nm8M4M9K95J11n78J42K59O9J00j0o79L07J86J82p5k01r9J40
2247A9n3k1j5QP8L9j54M88m72j6j1J00J07k6j02j31J41P8J8L8k26k12K62L86l23
2272@j94K95o6O1M4M7k70R5k16M95k20j22J61j89P4J09j91J73M1l87K51L11k60
2295D2q8K08k28j50J89K06j66k50J42K48k71L3m4J49qjL05j46n3N1N9n47L92k33
2319a61J12r4j7J99Q5j16q1O8j9K24j66l88J65L18p2J41r7m3k51J16n3M9P1L37
2343C27o47J87N7L50l00M9j53k13O42k32k11K38j86J95k16K06k93J41o3K55k10
2364g7j80L69K27l24Mj68j71L05k33L05k91M28k7r9l47K0N91Jq28K49L46j26N0
2387B4k3m58J86M66n2l20J77m9r2P8K10j41k43J91N8M9K10j80j95k9J03K45J29
$$ y = [4, 302, 144, 233, -180, -175, -223, -179, -130, 165, 276, -302, -160, 99, 168, 268, 258, -421, -114, 72, 254, 179, -22, -121, 19, -34, -55, -70, -62, 16, 55, -99, 389, -83, -99, -110, -10, 97, 71, -31, -162, -21, 57, 75, 113, -113, -325, -63, 323, 0, -194, 101, 35, 96, 140, 187, -83, 12, -204, 291, 71, -51, 110, -79, -5, 104, -87, 86, 127, -260, -9, 302, 42, -46, 162, -66, -216, -27, 179, 13, -237, -95, 153, -118, -85, -129, 20, 12, 11, 316, 170, 117, 168, 227, -320, 72, -161, -49, -143, -160, 39, 124, 8, -73, -5, -24, 200, 34, -354, -189, 129, 57, 198, 101, 58, -193, -77, -130, -81, -10, 327, -320, -133, -76, 274, -26, 23, -130, -343, 299, 67, -144, 94, -92, 103, -113, 93, -200, -59, -122, 133, -77, -257, 112, 339, 15, 19, -149, -320, -15, -248, 57, -234, 194, 167, 68, -279, -259, 332, 333, -495, -246, 100, -26, 24, 1, -457, -271, 195, 143, -177, 0, -49, -141, -63, 147, 6, -237, -46, 12, 61, 271, 91, -104, -133, -30, 215, 344]
2410C44l09l45M25j74K76%m07K81j69J59m9j95N8K38m11L68J92Q0k11k58o8L74
2432A99j45j45K37k30r8J55L21l60Q4K33K1j59j24j47Q2L41l03J52j38q5j9p5
2454b03N4L50j20k34N6l9L6K10J76l6j87k4n1n3K08k81K61k55M70j34l11J70q2
2477a9K00k81K11k11K83m49J97j90k3J8M09k58j36O99n96J22J7P6P3k90j80J71
2499a57K45n4j40k86K44L9L99m25o4K17l82M96k94o9L00k47l5K94k31L30q6m98
2521d04K50k25K51N84o02qM26k46j38OP0R8J00p6r8O6j35K33l6m36N90m20J28
2544b2J59k10j0L8J98k75J88l81N35k26N7l58N0K56J60m83j36J44L18M4k1k89
2566b64K72K75l79N4j86P17o08J62J47J32l88n4P9o4J52L6k15O0K05l60J76MJ00
$$ y = [344, 35, -310, 115, -59, 217, 217, -190, 91, -78, 81, 32, -163, -105, 133, -278, 90, 282, 362, 151, -107, -175, 199, 54, -91, 146, -84, -182, -27, 294, -66, 18, 251, 272, 113, -11, -158, -76, 265, -38, 114, -24, -109, -128, -203, -149, 201, 81, -153, -97, -136, -100, 110, 286, 250, 63, 39, -12, -65, 143, -138, 123, -132, 338, 204, -107, 63, -19, 181, -100, 111, -100, 183, -266, -69, -259, -282, -264, 145, -113, -249, 450, -146, -24, -7, 69, 142, -148, -328, -157, 88, 34, -106, -392, -148, -109, 290, -135, -199, 18, -364, 132, -162, -231, 69, -178, -213, 81, -150, 180, 94, -404, -154, -379, -128, 456, -146, -154, 272, 26, -112, -106, -36, 62, 162, 86, -12, 54, -81, 152, 116, -320, 270, -150, -22, 137, -73, -83, -45, 153, -122, 66, -315, 220, -6, 51, -307, -257, -1, 159, -324, -460, -316, 2, 46, 25, -264, 8, 283, -96, -42, -228, 489, -119, 43, 190, 322, -66, -120, -41, -105, 47, 83, -132, -72, 133, -227, -51, -47, 53]
2589E3j31O50k62j87n4j31oK84k37K70q7j41N5l5j9K7k04L04m00J89K22k29M72
2612D03p27L51l99L18P9J46j13o3J40l6k13K62k72kr7J71L60j70k66J00%J91m7
2635A16l09K81k04K65k87J51K35l71K05K3j55j90M43m6L2L38m65J09k61L28k2
2656B16k58j46J8j05L27k12NM22p8k58J9R5RK32j48J32k53N5j95K08O8o0m7k07
2680a61Q8J4q8M49l55K61k04n4N3R6l08J62j1q1K51N5Q0k51l61L96%o4jK35R9
2705C00o9j23l67K4J12L51k97L15k83J14J92j46rK6N5k67l9N2r6J88r0k8J89Q6
2729A90l36J33nK92k21J1jJ09k07k1j7k4J83p5jP8q4j31L46n39L28l35K73P5J43
2754A64j27r9o6N8K47k73J19q3k5pJ63j97J15J88k85K53j40J03l9j2j63K86K0
$$ y = [53, -78, 572, 310, 123, 69, -62, -68, 216, -21, 249, 162, 21, 76, 41, 22, 49, -155, 149, -251, -62, 160, -69, 403, -324, 27, -372, -54, 25, 171, 58, -5, 135, 99, -114, 148, -124, -126, -223, -52, 308, 138, -128, -28, -28, 163, 116, -193, 88, -116, 149, -138, 13, 248, -123, 82, 105, -50, -240, 203, 157, 189, 527, 62, 171, -90, 238, 216, -42, -188, -170, -275, 52, -160, -155, 267, 189, -69, -50, 45, 54, 286, 138, 270, 17, 72, -123, 85, 153, 93, 46, -161, -73, -59, -147, 302, -53, 208, 4, -50, 3, 99, -209, -47, -58, -139, 112, 167, 247, -4, -365, 31, 31, -33, -34, 201, 300, 231, 108, -259, -235, -123, 228, -69, 246, -37, 77, 269, 123, 114, 140, 195, -72, -111, -59, -155, 33, -57, -85, 104, 190, -146, -13, -18, 274, 53, 64, 63, 172, -35, -56, -73, -97, 86, 11, 10, 88, 4, -127, 219, -320, 8, -327, -54, 21, 164, 37, -62, -128, -70, 177, -96, 23, -60, -85, -92, 71, -126, -11, 177, -108, 145, 5, 108, 69, 57, -106, 180, 200]
2777B00p3j42P1l0m74O50j00m2k68K85M8j18k0O3M1j46P6k00L39p9k58L73j88
2800HJ29m7l31R8Q4K10m13J75J57J81l95J04K63j16K03Qk27k25oJ83k57O8J72
2823B6l2J98P0p1r8j14O8J16K7k39K62k38m1K52j55J0NL18m34j41J13M0j35J94
2847Al40M36j04j83M38N3l51O6R1J9j82J53pj92N0L24l77l3K25j21j68L41k76
2870a37l4J23J32m1J04k90n6L43l28J02r3L48m1O0k33l43N83l95O66l49l64J38
2892a05K59k33j03L15kq0k89J70J1k38L18K04l48k3J10K41j83j25J50J79J06m77
2914a43K54j3l54K80k57Q9K00n4j05O1N8k98L6L03K11l32J89m7Rj14j15J09L6
2937CK01J07l10j01J16L4j55K37j99k73L56O4Q0k99L4J47J51k86K10j64K60j86
$$ y = [200, 127, -15, 56, 26, -448, 202, 102, 60, -208, 77, 125, 7, -13, 50, 91, -55, 21, -179, 160, 81, -177, 196, 8, 137, 90, -241, -143, -59, 151, -262, -87, 70, 251, -144, -40, 223, 107, 310, 318, 91, -134, -140, 43, -214, -146, 26, -6, 192, 262, 191, 93, -21, 47, 163, 190, -49, 213, -25, -66, 186, 31, 41, 46, 364, -70, -211, -98, -58, -193, 1, -339, 97, -7, -190, 248, 301, -50, 16, 107, 126, -56, 97, 90, -102, -52, 272, -105, -138, 87, -34, -202, 139, -137, -171, -48, 84, 43, 147, -143, -199, 144, -184, -82, -175, 173, 132, 192, -41, -384, 199, -196, 470, 121, -243, -105, 154, -79, -182, 133, 131, 51, -238, -68, -57, -295, 23, 227, -121, -144, -34, 207, 24, -101, 49, 228, 334, -143, 111, 98, -256, 24, -233, -144, 56, 2, -103, -42, 16, -282, -246, 57, 268, -64, 125, 78, 87, -27, -142, -33, 3, 204, 311, 1, -100, 16, 50, -105, 132, -67, -340, 16, 80, 160, -139, -105, 42, 193, -93, 117, -47, 213, 27]
2959B7K90k06j79o2K75m0k97K17K33k99J70l48J01K76k51jK08L89m68k04L75k40
2981c4K10J03j68j76O6j9j38r1K64n1NJ58l54J7R3J20k91K42K28j79j48L92k90
3004d1J36j37L86o57M00j5l2m7k04Q4K4J06j08p6J66K72L0q5k4K0k57J82J91k94
3028B0j22j51L07K80m18J5J33l3j9J30l11P0OO9L9l8K17j9l17K05q0K75n4O6K
3053B72k23K65l36Q3j89J88j91O7jK01j48J01J08l05r3K94m5J22k85Q0j54J70
3075a9J06k83L27J03m90P5J21k56M67j09M3k66j0J42j83K06l74K88J11L38l15
3096B2kL1p9J01k34K57Nm6j12K24l7J74k30j40J00r9qK02j78r2M11j50k0j02M1
3121C9j87L02l18J54N0p8m4K02R6jj78p7k61K38J77k37K44j23j39M45k53j81M51
$$ y = [27, 317, 111, -68, -130, 145, 105, -192, 25, 258, -41, 129, -219, -118, 158, -93, -94, 114, 503, 35, -169, 206, -34, 176, 279, 111, -65, 1, -18, -156, -247, 17, -34, -29, 129, -225, -208, -115, 5, -286, -44, 184, 5, -143, 249, -41, 95, -42, 344, -313, 87, 72, 40, -7, -211, -127, -103, 3, -105, -181, -15, 257, 287, 202, 178, 198, -59, 123, 314, 20, -102, -253, 54, 334, -84, -69, 64, 31, 12, 142, -169, -99, -93, -24, 15, -23, 194, 175, -142, 63, -17, 258, 204, 270, 272, 49, 314, -22, 61, -128, 60, -131, -64, -65, 136, -12, 89, 197, -108, -201, 93, 48, 170, -115, -35, -189, -19, 87, -196, 131, 234, -256, -181, -60, -316, 151, 42, 85, -181, -191, -49, -232, -26, -400, -112, -1, 337, 22, 20, 51, -28, 73, -161, 96, 101, 55, -57, 167, 130, 304, 74, -66, 34, -65, -73, 129, -49, -141, 270, 120, 100, -2, 39, -148, 154, -164, -10, 40, -38, -82, 120, 216, 215, 37, -40, -301, -63, 114, -123, 121, -2, -141, 304, 51, -130, 321]
3144C21n99M02J23k79J44J72j47j71q5L32j50K24r8k74j7K16J50m57K70k2m1J3
3166B7k3j9J83l10r5J05K78m14J02R5j02J43K31L40n90K42m59N05k64J72k04J25
3188F8L8R0j70K3LK40l82M76n31J63J41Q8l81L24k72k2J26O5k59K82l23K03l93
3211d03O16K7m90J87K49j16j65J71k7M8j47K47j01N5m81K64J30r6k22J38K50l9
3233I5m4m2L94m93j56K17j73K39K04j51m08J50MK35J2j67N3K93k03n3k13JJ5K65
3257G4K46l08N4j26Q2N1k25R6j83K01K11R0j70k4L9k44K23k96J50J82j6l21Qj40
3281c46N27j12J99l28K70j03j30K79l78M4P0j09K81k89j96L88j40J27O7N3k22
3302d8K90l10K13j43l14M60J8k37Q8Q0j57K65j40J3j34L6L2K38J6l91n9L53k38
$$ y = [321, -278, 124, 247, -32, 112, 284, 137, -34, -119, 213, 63, 287, 189, -85, -102, 114, 264, -193, 77, 55, 14, 27, 4, -15, 168, -142, -237, -132, 146, -268, -166, -71, -173, -30, 201, 541, -49, 193, -266, 239, -25, 147, -57, 68, 106, 196, 26, 49, 52, 292, -90, 386, -145, 18, 159, 247, -134, 190, -82, -104, 22, 87, -172, 110, -213, -10, -403, 213, 240, -250, -63, 186, 70, -95, 76, 49, 97, -50, 197, 96, 151, -330, -66, 64, -32, -254, -116, 134, 95, 51, 9, 403, -90, -246, -29, -202, 37, 241, 90, -318, -168, -164, 71, 83, -84, -31, 262, 59, 6, -207, -206, -191, 74, 320, 12, 66, -60, 22, 73, -152, -56, -239, -38, 173, 263, 93, 69, 108, -136, 87, -209, -59, 123, 107, -214, -206, -346, 181, 69, 268, -60, 210, 107, -23, 256, -122, -78, -8, -117, 164, -125, -321, 67, -73, 54, 121, 174, -48, 242, -68, 145, 2, -312, 148, 166, -71, 17, 97, -60, 205, 65, 78, -56, -20, 12, 250, 266, -125, -184, 169, -69]
3325f9rN8J34mM2Q4l90p9K00J07P1r6R1q3j51M9K36Nk80kj76L20J48l40l3N47
3351C80n31K04j19K93l14J13k34L86m3k2J36l53K6K35n6j15k55L32n7K93J54k21
3373B32j63j16l37L95N3J78N4n06L42J6l08K62J19p6j18L00n52K41k78L57J7L
3395A15l0kK6k72J56K74k35m3J93J05k73P3j78m7K29N4j49j33m7M3j14kK48K87
3419B78k36J86k38m9K27kk72j47L79N0j00R7j37J45O9j84j31lJ92j57q1R0K06
3442A82kj74J84o2N3J68m41J05k69L52j42M42m01m8jL37k06k24q5K41K8kj84K73
3466A24K34m64P9J84k33pr3m7K44k59M17k67o0l2K73k45J92J57l49K98m33J99
3488h8m8J64J57m29K90j26L88K6l79J38N2j21j26L53j31l98J72K9K07M3l21K58
$$ y = [-69, -78, -20, 114, 110, 152, 236, -154, -233, -33, 74, 145, 49, 140, 57, -94, -45, 191, 196, -84, -86, -262, 58, 206, -134, -167, 380, -151, 53, -66, 227, -87, 26, -208, 178, 135, 113, 249, -104, -78, 157, 101, -14, -269, 63, 6, 299, 453, 232, 69, -47, -384, 11, 64, 242, 296, -210, 132, 148, -160, 102, 221, 145, 27, 327, -225, 16, -262, 95, 112, 115, 85, 83, 109, -163, -7, 267, 32, -11, 182, 287, 14, 87, -91, -138, 91, 145, -4, -137, -184, -141, -255, -257, -9, 278, 42, 228, -10, -59, 168, 166, -106, -253, 126, 176, 76, 173, 36, 181, 250, 66, -65, -68, 124, -33, -114, -24, 182, 180, 6, 190, 128, 181, 349, -92, 13, -256, 96, -46, 396, -5, -53, -54, 283, 77, -147, -232, 9, 37, 35, -149, 124, 358, -106, -27, 157, -76, -83, -176, -223, 21, -238, 179, -88, -148, -180, 93, -152, 40, 197, -152, 146, -287, -88, -136, 28, 185, -244, 46, -80, 308, 334, -45, 93, 145, 24, -102, 251, 120, -278, -106, -77, 130, 173, -148, 110]
3510A10m1j57J53K9k04j87R9J18P1J91l03p4M56k17Nj18J38l35K17L9P5j41q3
3533a59K37J56k18k28L41m99M49j5l7j20j73K97K23o1l08J51Q4R0k14k97K72j85
3555b14J10R7k9k5q0l8K01K69j30j60r4mL27m55K83j25K6K34r8n2l99N6L49J40
3579A89k24k31J22L21k86K14L5p4Q2k36J42m1J50kq6J73k85k22M10j02k62K9O9
3602a15N5q5k7L06q8p2J1k30K41l0M6k54J0L5J72R3j30K36j34k40M82m45P1m0
3626a32J62L22m72j83O8L05l91K39N7j88J19R7K35j84J16q0l17J8L3O0NM41k17
3649A13l70J77LJ33J44L0m8l30K93J88k33J01l19J48R8J22m09J5L43j61m2N04
3671E00n27j7K25k46k10J51J49O7M9J31l37K31q4j44J13j4k10O6m5j06O01k38
$$ y = [110, 69, -88, 65, 94, -110, -297, -198, -80, -9, 182, -121, -195, 261, 44, 49, -69, 69, -266, -49, -10, 65, -76, -159, 78, 234, 16, -212, 129, -370, 79, 64, 27, -93, -266, 31, 254, 193, -115, 36, 120, 210, -4, -301, -29, -214, -104, -7, -36, -61, -141, -179, 22, 291, 161, 1, -93, -97, 230, -225, 58, -67, -41, 193, 95, 43, -356, -300, 49, 189, -35, -266, -144, 177, -109, 105, 140, 66, 148, -88, 54, 13, 163, 161, 75, 248, -37, -259, 151, 49, -213, -184, -115, -60, -145, -172, 134, 46, -26, -15, -245, -4, -34, 12, -242, -232, -197, -25, 68, -62, 174, 40, -200, 282, -163, -92, -132, 30, 352, -120, -303, -235, 70, -321, -82, -25, -213, -94, 3, 238, 54, 170, 90, -227, -209, -176, -116, -111, 330, 113, -257, -80, -77, 56, 200, 230, 182, -148, 145, 333, 100, 201, -118, 30, 128, 250, -159, -144, 199, 38, -4, 500, -27, -44, 181, -65, -275, -124, 25, 92, 141, 272, -65, 166, 82, -62, 51, 37, -173, -107, -152, -258, 343, 105]
3693A05p5J3M1j70J80j26J03o8J75q1l78L51p7QJk28R9J02N8M2Q4l21L48J06l34
3718d2N6m0j17j77m4L28n3l8J0L6K25m03L33j04k25O10m73M02k58n4j67J74J5
3741fK0Nj67K82k03K03j85K82O4j00J4k90K56j68n0j89K19j72L5J46o2Q1j38j47
3765b70J85J13j25q1qM75m05l8K20J77l95k61J05L96Q5n1k22k2J70p1R5j14K68
3788B26o49L43Q4j03K96k74J02k2R7j30k16L34k74Q9m2K92l19R1j64L70k00L35
3810B66Pm05k07L65K59k49p2p2jL0J51l31N41m17J83j51k26K98K6l4P6o9K13j83
3834bj30k9J37M1Q1j08j52L48J26m60j28N09n60N10k04m2K14qJ39k73J19k90j40
3857c02L02J49l16k6Q9Q9N3J74m09J26K3n5K70r0M8j77P1J02k12m6o5J47K46o5
$$ y = [105, 30, 43, 84, -86, 94, -32, 71, 3, 178, 97, -281, 70, -7, 1, 2, -226, -127, -25, 33, 75, 159, -162, 186, 292, -42, 14, -26, -143, -320, -364, -36, -89, -127, -117, -81, 144, -259, 74, -30, -255, 355, -118, 284, 26, -28, -195, -21, -6, 14, 19, -148, 134, -69, 134, -51, 231, 295, 195, 209, -81, 175, 7, -43, -232, -13, -185, -150, -4, -66, 15, -123, -270, -85, 28, -97, -178, -186, 289, -116, -154, 66, 243, -152, -413, -308, 88, 173, 122, -100, -122, 48, -23, 72, -42, 226, -423, -80, 4, -99, 197, -77, 25, 3, 100, -30, -246, 88, -186, -97, -139, 153, -166, -75, -239, 131, -69, 266, 273, -132, -339, 26, 285, 36, -36, -108, -109, -79, 72, -259, 282, -135, 48, -103, -329, -31, -5, -39, 37, -32, 181, -2, -132, -161, -24, 17, 98, -10, -162, 186, 312, -148, -276, 233, -327, 183, -21, -63, 151, 143, 282, 9, 128, -162, -302, 0, 149, -167, -193, -104, -15, 38, 212, -197, -71, -48, -103, 167, 77, 125, -52, 19, 121, -91, -137, -202, -55, 191, 126]
3881A26k61OL45j97j86M3J83p8j62Q2K79j75J05k14J83k97j8j97N74J21j94k55
3903a87K39j17J26p3J10K00l31L13k92r6R3k05K81K0j80M81l11k95n7M45M6k83
3925g3P2r2K21k21K64k78K37l68M01l9o8P8N4j66j23K20l05J37R1J8m8O0P9j09
3949D2j05oJ08O1l31l2M27k98M4P9J96k21J67l13j82L50J84o8l13J60j73L06K3
3972A05j04J1k69L68J15l34M1J8p3K23L06l04p3J17k85L45k60L46m48K49k16K83
3994A61p5l10J69K30k92qP6M6P9k58J23J56j09p1K49j78J39K11l31o0J85k03J48
4017G7J13k25J08R4l75M5J84q2j30J6M94m59OK88p7j50oJ19j04k29RK49j1M2j91
4042a95J80J28M6k50J21p7L65n01m8P8J26R5k34L62j86Q3k7Q4l53J20J6L20m57
$$ y = [126, -135, -129, 216, 19, -167, -124, 59, -19, -181, -99, 180, 5, 110, -104, 79, -218, -236, -433, 141, 262, 68, -187, 52, -65, 61, -12, 98, 298, -33, 280, -12, -108, -15, -220, 61, 81, -99, 382, 71, -224, -281, 164, 210, -73, -1, -93, 128, -93, 171, -107, 130, -238, 163, 124, 56, 134, 188, 22, -101, 119, -186, -49, 42, 60, 12, 72, 151, 42, -63, -69, 39, 100, -231, -263, 164, -134, -90, -11, 185, -36, 131, -182, -364, -14, 170, 102, -211, -51, -224, 82, 105, 1, 12, -257, 111, 226, -108, -67, -49, -122, 101, 407, 103, 30, 147, -138, 207, -53, 293, -155, 94, -122, 161, 86, -224, -55, 175, -117, -125, -49, -3, 76, -182, -59, 97, -12, -83, 166, -12, 127, 338, 7, -53, 132, -71, 77, 190, -35, 73, 167, -208, -163, 21, -61, -191, -175, 319, -140, -134, 154, 77, -73, -79, 40, -64, -293, -284, -35, -46, -4, -195, -15, 113, 159, -91, 30, -47, 318, -183, -231, -153, -27, 68, -166, 196, 10, 93, 66, 150, -203, -83, -67, 253, -204]
4065b04l6L13P8l47K78J11m86K80j86J2K85k13Q4J0L2k73K62lr2O4J09J62M5l06
4089b1q9k30L97K7j53k9K00N2j72J06q2Jl79N28m06K50j27J30J55j34k91M24m90
4112c33M21j41O0L3j86jL39k14J55Q7k7l65L1L65J50k75l63j3nJ71J47k13O2J98
4136H3j17j69K48qK32qm56K13j21j82L66l05M94n0m77L96j97R2M7j73j09J64J00
4159F3m5l4O5n9m4R9j49J76k18M02k71J04j50o6P5J24n28L05J68K3q8J1M3k8O9
4184D7m6M0k9k28K24M2N5o4J82k56J80K9j39O0n3O5J56j19j79j86K50J78m26M67
4208B50q3j41r1M4k37M22k18m6M9k5J24k2j61K45l3l0j80K09M8l47J06N9j05K60
4232I7j91M4L10k30O0j53k19M43l09J06j49J04J39O4m49K32J37j81K73Q1m62L27
$$ y = [-204, -240, 73, 151, -196, 82, 193, -293, -13, -199, -187, 98, -115, -31, -21, 11, -262, 0, -3, -95, -31, 78, 240, 285, -21, -110, -340, 57, 84, -69, -98, 102, 154, -18, 88, 6, 7, -372, 156, -250, 0, -127, 3, 158, 24, -267, 157, -333, 88, -53, 7, 40, -146, -147, 192, -22, 133, 220, 193, -172, -141, 224, 374, 99, -264, -277, -282, -111, 36, -177, -115, 83, -34, -203, 45, 37, 269, 261, -195, 18, -103, -285, 81, -224, 270, 220, -257, 139, -58, 34, 81, -92, -201, -37, 63, 18, -16, 49, -10, -54, 45, -104, 72, -146, 256, -15, 89, -61, -127, -52, 72, -456, -151, 17, 40, -48, -37, 6, -22, 47, 1, 41, 12, -216, 8, 50, 105, 41, 223, -33, 147, 176, 37, 97, 44, 109, 265, 146, -33, -219, 31, 209, -217, 250, 167, 26, -65, -21, -258, 164, -54, -100, -51, -76, 48, 26, -135, 110, 77, 47, -133, 76, 124, -223, -117, -58, -163, 97, -94, -50, 260, 30, 90, -63, -282, 161, -148, -42, -191, -87, 52, 116, -333, -101, 36, -145, 128, 209, -253, 74]
4254G4Q9k74J26N0r2K74k46J23j11q7K85J28j13k54o5J9L31j25j5k30J4K06k05
4277i8l1j07O7N1J82K19k0j79l16J71m6L7kK37m4j89J45O0n9j36J19L7k13J06
4301in6l0J83j40M16n19R6R4k96Q3J46nk78L56l75O47l70p8J20O4m9m0KJ28%J67
4327B57j52j12j39L7L89j55N4k30Q9j14Q0Q6j94J06j95K77j68K0L49l26j16J81
4349B4j63Q0J6j54L0L02p2j46j13L78M0k05k9k65K73j57L63l82K64j38O3K9j27
4372h9q7M98l76r4L5K47j67j30M19j62k60J43j73K14o4l76K61K34K45o7m18K5
4394a42P0m9K48r8j99o6o2N05m05m4L9K67O3k95K00J6j85J55K35j34K72o77J75
4417a11K74j27j45L59Om31K08P4K1l05J06L3K00j35j61K45k12K28k15j1J45L3
$$ y = [74, 163, -111, 15, 65, -27, 247, 1, 124, 13, -74, 211, 339, 226, -28, -93, -74, 257, 132, 117, -113, -99, 107, -98, -129, -236, -169, -118, 64, 283, 263, 84, -232, -61, -107, -70, -72, 165, 121, -68, 77, 137, 78, -58, 61, 98, -115, -9, -65, -95, 88, -52, 364, -155, -59, 35, -261, -178, -32, -37, -315, 41, -334, 313, -57, -135, -15, 49, 0, -40, -38, 90, 90, 257, 105, -7, -146, -109, 280, 125, 179, -51, 38, -76, 4, 90, -104, 2, -193, 84, -84, -64, 285, -41, -157, 24, -139, -59, -43, -197, -167, 135, 63, -83, -196, 182, 222, 17, -12, -277, -4, -161, 202, -180, 84, -54, 9, 38, -89, -176, 322, -54, -148, -113, 134, -33, -163, 256, 94, -166, -23, -196, 18, -46, -422, -161, 73, 318, 251, -167, -142, -72, -121, 127, 29, -170, -236, -298, 207, -198, -242, -203, 64, 127, -168, 32, 48, -137, 18, 253, 119, 391, -286, -111, 163, 36, -109, 250, 256, -175, 33, 107, 128, -177, -71, -38, 162, 27, -134, 111, -101, 127, -88, -99, 46, 79]
4439G9l11J8K85k23K95k09m1K11r9M3j50L17o5j66O9J56k15J36j73M2J66k27m8
4462a10J05r7K87J5k19K92k31M7Lj32r3K20n8l57L00K27j71j6p6P4L3J30l98q7
4486c12r2K23K25J85j92n0K72k69j29L19n30M61j43m8o6L12k1J43K6l36j52J10
4508f4K11p3m2k56K63K4q2M3m3M3j48r5L80L1k23M59m03pl06J03J60Q2J01J27
4532B85n69J64L78j39r9R0k27L4N19l02k12j71J62J41j81J09J1P9k74J48J22J13
4554A81k38%r0L41j85k78N90m78J04K9p9L42M9k10j40l9j03K37j09j05K07k4k49
4577b47K46m1j63J83J52r9j35N9j31K88j57K33k91k7K07j34L12j67j74K5N3j06
4599a14J31k02N76l55q0k6Q1M6k23K22P7m63K91J20r7K1k74L79J17q7m15K94n5
$$ y = [79, -232, -214, 71, -152, 143, -66, -107, 104, 5, 48, -102, 215, 150, -16, 53, 209, -6, 130, -43, -1, 165, -62, -110, -5, -102, 185, 200, -19, 273, 42, 89, 92, -40, -133, 87, 29, -328, -28, 199, 28, 12, -64, 10, 43, 173, -225, -312, -404, -181, 44, 229, 37, -13, 259, -10, -139, 180, -350, 111, -32, -80, -146, 166, 145, 288, 314, -22, -174, -64, 147, 74, 32, -224, 39, 63, -19, 24, -19, 24, -124, -219, 161, 192, -31, 428, 25, 18, -288, -185, -25, 57, 158, 285, -284, -120, 258, 119, 20, 110, -117, -83, 436, 134, -78, -249, -87, 54, -127, -18, -7, 72, -202, -54, 68, 181, -57, -57, -147, 194, 9, -269, 321, -157, -53, -24, -103, 239, 288, 78, -62, -101, -204, 33, -76, -181, 26, 2, -247, -1, -42, -205, -22, 130, 31, -104, -45, -176, 112, -45, 188, -103, -130, 77, -57, 255, 88, -86, -61, -8, -114, 17, -185, 391, 36, -44, -70, 11, 57, -166, 56, 133, -330, -39, 81, -16, 5, -269, 110, 227, 140, -275, 19, -36]
4622c6k06L57q4k6j0K40k1k38k95M25p2J60Kj51k5J90r6k18K48m5l9L8l12Q8K11
4647H5OR3n34M94j64J55j10Q4J6R8l64j36L54K30l23O9K42k86m1J10j97N1K21
4670A53j51o9J60M2j95K75l64P1K47l1j83J56k66L83k51j59O4J93l36L84p3o2
4692a2l6j47L39j39J33J39l63L06k09N8q1k26L80q9l30N55p6k64J00r9K96m38
4714b03o2j63N50l6k57L03Mj72N0K5N2K77l45J96j87j39K5j99M26j99J20pk26
4737a67k2J92J5O3l32L36J16r7J9n4po4J78k17j33M14o11L11J82k92M33k60p7
4760g4j96L52j51p0K30J26K88o74J22Q9J46k66J25j09K45j63j01K99j06k88K38
4781F2j04o2K5J89k40J84j24k2j96N56l83J85k97K52K9K4j25J19m57K27Q7J94
$$ y = [-36, -242, 115, 31, 5, -5, 235, 214, -24, -319, 106, 34, 194, 196, 45, 20, 210, 114, -104, 144, 99, 60, 98, -214, -126, 85, 91, 184, -350, 144, -20, 135, 25, 109, 125, 223, -141, -277, 77, 307, -16, 53, 295, 9, -32, 78, -119, -68, 153, 2, -67, 93, 135, -60, 215, -149, -78, 169, 138, -45, 111, -155, 228, -23, -182, -118, 75, -261, 123, 50, -12, -48, -195, 144, 5, 138, 277, -86, 220, 11, 69, -12, -238, 142, 53, -277, 278, 202, -62, 38, -61, 235, -203, -265, -428, 122, 86, -171, 132, 136, -36, 14, 39, 91, 368, 23, 219, 32, -107, -82, -281, 145, -54, 66, 59, -167, -189, 3, 18, 81, -251, 85, 201, 104, 123, 69, 62, -2, 176, -41, -174, 240, -371, -60, 122, -170, 263, 3, -74, -270, 82, -69, -139, 91, 217, 505, -169, -47, 42, 188, -78, 47, -62, 183, 20, -81, 218, 112, -176, 62, -42, -104, -79, 110, -130, 54, -70, -92, -288, 268, -115, 70, -227, 25, 54, 78, -47, 72, -385, -158, -71, 123]
4803A23n4n4J86j32O5j23L47n64K83j26J61j43P9j37Rr8L37k77l1J68j74J62K12
4826B19j16nj34J52nj91K03j29K5P0p6j09J25j21j13K16P9l2j10jK93p4j93J3
4850a4J81l56K47j7q1L64l73K80q1J50j21J08n35L16kk26K02j90L25J5k04O6q9
4873c5L02p4j21Ll54M27l09K65r5q8j40M03o9p0K37k82k12K53j23J62M7O1k81
4896i3J83k49K46Rp5N9J03k78M5K14m0k73mP1L1J11L9j96jk15K06L13m04K20j60
4921a38K44l9j12K92l08J02r9k5q0J61k64K23nOk7j09j25L62q9k87K12K81k74
4944i8L1J25q3p8K40k52M4J77k07MJ44qk34J02j7K42l19J87R4j85P7k42J94n2
4968a14M09K2m39M10j81k4K7pL35n00mpL12m41L52k23l9L2j41K72J16O8m5k05
$$ y = [123, 69, 15, 201, 69, 134, 11, 358, -206, 77, -49, 112, -31, 48, -89, -80, -178, 159, -118, -149, 19, -155, 7, 219, 103, 98, -36, 116, 111, -80, 123, -6, 19, 89, 13, -96, 29, -92, -205, 11, 90, 58, -52, -53, 240, 166, -27, -14, 167, -189, 58, 41, -40, 324, -49, 231, 150, 300, 179, 287, -248, 68, 66, -160, 42, -148, 177, 192, -12, 54, -35, 267, 193, 72, 75, -279, 148, -161, 104, 9, -79, -219, 184, 115, 45, 282, 0, -212, 41, -82, 80, 127, 188, -93, 90, -159, 87, 96, 21, 80, 183, -95, -50, 164, 124, -149, -153, -82, -51, 60, 99, -97, -98, -313, -107, 206, -198, 22, -138, 106, 67, -45, 247, -61, 41, -58, -83, -163, -2, -266, -43, -48, -42, -69, -178, -303, 59, -30, -317, -105, 176, -98, -67, 58, -25, -103, 137, -115, -71, 106, -101, -97, 47, 39, -195, -93, -110, 132, -187, 0, 94, -91, -14, -256, -62, -114, 295, 317, -122, 288, 107, 83, 110, 103, 438, -62, -66, -73, 239, -202, 150, -73, -112, -80, -221, 51, 167, 235, 190, -15]
4992a5K96l20K36l7P2p8j51j44J85j57N0M4j03K5K98j11Ml93J92J76k94K07R3
5015G5k76K93k27k2K02j13J9K3L78j69k02K36k45j72J3K21K1L6R1m45L02K23k77
5038a5j28K39l13K06L47j93j27m04m7K13K97j26n1J92r4k51L67p9n8K27p4j09
5060A9M34k18l32J59j2j38o4K89k96O2J53Q4l75K16N6j82PJ9n5K69r4j72K73m0
5084F2q8P2jL84m44O1J57k78j00L40k50K63l34j93O97j89o8k15k4J76n0M8l17
5107b91L42j94J36L4k06J90L26m85K46j28M1j87P3J98Q6j81k9j64J46J36P8k46
5129g9j04j74K54J96j69L61k83n5K5L23j18l31J73J2L7j25K78j09l57K19N4J02
5151A30Q2O0l94PK24l6l2m5J43k00N5k68K85n0L01L46m28J9l22K09J35k25j6K0
$$ y = [-15, 281, -39, 197, 160, 232, 154, 3, -141, 44, -113, -63, -19, -122, -97, 201, 90, 94, -299, -107, 69, -225, -18, 75, -201, 92, -135, -157, 45, -68, -49, -26, 352, 183, -19, 217, -28, -200, -187, 34, 55, 91, 182, -263, 39, 262, -15, -143, 96, -217, -11, 336, 143, 16, -388, -435, -222, 75, -51, -102, 90, -4, -255, 112, 33, -25, 202, 128, 19, 453, 235, -97, 62, 50, -88, -152, 137, -159, -97, 56, 140, -235, -19, 37, -145, -138, -119, -174, 95, 1, -171, 102, 62, -26, 46, 45, 429, -15, 46, 203, -75, -175, 165, -85, 178, -156, -349, 348, 159, 91, -124, -148, 28, -22, 26, -291, 51, -143, -7, 27, -179, 11, 337, -148, 98, -30, 11, -176, -103, 95, 181, 0, -29, -193, -47, 89, 167, -79, -183, -357, -103, 93, -76, 285, 2, -53, -28, 295, 177, -154, 19, 31, 68, -57, 221, 112, -245, -26, 28, 130, 212, 272, -122, -115, 109, 73, 41, -4, 139, -61, -6, -274, 11, -39, 262, 608, 180, 199, -123, 86, 221, -4, -20, 0]
5175@L55l62l63N05q1J52l30Q4j59K24l2K5k66L29J06k85n1J71J5k33J96k86N
5198b81N12k99J05p6n8J56k34J09L4Q0l20J07L42q4Q6j65M7MK17l40J65K1N3k14
5222c3rk0K17J49r0j25Kk81N68l57J89k56j34L33k59J97k82M50p8j39q0K53m51
5245b36M90j01k20K22k77J83N0j25R4k7j68J42k47M3L58k98M02k38l21N28k97
5266d3n2k60M32j27l52K62L27j34K35r8j38k76k2r8L38J16J26J25n35N9P9j40
5288a76j02K02K47k77RR3j19J54j79J94k41J13J26j23L03j77n3J13k7m29L65Q3
5310I9J84j82j42J19m5j14J36k24K38o3J15P9k26N2m0J57k63m4j10M56j52L5L5
5333A00j82J44j25K27j74K31m24J72J02o9k18K92k43j8j48L62m6m4P6J17k26K08
$$ y = [0, 355, -7, -370, 135, 54, 206, -124, -40, -199, 25, -7, 18, -248, 81, 187, -98, -149, 22, 37, -196, 0, -286, -281, 231, -68, 37, -39, -97, 59, -175, -66, -32, 48, -272, -165, 177, 93, 179, 14, 61, 65, 282, -58, 107, 128, 181, -33, -42, -62, 155, 304, 214, 89, 91, -190, 378, 21, 210, -46, -180, 153, -106, 91, -191, 259, 181, 42, -38, 215, -236, 254, 153, -67, 155, -122, 61, 111, -14, 80, 53, -115, 27, -220, -177, 181, -117, 285, 47, -274, 254, -43, -95, -355, 77, -50, -402, -140, 187, 53, 288, 190, 52, -224, -246, -344, -6, 110, 236, 361, -174, -115, -36, -176, -278, -76, 171, -106, -97, -4, -123, 31, -148, 46, -195, -82, 44, -79, 224, 47, -6, 107, 80, -349, 16, 99, 283, 101, -41, 78, 33, -81, 55, -169, 69, 6, 121, 200, -26, 26, -14, 143, -120, -164, -274, 182, 30, 65, 100, -82, 62, -63, 164, -10, 221, -203, -31, 71, 2, -216, 76, -167, -185, -333, 29, -17, -61, 15, 132, -94, 114]
5355A14n0M8J10k36L35m42K6j45j5J57j04L21%j00J01J59n84J63J87j22mK7J20
5378F6k96L3N43j06m11K72o6n9k34nL0L20j6N0j19o9K01K4o7k96M6PN1L00l4j01
5404F4k72n8J53J72j20m5K05J87j72k96K72p6r5j09K03k6J9Q9k15jJ37P0j65J85
5428A06Q1J21j39k34J40q4R5l17J30K59m4k33J70k57j08K10J91k60L38k80K15
5449A00k07K72K4k96J94K6j36J03n59N72R7pj40j9J4j09K5L9L41j48n03J24K85
5472I2o7Q6J7m8J78n96J98J22p7J90r2r2J2K31K59o68K04m6L24l42l06N34P0m18
5496b35K31O7OM3k45j50M49k19J34k64K40R6j47J00J4k31L0J2j28J27O9n2o2J90
5520G5n5m0P7j59K06R7J13m25R7n6Mk83L43j3L1l3J57j26j77J17k8%L64m57J37
$$ y = [114, 64, 112, 222, -14, 321, -121, -95, -240, -255, -98, -202, 119, 119, 19, 120, 279, -305, -142, 45, -77, -81, -54, 66, -230, -197, 346, 240, -171, 101, 35, -24, -258, -263, -233, 87, 71, 121, 2, -67, 134, 158, 91, -205, -159, -152, -101, 199, 165, 64, -208, -266, -113, 59, -61, -106, 99, 286, 114, -182, 90, 14, -81, -190, 13, -13, 6, 95, -120, -121, 16, 86, -79, 106, 187, 308, 169, -65, 75, -9, 86, -231, -101, 158, 114, -119, 51, -206, -314, -104, 87, -173, 165, -115, 100, -107, 165, 189, -107, 87, 113, -23, 80, -479, 93, 190, 183, 43, 24, 38, -71, -46, -7, 334, 186, -317, -193, 92, 25, 111, 128, 80, 258, -338, -140, -18, -95, 95, 3, -89, -77, 154, 413, -255, -51, -97, 227, -115, -421, 113, 183, -235, -4, 63, 69, 112, -133, -283, 166, -53, 81, -183, 57, 153, 6, 106, 120, -111, -81, -69, -197, -70, -1, -53, -115, 75, 20, -20, 57, -102, 104, 201, 314, -111, -14, -70, -66, -349, -6, -19, 12, -21, 136, 10, -167, -50, -78, -78, 286, -171, -34]
5545c4J83l9k24K01k28L1J48l3J06J32j94k12K30j59K67j01p5k05K36j49o6K06
5567B1n2Q8j20j71M72K40m90l33M42k64NK78j0K60k10M9l66J83j2j79K6K61K10
5590C28k91J86l11m3J92q2K23p1n5k36N2L57l21J24j1K63k02k43N6J51R3j12j3
5613C4j57K05j92J76Q7k75J39J01r3k99K27j51q3L88k01J0Oj52K82r0m41M47j6
5636d8j97L56j3l42J02L69p5M9J75l54J2K73l61J27K99l31q6p2P7j01j20R5l97
5659e63M80J00J89O4lk32O9K50j68m06J03K67k8j60J95m22L37J40k27m3j58L78
5681A62j61j85K3K17n6Rj65J72J4j72j00M30m53J44J08o2J49j41P4j87L48j44
5703B4j0J66j18J56m01L59r2m08K79J10J02j53l51M41J5M23n22q6j34K18o8J01
$$ y = [-34, 149, 110, -114, 87, -141, -110, 38, 5, 111, 243, 49, -163, 67, -92, 175, 74, -1, -206, 30, -119, -185, 21, -31, 57, -63, -234, 238, 478, -12, -345, 97, -167, -162, 116, 106, 366, 156, 205, -161, 22, 10, -169, -143, 118, 328, 37, 223, -88, -131, 61, -21, 202, 131, 76, -160, -108, 249, -72, 52, 41, 304, 102, -141, -85, 66, 159, 47, 34, -123, 82, -110, 66, 153, -122, 17, 118, 25, -274, -47, -198, -281, 107, -94, -84, -78, -230, 52, -38, -479, -32, -48, -245, 111, 98, -244, -142, 227, 152, 201, 376, 22, 34, 307, -54, 73, 372, 41, -45, -117, -40, -141, -261, -166, -563, -83, 17, 206, 270, 267, 35, 104, 354, 186, -220, -117, 150, 122, -38, 157, -265, 72, 212, -15, -58, -216, 162, 1, -184, -161, 56, 0, 9, -156, 16, 30, -142, -242, 188, -265, -121, -13, -75, 74, -67, 7, -180, 168, 24, 14, 180, 62, 218, -183, 176, 84, -324, -45, 65, 167, 14, -337, 104, 119, 542, 20, -66, -200, 18, -50, 51]
5725E1j41K19k18r5K31r3K44j66q8lJ75P0J6j73j48J39k3P0j09L44l67J34Q7j85
5749b9j74J78M2j38Q6j98M09j18J12j40j13L0j18N21j97q9j21%L0r1J65j42j86
5772b81l0K76J73R9k75l3j05J79j11j26L86j93J4L6j13R9j68J57J7NJ67m96L20
5795cJ78k59K51k06Q6o7N8K12j00j09nj55J61j18j00J35L57m72L38k02J76l26
5817a70K93j43j1Q5L7j87J6K17j90l1j32J54lJ44m42L59J68k12r7L04l5j76Q1
5840B9n0M7P1O5m57M94j4M3l30R1Ll70L87j87L69m04K47M4j02N7j39K1L41m74
5864b18J89k1L08k75K3K0J16k82K4P8J59k45K32j54O2J0l67K70j23N0J19O2M1
5887G8K1q1l0m3K55L05m99j94j4L43Q1k63J29j85q6n1J52k12K47n4j8j89M27j16
$$ y = [51, -90, 129, -89, -184, 47, -46, 198, 32, -56, -59, 116, 186, 202, 29, -119, 20, -3, 67, -42, 302, -65, 69, 156, -29, -203, -25, 17, -121, -35, -233, 176, 58, 170, 30, -83, -53, -171, 350, 153, 64, -57, -57, -27, -118, 47, -95, -281, -311, -35, 138, 237, -38, -71, -176, 3, -108, -234, 152, -41, -27, 9, -104, -5, -173, -16, 1, 6, 173, -323, -3, 175, -84, 167, -39, 47, -20, 38, 250, 150, 41, 36, -119, 42, -76, -176, -41, 316, -156, 182, -20, 156, -170, 123, -20, -31, 54, 91, -96, -80, 137, -53, -84, -216, -62, -65, 79, -363, -4, 164, -48, -145, 159, 124, -52, 29, -21, 26, 97, 162, -295, 199, 185, 228, -102, -11, -8, -378, 9, -178, 191, -213, 34, 78, -24, 33, -106, -85, 256, -218, -29, -50, 258, -17, 6, 26, 142, -140, -116, -38, 121, -124, 108, -46, 16, 26, -341, -71, -194, -144, -25, 37, 78, 99, 18, -12, -55, 200, 505, 6, -188, -202, 141, 222, -41, 88, -97, -183, -234, -82, -294, -47, -101, -119, -308, 119, 3]
5911Cj42J78n6q6qk6M1j52J73n0J92L30k06k09p2J03K06l03O6J17K2k2j69J17
5935D7K97k18k89K56K42l49J42l19J90l69L52M11n60J91L7q3J75k5k22K86nP0
5957B57j80m15M99k40N3n9n0L80m95K59J61k42N4K42m13L92J56m20L69l55K6K63
5979B42j69j80K38j05J4j29K77k86M66m42R4K2j95Q4O0j1l14K70J6K66l34j26
6001b42J5J18J67j69J66K4k96j08L1Q7M2m1K48Jm9J12j56j0j29K32k93r6L19m4
6025g1k6Q0l26O55n20nK22q1L80l50J14m6k05j1K66J22j84k3q6J68j42K97p7l32
6049a81L43k36J87j44J07l04J56j58J27K7J47Kj96L26l63N0J48k9O0L4l4m5M8
6072G2M89m67L8m5J82l53p0M71q52L17K08K26j69J39j6l84L96j32J40J70l79K13
$$ y = [3, -139, 39, -17, -103, -111, -137, -96, -248, -75, -125, 67, 397, 191, -18, -90, 13, 219, -84, -18, 99, 121, 99, -70, 47, 344, 126, -163, 93, 335, -14, 128, -191, -1, -370, -18, 393, -167, 24, 61, -22, 153, 128, -94, 192, 187, 257, 77, -338, 161, -79, -26, -85, -135, 245, -250, 9, 170, -72, -18, 224, -189, 203, 359, -61, 308, -47, -21, 242, 73, -107, 131, 26, 40, -89, 188, -98, 368, -74, 20, 42, -153, -69, -9, -20, -334, -64, -48, 218, -116, -242, -227, -109, 58, -111, 55, 79, -217, -325, -294, -207, -165, -206, 42, 43, -6, 106, -50, -60, -189, 43, -250, -346, -27, -71, -97, -17, -343, 312, -208, -213, 9, -72, 308, -42, 72, 26, -179, -190, 76, 198, 14, -9, -95, 73, -69, 228, 151, -181, 162, -74, 113, -31, 76, -228, -72, -230, -103, -76, 71, 73, -123, 203, -160, -110, 38, 9, 69, 103, 69, 24, 72, 561, 94, 132, 87, 269, -84, -154, 317, -535, -218, -10, 216, 47, 186, 170, -214, 182, 50, 190, 360, -19, 194]
6094A94k78L99k98Q1j77J42j0j22M0r3J79k24K33J76j76J3k19J64j90K87R2q3
6116A30j25R5k24Pk00J8N79l47L14m36k6K31l7J5j27J21K67l01K71j42j29K98
6138B52j27l40K24r6J10k37K20j20j22M58r2K2J33n22Q0J84P7N5k56J61n52P02
6160B14l42K2o7K64j9k64k9K76l96L91j40j42O7K35j31j32J06p7k55L38R1k16
6182b06%K56j09J26j42K99m37J92J92p0P7r6r7j68J06o6N4J40r3L9NK20n43O51
6206C30j92lp7r8k6J69k62J32K13k10m2r1J74j22K68O6o05N33k2L2O9l94j04k3
6230b85J85R3K5O3o0L1J20k52j3j39L78qO0Op9m3l47K74J64J9O5k10Q3l09n0J77
6256e2L80k58K7j05M05n10O0l2J94p3j24j52K06j63j09L74J11q6J8J72n63j64
$$ y = [194, -84, 315, 17, 98, -79, 63, 53, -69, -29, -122, 57, -167, 66, 242, 66, 79, -140, 24, -166, 121, 213, 130, 5, 100, -124, -117, -317, -299, 280, -67, 247, -189, -215, 16, -21, -6, -133, -12, 255, -46, 225, 83, -46, 252, 125, -215, 9, -87, 23, -214, 6, -114, -236, 222, 130, 152, 285, -237, -157, 27, 104, 159, -97, 64, -488, 214, -128, -106, -173, 91, 72, -192, -221, 55, -341, 50, -90, -232, -165, 70, -61, -193, -87, -164, -419, -81, 10, -206, -206, 50, -59, 67, -75, 224, -213, -21, 171, 101, 178, 82, -15, -183, -77, -143, -89, 51, -42, -3, 2, 222, -321, 330, 138, 135, 58, -40, -66, 103, -159, -27, 186, -24, -66, -157, 17, -105, 163, 229, -376, 157, 135, 167, 236, -158, -262, -285, -100, -7, 18, 81, 21, 52, 172, -80, -93, -232, 146, 138, 198, 204, 125, 82, -265, 9, 173, 192, 257, 47, 130, -179, -229, -52, 328, 70, 97, -8, 397, -113, -53, -85, 109, 36, -88, -240, -34, -197, -306, 68, 179, 93, 111, 283, -280, -444]
6278d44N45K68n72K92l70K15K0j62L4o5L5K83r3k56L02l32L67j83M5M38l75N7
6300D9O1k77n6K05Q6N9k3J51m24K73k02J89K15m46l1K21K03j36k0l04L03K09j63
6323A42j83j53J95l00O79m19j26J45J49J31m55J88J18l26J83R3M8K8j38q4j30
6344b15R1P9P2L3K38m06L28P5l75j06J5k1R8K58l54J71j06j5J5J00Mp7J30J02
6368A34o4N4q0J20j48k06p7L84j08mp6j32J06K07j84J26Q3J26m98L44j75L45m29
6391a52j55K44j58j73M65j36j62K02J33j49o0L15l14o3J01K16k83J93j47K97L3
6412B47l00Qj26J09J86r7j62r0J95j0p5K2J33j04OL70k26p5J13k92J17K36l09
6435a24M4k35L21k8K85k72J27J22k28Q5j33P5Qj30K75p0q6r0O2O7j93J26n0P9
$$ y = [-444, 101, 369, -203, 89, -281, -66, -46, -208, -174, -239, -204, 79, -14, -270, 32, -300, 67, -116, -71, 367, -8, 49, 110, -167, -223, -18, 68, 127, 104, 255, -169, 104, -98, 91, 306, -140, -171, 50, 253, 117, 97, -207, 96, 305, 142, -41, -194, 1, -299, 380, -39, -165, -20, 129, 260, -195, -7, 111, -215, -32, 61, 109, 137, -1, -85, -215, -124, -45, 27, 60, 298, -108, 220, 295, -80, -186, -171, -192, -94, 164, -190, -19, -125, -140, -125, -25, -21, -98, 32, 134, 70, 124, 44, 164, 16, -190, -267, 117, 9, 5, -71, -203, -97, 110, -74, 52, 135, 261, -237, 107, -68, 277, -152, -307, -63, -221, -394, 71, -65, -227, -25, 108, -41, -101, 214, -100, -163, -62, 154, -129, 64, -83, 214, 247, -53, -45, -171, -62, 124, 27, -135, -225, -30, -40, -115, -93, 40, -64, -58, 312, 86, 11, 124, -168, -51, 185, -124, -80, -315, 6, -22, 263, -9, 118, 240, 12, 97, -36, 39, 47, -83, 192, 122, 36, -54, 8, 75, -118, 8, -42, 37]
6459C7n4lK65k55j03K55o5r6K7J54k57k88M49j77k1N2K91j11m55M87m47P0K62
6482A7K16k19K83l63K11L3k97R8rmj41Q7K97j07M4l07J87r6j14L13p1k57k4K91
6506F8r7K19p8l10J8J82l5N8k71K32M03m71M3Q8P0j60J15j32J84r9o0o6o0L29
6530A70k80L92l86J44R5J46l41l16M95k6K23p38L93K19j17j79J06J06j06j17K96
6551A79r4j17M8R7l87L88k20L60q0k74R3j59K22r7K5J35k0k78L02j72J62j95J69
6574H7L4l34M69j32j90Kj30K32J48k81O0K49j63j7j50M2j65K11R0k95K02K3l2
6597d0k47J21RJ14L8j84J97k8L25m69L24r0R9J70n86J8L42J92m36K66K5R3j83
6620G0r1J22j11J21k48J86k46L64m2n58J23O40k04J17l92M1n9J04k1o6M20l14
$$ y = [37, -17, -20, 245, -10, -113, 142, 77, -19, 8, 162, -95, -383, 66, -111, -132, -80, 211, 100, -355, 132, -315, -245, 17, 233, 14, 297, -66, 145, 178, -119, -21, -30, -34, -175, -88, 209, 102, 146, -161, 26, -70, -184, 129, 58, -199, -223, 68, -29, 190, 112, -198, -180, 2, -33, 25, -246, -14, 389, -82, -39, 49, 119, -41, 74, -58, 126, 27, -33, -99, -159, 170, -110, 282, -104, 40, 135, 281, -60, -376, 119, 93, 316, -422, -29, 190, 73, -106, 0, 106, 0, -117, 179, 85, -32, 16, 113, -274, 114, -106, 254, 174, -100, -7, -166, 56, -41, -16, 119, 99, -179, 123, -49, 113, -82, 87, 121, -213, 256, 124, -66, -64, -194, 38, 186, -95, -35, 214, 51, 34, -116, -74, -239, -28, 62, -233, -31, -8, -40, -287, -166, -157, -43, -5, -189, 8, -20, 305, -164, 160, 70, 169, 339, -247, -229, 113, 305, -131, 135, 160, 253, 70, -21, 101, -10, 111, -137, 49, -197, 167, 125, -433, -310, 330, 126, 243, -149, -108, -167, -63, -84, -150, 270, -44]
6642d4o8J58KK29l70K48j82J42n2M9n1j16p5K99m20M45k17j57L47Jj83j07K83
6665A61mk49L36l56K41m7j75K99r8k33L04k43J00n0j1q0J03j06K43k41K28q0N5
6688I7l39R1K21k94L91l85l4L19L0k37L45l93J08M23j64o00L47J19O0k65N7K76
6710A73k27J8O7k72J9K23j69K59O3j70k4l0J94j82J45k03j52K73P4Rjj86L67l39
6734g1J60l03L42P5j51k2j75L18j03j23K41l05J83l9PL4k61l3j6M31j13p4j63
6757a61p2O2n5Q5M4j22L43l53J79L9M5q4j21M53l02Q3J39n07L1K3N1J90O2J00
6781A52j18k8l08l0M99l4K6m26K72K11j65k1K05k63m10N43k72J96r8K73j61k51
6803b08K28j3j05o6K53O9j46J31n8L82m12m5k52l5M4K85Jj35K26k49J57j47J85
$$ y = [-44, -112, 46, 48, 277, -93, 155, -27, 115, 63, 112, 61, -55, -130, 169, -251, 194, -23, -180, 167, 168, -15, -122, 161, 157, -92, 244, -112, 129, 82, -93, 206, 108, -125, 179, -64, 36, -14, -25, -105, -2, -108, 135, -106, 122, 42, 97, -242, -151, 70, -224, 167, -218, -252, 67, 97, -140, 205, -188, -80, 343, 179, -421, -74, 45, 105, -160, -103, 173, -54, -36, 31, -241, -222, 1, -168, 91, 154, -16, -40, -70, 124, -58, 87, -116, -268, 5, 79, 88, 87, -99, 268, -71, 89, -214, 128, 203, 52, 30, -145, 173, 70, -53, 188, -117, 66, 27, 34, 68, -193, -226, -242, 189, 76, 2, -161, -233, -171, -226, -141, -97, -219, 124, -229, -50, -11, 34, -50, -171, 282, -20, 63, 202, -305, -274, -251, -200, -10, 52, 152, 34, 6, -302, -332, 167, 133, 159, -267, 5, 216, 51, 30, 235, -28, -438, 105, -167, 29, -69, 204, 43, -208, 20, 7, -98, -164, 89, 158, 12, 143, 85, 467, 55, 10, -242, -277, -233, 52, 53, -82, 144, -105, 52, -95, 90]
6826I0j19n0N1j8j6jk10L94O5j44K7M7R1l58j25K29l6j28K38j30L40j48k8k15
6850a54K71l21J3j18K92J74j94n09O31j86K07j28K67l43K51M0k87j53K65j17N5
6871d4J99m05K29J53l22J05L29m90K39p3k1J10M5j77M4K41j72k7J97k61J85m07
6893c23N9J27J78j6k29O4Q1J56O0k05Ppq5K92j76J49n6q8J15J74l53j77L25j15
6917d3rN4J36l21L20O6j17J07j47k1Nj31J9O9L70k64nJ96l50J16m4R2K7j05j08
6942h8N0P0N4j6J29j69J32j71L2O1q2j7Qj50L73l2l77P0J08j5K13o2p0K9j4j8
6968D8n6J6N6O9k25J0K6K28M3j22q8Q4L9k33L04k30j81L56k36J0J58R1k57jM18
6993C27k94k80J65K09q3q6M4L8k8J73m04J38k23L18L7k79K01K45l55NJ81NM5k47
$$ y = [90, -29, -79, -28, -46, -62, -63, -273, 121, 186, 42, 69, 116, 207, -151, -276, -47, -83, -211, 27, -103, 237, 89, 61, -154, 117, -204, -191, -309, -17, 157, -37, -546, 85, -101, 106, -22, 245, -98, 153, 193, -94, -247, 18, -99, -44, 155, -250, -21, 132, -190, -85, 244, -246, -7, -80, -101, 9, 54, -123, -79, 162, -10, -37, 160, -101, 84, -323, -264, -137, 41, 25, -204, -140, -59, 97, 157, -48, -41, -48, -133, 159, -17, 132, 76, -12, 103, 277, -76, -253, 72, -43, -52, 2, 138, -183, 137, 203, 86, 193, 46, 25, 30, -101, -82, -13, 357, 93, 88, 284, -66, 50, 6, 98, 125, 20, -88, -38, 32, 86, 70, 199, 30, 162, -9, 23, 84, 2, -15, -7, -157, 216, 184, -193, -123, -15, -30, 183, 121, 51, 80, 66, 48, -8, 8, 64, 133, -92, -82, -56, 172, 215, 93, 5, 89, 128, -105, 199, -31, -212, 144, -92, -82, 76, 167, -90, -91, 327, 33, -247, -82, 127, 44, -42, 2, 40, 12, 185, -219, -81, -304, 14, 51, -228, -27, 218, -137, -132, 49, 54, 99, -148]
7017a48J44j76j9j07L99O0j11k33K38Jn0J88l34J53P3o3j28K39k70M07k72J08
7039I9k43K21k86L21k39J11R9r1O5j07k73N66m86M09j61k51K88N6j07k05M48L9
7061B73m7m31L07J85k92j27L61m32k76L24N21l39q2L40k07p0j07l3J40Nm05K41
7083a51L38k2j79r8m8M17l93m1J33L52j56l76J63l09N66l96L71k44O6l5kJ06q2
7106b0M4k55M11k14q1L11j36j2k00K72k86J05j42K56k2r4J93o8j30M81m19J8K1
7129C3j28k63K58K39j93N0j06J70j53R2K1O9k84J39J06J46j47J27j41J77k52m8
7151h8J14j46M14n58L89k34k2K22j88j08L00J29m37J51L59k89J22K7j05R7q6n5
7173Hr5K93m89L76j95R8Q7k90K09J62j09P7K60M1j45j88j09j64K91l38L19l51
$$ y = [-148, -4, -180, -199, -306, 93, 153, 42, -191, 47, 48, -2, 186, -148, 5, 78, 15, -113, 126, -144, 263, -9, 99, -144, 77, -209, 112, -127, -16, 83, -8, 57, -50, -323, 243, -243, 166, 5, -246, 42, 98, -9, -214, 234, 273, 226, -205, 102, 287, -5, -132, 229, -203, -479, -155, 366, 27, -55, 285, 78, 8, -99, -132, 8, 13, -392, -151, 187, 165, -14, -112, -160, 257, -136, -177, -44, 308, 152, -224, -61, -370, 196, -200, 171, -73, -7, -42, -44, 62, -20, 24, -231, 180, -34, -115, 196, 60, 48, -152, 120, -166, -61, -203, 53, 31, -63, 130, 62, -68, 413, -6, 12, 33, -95, -358, -100, 139, -54, -4, -110, 60, -93, -1, 20, 89, -195, -56, 50, 196, 49, 176, 35, 212, -40, -88, 26, -120, 294, -264, 125, -109, -131, 91, -97, -205, 95, 224, -213, -62, 297, 8, 130, 157, 52, 149, 63, 8, -87, 206, -283, 93, -102, -4, 83, -207, 2, 164, 55, 132, 392, 433, 288, 100, -9, -173, 118, -220, 99, -252]
7195b52L76k2j15j25J94K24l35OJ71j47k09j20M67j64P3R1J53l20M09m40J51m44
7217c78J32J54j66J50R0K5p6Oj36K33r8L19k39J46Q5k31P7J92j45R5l84J1K57
7240A19p2K53m20M9K65j80nL5M3k53K84p2J61q3j75J52k65j3M67k82N8j53J41
7263E4%Pk6J10j15j6J51j63K64l43m71J053m65k93J89RK67l48K36j45K32k47j34
7286a94L6O4J05m7K63p7k51j13l7j15J06N90n21J41n4r9P7K30J58l28Q5o5J8K28
7310B00Pk94L1l3m3k2K60l76K66Q3j93K21J26j66k66J92K09l33J82M8j25p4j30
7333b30K05N7q4O5Oj60K69L0k77O4J22J78o18K36no4K35j97K04O0m38L69K57m40
7357a56K32l83N19m10j86O47l35j12L46q1K9M0p8O9j68J07k69J0Q0P2k18j07M63
$$ y = [-252, 124, 102, -13, -138, 56, 280, -55, -49, 122, -25, -234, -354, 113, -51, 22, 113, 266, -54, 355, -85, 66, -378, -246, -92, -258, -108, -18, 7, -69, -63, -199, 34, -64, 255, 16, 162, 247, 16, 93, 285, 140, 235, -149, -138, 119, 47, 300, -120, -71, 194, 14, 9, 44, 87, -166, 118, 46, 207, 124, -51, 101, -164, -177, 290, 8, 66, -87, 54, 54, 61, 35, 145, 30, 14, 165, 2, 266, -77, -548, 505, 40, -253, -64, -55, 212, -136, 100, -45, 187, -60, -194, -158, -94, 11, -36, 227, 150, -101, -214, -251, -366, -260, 330, -191, -50, -104, -203, -126, 104, 262, -66, 19, -46, -28, 200, 207, -87, -56, -89, -132, -154, 106, -270, -4, 79, -114, 107, 233, 67, -199, -7, 202, -131, 51, 99, -26, -100, -230, -25, 32, -52, 13, 19, -141, 128, 158, -119, -55, 67, 245, -373, -137, -142, -206, 29, -168, 36, 96, -342, 27, 284, -156, 76, -307, 212, -198, -384, 263, -72, -184, 162, 81, 110, 150, 72, 141, -27, 80, -189, -179, -99, -27, -245, -352, 111]
7380A11o9R7j28K49k41J73j85j11M26k16l11L23o1l10M37j43k1j76J9K04j39L79
7402C07k21K71m15o2Q6o5R8J77q0J2k72k8L35m76P4M95j98J62l71q6M69o0j54
7425bJ35p3k65J68K36k75PM6K7K36k72J19k19K99o8j83K85j99l8L27k57l6k62
7448b64J79K36j13n7J02J21l86K6Pl0k9J71J9p0o6J90J59k18J64q8Q4j20n8q3
7472a24J88K58k48L39o70K68J5L05l38P2J80l6qm7j78j14K87j82J05N8m5l5lj60
7496a13J41j38J12o9J27l66K28m8P4r0K36o1m8K39m42K49Q0r5o0j80L3M51m57
7519a97L03n5PJ75k07O4J5k92O7k2J34P3K44o7J5l15L3L18l96J99j55L12k06j57
7543a10L53k08L4rK09k35q5K76l5j09k11l89N46Q4M8k90J0J11j82M23j15r8O2
$$ y = [111, 42, 139, 11, 260, 19, 192, 7, -104, 322, 106, -205, 118, 57, -253, 184, 41, 20, -156, -137, 67, -72, 307, 86, 357, -58, -120, -34, -99, -1, 176, 96, 108, -164, -192, 143, -333, -259, 236, 38, 200, -171, -257, 212, 152, -2, 133, 60, -205, -37, 199, -76, -69, -23, 4, 240, -32, 87, -132, 167, 99, -84, 201, 2, -36, 291, 34, -2, -264, -85, 151, 38, -19, 83, 204, -182, -156, -149, -179, -208, -37, -18, -88, -154, 36, 195, -23, 141, 53, 137, 17, -41, -124, 64, 322, 74, 413, -257, 11, 26, 331, -7, 65, 245, 209, 201, 154, -24, -138, 149, -33, 72, 130, 85, 50, 47, -113, 28, -110, 2, -67, 60, -306, -78, -126, -52, -142, 94, 33, -15, 224, -218, 31, 111, 16, -44, -224, -191, 260, -197, 106, 51, 58, 233, 26, 90, 105, -187, -120, -142, -8, 65, 309, 242, 257, -58, -25, 293, -103, 96, -59, 253, 47, -110, 243, 35, 69, 60, 269, 34, -51, 225, 190, 81, -130, -519, 27, 111, 159, -131, -121, -10, -192, 231, 116, 18, 80]
7566H0j19n2J9M4p6J25k99L50k22L50L1j3k89k42M47k72L09j66j49K17p9K65q6
7589A73m4j06k58M17j86O8j03j57J74L2l00N27j85J2lQ4p9j8J21M8k77Q3k54M68
7613B37l78N6j31M18m5j33n0O1J27J36m50J34k52N32j68j64Q7m2N9n3p0J65p1
7636EJ38J26j91j67J40J0n5M3j03K46k52J18k30J41l05K71K38P2k82K94j91j9
7658D7N1j99J01K16m28K24j00L0J32m7l82O59L9n60J12M50qn71J33K62m45j68
7680d52L66J65J08m81L37M7K07r5k72J7J80j50L17n03M47k44J09J88m09J58j48
7701a08m6J56q4L4mn5r2L86l32K45k61J15j62J33l9M0O6K9J33m04K54k05J06j5
7725a10L98k92L3J23J41j82j89Nk51jM56j29P6m03Q6J07K71lm53K17O2M38p46
$$ y = [80, -39, -91, -72, -28, -104, 21, -278, 72, -150, 200, 231, 218, -71, -313, 134, -138, 171, 5, -144, 73, -6, 259, 173, 129, 23, -235, 182, -4, 64, -39, -196, -22, 10, -290, 237, 52, 64, 61, 145, 66, 48, 169, 217, -60, 23, -231, 237, -141, -85, -216, 202, 157, 24, -26, 35, 162, 298, -152, -18, -270, 262, 94, -70, 17, -25, 34, -19, -89, 76, 5, 143, 269, 78, -89, 51, 61, 6, 49, -54, 192, -60, 58, -172, -31, -336, -65, 173, 245, -37, 257, 66, 47, 98, -101, 0, 216, -212, 12, -88, -58, 74, 27, -355, 304, 343, -217, -105, 345, 337, -234, -101, 161, -284, -452, -86, 79, 187, -294, 43, 90, 297, 202, -70, -53, 127, -23, 294, -209, 238, -6, 103, 291, -118, 40, -108, -154, 2, -82, -48, -52, -107, -199, 187, -145, 100, -161, -46, -208, -75, -114, -74, -8, 21, 154, -250, 4, -201, -95, -110, 288, -4, 29, 152, 293, 111, -78, -73, -324, -325, 131, 2, 78, -325, -239, -132, 139, 136, -317, -100, -38, 400, -346]
7748c46L17N0k80L93m04L64l92J43K9J87o6K84k34k80K70j38r9K9K59L8k47J30
7770Gj51J34Pn1J71l46J87K18j87Q8L2l39K75K07n17J80K80m80R4J58J70j79r7
7793a39k0qK53j24j02Kp1L69m08M6N8J09n6j49K37K3L5k37J74J69m07J69j2J96
7817A07k24J11L06l80K59j87J08q9K01r9j31j50L21N2k67k26K04K21j17j23J4
7838h9kJ95J14k56l11J83P8o5J25M6K57m29p1K77K58l01J04l04K42P9j4j80o5
7861a29J86j97L86l18L68k60P1k39P9J53k89K24J47l73J88mK72k96J90m02K60
7882A7n6k4J56j88l8l1J47K13m25j00K98J40p5o9k16L01l5m1K32K9L1j76p8K0
7906C2K46k55J20j91k0L5r2K55J71m90j6J98l44K59m9M36m78J27o1K32J72k38
$$ y = [-346, -29, 21, -259, 134, -270, 94, -298, -155, -126, 61, -5, 279, 45, -235, 35, -103, -202, -173, 86, 124, -123, 7, -144, -10, -3, -54, 117, -229, -42, 176, -11, 77, 109, -230, 45, 252, -265, -85, 195, -285, -191, -33, 137, -42, -139, -159, -167, 86, -38, -140, -138, -209, 160, -248, -202, -144, -35, -91, -240, -3, 20, 55, -182, -8, 161, -246, -77, -89, 107, -117, -6, 300, -80, 179, -8, 100, 11, 212, 113, -18, -168, 153, 205, -62, -288, -84, 137, 20, -103, -89, -91, 104, 218, -38, -349, -166, -88, -153, -28, 18, 275, -154, -225, 52, 310, 9, 113, -191, 51, 130, 116, -64, -129, 57, -140, 246, -72, 296, 36, 107, -132, -53, 100, -189, 35, 182, -191, -3, -7, 265, -31, 159, -243, 17, -39, -63, 93, -95, -133, -164, -17, 196, -229, -329, -31, 109, 34, -35, -251, 50, 15, -26, 206, 235, 266, 90, 12, 32, 278, 23, 143, -48, -68, -33, -125, 130, 301, -189, -205, -7, -351, -92, -141, 295, -183, -56, -117, 115, 287, 49]
7928D9j79J11m2L1J01k9O6k42K19j58J50J3J6j95P6l41O11n19L0L55p7j2j15J16
7952C5Q3k44M0r8M54m4m27L33k32O7N6J07n7J8r3R9o2n1J92j78L55k72l1R6j72
7977b6J71k94j21K85o3j78J7M16j66L33l73J24l73O98n46m5K64l61L39l3j09r6
7999a37J01L8k01J07J67J0j31k46J75L52l62K8K68j48k2qj86J52J68J91m14J85
8021H7l3L3L7l42M12k23P4J9o1Op2j14L36l46R1O0O4L0r4J18k44K73K30o30M95
8046B06k0k12KL8k93L70oj26J77k74K46j35j25J95O8k00L95k44k23J54l7J52J64
8069B72m08K6M43n40L11j06L6l75M70K96o84L82r1r6K62Q8n74K16j07M11k71J01
8091F2n4L5J7j66K86k73J97R5m20J07j9J63r2J94m20l9K67K17l35J89L3j09r4
$$ y = [49, -130, -19, -61, -30, 71, 42, 108, -134, 85, -73, 77, 90, 106, -89, -13, -354, 257, -262, -232, 123, 46, 34, -81, 35, 118, -126, -86, -184, 270, 226, -201, 132, -100, -33, 23, 130, 73, 91, -2, 97, 35, -16, 176, -2, 353, 81, 50, 146, -26, 145, -149, -270, 15, -48, -226, -209, 207, 41, 374, 1, 125, -248, 450, -96, -141, 123, -238, 101, 68, -41, -137, -36, 2, -199, -92, 75, 85, -46, -292, -117, 235, -127, -99, 169, 21, -1, -9, -195, -43, 125, 316, -98, 87, 54, 87, 124, -218, 194, -29, 45, 64, 3, 9, -63, -177, 159, -187, -96, -36, 28, 58, -36, 82, -162, 111, 341, -289, 206, 186, -26, -24, 14, -279, 91, 85, -41, 136, -138, 108, -27, -152, 43, 111, -89, 306, 62, -161, -7, -44, 108, 272, -136, -110, 333, -207, 104, -2, 34, -341, 129, 425, -259, 123, 32, -64, 198, 286, -288, -72, -179, 232, -39, 62, 8, 43, 60, -106, 180, -93, 104, 199, -221, -114, -133, 30, -62, 132, -288, -327, -60, 157, -178, 11, 44, -65, -159]
8114a59K62K37j35l82M14j89j32J72L5q2j43j26M24k04oj9J29k99k4J26n3L76
8136B22l33J31k1J49j33o9J43J14Q4m59L18l58K48J44n8l0P8m18k6L72O4K1j8
8159A65m15M07j18Lk30J15J33p8oK02l20L22n4j95O6OJ24Jn2m89M17J79j99J62
8183A46k79K85n7j93M73n47J26L1
$$ y = [-159, 103, 340, 205, -177, 237, 48, -84, 88, 123, 41, -102, -228, 196, -8, -14, -33, 96, -203, -227, -101, -154, 222, -111, 20, -1, 148, 15, -54, 89, 203, 287, -172, 146, -212, 36, 180, 122, 92, 170, -248, -274, 98, 162, 183, 165, -250, 157, 39, 42, -188, -73, 60, -18, -24, 178, -142, 180, 126, -69, -3, 3, 127, 128, 76, -413, 4, 183, -16, 146, -133, 152, 95, -98, 375, -172, -46, -15]
8191a5
$$ Imaginary data points
##PAGE= N=2
##DATA TABLE= (X++(I..I)), XYDATA
0@%%%%%%%%%%qJ6j6J6j6J6k4L2l3M1m8N6o5P3q7J00j10J23j44J64j83K08k31K55
34A35k86L19l57L97m39M86n40O00o64P37q17R04j003J118j249J402j581J795k058
53a101K387k817L406m263N624q145J4363n7587r9906R6611J17737J3581r9013
66a9123o4671K8202P1012J8645k7979k6637o68K595P567K0667K2516j5252m3331
79b6457j9310M3079N7203l785o6405m4368L3049O7497J9469m8825n6095J891N1360
92H303L7776j4968m3335k5373J5325L6841J8928j4544l0618j7385J1051K9253
104A1254K0225j1197l2462k1150J4038L6455K1510k0798m4301j6559L2493M6240
116C5748N546m4176m3130J0899N1936K9790k6408m6953j3258L1183L7689J716
$$ y = [0, 0, 0, 0, 0, 0, 0, 0, 0, 0, 0, -8, 8, -8, 8, -8, 8, -16, 16, -17, 24, -24, 32, -33, 40, -47, 53, -57, 66, -78, 86, -97, 111, -120, 135, -151, 168, -189, 208, -231, 255, -285, 315, -349, 388, -429, 475, -528, 590, -659, 743, -838, 957, -1101, 1286, -1531, 1875, -2388, 3236, -4909, 9454, -48133, -148039, -51428, 66309, 79890, -19123, -83794, -55592, 15420, 34065, 6086, -20551, -21219, -18624, -11057, 9610, 32126, 16874, -26457, -45767, -2688, 54515, 50730, -15675, -60043, -26994, 40503, 59972, 11147, -44948, -43057, 8303, 46079, 31111, -12224, -37597, -22272, 14569, 33497, 18953, -11665, -29050, -17999, 11254, 31479, 20282, -12180, -33330, -19292, 17163, 38673, 17875, -26426, -42985, -10492, 35748, 41294, -2882, -46012, -35113, 16823, 46613, 20205, -26748, -40006, -8823, 28866, 30582]
128C0582k9914k4268K887J9607J8124L992j3751k2482j0621J5495L1798J3146
140C4595k7615m1180k687M3304L7429j4507n0725k5812L1643M9392O376m1106
152h93l5130R125L6456K0373j3535k6827j0795R562J6060J1786K38j5410k0688
165a9678k787K3163K7550j454l5432k9486J5998M4705J8488l0766m2770l903L9591
178C219L4771j2067m0519j9527K0113L1306Q338j8335k2578m021J3224J5638P032
191A6594o392j7364j3930P016K5474J6947j3699l3952j3955K6849L7745J512l7765
204d920l1449J3278M0886J8957k4697l6337m010K8079K3436m396k2048j4555N144
217a2632J4101J0223J011q351j5895q039J2757K4340P385k2349k8965R9L3655
$$ y = [30582, 668, -23600, -20713, -1106, 17018, 21010, 7259, -15223, -25844, -10349, 21449, 34595, 6980, -34200, -36887, 6417, 43846, 29339, -21386, -47198, -15555, 33837, 40213, -893, -36023, -26898, 9558, 29931, 16396, -10431, -21226, -11664, 4396, 16182, 16420, 1010, -19678, -22465, 698, 28248, 26794, -8638, -38124, -22126, 22579, 41067, 10301, -32469, -36372, 3219, 37990, 25923, -14596, -34123, -14010, 17296, 25634, 7299, -15279, -19300, -6076, 9562, 16594, 10202, -7162, -21092, -14076, 11398, 28345, 14646, -19306, -33261, -6412, 31333, 32845, -4920, -36369, -23091, 17795, 36752, 12055, -24282, -28292, -213, 23223, 18827, -3221, -17776, -12632, 1469, 11692, 12703, 4352, -11543, -19582, -6825, 17515, 24900, 2551, -26414, -26315, 7340]
230G340K6709j4547l8964j4491K5980L4570J391l1196k4534R679K7545J2323j2298
243I507j7608p254P075J2866P715j171j1598j4198j625J8767J9635m327k6493
256h709j8992J3678L2976J1371k5239l1253J403L0623K2505j1638k9198j2396
268b4869J6891K2467L545j4644j4236k318R135J1676M844n634j2998r874O395
281i620J9334J1467j2978k4810o604K0666K5394r19k8050k0909J2079K9149J1197
294B5396j8638k4625k450K0534J7134m184j5986j0072L122J0649Q873L55q442
307A666j1313l559R881J6565L966j6912j9931K680K3472J7287j0835k7488j0040
320b4561K0280K4246r76k1807j6875O495K0335R640r652j4448m386O166R567N687
$$ y = [7340, 34049, 19502, -19462, -33953, -7973, 26597, 27988, -3208, -27742, -18063, 9482, 21805, 9507, -8101, -15355, -8280, 4586, 12301, 11130, -468, -14666, -16291, 2476, 22111, 17784, -8709, -27701, -14023, 18953, 30324, 5085, -26168, -24765, 5858, 28363, 16725, -12473, -24869, -7978, 14489, 18034, 3390, -10846, -13164, -4029, 7647, 12491, 6857, -6141, -16015, -9620, 9714, 21181, 8203, -16607, -23211, -2545, 22849, 21930, -6120, -27029, -14950, 14199, 25396, 6758, -17867, -20317, 217, 17351, 13167, -2819, -12891, -9769, 880, 9753, 10108, 1666, -9647, -13206, -3325, 13240, 17206, 294, -19637, -16957, 6515, 23802, 12967, -14521, -24561, -4281, 19965, 18989, -2818, -19693, -13198, 7137, 16777, 7125, -7323, -11709, -5543, 4024, 9711]
334I711k575r274r111R13J2848J3246m217j9372j1857J1285K2656O186j7854k1860
348a9275J556K2848J5385r325k1381p657J2502J6773K062j1562j1141k52P468
361a999Q102L340n010j0153n822N997J3218P204r906j7619m234J6841J7682l037
375A4604k0402j3906R802K1306P023j4438j7666m12J4766J2258l208j2180q000
388a0453L626Q119O012K70o705q869j637Q333J1868J303j2883j4013L536J7787
402F294J1064r465j9188n784J4277J7302m23j7337j1505N892J4236O815o662j0797
416e281l927N315P222M195k193p445p006J755J0598Q167l830j3579q435R106J6942
431A1604L311j4146j4932J980J6291J0599o565j5564n578R397J1725J771p757
$$ y = [9711, 7136, -2138, -11249, -10336, 2512, 15758, 11541, -7831, -19688, -8403, 14253, 20439, 2585, -19275, -17719, 5129, 20514, 11189, -10192, -17849, -5347, 11426, 13488, 1926, -9215, -9467, -1999, 6103, 9443, 4433, -5720, -11542, -5545, 7673, 14877, 4971, -12648, -16882, -41, 17641, 14604, -5798, -19704, -9902, 11404, 18427, 3989, -13677, -14089, 677, 12935, 9727, -2453, -10453, -6827, 1292, 7304, 7574, 869, -8000, -9637, -1304, 10564, 11867, -1016, -15029, -11493, 6294, 17358, 7893, -11295, -17079, -2802, 14500, 14077, -3260, -14765, -8873, 5363, 12178, 5516, -5281, -9208, -3893, 3329, 7524, 5331, -2114, -9120, -7365, 3233, 11400, 7570, -6009, -14444, -5338, 11604, 14915, 769, -14163, -12183, 4108, 14707, 8142, -7422, -13000, -3603, 8122, 9893, 2136]
444B136q882j162O520O602J824m175p746m392N721J0347L673q489j1825j949J2389
459E92J2367k776j5194q996P134J4860M929r994j3057j98J1044Q467j923q662
473a407o230J523P233N388q50n649o629q79P316Q340k72r809q832K710J3259P255
489A2467p209j4144l352J0510J2558q28j1935r056M108J0892N054n135p927l298
503g295L819O673L064k074o575m462J702Q205N800m162j0382m939P157J1868K555
518A0954j0703j0969J980J2035P464m803j1204m448O476R452J697o596o472r65
532f102M723O128J684m673o141k589M512Q196K473p177r109J4R284Q671k927j0748
548c781o969O047J1221K986p524r305o00P958P277j357o889n010J177N551M740
$$ y = [2136, -6746, -7908, -1388, 5214, 7038, 2863, -4883, -9275, -3554, 6793, 10466, 1977, -9848, -11797, 592, 12959, 10183, -5011, -14007, -6873, 7987, 12916, 2922, -10135, -10333, 711, 9178, 7255, -1407, -7637, -6114, 1119, 6507, 5657, 8, -6621, -7500, -184, 8156, 7884, -1925, -10757, -8047, 5212, 12467, 5258, -8886, -12238, -1728, 10830, 10002, -1933, -10989, -6881, 4011, 9065, 3930, -3997, -7295, -3476, 3197, 6261, 4187, -2388, -6850, -5148, 3057, 8857, 4695, -5687, -10626, -3469, 8399, 10954, 251, -10718, -8738, 3297, 10761, 5958, -5246, -9694, -3218, 6234, 7931, 1335, -5137, -6102, -1379, 4749, 6433, 1760, -4381, -6970, -2458, 5738, 8211, 1034, -8075, -8061, 1223, 9894, 6967, -3781, -10750, -4703, 6518, 9504, 1980, -7325, -7925, 33, 7310, 5953, -936, -5946, -4769, 782, 5522]
563E522o62n507n150M42N996O280j386p792o278L372R627M850n995r965k464Q423
579f87Q486q10q473o610K594Q339M531l897o455l033L077N544L000k717n789l159
595f059K687O460M264m153q510k563O237Q343R13q117p487J482Q830O126m148
610D305q540l053M506P230K089m777n990j054M430M802J218l654n786j348M662
625i60O013R96n651o805M44P460N989k665q223m384M317Q433K399n915p001n87
641f140O086N261m59n190m451J074M569L866q19m371m547J146N537M159j785o024
657b088m543K793P872K826m826o945j488N690O502j9o758n260K039O176L407j822
673C556n600l188K722M883K879k734n184k536K656N617K185l455n826j871N037
$$ y = [5522, 4860, -647, -5797, -5355, 641, 6921, 5535, -2257, -8535, -5163, 4464, 9314, 3319, -6646, -9110, -687, 7799, 6989, -1484, -8094, -5500, 2839, 7370, 3473, -2982, -6015, -2938, 2606, 5606, 2889, -2900, -6059, -3372, 3088, 7352, 3199, -5311, -7874, -1637, 6706, 7619, -498, -7985, -6503, 2327, 8453, 4305, -4235, -7288, -2782, 4448, 6537, 1760, -4230, -5284, -854, 3948, 5166, 1512, -4274, -5622, -960, 5053, 6049, 398, -6407, -5963, 1497, 7486, 4821, -3402, -7786, -3469, 4964, 7363, 1448, -5553, -6140, -54, 5207, 4748, -442, -4893, -3819, 750, 4616, 3797, -574, -5121, -3975, 1562, 5721, 3936, -2088, -6631, -3838, 4034, 6860, 2034, -4911, -6399, -709, 5793, 5774, -984, -6244, -4205, 1971, 5378, 3556, -2044, -5232, -2510, 2373, 5252, 2518, -2666, -5202, -2546, 3071, 5256, 1801, -4025, -5896, -859]
688h59O469j79o083n377J657O126M539k732o440l008L901N403J839l601n154j115
704d614L828M584M53l717l927j177M254M939l80m767m146O48N059M869k256o227
720b577l287L550O178J704m575n458m15M895M117j92m292l965O09M524L441r57
736C300m371l329J058N211L030j877n731k193K687N534J941l968n048q97M567
751h6M642m81m482m530J428N210K697j751m554k057J434M580K109k244m434j471
767c990K323M591J404l637m279j038M468M271q1m797m189J765M822L083k108m851
783b243k505K675M912J598l459m077q20L412L902L80l559l822J94L405L810n43
799C260m036l539J669M344K726k030m540k439L047M646R56l044m594k50L615L632
$$ y = [-859, 5610, 5431, -652, -6029, -4372, 1754, 6293, 3561, -2879, -5887, -1986, 3417, 5256, 1655, -3499, -4614, -786, 3798, 4251, 534, -3393, -4570, -316, 4623, 4243, -524, -4670, -4022, 1037, 5906, 3650, -2577, -5864, -2314, 3864, 5568, 993, -4465, -4880, 15, 4132, 3940, -352, -4317, -3708, 816, 4257, 3300, -1071, -4400, -3342, 1869, 4899, 3022, -2709, -4902, -2215, 3319, 5260, 1292, -3756, -4653, -86, 4556, 4075, -407, -4937, -3509, 1701, 4398, 2647, -1907, -3964, -2530, 2050, 4159, 1915, -2519, -3990, -1667, 2924, 4328, 691, -3588, -4626, -158, 4113, 4032, -765, -4954, -3189, 1633, 4716, 2608, -2243, -4748, -2073, 2839, 4437, 978, -3099, -3919, -507, 3395, 3775, 216, -3606, -3412, -7, 3803, 3260, -776, -4315, -2646, 1698, 4424, 2394, -2146, -4585, -1538, 3108, 4064, 1020, -3574, -3824, -209, 3423]
815C423j3l879k759K48L694K641n31l962k642J713L622K192j616m225k042K733
831a403M235R31k938m037n99L984L310k43l863k759N76L818K659j549l612k104
847c594J723L641J769k042l919j086K816L417P53k932l510l36L531L282q39l419
863g45k669Q69L926K178j628l803j744K027L844J171k202l613o27K728K925L63
879C000k826l356L04L594K622q50l159k545R06L752K005j810l336j382J797L387
895B103J355k730l263m89K695L121K09l160k810N96L258K123j083l030k308J599
911a814L624J232j813l114j418K306L232P80k780k749j11K596K531L42l647k206
927c009O70L471J648r71l093j892K043K839J539j974k889j442K599K782L35k572
$$ y = [3423, 3410, -469, -3228, -2980, 714, 3355, 2824, -1138, -3780, -2067, 1555, 3747, 2131, -2094, -4136, -1403, 2832, 3763, 825, -3212, -3811, 173, 3483, 3240, -623, -3382, -2806, 1012, 3671, 2122, -1490, -3594, -1871, 1770, 3539, 1497, -2422, -3508, -692, 2725, 3478, 546, -2964, -3300, 231, 3513, 2674, -745, -3414, -2545, 1381, 3559, 1931, -1872, -3616, -1589, 2255, 3426, 1224, -2389, -3016, -288, 2637, 3000, 174, -3182, -2878, 716, 3338, 2488, -671, -3216, -2310, 1442, 3447, 1637, -1699, -3081, -1284, 2103, 3458, 728, -2535, -3024, -329, 2792, 3001, -159, -2969, -2373, 885, 3008, 1925, -1105, -3413, -1814, 1810, 3042, 1229, -1885, -3303, -997, 2235, 3015, 235, -2514, -2625, -29, 2502, 2844, -803, -3009, -2339, 1132, 2780, 1809, -1284, -3176, -1133, 1706, 3245, 1271, -1618, -3060, -461, 2321, 2656, 84]
943H4k394k05K909K704j080k947j887J086K699K265j837k771j467K028K695P17
959B599k173k308p26K325K555m66j993k261J89K714J990q44k306j799R22L191
975A609R73j630k460j014J810K259J014k302k442l54K374K704n77k387k032N12
991a943K764J832r46k852j132J162K694Q48j757k462p73K223K191M05k237k272
1007b255r1K535K062l44k423j925J017K229J620j364k330q80R69K592Q28j676
1023E64k557m4J347K976l14j923k217M27K313J480j51k417j982R74K627J225j519
1040H09k024r66J482K222N94j796k159j97K029K108m32j959j621N04K078J252
1056A924n43k103j531J169K115Q18r21k382o63J576K411l0j880j519l1J769J616
$$ y = [84, -2310, -2515, 394, 3098, 2018, -929, -2816, -1730, 969, 3234, 1397, -1374, -2841, -813, 1882, 2599, 426, -1882, -2608, -283, 2272, 1806, -187, -2448, -2259, 455, 2445, 1601, -705, -2504, -1582, 1609, 2582, 952, -1508, -2522, -712, 1547, 2561, 259, -2183, -2537, -163, 2541, 1964, -423, -2455, -1943, 821, 2653, 1707, -1145, -2277, -1115, 1579, 2427, 670, -1792, -2565, -342, 1849, 2254, 17, -2255, -2346, 189, 2251, 1907, -516, -2441, -1424, 805, 2425, 1061, -1269, -2149, -1180, 1412, 2240, 564, -1993, -2037, -690, 2286, 1972, 49, -2168, -1741, 572, 2052, 1901, -516, -2498, -1524, 1103, 2328, 809, -1215, -2181, -699, 1523, 2117, 321, -1838, -2035, -6, 2102, 1670, -289, -1910, -1406, 672, 1924, 1381, -722, -2253, -1084, 1031, 1849, 928, -1454, -2117, -541, 1870, 1840, -40, -1559, -1590, 179, 1795]
1073A795m02j923j355O94J797J048l06k088j510J494J946O75j196j801q23J402
1089e53K177K06j590k065j59K267J677o32k150r88N85K310J220j358j985p65J119
1106f84J769R92j621k014j53J373K116k72j743j653O68K007J025r26j692r84N96
1123a196K216P78j200j879p04J380J861K10j254j437K1J287J346k20j400j484
1139a675M39J963R71q90j406r52P20J960M94j039j897m52J524J259Q74j738j605
1156a450j9J992P59q2j637j192N86J781P18l79j798j213J146K128L84j292j709
1173a277j35J269J410M71j855j402L53J987O91k99j704j080O68J503R70j076j552
1190a058n35J206J506j01r43r39j41R27J536k63j487r46J93J383R40l15j425j001
$$ y = [1795, 1393, -530, -1885, -1191, 606, 1654, 1348, -740, -2250, -756, 1190, 1865, 669, -1132, -1955, -553, 1624, 1830, 240, -1825, -1984, 283, 1960, 1328, -822, -1810, -1225, 1085, 2305, 947, -1038, -1803, -684, 1085, 2077, 456, -1558, -1711, -338, 1778, 1506, -237, -1890, -1222, 785, 1810, 884, -808, -1792, -1196, 1020, 1798, 598, -1281, -1985, -605, 1256, 1466, 212, -1225, -1204, 83, 1429, 1209, -191, -1675, -1236, 727, 1698, 808, -598, -1550, -830, 1130, 1624, 585, -1312, -1764, -240, 1019, 1893, 155, -1450, -1469, 523, 1282, 1200, -437, -1629, -1043, 738, 1456, 1077, -721, -1934, -788, 1340, 1724, 432, -1277, -1412, -143, 1267, 1738, -117, -1519, -1166, 821, 1512, 1213, -491, -1571, -903, 600, 1570, 494, -1058, -1593, -387, 1119, 1018, 75, -864, -1005, -78, 1458, 1195, -292, -1238, -1045, 338, 1278, 963, -462, -1463]
1208a463J115J382K16p70j369m58J257J427m1j098j311k61J738J198m99j382j176
1225a495M15J455P86j28j895l75N81J497K36n81j382o71J759O98J80r03j352P6
1243a099J337J062n56j133n24L10J037P67q49p24p88O35J547L49q10j551k06J578
1261C82P38P6j427q95J75J166P66m97r30p69O97J006N75r21p06k4J16J114N64
1280A206j247p84p7J027Q94j53r73j066L23J052J020n78j300m38N56J259N18j183
1298E6j134mJ041Q41K45r23j087L07P79O29r4r91p21L77J260L21m75j106m57N95
1318e41J189O81q37j444Q7N17J642j70j255q03N28O07P38k39j189j41J38R77M08
1337H93l90j266m31R58Q98j0n20p07m61J471M02l20j004k84K59O18J132p84j003
$$ y = [-1463, -348, 1034, 1250, 480, -889, -1347, -90, 1337, 1296, 198, -1113, -1374, 364, 1562, 1063, -319, -1495, -1080, 375, 1161, 1033, -862, -1237, -656, 841, 1077, 496, -886, -1557, 202, 900, 1080, 177, -1175, -1099, 238, 1300, 744, -389, -913, -603, 434, 1201, 352, -372, -1160, -525, 1022, 1371, 561, -990, -1196, 382, 1120, 1196, -231, -1126, -951, 215, 981, 484, -446, -1215, -518, 488, 1063, 142, -564, -588, -472, 642, 1206, -41, -825, -902, 125, 1019, 866, -107, -1173, -850, 202, 1222, 644, -656, -1094, -538, 721, 1239, 56, -1078, -1082, -41, 800, 1045, 122, -965, -658, 121, 750, 656, -335, -1056, -679, 581, 902, 427, -679, -1136, -541, 648, 1329, 492, -952, -865, -348, 1294, 1124, -131, -934, -406, 201, 939, 700, -489, -630, -492, 485, 893, 503, -763, -1194, -236, 662, 652, 132, -575, -1036, 435, 837, 517, -487, -771, -512, 106, 1238, 454, -549]
1356e49m02P20N37O17p88j052J72N47Q58L74j236o09Q5Q77N69Q2r86j064Q51Q24
1376D27O93p44o62n49L81J156K60o24j112K6R16M27o0n04p62L13P28L81j62o94
1396a65o39L2J420K28n44p30l71L96R50J95n03j053O8O82Q60l62o79n26J67R16
1416C42L58k72q31n42Q59R10pn29r67n8O52P83j52p25o84L05M14M30M62r33l02
1437d87oO49P61m37q54l61N27N73N79j224l28j01O48Q53m33j68m88k55Q09O01
1457H58m45q01j70L28L83N38n96m81l47N77O54O35r55q95lO78M56Q1n94o70J45
1478f24Q13M79l13o45m80N27N60L14k51n90k26M83K74J19j88n45l1O63K89q1m67
1499H0n69P0P87J14l33n41j29K61O46K42n54l09k66M14O19N4l46p92R8M51O01
$$ y = [-549, -951, -231, 306, 923, 135, -917, -745, -198, 660, 1034, -202, -811, -726, 151, 720, 802, -184, -1248, -397, 427, 1120, 376, -286, -835, -454, 702, 962, 338, -774, -748, 168, 595, 535, 31, -731, -418, 310, 691, 529, -165, -804, -772, 648, 876, 332, -398, -769, -373, 577, 772, 269, -784, -716, -34, 826, 464, -215, -741, -574, 342, 700, 428, -403, -945, -86, 824, 817, 288, -679, -737, -85, 698, 546, -179, -863, -558, -144, 286, 748, -185, -487, -493, 156, 917, 480, -374, -735, -208, 365, 944, -280, -608, -709, -61, 792, 359, 191, -297, -552, 257, 858, 413, -388, -558, -230, 153, 691, 95, -386, -733, -156, 498, 1133, 178, -717, -720, -42, 414, 495, -99, -769, -624, 189, 668, 355, -290, -770, -243, 317, 631, 380, -210, -436, 47, 321, 440, 252, -293, -324, 339, 628, 547, 80, -489, -419, 368, 482, 149, -392, -521, -260, 386, 628, 74, -235, -501, -87, 532, 586, 240, -552, -454, -3, 598]
1520E98l15n70m7pN64K28k11k17p80N57N89K76n08m89j64M89M55k05m51p98N73
1541d33O44M21j77r92J77K48N49J83j50j012k60O59M19l2l05n38K01J90P02j14
1561C80n14k83K73N29O7j10o64k95J86P43J80j27r75J64O85J71o4j98n58M3K39
1582a28O30j29n86j30J46J14M44n1n92o2M30M32l6m42l15l9J33P10m0m37p58K27
1604d79N40M94J14r07j89K28M26L57l19o82j94L40N17J55m17l74J56K66L60m69
1624g7J81m64j9P32k0p2m84m87M44M09J80k7n43j62N15K24o9l15m82j08N99M07
1646C62J90m41o71O2M59N05k30m98k78M97K81L15m51k20n55K80P38j07l83j44
1666b89J5J50N96k11n10m16M15L83Q2l11k21k68N93Q2K54l10j12m00M19M10j03
$$ y = [598, 283, -287, -334, -341, 223, 451, 240, 23, -757, -200, 389, 665, 157, -332, -496, -7, 448, 243, -208, -1006, -433, 211, 632, 455, -537, -360, -112, 437, 620, 470, -542, -802, -143, 276, 244, -61, -599, -398, -208, 494, 380, -134, -417, -144, 385, 452, 342, -322, -617, -431, 312, 492, 365, -610, -446, 239, 410, 346, 148, -410, -367, -128, 502, 373, -213, -343, -197, -83, 361, 310, -282, -344, 86, 518, 482, 40, -275, -314, -181, 529, 489, 52, -706, -479, 61, 555, 669, -238, -427, -199, 227, 584, 265, -417, -611, -271, 246, 401, -16, -390, -234, 32, 392, -77, 104, -360, -379, 353, 333, 261, -223, -710, -266, 143, 323, 296, -247, -409, 106, 330, 261, -54, -536, -644, -45, 362, 552, 111, -560, -498, -39, 466, 236, -262, -540, -43, 238, 553, 102, -118, -673, -393, 345, 238, -145, -289, -274, -124, 472, 261, -249, -665, -250, 133, 215, -96, -317, -585, 8, 90, 344, 34, -78, -478, -59, 351, 248]
1687B48k81k55K92O6M59j33n85J3L9K58M96k35m44k46J49M54J93l17k00j60K8
1708a61M55m04j29j39R4O21J44k23n00QK1L77o4K12n87p0J89J91J42L8p09q8Q27
1731B45L94j83o60k10R8M38J12J9k88rK8K07K3K9p63J85L76J00K17k27l78J29
1753a18N7K45J89p81N2N8L56Q3j70l88K15J63J2L46j32l33J14Q7K93j64k71n23
1775f10N12L75l0j71n9j13j97N51K5m33N7o1L12K9J38k39n00L31j85M63L36o57
1797a26k39L21J57J62m79J23j65J22M97q0l44k72N18j94J71J05l24j72K89kL12
1818C80j58rm21j59K48p0K88j53q2K41N9J68j42m41j15M02o6K09k63k56J01K86
1840D7J76k81j52j52L55k53N01l02k06L1L72j60J01k04n9O5j27M96j61l9r0j33
$$ y = [248, -33, -288, 4, 70, 529, 396, -189, -176, -137, 121, 617, 382, -62, -308, -159, 295, 488, 171, -29, -189, -161, 294, -110, -239, -378, -284, 337, 481, 258, -242, -234, -213, 164, 100, 312, -275, -345, -156, 35, 177, 215, -494, -582, 245, 639, 456, -204, -414, -316, 122, 234, 253, -35, -44, -16, 191, 214, 243, -520, -335, 41, 141, 358, 131, -247, -118, -61, 184, 373, -408, -356, -298, 58, 141, -29, -417, -202, -39, -27, 319, 187, -146, -32, 55, 348, 184, -87, -610, -98, 277, 247, 76, 17, -96, -293, 258, 283, -150, -93, -154, 158, 187, 325, 86, -414, -83, -268, 195, 531, -126, -365, -44, 113, 275, -204, -81, -246, -124, 373, 293, -51, -323, 195, 1, 172, 277, -47, -219, 70, 68, 380, 222, 213, -208, -367, -119, -189, 99, -54, -136, 105, 164, 332, 190, -251, -366, 36, -30, 179, -84, -340, -239, 47, 223, -58, -210, -362, -7, -260, 241, -61, -267, -236, 136, -24, 77, -127, -186, -121, -248, 248, 87, 48, -42, -175]
1862a75K67J65R8n08k90J95M06P3k59j02j13J67L52N1p57L09K8K85k5q6k06J62
1884C7l5L23j40k92L27l75Q2M05r5m18K82k18P6K19J00n64L08Q5J73k73Q9K01
1906B97n36M0K59K14k73m95N5J55M93j4Q7k37l97Q6M33J34l20l94L03L03n6k5
1928A12m83J27L08L08m03r0n5L6k48N62j90L4M4j37M09k68j91L06l29k4L38k5
1950A41r3j34Q0j46N72m69J9L7l05J36L14k64R3j75J82O5N01l85j48k97L22K05
1972B51J78n81R8p8J17J39j09j77k23J81K64K22k69K04o04L84n6M00l16j23j27
1993b25K92L1L3j03nj99o6M44J71p67M00k35J47L07Q7m15l18K05L29J09k01j20
2015i9p7L77J30mm51J9q2L11k55L20k26j22j26K2K48K88j54k21r1J34M22m95N5
$$ y = [-175, 92, 257, 355, -153, -443, -248, 158, 231, -28, -130, -243, -76, 276, 327, -430, -121, -93, 192, 167, 81, -125, 37, 2, 325, 185, -107, 220, -155, -73, 332, 237, -181, 101, -117, -41, 178, 278, -286, 22, 107, 280, 7, 96, 297, -239, -199, 60, 274, 1, -494, -439, -284, 209, 195, 282, 45, -352, -266, 167, 301, -19, -413, -110, 193, 137, 112, -371, -244, 64, 372, -31, -121, -176, -140, -388, 174, -16, 18, 62, -75, 334, 66, -125, 181, -148, -172, 166, 141, 48, -86, -6, -152, 420, -49, -30, 7, -298, -162, 152, -112, -19, -194, -12, 53, 554, 169, 21, -276, 46, 251, 429, -152, -54, -132, -15, 124, 15, -162, -385, -204, 60, 282, 13, 217, -387, -3, -59, 341, 25, -98, -225, 67, 98, 131, 28, 23, -176, -242, 202, 373, -394, 6, -229, -82, 225, 312, -103, -421, -216, 113, 222, 21, -99, -176, 201, 331, 327, -124, -105, -187, 124, -131, 189, -37, -159, -285, -263, -15, 273, 119, -102, -193, -59, 363, -132, -77]
2038g7p1J2L41j05k72K69k43k35O48m0k36j27K26J98k19j26oN2l58K29M64k74
2060E0k91q6L92J18kJ20n07q8J53m7K90n70L18K05J82j67r4r4m26O08k09J74l8
2083iJ8l10J9L79r4k51K29l20Q1M27j1k89J29k55K87J86k51J22j6q4q4J55k04
2106a46M5l2J39L6Q5j48R8j51J1J01n9n5j00K12J35l12p3R3J35L1N7J9K10j99
2130A32p7Q7Q0j99m6M0q1L0K20k31n6k09K55p6j02K83k53R4J4K1K59j72n8J5j49
2155a79N12k42k58n5J84K32k6j52j38K16J76j71K4r6j00L39k16K36j70M6l50P1
2177a17J33K5j54R3M5K35l32L65m08p1k28M93K23k09k44j23PK82j40J43K33m87
2199b36L11J90j00j10q9j12J23J22N3J88l50J3qp5p2L13l42J50L2m8K03k10Q3
$$ y = [-77, -148, -136, 205, 100, -172, 97, -146, -381, 267, 227, -9, -136, 90, 288, 69, -57, -63, -11, -369, -140, 324, 50, -241, -327, 65, 183, 181, 301, -206, -294, -141, -188, 102, -468, -150, 55, 237, 70, -24, -118, -544, 64, -145, 29, -9, 9, -301, -282, 97, 3, -248, -19, -339, -258, 169, 158, -131, -2, -257, 30, 216, -35, 87, 71, -13, -97, 58, -146, -101, -133, 6, 42, 127, -21, 77, -74, -63, 38, -21, -76, -176, 36, 171, -141, -214, -121, 14, 45, 102, 121, 331, 132, 55, 142, 222, 23, -23, 17, -64, -34, 186, -45, -101, -310, -55, -131, -233, 50, -203, -109, -95, -74, 185, 13, -45, -30, -179, 333, 91, -167, -222, -38, 194, 168, 16, -122, 94, 270, 99, 123, 27, -73, 266, 50, 286, 116, 162, -188, -117, 16, 41, -113, -20, 25, 260, -72, 293, -115, -186, -414, 79, 302, 93, -151, -274, -267, 15, -125, 18, 251, -236, 75, 265, 165, 55, -34, -146, -23, 99, 152, 340, -10, 3, -5, -80, -152, 161, -181, -31, 1, -47, 156, -54, 29]
2222B9j4K4k1M3j72mK09pJ94m62l5J2j75N21J02j93m35J56J89K82k03k6j52J78
2246D0N4l7k57P9R1L02k93k06J06PR5k66L43J05j22k25j18J44L66J19n07K23k50
2269b07L37J12m74J79J24j3P0R5q4l82L57m5l5j60RJ57J57l07O3J43k5L8k47K11
2293G3L08l84k51J97K26q6j01J03jk03K98j74k22M37p5n33O69k02J55l9l59J67
2315CK69k1j94k97K0K07K38L7l36l01J94K65J64M7l66J6p8K23j01J26l85J28J40
2338bM9q1n7O6j84R7J36J03K53n73k3O14q8j25k23j09K17m6K07j49k38O4J51r8
2362c9q7J01J05n1L06m04L3L69m33J34J95k51K64j72p4k6K97j32m3j23j01O9L4
2385b9N8l93K61J85j64L16k25l8J6k51nL61j83J95J34j28k05M32l5o60L43O2j30
$$ y = [29, 15, 39, 18, 61, -111, -115, 94, 87, 281, -181, -216, -204, -379, 142, 244, 51, -384, -228, -39, 243, 40, 14, -138, 40, 94, 57, -200, -121, -30, 272, -21, -227, -121, -114, -19, -285, 58, 163, 41, -184, -302, -158, 208, 327, -180, 43, -207, 130, 242, -232, -53, 71, 58, 128, 223, 139, -243, 114, 69, 34, -126, -117, 40, 197, -110, -47, 96, 71, 109, -138, 73, 381, -3, -254, -57, 169, 83, -18, 85, 84, -119, 179, 5, -217, 220, 145, -388, 281, 79, 234, 195, -164, 3, 272, 251, 57, -240, -220, -13, 225, 262, -74, -375, -181, 84, 248, 295, -71, -55, -133, 90, -11, 115, -270, -142, -2, 47, -34, -91, -25, -209, -112, 24, 127, 380, -193, -216, 398, 310, 185, -38, -147, 70, 24, 231, 82, -156, -92, 59, -39, -126, -25, 80, 29, 335, -69, -36, 333, -100, 34, 229, -22, 242, 70, -4, -30, 267, 135, 92, -31, -132, -63, -29, 29, -364, -103, 82, -82, 234, 9, -29, -13, -264, -269, 92, -91, 104, 238, 110, -95, 337, 302, -358, -15, 47, -83]
2408h3K39o66K02J94J02K8j1l94J19L22K40n44N9K67l32N43k19l45J98J35Jk90
2430b35K41K0j37O0J1J88r4L0j96Q2Q7K22j39j88J52k42M52k42m55O51j93k96
2452b21L35k51K79j64q5J37J58j3J85m26j32J56j24M5J32P9l27J77J62o6j57j33
2474b54Q2N9k7J82j17q8K56j50JP0j23L9M5J3K40k56j92L3L23l30L57l30J6KR3
2499e6J80M7q12R98k34J59k42j42K1J84J25p3n1L8j88jJ86k31M56J6o33L16j17
2522e4J46R3j84j3j78L20J01l58r5K77J72m95K24K84l8k20k07J25K2M8k41N89
2544C18k47oj69K10k38k9J88L2J39m16M54J23j26k24l6k22K39M8Q4j09k08K40
2566D5j46N0L6okJ95j31P8M02m20j09r8K6Q7K11q9m41J40K68lpj28K93n12p8L37
$$ y = [-83, 156, -510, -308, -114, -12, 16, 5, -389, -270, 52, 292, -252, -193, 74, -258, 285, 66, -279, -81, 54, 55, -235, 6, 26, -111, -51, -40, 148, 54, 84, -112, -30, 57, 279, 140, -48, 104, -138, 314, 72, -383, 268, 75, -221, 114, -137, 142, -22, -107, 30, 188, 175, 360, -66, -198, -42, -166, -121, 11, 90, -237, -60, 102, 36, -121, -254, -172, -113, -140, 42, -75, -163, 93, -57, -56, 14, -109, -70, -25, -12, 228, -28, -220, -187, 136, -194, 163, -167, -151, -149, -56, 124, 171, -641, 357, 123, 282, 40, -102, -81, 103, 228, 155, 104, 142, -46, -47, 139, -92, 364, 380, -253, 63, -54, 92, 185, 1, -12, -190, 130, 231, -127, -222, 55, 227, -268, -44, 240, 202, -18, -225, -100, -78, -30, -271, 318, 71, 65, -104, 106, -132, -161, 27, 59, 198, -218, 236, 359, 233, 9, -27, -249, -10, 38, 122, 13, -195, 45, -101, -51, -15, -21, -23, 172, 41, 119, 521, 101, -8, -106, -80, 7, 218, 129, -312, -172, 96, 93, 86, -42, 251, -261, -339, -2]
2592bk81Q1M77k96q6j2J56n4j56j0L96k42J21j51J91J72l0p0k91L8j08L30p1M
2616A06j86r6L06M0j07j2k0j04J80j22O4qp3K56l86Q9J34R7j16J8J59j84M8k42
2640a59J17K33L2j90Nj02J58J26l18K62j39k04L73k37o4k9J77J88j18j77J77J15
2662B26l57j58N64k93p8l28L40J20J52l48l1N0n2J80j70m9J22n2K09J53l2O2l74
2685a44j4L32m24L75j06K64k26l81R6M65j15n7j31j09N51l08j16m3K66m8o8l02
2707b43L67n4N1jm1o5j38K59J35l51L06q0p9j47Q3K61k37j00n4J71J3P5l1m09
2731c09J44oL22Q1k78j72M12j33k32j5P1J09L4M4L04m12j61L21m59J88J21J90
2753A64m60N6p2M53j79J65m3k12K99k36J4J6k33J54l0K11K88l68J7J59l36K23
$$ y = [-2, -283, -202, 275, -21, -107, -119, 37, -17, -173, -183, 213, -29, 92, -59, 132, 304, 274, 204, -87, -49, -157, 173, 102, 106, -80, -176, 130, 170, 63, 51, 31, -73, 107, -15, 49, 41, -32, 224, -162, -73, 61, 158, 42, 60, 219, 35, 83, -159, -42, 191, 223, 33, 38, -64, 94, 220, -98, 164, 25, -179, 194, -43, -107, -136, 41, 229, 111, -66, 111, 226, -131, -289, 275, -18, -96, -424, -84, 36, 188, -160, -191, -141, -193, -13, -183, -232, -110, -162, 47, 200, 168, 230, -144, -158, 174, -250, 125, 19, 283, 57, -324, -228, 237, 122, 65, -66, -175, 376, 68, -48, -91, 175, 127, 59, -243, 124, 70, 121, 120, 79, 14, -124, 135, 270, -81, 225, 145, 66, -81, 2, 263, 26, -74, -128, 43, 56, 131, 100, -309, -165, -171, 151, 232, -46, -218, 194, 61, -171, -186, -115, -6, 28, 72, 376, -36, -197, 124, -335, -147, -26, 164, -296, -240, -312, 141, -38, 127, 84, -128, 171, -65, -51, -35, -268, -114, -144, 67, 355, -13, 4, 163, -173, 50]
2775E0k55J04N3KJ24p7j36J93j58K50L5K29m92j47P23n05Q4L22m30J26j9k46K32
2798F2p7K13k42O1qk02K90m54M84q0J94%j8m18n4N12j6K20l88j55L91k48p8Q5
2822G4r1J19k25K06J4j62m9J35n7R7k29L20k84QJ1L96j10n0j15J50k3k74J56q5
2846f8o1J71j68r7R8N7P6J02k71L49j40j15J60R7j10q4K23m48J15k26M89K16m34
2869f9oJ87J06j77k78N4K72K51o19LP3K49J94m24K00r4j49L00j19K26k41K09l74
2892b26j8K87M3j04j30J89q4M5k15K60K91j53k75O6m3j41J53Q7r4M3J04l72N05
2915B18r9n9j22K45k18j01m9K05Q8k01J74r9N1O7j96n2M4L07J45o4j23n6J7P0
2939A92j60k13J04q7N6K03j36j77P3J45k47L22O1m42N98m94J94R2k60N2R8J1J2
$$ y = [50, -205, -101, -48, -46, 78, 1, -135, 58, -100, 150, 185, 414, -78, -225, 498, -7, 77, 399, -31, 95, 76, -170, 62, -15, 198, -44, 17, 9, -193, 97, -357, 127, 47, 241, 241, 223, -195, -249, 263, 247, 467, 79, -76, 315, 67, -11, 74, -17, 102, -123, 83, 97, -65, -114, 21, -36, 61, -168, 152, -132, -124, -113, 283, 173, 123, 8, 158, 135, -139, 17, -68, -129, 42, -126, -223, -125, -68, 8, 110, -161, 188, 48, -67, 93, 190, 80, -4, 219, -229, -114, -340, 149, 365, -69, -75, 112, 218, 41, -237, -183, 89, 340, -279, -276, -203, 46, 240, -184, 16, -78, -227, 73, -46, 180, -61, 148, -226, -244, 43, 86, -18, -148, 41, -43, 2, -213, 47, 338, 185, -90, -24, -67, -208, -55, 32, -62, -19, 85, -287, 218, 119, 60, -62, 183, -35, -136, -185, 20, 108, -93, 81, -18, 33, 100, -96, -148, -104, 203, 348, 284, 161, 105, 122, 192, 32, -181, -77, -164, -108, 95, -41, -218, -145, 0, -247, 75, 136, -306, 292, -202, -8, 84, -176, -124, -26, -15, -3]
2962cj62J93J54j98K01k34K01k30m7J33j90M31k08K25j91j09k44K28J03J37p9
2983A11l37L78l36J58J41j31j80L01p2J21j33j08L06k0l75L46p6Qk47K97q5j60
3005i3J21R7Ll11L08J77m60r1J28J32k7J6N1J86j96j29J91k05K06m6J9J68k82
3028c7j17OJ25q6Q1J53j7j53L3p5J81m15L25P9m1j69J41J16J50l00Pj94L08L8
3052A39j56lK96L02n73j54K04k6p7K62j29j07j4J27L2K23o5l15j86L62K54l12
3074H4m36M33L3J53m29P5L59k87r4j44R1K66J83k82O4m50N99k92k0O0R0k8j2K02
3098B18m84M54J28j60r1k32K19p7J98J1l67J82m9j0K57k46P6J54k34J72j03J40
3120A56l02J14K9N5J94l33j09M28k27J86O4j97j36R0J54Q6j77j15L95k82l41J42
$$ y = [-3, -165, 28, 182, -16, 185, -49, 152, -78, -125, 8, -182, 249, 41, 266, 75, -34, -278, -50, 53, 190, 111, -226, 152, -184, -26, 115, -16, -196, 105, 33, 154, 21, -87, 219, 199, -176, 170, 94, 102, -145, 152, 67, -93, 28, 125, 128, -183, 125, 302, -158, -249, -121, 11, -16, 0, 51, 237, 41, -88, 103, -102, 104, 58, 77, 245, -37, -154, -148, -23, -109, -28, 125, 108, -45, -12, -87, 94, -321, 4, 83, 42, -127, 14, 130, 280, -20, -13, -207, 101, 139, -17, -20, 276, 578, 5, -149, 55, 29, -48, 214, 85, -22, -36, 91, 123, 346, 281, -34, -220, 142, 396, 84, -352, 81, 114, 267, -162, -87, 272, -15, -109, -253, -162, 104, 287, 5, 69, -381, 218, -74, -94, -34, 56, 28, 16, 218, -266, 188, 316, 156, 65, -167, 52, -25, 173, 184, -183, -1, -50, -60, 197, -49, 27, 181, -53, 119, 16, 156, -146, -32, -3, 52, 246, -87, -196, 232, 5, 191, 255, 58, -78, 12, 166, 252, 75, -40, 355, 73, -268, -126]
3142a26K85kl84L68j61J33k51J5o5J66J40k50l0mj46L38J35j58nj72J6J08KP4
3166B6J57j20j03k18O0L32N1j31l71M52j43P7j16O8jP0k53jj08J94K43j13j4m7
3190iQ8m4M6M3l89L80R9q5R4j08J74k97k36K16k52L96K7m05J46K41j83K05l41
3213a94j50K92K01P6l99n3M15k87M47o22k11N30N3K6k12N6q1J66K0L8j31OL20
3236C06k04o5O2j32k7L9J27k00M68n87M21N3n14N10k34J73j72M4k92M21Pp0l26
3259a92M9J02K45k26R0j04JQ9K79m97j25j7L17n3J19M8j55Q7N8l31K15j22K40
3282A17J8pl72O42l37J45k6k28M6R5N7N0o8R2o0k23Q3j29J88j77r3J12K93j62
3306E6K18j36j21l12L35j4k15K11j91J72j31j45L33O6o2j6l45J99O9J28jR4j20
$$ y = [-126, 159, 157, -227, 141, -20, 113, -138, -123, -188, -22, 118, -132, -162, -166, -312, 26, 161, 3, -2, -174, -158, -50, -48, 26, 183, 63, -40, -258, -198, 134, 185, 54, -317, 135, -8, 69, -47, 21, 20, 90, -163, -164, -272, -78, 165, 52, 38, -9, 79, 35, 81, 124, -265, 115, 214, 129, 223, 115, 289, -8, -244, -28, -280, 116, 143, -262, -116, 125, -58, 147, -194, -344, -52, 149, 225, -174, -227, 188, -99, 348, -274, -485, 45, 98, 124, -88, -32, -113, 53, 73, 111, -20, -14, 306, 102, 37, 99, -33, -60, -21, 106, -94, 374, -213, 208, 261, -253, 257, 23, 196, 24, 68, -224, 197, 204, 134, -192, -143, -41, 204, -22, 68, -36, -35, 54, 333, -164, -289, -306, 11, -42, 77, 125, -30, 57, 115, -216, -1, -123, 117, 135, 128, -244, 398, 61, 206, 180, -48, -2, 93, 150, 200, 132, 224, 164, -59, 24, -105, 83, -94, -187, -75, 218, 56, 274, 138, 17, -295, 40, 26, -189, 22, -169, 3, -128, -273, 60, 126, 64, 48, -297, -98, -29, 99, 98, 192, 72]
3329G2j83K10l34M07p6J71l65R6J40j08Mj80j29L55n5p2P3n2J41k68J64K75n05
$$ y = [72, -111, 99, -235, 172, 96, 267, -98, -2, 138, 30, 34, -146, -275, 80, 25, -47, 26, -26, 115, -153, 11, 286, -219]
$$ [...]
8191a00
##END NTUPLES=NMR FID
##END=
