##TITLE=1H_EC-3195(51)
 CDCl3, 8 sc, 
 27.5.2019
##JCAMPDX= 6.0         $$ Bruker NMR JCAMP-DX V2.0
##DATA TYPE= NMR FID
##DATA CLASS= NTUPLES
##ORIGIN= UXNMR, Bruker Analytische Messtechnik GmbH
##OWNER= root
$$ XWIN-NMR		Version 3.5
$$ Mon May 27 14:12:22 2019 Russian Standard Time (UT+4h)  she@DPX200
##.OBSERVE FREQUENCY= 200.1315
##.OBSERVE NUCLEUS= ^1H
##.DELAY= (6, 6)
##.ACQUISITION MODE= SIMULTANEOUS
##.ACQUISITION SCHEME= undefined
##.AVERAGES= 8
##.DIGITISER RES= 18
##SPECTROMETER/DATA SYSTEM= spect
##.PULSE SEQUENCE= zg30
##.SOLVENT NAME= CDCl3
##.SHIFT REFERENCE= (INTERNAL, CDCl3, 0, 15.7039)
##AUDIT TRAIL= $$ (NUMBER, WHEN, WHO, WHERE, WHAT)
$$ ##TITLE= Audit trail, XWIN-NMR		Version 3.5
$$ ##JCAMPDX= 5.01
$$ ##ORIGIN= Bruker BioSpin GmbH
$$ ##OWNER= she
$$ F:/spectra/data/she/nmr/H-F/1/audita.txt
$$ ##AUDIT TRAIL=  $$ (NUMBER, WHEN, WHO, WHERE, WHAT)
(   1,<2019-05-27 14:11:11.00 +0400>,<she>,<DPX200>,
      <created by zg, POWCHK disabled, PULCHK disabled
       configuration hash MD5:
       00 E9 B6 7A A2 85 ED C7 34 08 36 98 17 FE 4E 26
       data hash MD5: 16K
       6F 4A 77 4F CA 76 EB 37 DA ED 81 84 20 9D 18 0B>)
$$ ##END=
$$ 
$$ hash MD5
$$ 10 7F 12 20 BF 8C 82 FA 9F 62 CE 32 35 F2 B1 8E
##$RELAX= 
##$RELAX= 
##$RELAX= 
##$RELAX= 
##$RELAX= 
##$RELAX= 
$$ Bruker specific parameters
$$ --------------------------
##$DU= <F:/spectra>
##$EXPNO= 1
##$NAME= <H-F>
##$PROCNO= 1
##$TYPE= <nmr>
##$USER= <she>
##$AMP= (0..31)
100 100 100 100 100 100 100 100 100 100 100 100 100 100 100 100 100 100 
100 100 100 100 100 100 100 100 100 100 100 100 100 100 
##$AQSEQ= 0
##$AQ_mod= 1
##$AUNM= <au_zg>
##$AUTOPOS= <>
##$BF1= 200.13
##$BF2= 200.13
##$BF3= 200.13
##$BF4= 200.13
##$BF5= 200.13
##$BF6= 200.13
##$BF7= 200.13
##$BF8= 200.13
##$BYTORDA= 1
##$CFDGTYP= 0
##$CFRGTYP= 5
##$CHEMSTR= <none>
##$CNST= (0..31)
1 1 145 1 1 1 1 1 1 1 1 1 1 1 1 1 1 1 1 1 1 1 1 1 1 1 1 1 1 1 1 1 
##$CPDPRG= <>
##$CPDPRG1= <>
##$CPDPRG2= <>
##$CPDPRG3= <>
##$CPDPRG4= <mlev>
##$CPDPRG5= <mlev>
##$CPDPRG6= <mlev>
##$CPDPRG7= <mlev>
##$CPDPRG8= <mlev>
##$CPDPRGB= <>
##$CPDPRGT= <>
##$D= (0..31)
0 1.2 0 0 0 0 0 0 0 0 0 0.03 0 0 0 0 0 0 0 0 0 0 0 0 0 0 0 0 0 0 0 0 
##$DATE= 1558951870
##$DBL= (0..7)
120 120 120 120 120 120 120 120 
##$DBP= (0..7)
150 150 150 150 150 150 150 150 
##$DBP07= 0
##$DBPNAM0= <>
##$DBPNAM1= <>
##$DBPNAM2= <>
##$DBPNAM3= <>
##$DBPNAM4= <>
##$DBPNAM5= <>
##$DBPNAM6= <>
##$DBPNAM7= <>
##$DBPOAL= (0..7)
0.5 0.5 0.5 0.5 0.5 0.5 0.5 0.5 
##$DBPOFFS= (0..7)
0 0 0 0 0 0 0 0 
##$DE= 6
##$DECBNUC= <off>
##$DECIM= 24
##$DECNUC= <off>
##$DECSTAT= 4
##$DIGMOD= 1
##$DIGTYP= 9
##$DL= (0..7)
0 120 120 120 120 120 120 120 
##$DP= (0..7)
150 150 150 150 150 150 150 150 
##$DP07= 0
##$DPNAME0= <>
##$DPNAME1= <>
##$DPNAME2= <>
##$DPNAME3= <>
##$DPNAME4= <>
##$DPNAME5= <>
##$DPNAME6= <>
##$DPNAME7= <>
##$DPOAL= (0..7)
0.5 0.5 0.5 0.5 0.5 0.5 0.5 0.5 
##$DPOFFS= (0..7)
0 0 0 0 0 0 0 0 
##$DQDMODE= 0
##$DR= 18
##$DS= 0
##$DSLIST= <SSSSSSSSSSSSSSS>
##$DSPFIRM= 0
$$ [...]
##$SUBNAM2= <"">
##$SUBNAM3= <"">
##$SUBNAM4= <"">
##$SUBNAM5= <"">
##$SUBNAM6= <"">
##$SUBNAM7= <"">
##$SUBNAM8= <"">
##$SUBNAM9= <"">
##$SW= 24.9337058887773
##$SWIBOX= (0..15)
0 0 2 0 0 0 0 0 0 0 0 0 0 0 0 0 
##$SW_h= 4990.01996007984
##$TD= 16384
##$TD0= 1
##$TE= 0
##$TE2= 300
##$TE3= 300
##$TEG= 300
##$TL= (0..7)
0 120 120 120 120 120 120 120 
##$TP= (0..7)
150 150 150 150 150 150 150 150 
##$TP07= 0
##$TPNAME0= <>
##$TPNAME1= <>
##$TPNAME2= <>
##$TPNAME3= <>
##$TPNAME4= <>
##$TPNAME5= <>
##$TPNAME6= <>
##$TPNAME7= <>
##$TPOAL= (0..7)
0.5 0.5 0.5 0.5 0.5 0.5 0.5 0.5 
##$TPOFFS= (0..7)
0 0 0 0 0 0 0 0 
##$TUNHIN= 0
##$TUNHOUT= 0
##$TUNXOUT= 0
##$USERA1= <user>
##$USERA2= <user>
##$USERA3= <user>
##$USERA4= <user>
##$USERA5= <user>
##$V9= 5
##$VALIST= <valist>
##$VCLIST= <CCCCCCCCCCCCCCC>
##$VD= 0
##$VDLIST= <DDDDDDDDDDDDDDD>
##$VPLIST= <PPPPPPPPPPPPPPP>
##$VTLIST= <TTTTTTTTTTTTTTT>
##$WBST= 1024
##$WBSW= 4
##$XGAIN= (0..3)
0 0 0 0 
##$XL= 0
##$YL= 0
##$YMAX_a= 329020
##$YMIN_a= -552193
##$ZGOPTNS= <>
##$ZL1= 120
##$ZL2= 120
##$ZL3= 120
##$ZL4= 120
##$ABSF1= 10
##$ABSF2= 0
##$ABSG= 5
##$ABSL= 3
##$ALPHA= 0
##$AQORDER= 0
##$ASSFAC= 0
##$ASSFACI= 0
##$ASSFACX= 0
##$ASSWID= 0
##$AUNMP= <proc_1d>
##$AZFE= 0.1
##$AZFW= 0.1
##$BCFW= 1
##$BC_mod= 2
##$BYTORDP= 1
##$COROFFS= 0
##$CY= 11.3945322036743
##$DATMOD= 1
##$DC= 2
##$DFILT= <>
##$DTYPP= 0
##$F1P= 18.9103706918063
##$F2P= -1.10871071338519
##$FCOR= 0.5
##$FTSIZE= 0
##$FT_mod= 4
##$GAMMA= 1
##$GB= 0.15
##$INTBC= 1
##$INTSCL= 1
##$ISEN= 128
##$LB= 0.24
##$LEV0= 0
##$LPBIN= 0
##$MAXI= 10000
##$MC2= 0
##$MEAN= 0
##$ME_mod= 0
##$MI= 1.114404
##$NCOEF= 0
##$NC_proc= 0
##$NLEV= 6
##$NOISF1= 3.799351
##$NOISF2= 2.8
##$NSP= 1
##$NTH_PI= 0
##$NZP= 0
##$OFFSET= 15.70392
##$PC= 1
##$PHC0= -8861.046
##$PHC1= 21.00026
##$PH_mod= 1
##$PKNL= yes
##$PPARMOD= 0
##$PSCAL= 0
##$PSIGN= 0
##$REVERSE= no
##$SF= 200.130013532006
##$SI= 16384
##$SIGF1= 3
##$SIGF2= 2
##$SINO= 400
##$SIOLD= 16384
##$SREGLST= <1H.CDCl3>
##$SSB= 0
##$STSI= 0
##$STSR= 0
##$SW_p= 3612.71676300578
##$SYMM= 0
##$S_DEV= 0
##$TDeff= 0
##$TDoff= 0
##$TI= <>
##$TILT= no
##$TM1= 0
##$TM2= 0
##$TOPLEV= 0
##$USERP1= <user>
##$USERP2= <user>
##$USERP3= <user>
##$USERP4= <user>
##$USERP5= <user>
##$WDW= 1
##$XDIM= 8192
##$YMAX_p= 0
##$YMIN_p= 0
$$ End of Bruker specific parameters
$$ ---------------------------------
##NTUPLES= NMR FID
##VAR_NAME=  TIME,          FID/REAL,        FID/IMAG
##SYMBOL=    X,             R,               I
##VAR_TYPE=  INDEPENDENT,   DEPENDENT,       DEPENDENT
##VAR_FORM=  AFFN,          ASDF,            ASDF
##VAR_DIM=   8192,          8192,            8192
##UNITS=     SECONDS,       ARBITRARY UNITS, ARBITRARY UNITS
##FACTOR=    0.0002004,     1,               1
##FIRST=     0,             0,               0
##LAST=      1.6414764,     0,               0
##MIN=       0,             -552193,         0
##MAX=       1.6414764,     329020,          0
$$ Real data points
##PAGE= N=1
##DATA TABLE= (X++(R..R)), XYDATA
$$ [...]
$$ plain form
2640 4718 2562 3650 4553 2935 2719 3473 2520 2391 4660 4114 1702 2193 3613 2548 2188 2171 436
2657 436 749 3257 2471 385 704 1203 369 687 936 -875 -754 1521 1090 -1835 -1839 -291 -625 -1385 -518
2676 -518 -2167 -2332 -456 -892 -3697 -3368 -2363 -2563 -1907 -1150 -3411 -3994 -1764 -1378 -4528 -4327 -2260
2693 -2260 -2811 -3158 -2289 -3299 -4797 -3014 -2157 -3800 -4552 -2900 -2583 -2743 -2574 -3976 -4493 -1988 -1831
2710 -1831 -3864 -3690 -2221 -2835 -3021 -1707 -2965 -4451 -1850 60 -2015 -3115 -1558 -980 -1547 -1203
2726 -1203 -1753 -2290 -284 1056 -166 -1332 -42 191 255 1214 -327 -923 1636 3482 1192 -254 1086
2743 1086 2288 1830 2861 2378 763 1817 3783 3147 1091 2072 3076 3676 4063 3131 1461 3415 5349
2760 5349 2967 1842 3191 4088 3755 4766 3822 1197 2613 5413 3843 1290 2221 3623 3620 3706 2770
$$ packed form
2640D718k156J088R03j618k16P54r53j29K269n46k412M91J420j065l60j7j735
2657D36L13K508p86k086L19M99q34L18K49j811J21K275m31k925mJ548l34p60Q67
2676e18j649j65J876m36k805L29J005k00O56P57k261n83K230L86l150K01K067
2693b260n51l47Q69j010j498J783Q57j643p52J652L17j60J69j402n17K505J57
2710a831k033J74J469o14j86J314j258j486K601J910k075j100J557N78n67L44
2726a203n50n37K006J340j222j166J290K33O4R59j541n96K559J846k290j446J340
2743A086J202m58J031m83j615J054J966o36k056R81J004O00L87r32j670J954J934
2760E349k382j125J349Q97l33J011r44k625J416K800j570k553R31J402lQ6r36
$$ plain form
2777 2770 1526 2717 3840 2878 1478 1696 2225 1769 2688 1463 -516 997 3786 1882 -1003 198
2793 198 1442 399 638 232 -1628 -1034 1460 774 -1848 -1754 -1240 -651 -699 -1500 -3140 -2096 108 -1240
2811 -1240 -3757 -2753 -1356 -2212 -2162 -2277 -3814 -3630 -1098 -1600 -4652 -4733 -2747 -2331 -2369 -3106 -4755 -3976
2829 -3976 -1516 -2774 -4993 -3951 -2012 -2510 -2372 -2505 -3844 -4306 -1754 -1266 -4463 -4294 -1789 -1704 -1662
2846 -1662 -2400 -3472 -2668 -564 -475 -2782 -2302 -707 -998 -877 -386 -1697 -1601 1235 1430 -1549 -1303 915
2864 915 1186 68 437 -253 357 2662 2827 502 191 2012 2132 1904 2251 985 1298 3626 3642 1336
2882 1336 954 3427 3651 2695 2845 2266 2118 4147 4603 2049 1520 3692 3829 3338 3304 2668 2483 4138
2900 4138 3819 1463 1539 3952 4081 2885 3189 2422 1484 2998 3767 1353 494 2677 3072 1524 1270 1184
$$ packed form
2777B770j244J191J123r62j400K18N29m56R19j225j979J513K789j904k885J201
2793A98J244j043K39m06j860N94K494o86k622R4N14N89m8q01j640J044K204j348
2811a240k517J004J397q56N0j15j537J84K532n02l052q1J986M16l8p37j649P79
2829c976K460j258k219J042J939m98J38j33j339m62K552M88l197J69K505Q5M2
2846a662p38j072Q04K104Q9k307M80J595k91J21M91j311R6K836J95k979K46K218
2864I15K71j118L69o90O10K305J65k325l11J821J20k28L47j266L13K328J6k306
2882A336l82K473K24r56J50n79j48K029M56k554n29K172J37m91l4o36j85J655
2900D138l19k356P6K413J29j196L04p67r38J514P69k414q59K183L95j548k54q6
$$ plain form
2918 1184 585 1450 2261 148 -366 1025 1128 -130 -30 -403 -1116 609 1261 -1553 -2378 -502 -272 -1983
2936 -1983 -1922 -1406 -2294 -1604 -576 -1808 -3309 -2037 -1569 -2831 -2610 -2650 -3166 -2107 -1471 -3367 -4153 -2307
2954 -2307 -2309 -3495 -3200 -1863 -3459 -3082 -1638 -2699 -4372 -3137 -1519 -2953 -3055 -2604 -2436 -2034 -1770
2971 -1770 -3025 -3344 -1413 -1165 -2743 -1652 -1233 -2378 -2265 -386 -1352 -3171 -898 512 -1496 -1630
2987 -1630 -342 -388 -814 -152 100 -543 657 1420 134 308 1167 495 516 2238 1460 414 1978 2942
3005 2942 1185 629 2642 2437 1709 2882 2728 1932 2897 3349 2513 2237 3186 3035 3119 3917 3002 2257 3033
3024 3033 3920 2152 2026 3835 3494 2053 3395 3508 1675 2541 3517 2067 1623 3099 2589 1721 1842
3041 1842 2159 805 1650 2813 1246 276 1730 1389 -217 475 1136 -267 174 1204 -249 -1341 31
$$ packed form
2918A184n99Q65Q11k113n14J391J03j258J00l73p13J725O52k814q25J876K30j711
2936a983O1N16q88O90J028j232j501J272M68j262K21m0n16J059O36j896p86J846
2954b307kj186K95J337j596L77J444j061j673J235J618j434j02M51J68M02K64
2971a770j255l19J931K48j578J091M19j145J13J879r66j819K273J410k008j34
2987a630J288m6m26O62K52o43J200P63j286J74Q59o72K1J722p78j046J564R64
3005B942j757n56K013k05p28J173j54p96R65M52q36k76R49j51Q4P98r15p45P76
3024C033Q87j768j26J809l41j441J342J13j833Q66R76j450m44J476n10q68J21
3041A842L17j354Q45J163j567r70J454l41j606O92O61j403M41J030j453j092J372
$$ plain form
3058 31 99 -1224 -982 -696 -1800 -1133 -324 -1809 -2532 -1277 -1257 -2075 -2081 -1875 -2619 -2033 -1028 -2905 -4278
3077 -4278 -1917 -1726 -3009 -2627 -2028 -2995 -2983 -1805 -3052 -4058 -2726 -1597 -3001 -2888 -2319 -3053 -2754
3094 -2754 -1956 -2755 -3898 -2279 -1259 -2973 -2625 -1750 -2378 -2277 -980 -2239 -3157 -1597 -200 -1107 -1885
3111 -1885 -1254 -1496 -1167 242 -388 -1551 -25 701 -574 -537 471 202 99 1576 977 -215 820
3128 820 2551 990 695 1261 1198 1397 3010 2437 633 1659 2816 2113 1839 2519 2598 1988 3458 3099
3146 3099 1149 1981 3700 2937 1747 2500 2363 2223 3743 3099 1306 1883 3416 3156 2007 2717 2367
3163 2367 1796 3139 2897 921 1437 3027 2468 1421 1914 1560 979 1941 2116 201 466 2015 1462 -1
3181 -1 571 568 -122 772 1068 -875 -1078 664 423 -1189 -961 -1215 -1929 -503 -470 -2129 -2785 -940 -1263 -2548
$$ packed form
3058C1O8j323K42K86j104O67Q09j485p23J255K0q18oK06p44N86J005j877j373
3077d278K361J91j283L82N99r67J2J178j247j006J332J129j404J13N69p34K99
3094b754P98p99j143J619J020j714L48Q75o28J01J297j259r18J560J397r07p78
3111a885O31k42L29J409o30j163J526P26j275L7J008k69j03J477n99j192J035
3128H20J731j561k95N66o3J99J613n73j804J026J157p03k74O80P9o10J470l59
3146C099j950Q32J719p63j190P53j37j40J520o44j793N77J533k60j149P10l50
3163B367n71J343k42j976N16J590n59j047M93l54n81R62J75j915K65J549n53j463
3181aN72lo90Q94K96j943k03J742k41j612K28k54p14J426L3j659o56J845l23j285
$$ plain form
3201 -2548 -2388 -2342 -2662 -1957 -1207 -3115 -3343 -1730 -2062 -3304 -3088 -2688 -3149 -1890 -1467 -3582 -3994 -2058
3219 -2058 -1729 -2993 -2507 -2389 -2867 -2017 -1136 -2841 -3278 -1703 -1265 -2440 -2288 -1782 -2226 -1253 -742 -2320
3237 -2320 -2681 -469 70 -1254 -1326 -1080 -1496 -576 703 -465 -1807 -231 1116 164 320 597 -18 234
3255 234 1595 535 -185 1531 2262 784 920 1531 1029 1512 2853 1922 529 2229 3210 1983 1565
3272 1565 2569 2214 2288 3360 2595 1530 2535 3408 2189 2380 3220 2510 2451 3479 2627 1587 2259 3100
3290 3100 2027 1769 2749 2113 2173 2759 2286 426 1392 2632 1389 996 1673 1661 585 1432 1349 -42 607
3309 607 1212 -21 -360 827 67 -954 84 -42 -1460 -442 407 -801 -1691 -588 -708 -1977 -1290
3326 -1290 -1278 -2061 -1968 -1152 -1854 -2234 -1424 -1977 -2571 -2092 -1399 -2768 -2477 -1634 -2680 -3339 -1877 -2289 -3155
$$ packed form
3201b548J60M6l20P05P50j908k28J613l32j242K16M00m61J259M23k115m12J936
3219b058L29j264M86J18m78Q50Q81j705m37J575M38j175J52N06m44R73N11j578
3237b320l61K212N39j324p2K46m16R20J279j168j342J576J347r52J56K77o15K52
3255B34J361j060p20J716P31j478J36O11n02M83J341r31j393J700R81j227m18
3272A565J004l55P4J072p65j065J005Q73j219J91Q40p10n9J028q52j040O72Q41
3290C100j073k58R80o36O0N86m73j860R66J240j243l93O77j2j076Q47q3j391O49
3309F07O05j233l39J187p60j021J038j26j418J018Q49j208q90J103j20j269O87
3326a290J2p83R3Q16p02l80Q10n53n94M79O93j369K91Q43j046o59J462m12q66
$$ plain form
3345 -3155 -2147 -2202 -2776 -2783 -1843 -2686 -3138 -1881 -1817 -2889 -2439 -1647 -2358 -2523 -1644 -2207 -2401 -1217 -796 -2296
3365 -2296 -1758 -853 -1388 -1700 -789 -1105 -1818 -389 166 -1212 -903 93 -743 -564 786 92 -553 965
3383 965 1554 -115 244 1203 1039 865 1636 1319 621 1815 2563 1424 1268 2286 2325 1929 2558 2267 1408
3402 1408 2326 2808 1820 1615 2962 2738 2421 3022 2490 1520 2581 3567 2122 1490 3070 2888 1761 2546
3420 2546 1986 1132 2153 2714 1842 1356 2033 1699 1517 1982 1307 276 1326 2333 779 -156 1207 1262
3438 1262 284 244 530 -731 19 857 292 -1203 -668 -320 -519 191 -685 -1905 -887 83 -1324 -2276
3456 -2276 -1192 -1366 -1915 -1326 -1279 -2607 -2283 -741 -1639 -3019 -2663 -1781 -1964 -1899 -1858 -3008 -2734 -1393 -1850
3475 -1850 -2862 -1984 -2114 -2665 -1748 -1484 -3357 -3092 -874 -1778 -3320 -2421 -1092 -1611 -1562 -1322 -2070 -2146 -1074
$$ packed form
3345c155J008n5n74pR40q43m52J257O4j072M50P92p11j65Q79n63j94J184M21j500
3365b296N38R05n35l12R11l16p13J429N55j378L09R96q36J79J350o94o45J518
3383I65N89j669L59R59j64j74P71l17o98J194P48j139j56J018L9l96O29k91q59
3402A408R18M82r88k05J347k24l17O01n32r70J061R86j445o32J580j82j127P85
3420B546n60q54J021N61q72m86O77l34j82M65o75j031J050J007j554r35J363N5
3438A262r78m0K86j261P50Q38n65j495N35L48j99P10q76j220J018R70j407r52
3456b276J084j74n49N89M7j328L24J542q98j380L56Q82j83O5M1j150K74J341m57
3475a850j012Q78j30n51R17K64j873K65K218r04j542Q99J329n19M9K40p48p6J072
$$ plain form
3494 -1074 -835 -1889 -1534 -947 -1252 -319 -895 -2219 -1348 529 747 -1066 -760 125 -77 -30 1320 -57
3512 -57 -828 1330 1546 351 555 1112 1082 1694 1511 628 798 2450 2509 1116 1125 1741 1587 2166 3019 1665
3532 1665 709 2652 3296 1672 1666 2520 2469 2239 2613 2158 1520 2664 3139 1774 1408 1688 2065 2543 2760
3551 2760 1045 587 2322 3094 871 845 1903 1572 1401 1850 1287 -148 978 2280 965 276 418
3568 418 745 809 834 -389 -1227 715 1178 -650 -1221 -10 -471 -934 -316 -881 -2378 -1428 223 -1282
3586 -1282 -2041 -1879 -1616 -1501 -1260 -1874 -2539 -1458 -1224 -2404 -2745 -1808 -2413 -2539 -1593 -1840 -3396 -2022
3604 -2022 -1089 -2298 -3387 -2232 -1352 -2180 -1964 -2091 -2509 -2082 -1097 -2001 -2130 -1743 -1641 -1992 -742 -1337
3622 -1337 -2490 -1528 -289 -1291 -1879 -1173 -140 -514 -546 -670 -1153 -606 428 9 -704 201 425 31
$$ packed form
3494a074K39j054L55N87l05R33n76j324Q71J877K18j813L06Q85k02M7J350j377
3512e7p71K158K16j195K04N57l0O12j83q83J70J652N9j393RO16j54N79Q53j354
3532A665r56J943O44j624oQ54n1k30L74m55o38J144M75j365l66K80L77M78K17
3551B760j715m58J735P72k223k6J058l31j71M49n63j435J126J302j315o89J42
3568D18L27O4K5j223q38J942M63j828n71J211m61m63O18n65j497R50J651j505
3586a282p59J62K63J15K41o14o65J081K34j180l41R37o05j26R46k47j556J374
3604b022R33j209j089J155Q80q28K16j27m18M27R85r04j29L87J02l51J250n95
3622a337j153R62J239j002n88P06J033l74l2j24m83N47J034m19p13R05K24l94
$$ plain form
3640 31 525 400 -269 206 1905 1077 206 1485 1780 485 1085 1889 828 1077 2491 1780 802 1924
3658 1924 2137 1849 2040 2201 1588 1795 2749 2290 1412 1986 2480 1757 2077 2759 1918 1415 2846 2141 1434
3677 1434 1982 2406 1897 2045 2315 1416 1113 1867 1787 300 984 1963 1222 1180 1294 576 354 1290 749 -320
3697 -320 362 1097 -30 -210 299 -134 -676 123 126 -1062 -823 52 -782 -1210 -1072 -1348 -1018 -673 -1204 -1925
3717 -1925 -1530 -1051 -1845 -1709 -1243 -1772 -2378 -1294 -1255 -2362 -2298 -1763 -1742 -2588 -2034 -1839 -2366 -1456 -1901 -2533
3737 -2533 -2174 -1566 -2145 -2344 -1405 -1823 -2344 -1525 -1344 -2527 -2058 -657 -1298 -2220 -1003 -1154 -1443 -1358 -552
3756 -552 -1103 -1462 -340 -717 -832 -259 -88 -798 -292 371 -630 -368 957 365 -360 433 905 269 755
3775 755 1163 723 486 1556 1561 827 1597 1815 1165 1128 1904 1347 1723 2514 1919 970 1704 2699 1875 1585 2293
$$ packed form
3640C1M94j25o69M75J699q28q71J279K95j295O00Q04j061K49J414p11r78J122
3658A924K13k88J91J61o13K07R54m59q78N74M94p23L20O82q41n03J431p05p07
3677A434N48M24n09J48K70q99l03P54q0j487O84R79p41m2J14p18k22R36n41j069
3697c20O82P35j127j80N09m33n42P99Lj188K39Q75q34m28J38k76L30L45n31p21
3717a925L95M79p94J36M66n29o06J084L9j107O4N35K1q46N54J95n27R10m45o32
3737b533L59O08n79j99R39m18n21Q19J81j183M69J401o41r22J217j51k89Q5Q06
3756e52n51l59J122l77j15N73J71p10N06O63j001K62J325n92p25P93M72o36M86
3775G55M08m40k37J070Np34P70K18o50l7P76n57L76P91n95r49P34R95q24k90P08
$$ plain form
3796 2293 1644 1309 2466 2268 1161 1728 2512 1858 1977 2484 1719 1392 2055 1800 958 1641 2264 1129 1148
3815 1148 1714 1241 765 1606 1209 305 817 1513 580 306 804 154 -266 661 824 -305 -492 298 -258
3834 -258 -645 -434 -568 -1070 -297 -395 -1568 -1192 -406 -1088 -1326 -1459 -1377 -1795 -973 -595 -2124 -1834 -1257 -1482
3854 -1482 -2119 -1659 -1866 -2256 -1346 -1781 -2412 -2636 -1269 -1729 -2292 -1643 -1702 -1994 -1441 -1382 -2169 -2220 -987 -1246
3874 -1246 -1786 -1360 -1123 -2075 -1451 -496 -1691 -1856 -476 -611 -990 -933 -767 -1252 -760 56 -631 -1131 -18
3893 -18 375 -491 24 12 -176 -5 1148 524 -83 835 1044 553 1040 1146 529 1068 1848 1008 354 1539
3913 1539 1712 1279 1573 1695 855 1736 2686 1620 1113 2064 1919 1804 1941 1883 1757 1789 2763 1740 1139 1852
3933 1852 2326 1603 1830 1929 1199 1454 2115 1842 726 1406 2015 1413 1251 1300 572 878 1591 1315 -98 391
$$ packed form
3796B293o49l35J157j98j107N67P84o54J19N07p65l27O63k55q42O83O23j135J9
3815A148N66m73m76Q41l97r04N12O96r33k74M98o50m20R27J63j129j87P90n56
3834b58l87K11j34n02P73r8j173L76P86o82k38j33Q2m18Q22L78j529K90N77k25
3854a482o37M60k07l90R10m35o31k24J367m60n63O49n9k92N53N9p87n1J233k59
3874a246n40M26K37r52O24R55j195j65J380j35l79N7J66m85M92Q16o87n00J113
3893a8L93q66N15j2j88J71J153o24o07R18K09m91M87J06o17N39P80q40o54J185
3913A539J73m33K94J22q40Q81R50j066n07R51j45j15J37n8j26L2R74j023o01P13
3933A852M74p23K27R9p30K55O61k73j116O80O09o02j62M9p28L06P13k76j413M89
$$ plain form
3953 391 981 233 569 309 -289 -210 676 150 -1127 -426 266 -152 -530 -397 -1019 -753 -35 -654 -1576 -1400
3973 -1400 -550 -988 -1146 -1241 -1735 -2109 -1013 -777 -2210 -1960 -1172 -1574 -1788 -1540 -1902 -2478 -1266 -1161 -2541
3992 -2541 -2260 -1314 -1536 -1861 -1667 -2410 -2144 -840 -1118 -2483 -2236 -703 -1428 -1662 -956 -1477 -1978 -569
4010 -569 -490 -1628 -1633 -563 -802 -1025 -613 -662 -1160 -221 -47 -757 -451 152 133 -188 555 -97 -272 522 1203
4031 1203 -171 -33 937 1173 571 722 831 565 1387 1827 1115 603 1856 1708 1363 1336 1401 1129 2278
4050 2278 2152 1138 1260 2034 1845 1481 1742 1723 1290 1518 2597 1393 1010 1715 2220 1475 1642 1565 1103
4069 1103 1564 1746 1186 774 1671 1410 862 1473 933 273 915 1488 723 -433 636 809 80 264 443
4088 443 -493 -308 371 -74 -733 -207 15 -774 -588 -509 -1068 -828 -428 -918 -1748 -1154 -883 -1682 -1392 -1018
$$ packed form
3953C91N90p48L36k60n98P9Q86n26j277P01O92m18l78J33o22K66P18o19r22J76
3973a400Q50m38j58r5m94l74J096K36j433K50P88m02k14K48l62n76J212J05j380
3992b541K81R46k22l25J94p43K66J304k78j365K47J533p25k34P06n21n01J409
4010e69P9j138nJ070k39k23M12m9m98R39J74p10L06O03j9l21P43o52j75P94O81
4031A203j374J38R70K36o02J51J09k66Q22M40p12n12J253j48l45k7O5k72J149
4050B278j26j014J22P74j89l64K61j9m33K28J079j204l83P05N05p45J67p7m62
4069A103M61J82n60m12Q97k61n48O11n40o60O42N73p65j156J069J73p29J84J79
4088D43r36J85O79m45o59N26K22p89J86P9n59K40M00m90q30N94K71p99K90L74
$$ plain form
4108 -1018 -1539 -1775 -1057 -1277 -1892 -1408 -1230 -1707 -1731 -1213 -2015 -2010 -995 -1345 -1682 -1402 -1569 -2059 -2198 -1020
4128 -1020 -1703 -2089 -979 -1202 -1928 -1323 -948 -1703 -1743 -1024 -880 -1099 -875 -1015 -1200 -569 -619 -1134 -550 133
4148 133 -484 -760 272 31 -771 -116 623 -109 -139 989 524 282 576 775 397 975 1300 917 617 1156
4168 1156 1076 746 1197 1578 1115 1307 1800 878 822 2159 1975 860 1572 1792 1400 1800 2216 1709 1028 2170
4188 2170 1996 1556 1383 1755 1236 1633 2024 1447 1052 1744 1697 679 862 1546 1096 863 1186 667 323 1078
4208 1078 1499 528 418 672 494 363 488 -100 -522 448 664 -480 -446 134 -739 -343 505 -671 -1366
4227 -1366 -404 3 -909 -1353 -954 -974 -826 -632 -1002 -1635 -826 -820 -1566 -1781 -1447 -1564 -1575 -853 -1376 -2322 -1398
4248 -1398 -859 -1653 -2089 -1396 -1627 -1895 -1253 -1471 -2030 -1439 -808 -1254 -1862 -1277 -1329 -1341 -687 -1229 -1717 -1067
$$ packed form
4108a018n21k36P18k20o15M84J78m77k4N18q02NJ015l50l37K80j67m90j39J178
4128a020o83l86J110k23p26O05L75p55m0P19J44k19K24j40j85O31n0n15N84O83
4148A33o17k76J032k41q02O55P39p32l0J128m65k42K94J99l78N78L25l83l00N39
4168A156q0l30M51L81m63J92M93r22n6J337j84j115P12K20l92M00M16n07o81J142
4188B170j74m40j73L72n19L97L91n77l95O92m7j018J83O84m50k33L23n19l44P55
4208A078M21r71j10K54j78j31J25n88m22R70K16j144L4N80q73L96Q48j176o95
4227a366R62M07r12m44L99k0J48J94l70o33Q09Op46k15L34j17j1P22n23r46R24
4248a398N39p94m36O93k31k68O42k18n59N91O31m46o08N85n2j2O54n42m88O50
$$ plain form
4268 -1067 -294 -1259 -1230 -643 -761 -984 -294 -531 -995 -160 591 136 -842 -397 144 182 453 198 -195 524
4288 524 1092 433 256 781 432 576 1230 1290 72 933 1963 1055 518 1261 1439 1335 1519 1624 696 1034
4308 1034 1997 1969 1185 1361 1155 1781 1891 1797 1018 1072 2295 1679 596 1515 1596 1156 1608 1760 1073 773
4328 773 1642 1568 778 737 1344 873 1189 1156 168 454 1229 1057 130 571 606 -206 265 582 -452 -528 813
4349 813 584 -509 -769 215 -476 -205 -526 -878 -1001 -198 -683 -932 -1031 -658 -1284 -850 -629 -2028 -1942 -698
4369 -698 -754 -2217 -1289 -959 -1581 -1686 -1500 -1509 -2173 -1077 -667 -1800 -1638 -1523 -1476 -1269 -1035 -1605 -1897 -1095
4389 -1095 -929 -1775 -1684 -455 -1361 -1179 -378 -855 -1363 -968 -551 -720 -919 -676 -754 -538 31 -586 -730 81
4409 81 326 -300 -310 189 158 8 644 400 -198 731 1339 412 261 871 998 473 1034 991 502 1352 1753
$$ packed form
4268a067P73r65K9N87j18k23O90k37m64Q35P51m55r78M45N41L8K71k55l93P19
4288E24N68o59j77N25l49J44O54O0j218Q61J030r08n37P43J78j04J84J05r28L38
4308A034R63k8p84J76k06O26J10r4p79N4J223o16j083R19Q1m40M52J52o87l00
4328G73Q69p4p90m1O07m71L16l3r88K86P75j72r27M41L5q12M71L17j034p6J341
4349H13k29j093k60R84o91K71l21l52j23Q03m85k49r9L73o26M34K21j399Q6J244
4369f98n6j463R28L30o22j05J86ro64J096M10j133J62J15M7K07K34n70k92Q02
4389a095J66q46R1J229r06J82Q01m77n08L95M17j69j99K43p8K16N69o17j44Q11
4409H1K45o26j0M99l1j50O36k44n98R29O08r27j51O10J27n25N61m3m89Q50M01
$$ plain form
4430 1753 832 1096 1281 1237 758 1490 1395 842 1415 1962 1058 867 1719 1627 1359 1294 1782 1091 1330 1873 1241
4451 1241 981 1648 1288 1108 1678 1263 529 891 1532 708 483 1131 1132 564 1210 1094 357 255 884 506
4471 506 -144 425 259 13 349 277 -478 -200 102 -421 -903 -391 -436 -867 -153 -330 -1076 -856 -403 -1063 -1222
4492 -1222 -513 -518 -1343 -1337 -759 -1604 -1170 -725 -1018 -1624 -956 -990 -1731 -1435 -1166 -1859 -1690 -1015 -1246 -1591 -1067
4513 -1067 -1361 -1644 -1519 -1000 -1504 -1372 -1109 -1416 -1445 -1041 -796 -1282 -973 -768 -817 -1105 -273 -865 -1306 -455
4533 -455 -394 -790 -651 273 -65 -195 311 353 -443 -24 461 -70 -112 608 577 205 735 827 287 552 1353 975
4555 975 430 1322 943 553 1367 1464 853 1045 1570 875 754 1294 1773 999 1521 1335 1058 1495 1758 1291
4575 1291 766 1364 1390 956 1639 1560 759 1094 1891 1002 567 1593 1272 845 1101 1145 564 411 1247 656
$$ packed form
4430A753r21K64J85m4m79P32r5n53N73N47r04j91Q52r2k68o5M88o91K39N43o32
4451A241k60O67l60j80N70m15p34L62O41q24k25O48Jn68O46j16p37j02O29l78
4471E06o50N69j66k46L36p2p55K78L02n23m82N12m5m31P14j77p46K20M53o60j59
4492a222P09nq25ON78q45M34M45k93o06O68l4p41K96K69o93J69O75k31l45N24
4513a067k94k83J25N19n04J32K63l07k9M04K45m86L09K05m9k88Q32n92m41Q51
4533d55O1l96J39R24l38j30N06M2p96M19M85n31m2P20l1l72N30R2n40K65Q01l78
4555I75n45Q92l79l90Q14R7o11J92N25o95j21N40M79p74N22j86k77M37K63m67
4575A291n25N98K6m34O83p9q01L35P97q89m35J026l21m27K56M4n81j53Q36n91
$$ plain form
4595 656 307 640 857 216 659 376 -194 -4 553 167 -408 161 71 -148 -26 -131 -684 -483 -253 -272 -1056
4616 -1056 -396 -501 -983 -981 -357 -1163 -1056 -625 -1106 -1412 -939 -1013 -1601 -1073 -992 -1653 -1329 -546 -1284 -1900 -1287
4637 -1287 -898 -1338 -1228 -908 -1475 -1564 -540 -676 -1760 -1410 -1022 -1078 -1017 -716 -1150 -1522 -363 -585 -1455 -1000
4657 -1000 -318 -784 -256 -485 -745 -856 45 9 -570 -482 164 87 -199 115 144 -286 713 808 3 360 1098
4678 1098 230 544 971 506 29 1574 896 440 657 1294 1029 866 1624 972 545 1308 1431 949 1087
4697 1087 1571 1352 687 1289 1088 800 1346 1534 549 1018 1215 1290 1229 1362 1122 731 1250 1538 510 515 1129
4718 1129 1056 830 916 749 55 583 1022 164 82 647 419 128 564 194 -26 279 625 124 -375 388 -119
4739 -119 -458 -457 -205 -656 -503 -229 -1029 -1037 -555 -628 -1312 -792 -801 -1281 -1088 -722 -1357 -1324 -750 -892 -1302 -996 -1238
$$ packed form
4595F56l49L33K17o41M43k83n70J90N57l86n75N69r0k19J22j05n53K01K30j9p84
4616a056O60j05m82KO24q06J07M31m81l06M73p4n88N28Q1o61L24P83p38o16O13
4637a287L89m40J10L20n67q9J024j36j084L50L88n6O1L01m34l72J159k22q70M55
4657a000O82m66N28k29k60j11R01l6n79Q8O46p7k86L14K9m30R99R5q05L57P38
4678A098q68L14M27m65m77J545o78m56K17O37k65j63P58o52m27P63J23m82J38
4697A087M84k19o65O02k01k88N46J88r85M69J97P5o1J33k40l91N19K88j028NO14
4718A129p3k26Q6j67o94N28M39q58q2N65k28k91M36l70k20L05L46n01m99P63n07
4739a19l39JK52m51J53K74q00qM82p3o84N20rm80J93L66o35L3N74j42m10L06k42
$$ plain form
4762 -1238 -1834 -1244 -1122 -1277 -1529 -711 -977 -1705 -1072 -1105 -1780 -1320 -561 -1324 -1395 -930 -484 -1322 -1179 -740
4782 -740 -1288 -1014 -688 -1037 -1131 -466 -135 -974 -606 -281 -708 -701 115 -149 -596 -91 510 330 -334 528 -52
4803 -52 8 732 687 258 374 956 243 724 781 347 803 918 1141 603 1084 1392 763 758 1638 831 707 1604
4825 1604 1182 588 1063 1552 1229 927 1227 1149 1148 1620 1273 388 997 1270 1089 667 1232 854 496 1275 1238
4846 1238 402 796 1329 707 679 725 988 177 515 547 265 483 657 295 216 430 110 140 399 73 -339
4867 -339 -342 188 -329 -424 -247 -361 -878 -203 -393 -1040 -655 -394 -808 -1286 -739 -923 -954 -674 -767 -1178 -1042 -934
4889 -934 -1122 -1267 -840 -1105 -1518 -1026 -861 -1431 -1541 -706 -1157 -1621 -1070 -651 -1351 -1186 -487 -1192 -1436 -569
4909 -569 -890 -1112 -546 -878 -1035 -543 -353 -898 -687 36 -521 -719 -412 -320 -731 -279 46 -50 -327 -6 255
$$ packed form
4762a238n96N90J22j55k52Q18k66p28O33l3o75M60P59p63p1M65M46q38J43M39
4782g40n48K74L26l49r4O65L31q39L68L25m27PQ16k64m47N05O01j80o64Q62n80
4803e2O0P24m5m29J16N82p13M81N7m34M56J15K23n38M81L08o29nQ80q07j24Q97
4825A604m22n94M75M89l23l02L00p8jM72l47q85O09K73j81m22N65l78l58P79l7
4846A238q36L94N33o22k8M6K63q11L38L2k82K18J74l62p9K14l20L0K59l26m12
4867c39lN30n17r5J77j14n17O75j90o47L85K61m14m78N47j84l1K80r3m11J36J08
4889i34j88j45M27k65m13M92J65n70j10Q35m51m64N51M19p00J65O99p05k44Q67
4909e69l21k22N66l32j57M92J90n45K11P23n57j98L07R2m11M52L25r6k77L21K61
$$ plain form
4930 255 -11 -54 102 67 248 573 268 138 690 551 255 740 1146 291 608 1282 845 382 963 1380 734
4951 734 1151 1262 805 786 1693 910 1112 1084 1055 653 1119 1200 798 860 1161 1156 838 1009 1206 608 755 944
4973 944 841 390 1093 948 225 726 960 552 358 924 510 344 487 299 -27 292 346 -430 16 285
4993 285 139 -375 142 -302 -537 -101 -228 -574 -537 -503 -327 -895 -347 -629 -1067 -563 -222 -888 -1152 -531 -907
5014 -907 -1506 -819 -364 -990 -1034 -492 -1339 -1014 -515 -1017 -1042 -688 -1170 -1533 -759 -733 -1332 -1427 -544 -849 -1298
5035 -1298 -884 -392 -1142 -773 -587 -854 -974 -175 -266 -915 -619 -392 -600 -335 -230 -607 -659 -64 -45 -325 -5
5056 -5 184 -242 43 521 -148 -235 750 526 -219 258 615 395 74 1165 500 371 627 980 556 507 824
5077 824 734 795 1185 992 333 1062 957 739 1074 1297 1075 1135 1398 1032 476 1067 1247 576 739 784 761 778
$$ packed form
4930B55k66m3J56l5J81L25l05j30N52j39k96M85M06q55L17O74m37m63N81M17o46
4951G34M17J11m57j9R07p83K02k8k9m02M66Q1m02O2L01nl18J71J97n98J47J89
4973I44j03m51P03j45p23N01K34m08j94N66m14j66J43j88l26L19N4p76M46K69
4993B85j46n14N17m44k35M36j27l46L7L4J76n68N48k82m38N04L41o66k64O21l76
5014i07n99O87M55o26m4N42q47L25M99n02k5L54m82l63P74K6n99r5Q83l05m49
5035a298M14M92p50L69J86k67j20P99r1o49K96K27k08K65J05l77n2N95J9k80L20
5056eJ89m26K85M78o69q7R85k24p45M77L57k20l21J091o65j29K56L53m24m9L17
5077H24r0O1L90j93o59P29j05k18L35K23k22O0K63l66n56N91J80o71J63M5k3J7
$$ plain form
5099 778 1482 648 733 906 715 841 769 867 423 540 736 725 -164 454 781 239 -49 556 108 24 277 138
5121 138 -210 68 222 -138 -335 -156 -447 -172 13 -228 -603 -648 -159 -651 -843 -414 -286 -962 -579 -486 -981
5142 -981 -943 -634 -1021 -1201 -921 -497 -1103 -921 -897 -819 -944 -575 -1325 -1027 -933 -1062 -1332 -875 -736 -1168 -904
5163 -904 -624 -524 -1019 -737 -652 -614 -737 -406 -724 -804 -301 -409 -897 -302 -375 -553 -182 50 -344 -365 155 -67
5185 -67 -67 -69 221 -119 50 452 16 96 835 604 186 596 711 481 840 742 250 434 1050 660 555 697
5207 697 1129 423 720 1150 806 603 1093 1492 760 757 983 1108 781 1079 1249 519 1079 1223 487 689 759
5228 759 681 509 1136 552 606 1031 1025 103 508 833 270 139 660 403 198 566 843 283 -373 82 16 7
5250 7 283 -116 -514 -85 -83 -494 -410 283 -338 -424 80 -242 -822 -324 -122 -821 -878 -508 -636 -973 -569 -841
$$ packed form
5099G78P04q34Q5J73j91J26p2R8m44J17J96j1q89O18L27n42k88O05m48q4K53j39
5121A38l48K78J54l60j97J79k91K75J85k41l75m5M89m92j92M29J28o76L83R3m95
5142i81L8L09l87j80K80M24o06J82K4P8j25L69p50K98R4j29k70M57J39m32K64
5163i04K80J00m95K82Q5L8j23L31l18q0N03j08m88N95p3j78L71K32l94k1N20k22
5185f7%kK90l40J69M02m36Q0P39k31m18M10J15k30L59r8m92J84O16l90j05J42
5207F97M32p06K97M30l44k03M90L99p32lK26J25l27K98J70p30N60J44p36K02P0
5228G59p8j72O27n84N4M25or22M05L25n63j31N21k57k05L68K77n60o56M55o6r
5250GK76l99l98M29Km11Q4O93o21q6N04l22n80M98K02o99n7L70j28l37M04k72
$$ plain form
5272 -841 -920 -870 -436 -1043 -932 -405 -899 -1098 -636 -697 -1121 -626 -517 -1156 -930 -696 -926 -1042 -615 -562 -1058
5293 -1058 -935 -425 -1160 -909 -570 -481 -1021 -785 -397 -676 -716 -419 -189 -628 -121 -186 -489 -86 -40 -234 -247
5314 -247 99 -255 -205 372 84 -273 171 592 -123 118 552 365 218 777 574 576 782 1073 624 441 1125
5335 1125 553 382 819 615 518 1016 917 545 1021 1176 951 754 1072 1016 624 502 1075 764 858 1056 735
5356 735 613 1028 1066 491 808 1167 325 514 1000 99 369 729 693 312 395 513 74 -30 565 368 -39
5377 -39 252 444 133 -15 292 19 -163 -42 -157 -277 -280 129 -499 -552 -378 -491 -984 -448 -715 -1038 -503
5398 -503 -320 -661 -871 -671 -802 -684 -825 -604 -870 -1163 -800 -628 -1462 -785 -907 -1044 -767 -738 -1234 -822
5418 -822 -814 -693 -1255 -606 -549 -1263 -689 -465 -1140 -793 -533 -470 -905 -485 -226 -550 -453 -223 -679 -288 -241 -256
$$ packed form
5272h41p9N0M34o07J11N27m94j99M62o1m24M95J09o39K26K34k30j16M27N3m96
5293a058J23N10p35K51L39Q9n40K36L88k79m0K97K30m39N07o5l03M03M6j94j3
5314b47L46l54N0N77k88l57M44M21p15K41M34j87j47N59k03KK06K91m49j83O84
5335A125n72j71M37k04r7M98r9l72M76J55k25j97L18n6l92j22N73l11R4J98l21
5356G35j22M15L8n75L17L59q42J89M86r01K70L60l6l81Q3J18m39j04N95j97m07
5377c9K91J92l11j48L07k73j82J21j15j20lM09o28n3J74j13m93N36k67l23N35
5398e03J83l41k10K00j31J18j41K21k66k93L63J72q34O77j22j37K77K9m96M12
5418h22QJ21n62O49N7p14N74K24o75L47K60O3m35M20K59l24R7K30m56L91M7j5
$$ plain form
5440 -256 -571 -257 91 -271 275 224 -349 -144 156 595 97 396 287 323 268 475 262 411 726 651 337
5461 337 747 857 651 678 669 563 487 867 923 314 935 906 817 628 1130 437 645 971 771 500 883 931 573
5484 573 823 850 806 401 1195 919 472 657 698 661 907 811 432 317 683 471 49 470 511 82 48 437
5506 437 -83 -471 192 144 -318 -233 -275 -544 -203 -75 -489 -318 -363 -455 -444 -677 -321 -462 -603 -418 -617 -761
5528 -761 -781 -179 -967 -767 -552 -480 -877 -751 -779 -1039 -684 -507 -1185 -1064 -538 -807 -856 -868 -842 -898 -711 -539
5550 -539 -990 -589 -596 -900 -704 -537 -506 -628 -498 22 -733 -536 114 -229 -702 107 -159 -189 -227 55 -374 -192
5572 -192 435 135 -66 60 -106 -254 135 196 109 43 539 258 329 458 761 118 757 875 534 130 843
5593 843 856 542 614 971 584 648 949 764 715 789 719 572 806 812 561 653 1102 691 246 889 726 719 545 1014
$$ packed form
5440b56l15L14L48l62N46n1n73K05L00M39m98K99j09L6n5K07k13J49L15p5l14
5461C37M10J10k06K7rj06p6L80N6o09O21k9q9j89N02o93K08L26k00k71L83M8l58
5484E73K50K7m4m05P94k76m47J85M1l7K46r6l79j15L66k12m22M21M1m29l4L89
5506D37n20l88O63m8m62Q5m2k69L41J28m14J71m5r2J1k33L56j41j41J85j99j44
5528g61k0O02p88K00K15P2l97J26k8k60L55J77o78J21N26k69m9j2K6n6J87J72
5550e39m51M01pl04J96J67L1j22J30N20p55J97O50l43m73Q09k66l0l8K82m29J82
5572a92O27l00k01J26j66j48L89O1q7o6M96k81P1J29L03o43O39J18l41m04P13
5593H43J3l14P2L57l87O4L01j85m9P4p0j47K34Ok51R2M49m11m45O43j63pj74M69
$$ plain form
5617 1014 417 534 771 705 424 611 499 551 448 578 323 521 563 226 95 453 380 92 138 137 -57 -303
5639 -303 645 -209 -253 -58 -98 -402 -171 -302 -365 -554 -334 -589 -351 -189 -243 -701 -536 -393 -994 -928 -213 -916
5661 -916 -1050 -625 -549 -928 -975 -728 -973 -856 -599 -675 -958 -606 -376 -738 -833 -494 -825 -422 -603 -700 -808 -454
5683 -454 -228 -806 -829 -241 -380 -920 -246 -107 -509 -390 -320 -226 -498 -320 -116 -320 125 39 -232 -62 49
5704 49 -221 108 409 37 -114 329 414 19 253 542 555 261 671 600 -45 551 820 549 748 854 485
5725 485 614 517 690 887 519 692 236 516 1229 915 471 813 891 622 455 1264 713 709 988 660 569 889
5747 889 627 201 331 877 -105 474 621 211 39 486 572 317 273 536 369 -67 465 88 -269 -65 -10
5768 -10 38 -95 192 -83 -353 -53 -87 -386 -467 -13 -488 -406 105 -389 -638 -20 -348 -682 -500 -822 -714 -773
$$ packed form
5617A014n97J17K37o6k81J87j12N2j03J30k55J98M2l37j31L58p3k88M6jj94k46
5639c03R48q54m4J95m0l04K31j31o3j89K20k55K38J62n4m58J65J43o01O6P15p03
5661i16j34M25P6l79m7K47k45J17K57p6k83L52K30l62r5L39l31M03j81r7j08L54
5683d54K26n78k3N88j39n40O74J39m02J19P0R4k72J78K04k04M45q6k71J70J11
5704D9k70L29L01l72j51M43Q5l95K34K89J3k94M10p1o45N96K69k71J99J06l69
5725D85J29r7J73J97l68J73m56K80P13l14m44L42P8k69j67Q09n51mK79l28r1L20
5747H89k62m26J30N46r82N79J47m10j72M47Q6k55m4K63j67m36N32l77l57K04N5
5768a0M8j33K87k75k70L00l4k99q1M54m75Q2N11m94k49O18l28l34J82l22J08n9
$$ plain form
5790 -773 -376 -904 -998 -506 -425 -957 -744 -521 -732 -509 -143 -1080 -761 -478 -701 -893 -537 -404 -1029 -856 -1021
5811 -1021 -607 -605 -488 -242 -856 -759 -339 -632 -580 -164 -301 -251 -119 -31 -343 -407 -332 -278 -335 -269 -94 -18 -274 19
5835 19 84 -367 719 349 -161 302 564 35 326 625 123 256 869 306 174 487 615 426 743 715 578
5856 578 558 753 678 550 663 696 387 802 828 402 480 1160 777 490 817 749 363 664 761 578 339 858
5878 858 518 425 565 630 314 397 465 286 128 202 421 181 26 151 -162 -201 324 -210 -234 197 87 -283
5900 -283 -91 -34 -52 -203 103 -61 -499 -106 -39 -162 -98 -262 -793 -563 -361 -684 -853 -613 -180 -751 -788 -354
5922 -354 -676 -648 -323 -759 -1055 -229 -444 -588 -422 -689 -866 -804 -725 -624 -889 -641 -303 -633 -507 -617 -491
5943 -491 -525 -397 -305 -676 -374 -253 -395 -338 -87 -368 -535 388 -328 -215 -143 123 -253 -284 313 182 -237 370
$$ packed form
5790g73L97n28r4M92Q1n32K13K23k11K23L66r37L19K83k23j92L56J33o25J73j65
5811a021M14KJ17K46o14R7M20k93N2M16j37N0J32Q8l12o4P5N4n7O6J75P6k56K93
5835A9O5m51J086l70n10M63K62n29K91K99n02J33O13n63j32L13J28j89L17k8j37
5856E78k0J95p5j28J13L3l09M15K6m26P8O80l83k87L27o8l86L01R7j83k39N19
5878H58l40r3J40O5l16Q3O8j79j58P4K19k40j55J25l13l9N25n34k4M31j10l70
5900b83J92N7j8j51L06j64m38L93O7j23O4j64n31K30K02l23j69K40M33n71l7M34
5922c54l22K8L25m36k96Q26k15j44J66k67j77O2P9J01k65K48L38l30J26j10J26
5943d91l4J28R2l71L02J21j42N7K51k81j67R23p16J13P2K66l76l1N97j31m19O07
$$ plain form
5965 370 366 -16 282 140 378 -168 211 442 132 670 496 254 307 820 595 328 828 386 341 662 863
5986 863 473 498 635 679 462 1208 935 535 541 817 515 743 722 542 569 811 724 682 786 747 483 590 422
6009 422 521 341 377 523 247 408 476 73 44 238 109 16 223 19 103 388 126 -249 -269 89 -144 -577
6031 -577 -253 -323 -892 -377 -336 -524 -451 -324 -510 -563 -299 -422 -358 -635 -508 -659 -843 -239 -792 -887 -622 -672
6053 -672 -956 -558 -592 -847 -1049 -668 -593 -857 -403 -493 -539 -871 -560 -579 -742 -352 -190 -761 -514 -468 -277 -201
6075 -201 -144 -305 -544 -131 -88 -265 -409 -128 -327 -295 322 -276 -1 532 334 -10 388 179 -133 14 194
6096 194 17 311 339 414 258 462 523 296 192 217 611 421 621 664 167 555 419 414 569 609 544 523 545 590
6120 590 297 562 896 533 296 607 537 329 341 567 591 518 822 567 527 437 414 181 229 709 111 290 527
$$ packed form
5965C70ml82K98j42K38n46L79K31l10N38j74k42N3N13k25k67N00m42m5L21K01
5986H63l90K5J37M4k17P46k73m00OK76l02K28k1j80K7K42q7m2J04l9k64J07j68
6009D22R9j80L6J46k76J61O8m03k9J94j29r3K07k04Q4K85k62l75k0L58k33m33
6031e77L24p0n69N15M1j88P3J27j86n3K64j23O4k77J27j51j84O04n53r5K65n0
6053f72k84L98l4k55k02L81P5k64M54r0m6l32L11j9j63L90J62n71K47M6J91P6
6075b01N7j61k39M13M3j77j44K81j99L2O17n98K75N33j98l44L98k09l12J47J80
6096A94j77K94K8P5j56K04O1k27j04K5L94j90K00M3m97L88j36nJ55M0o5k1K2M5
6120E90k93K65L34l63k37L11p0k08J2K26K4p3L04k55m0r0k3k33M8M80n98J79K37
$$ plain form
6143 527 183 182 93 216 -31 227 253 247 -89 -18 167 -180 93 -91 -210 -451 -11 -244 -310 71 -347 -232 -254
6166 -254 -451 -165 -496 -255 -309 -433 -446 -553 -462 -370 -345 -905 -640 -363 -542 -646 -213 -446 -869 -540 -590 -654
6188 -654 -323 -461 -950 -610 -261 -518 -783 -651 -535 -452 -492 -483 -158 -642 -98 -272 -435 -477 -504 -399 -294 -200
6210 -200 -216 -356 65 -87 -523 -50 148 -228 -92 138 68 -199 137 202 76 420 478 -74 374 535 141
6231 141 -126 741 462 355 333 721 810 417 701 394 343 464 826 129 249 634 679 622 551 531 286 501
6253 501 395 643 126 873 348 175 579 518 289 666 556 364 363 521 402 31 469 167 137 236 458 30
6275 30 234 376 534 -209 228 310 -169 -281 19 -157 -209 -39 -18 -224 -108 -79 -517 -196 -206 -188 -635 -179
6297 -179 60 -312 -234 -377 -266 -335 -309 -602 -754 -609 -357 -525 -321 -168 -641 -374 -319 -547 -641 -659 -555 -510
$$ packed form
6143E27l44jq9J23k47K58K6ol36P1J85l47K73j84j19k41M40k33o6L81m18J15k2
6166b54j97K86l31K41n4j24j3j07R1R2K5n60K65K77j79j04M33k33m23L29n0o4
6188f54L31j38m89L40L49k57k65J32J16Q3m0RL25m84N44j74j63m2k7J05J05R4
6210b00j6j40M21j52m36M73J98l76J36K30p0k67L36O5j26L44N8n52M48J61l94
6231A41k67Q67k79j07k2L88Q9l93K84l07n1J21L62o97J20L85M5n7p1k0k45K15
6253E01j06K48n17P47n25j73M04o1k29L77j10j92jJ58j19l71M38l02l0R9K22m28
6275C0K04J42J58p43M37Q2m79j12L00j76n2J70K1k06J16K9m38L21j0J8m47M56
6297a79K39l72P8j43J11o9K6k93j52J45K52j68K04J53m73K67N5k28r4j8J04M5
$$ plain form
6319 -510 -684 -331 -886 -262 -89 -423 -245 -747 -296 -462 -142 -305 -275 -368 24 -165 -479 -339 -9 -295 -167
6340 -167 -54 -451 -41 -41 -241 -412 -119 6 -193 178 285 -87 -46 131 324 80 -11 369 193 -91 700
6361 700 459 288 677 522 141 343 639 361 454 597 547 110 740 497 398 590 577 663 505 566 491 305
6383 305 613 560 236 411 817 551 169 582 443 361 560 284 441 681 470 187 344 460 299 122 330
6404 330 225 -115 -21 68 183 27 124 -172 2 204 328 -115 -334 -66 -74 -169 294 -197 -263 -399 -69 -277
6426 -277 -491 13 -327 -511 -377 -368 -664 -544 -402 -573 -696 -259 -549 -590 -430 -586 -390 -522 -621 -804 -754 -358
6448 -358 -453 -491 -224 -420 -855 -448 -362 -522 -781 -298 -515 -432 -337 -210 -190 -475 -111 -83 -316 -6 -15 -307 -196
6471 -196 -231 -328 80 137 152 -64 43 53 193 142 164 -156 217 51 129 124 340 412 357 272 334 221 325 761 606
$$ packed form
6319e10j74L53n55O24J73l34J78n02M51j66L20j63L0r3L92j89l14J40L30k86J28
6340a67J13l97M10%k00j71K93J25j99L71J07l72M1J77J93k44r1L80j76k84P91
6361G00k41j71L89j55l81K02K96k78R3J43n0m37O30k43r9J92j3Q6j58O1p5j86
6383C05L08n3l24J75M06k66l82M13j39q2J99k76J57K40k11k83J57J16j61j77K08
6404C30j05l40R4Q9J15j56R7k96J74K02J24m43k19K68qr5M63m91o6j36L30k08
6426b77k14N04l40j84J34Rk96J20J42j71j23M37k90m1J60j56J96j32r9j83N0L96
6448c58r5l8K67j96m35M07Q6j60k59M83k17Q3R5J27K0k85L64K8k33L10rk92J11
6471a96l5r7M08N7J5k16J07J0J40n1K2l20L73j66P8nK16P2n5q5O2j13J04M36j55
$$ plain form
6496 606 420 401 813 272 613 658 506 326 498 508 390 411 496 650 619 784 609 310 342 437 387 576 780
6519 780 152 438 751 281 538 339 315 -76 146 443 104 237 591 270 -23 228 199 -168 354 -84 122
6540 122 11 2 135 -23 -46 95 -244 -170 -166 -198 -434 -352 -361 -590 -223 -469 -534 -406 -106 -548 -605 -379 -362 -377 -309
6565 -309 -299 -492 -454 -462 -658 -757 -88 -396 -727 -449 -618 -636 -628 -360 -477 -600 -401 -443 -594 -296 -322 -185 -585
6588 -585 -112 -541 -179 -325 -263 -441 -51 -309 -194 -133 -72 -151 -367 34 -283 -225 67 160 -121 -104 6 266
6610 266 -184 102 303 18 177 354 170 164 317 642 -136 61 700 171 191 339 253 36 705 320 169
6631 169 656 405 462 208 490 526 303 665 291 219 462 600 656 444 321 344 470 235 184 29 383 627
6653 627 98 450 347 135 166 526 326 136 325 413 46 132 132 92 -185 249 43 -232 -51 54 28 -121
$$ packed form
6496F06j86j9M12n41L41M5j52j80J72J0j18K1Q5J54l1J65j75k99L2R5n0J89K04
6519G80o28K86L13m70K57j99k4l91K22K97l39J33L54l21k93K51k9l67N22m38K06
6540A22j11rJ33j58k3J41l39P4Ml2k36Q2rk29L67k46o5J28L00m42n7K26J7j5O8
6565c09J0j93L8qj96r9O69l08l31K78j69j8QK68j17j23J99m2j51K98k6J37m00
6588e85M73m29L62j46O2j78L90k58J15O1O1p9k16M01l17N8K92R3k81J7J10K60
6610B66m50K86K01k85J59J77j84oJ53L25p78J97O39n29K0J48q6k17O69l85j51
6631A69M87k51N7k54K82L6k23L62l74p2K43J38N6k12j23K3J26k35n1j55L54K44
6653F27n29L52j03k12L1L60k00j90J89Q8l67Q6%m0k77M34k06k75J81J05k6j49
$$ plain form
6675 -121 -208 70 -243 -126 154 -312 -315 -107 -346 -411 -408 -301 -571 -349 -272 -292 -448 -201 -190 -607 -356 -530 -569
6698 -569 -767 -429 -608 -293 -224 -606 -744 -330 -368 -435 -501 -154 -499 -382 -290 -445 -410 -203 -353 -415 -305 -386 -124
6721 -124 -368 -137 -232 -420 -235 76 -534 16 144 -128 12 -151 -375 70 248 119 -129 398 366 45 33
6742 33 460 89 59 516 222 -27 -34 654 89 3 369 531 35 282 416 170 607 372 266 153 585 580
6764 580 304 449 257 379 64 535 121 327 331 383 298 264 534 337 281 306 450 317 578 104 173 465 64
6787 64 237 219 188 135 229 332 179 20 -105 179 433 154 151 128 -465 42 -110 -26 -54 160 -252 -176 -60 -200
6811 -200 -173 -299 -205 -163 -350 -277 -497 -485 -405 -70 -427 -78 -152 -174 -551 -597 -723 -443 -276 -656 -383 -210 -486
6834 -486 -195 -669 -368 -431 -560 -130 -96 -472 -494 -106 -540 -331 -238 95 -300 -163 -458 -115 -112 -36 -122 -355 89
$$ packed form
6675a21q7K78l13J17K80m66lK08k39o5LJ07k70K22P7k0j56K47J1m17K51j74l9
6698e69j98L38j79L15O9l82j38M14l8o7o6L47l45J17R2j55L5K07j50o2J10q1K62
6721a24k44K31r5j88J85L11o10N50J28k72J40j63k24M45J78j29k48N27l2l21j2
6742C3M27l71l0M57k94k49pO88n65q6L66J62m96K47J34k46M37k35j06j13M32n
6764E80k76J45j92J22l15M71m14K06MN2q5l4K70j97n6K5J44j33K61m74O9K92m01
6787F4J73j8l1n3R4J03j53j59j25K84K54k79lk3n93N07j52Q4k8K14m12P6J16j40
6811b00K7j26R4M2j87P3k20J2Q0L35l57L49p4k2l77m6j26K80J67l80K73J73k76
6834d86K91m74L01o3j29M30L4l76k2L88m34K09R3L33l95J37k95L43LP6q6k33M44
$$ plain form
6857 89 -105 -264 -226 90 52 86 109 -120 -66 15 155 53 141 28 160 -75 371 134 29 465 321 45 202
6880 202 212 280 452 223 174 280 227 589 429 172 721 310 419 491 642 85 391 412 463 382 593 525 50
6903 50 490 107 217 128 782 249 204 553 52 301 391 324 320 -46 452 119 73 240 418 198 25 76 230
6926 230 147 441 109 -19 75 60 -314 -123 255 42 -67 152 -271 -215 41 -100 -194 -273 -49 -808 -70 -367
6948 -367 -132 -195 -356 -148 -356 -492 -135 -417 -340 -33 -139 -790 -407 -521 -650 -501 -339 -357 -209 -354 -340
6969 -340 -604 -372 -185 -246 -260 -326 -686 -425 27 -387 -425 -544 106 -463 -78 -282 -273 -156 114 -80 -461 24
6991 24 230 107 -116 135 23 90 143 -133 -52 -67 -79 312 -52 -14 327 349 -40 473 -34 400 206 -89 349
7014 349 304 319 465 414 785 278 385 389 604 99 342 424 449 700 349 353 324 324 457 163 176 466 81 416
$$ packed form
6857H9j94j59L8L16l8L4K3k29N4Q1J40j02Q8j13J32k35M46k37j05M36j44k76J57
6880B02J0O8J72k29m9J06n3L62j60k57N49m11J09P2J51n57L06K1N1q1K11o8m75
6903E0M40l83J10q9O54n33m5L49n01K49R0o7ml66M98l33m6J67J78k20j73N1J54
6926B30q3K94l32j28R4j5l74J91L78k13j09K19m23N6K56j41r4p9K24p59P38k97
6948c67K35o3j61K08k08j36L57k82P7L07j06o51L83j14j29J49J62j8J48j45J4
6969c40k64K32J87o1j4o6l60K61M52m14l8j19O50n69L85k04RJ17K70j94l81M85
6991B4K06j23k23K51j12O7N3k76Q1j5j2L91l64L8L41K2l89N13n07M34j94k95M38
7014C49m5J5J46n1L71n07J07MK15n05K43Q2K5K51l51Mk9%J33k94J3K90l85L35
$$ plain form
7038 416 380 47 272 515 117 82 324 107 230 438 254 163 328 311 30 188 -109 289 97 38 113 -17
7060 -17 -83 164 -299 -39 55 -218 -120 -74 -195 -128 48 -86 -207 -55 -365 -396 -202 -204 -43 -428 -360 -254 -383
7083 -383 -526 -316 -185 -352 -217 -510 -671 -500 -464 -485 -168 -398 -108 -105 -170 -123 -243 -299 -245 -251 11 -253 -325 -273
7107 -273 -423 -269 -128 -240 -48 -281 -281 -146 100 -197 -136 108 -295 -95 175 50 -414 3 197 106 -79
7128 -79 145 162 14 256 277 234 205 47 5 82 370 446 93 288 70 -72 383 335 290 158 527 588 169 376
7152 376 189 285 282 208 206 292 191 218 393 211 292 346 224 428 134 -27 400 352 105 125 -14 113 279 283 179
7177 179 165 459 118 67 179 376 85 53 269 64 -74 104 -94 -331 -148 334 -440 -268 -9 -168 -254
7198 -254 303 -196 -109 -149 -98 -233 -309 -44 -399 -298 -78 -225 -422 -310 -399 -374 -500 -375 -879 -539 -120 -81
$$ packed form
7038D16l6l33K25K43l98l5K42k17J23K08j84r1J65j7k81J58k97L98j92n9P5j30
7060a7o6K47m63K60R4k73R8M6j21O7J76j34j21J52l10l1J94kJ61l85O8J06j29
7083c83j43K10J31j67J35k93j61J71L6k1L17k30K90Lo5M7j20n6N4oK62k64p2N2
7107b73j50J54J41j12J92k33%J35K46k97O1K44m03K00K70j25m64M17J94r1j85
7128g9K24J7j48K42K1m3k9j58m2P7K88P6l53J95k18j42M55m8m5j32L69O1m19K07
7152C76j87R6lp4kQ6j01K7J75j82Q1N4j22K04k94j61M27m8k47K0j39J27J66Mj04
7177A79j4K94l41n1J12J97k91l2K16k05j38J78j98k37J83M82p74J72K59j59q6
7198b54N57m99Q7m0N1j35p6K65l55J01K20j47j97J12q9K5j26J25n04L40M19L9
$$ plain form
7220 -81 -545 -139 -64 -492 -101 131 -370 -344 -60 -530 -605 -439 -157 -517 -139 -355 -178 -150 -291 -112 -238 -85
7242 -85 -215 -494 -26 -264 -102 -88 -44 311 -104 259 178 71 -163 59 389 -25 284 12 -32 429 74 61
7264 61 26 292 586 -103 341 515 292 289 167 369 104 318 293 312 535 499 -28 83 376 347 366 156 597
7287 597 280 581 193 334 -25 357 138 284 180 308 172 265 521 349 25 363 -125 191 171 306 -160
7308 -160 188 -64 -198 -154 162 77 -301 215 59 -325 -163 546 -60 -158 -10 -51 -360 -188 -86 -32 -164 -52
7330 -52 -361 -375 19 -397 -190 -252 -221 86 -406 -213 -335 -291 -484 -432 -201 -164 -316 -481 -364 -441 -291 -314 -283
7353 -283 -441 -468 -148 -315 -252 -236 -503 -439 -298 -67 95 -471 22 -56 -179 -251 -235 -148 -86 -75 -19 -58 -66 46 -147
7378 -147 -75 241 68 -175 117 -93 244 -317 477 228 153 36 -14 -205 133 186 154 95 454 -79 -98 253
$$ packed form
7220h1m64M06P5m28L91K32n01K6K84m70p5J66K82l60L78k16J77K8j41J79j26J53
7242h5j30k79M68k38J62J4M4L55m15L63q1j07k34K22L30m14L09k72m4M61l55j3
7264F1l5K66K94o89M44J74k23lj22K02k65K14k5J9K23l6n27J11K93k9J9k10M41
7287E97l17L01l88J41l59L82k19J46j04J28j36R3K56j72l24L38m88L16k0J35m66
7308a60L48k52j34M4L16q5l78N16j56l84J62P09o06r8J48m1l09J72J02N4j32J12
7330e2l09j4L94m16K07o2L1L07m92J93j22M4j93N2K31L7j52j65J17p7J50k3L1
7353b83j58k7L20j67O3J6k67O4J41K31J62n66M93p8j23p2J6Q7O2J1N6l9qJ12j93
7378a47P2L16j73k43K92k10L37n61P94k49p5j17n0j91L38N3l2n9L59n33j9L51
$$ plain form
7400 253 160 307 66 129 236 198 578 492 104 193 213 88 284 441 209 347 384 244 87 133 332 299 201
7423 201 74 455 -29 388 731 50 322 196 37 194 179 256 131 251 -143 17 147 24 52 -119 242
7444 242 -205 138 85 -67 -165 108 181 28 -35 26 -312 -38 4 -238 -198 -424 -163 -192 -276 -25 -254 -562 -113
7467 -113 -125 -413 -378 -240 -450 -386 -88 -63 -383 -143 -176 -325 -438 -411 -350 -449 -216 -487 -202 -500 -297 -526 -370
7490 -370 -520 -295 -272 -34 4 -327 104 -130 -200 -59 -10 -291 -198 -315 316 11 94 50 -263 -27 168 11
7512 11 -286 -48 200 -18 170 365 -35 135 338 226 126 161 79 255 456 203 413 141 300 175 172 251
7534 251 383 264 11 487 497 36 284 367 196 306 476 17 272 211 27 309 291 158 65 321 89 197
7556 197 166 513 245 224 521 339 -45 -5 314 -65 86 148 -130 171 -78 152 -179 -16 165 -118 141
$$ packed form
7400B53r3J47k41O3J07l8L80q6l88Q9K0j25J96J57k32J38L7j40j57M6J99l3r8
7423B01j27L81m84M17L43o81K72j26j59J57j5P7j25J20l94J60J30j23K8j71L61
7444B42m47L43n3j52r8K73P3j53o3O1l38K74M2k42M0k26K61k9q4K51k29l08M49
7467a13j2k88L5J38k10O4K98K5l20K40l3j49j13K7O1r9K33k71K85k98K03k29J56
7490c70j50K25K3K38L8l31M31k34p0J41M9k81R3j17O31l05Q3m4l13K36J95j57
7512A1k97K38K48k18J88J95m00J70K03j12j00L5q2J76K01k53K10k72J59j25lP9
7534B51J32j19k53M76J0m61K48Q3j71J10J70m59K55o1j84K82j8j33r3K56k32J08
7556A97l1L47k68k1K97j82l84M0L19l79J51O2k78L01k49K30l31J63J81k83K59
$$ plain form
7577 141 217 -131 -281 -119 -96 -297 61 -61 67 -250 -206 -9 -50 14 -2 -456 -251 71 -63 -150 -67 -250 -474
7600 -474 -380 -459 -94 -421 -6 -242 -208 -263 -600 -478 -141 -126 -360 -288 -418 -219 -389 -49 -118 -269 -347 -99 132
7623 132 -105 108 -153 -14 93 -78 142 -308 7 -61 -173 267 98 49 -92 -186 -83 66 430 91 97 221
7645 221 92 -178 14 185 52 -196 70 69 318 -80 459 301 169 760 39 71 220 128 247 266 63 172
7667 172 299 460 346 276 171 163 233 423 315 142 105 482 59 0 235 258 162 366 85 66 -45 69 394
7690 394 49 22 306 346 30 144 -52 182 371 53 -115 50 218 -37 -66 -10 -59 -80 28 -60 -166 -44
7712 -44 -149 -83 41 -198 -163 -204 -185 -145 -105 -168 -44 -239 -499 -144 -248 -255 -288 -251 -156 -210 -143 -303 -627 -246 -562
7737 -562 -286 -83 -384 -306 -437 57 -96 -323 38 -323 -363 39 -203 69 -191 -242 -116 9 -140 -314 -419
$$ packed form
7577A41P6l48j50J62K3k01L58j22J28l17M4J97m1O4j6m54K05L22j34q7Q3j83k24
7600d74R4p9L65l27M15k36L4n5l37J22L37J5k34P2j30J99j70L40o9j51p8K48K31
7623A32k37K13k61J39J07j71K20m50L15o8j12M40j69m9j41r4J03J49L64l39OJ24
7645B21j29k70J92J71j33k48K66jK49l98N39j58j32N91p21L2J49r2J19J9k03J09
7667A72J27J61j14p0j05qP0J90j08j73l7L77m23n9K35K3r6K04k81j9j11J14L25
7690C94l45k7K84M0l16J14j96K34J89l18j68J65J68k55k9N6m9k1J08q8j06J22
7712d4j05O6J24k39L5m1J9M0M0o3J24j95k60L55j04pl3L7R5n4O7j60l24L81l16
7737e62K76K03l01P8j31M94j53k27L61l61m0M02k42K72k60n1J26J25j49j74j05
$$ plain form
7758 -419 -156 -126 -63 94 -331 5 25 -116 -286 -395 192 -207 -2 168 236 -25 61 256 77 135 140 342 102
7781 102 39 171 151 2 260 32 -154 281 105 380 113 52 145 74 348 351 157 244 445 -26 138 383 491
7804 491 139 410 344 367 243 392 354 341 710 466 77 302 207 -142 266 101 126 145 103 294 -68 -123 -86
7827 -86 33 -182 155 238 76 -17 -323 27 -118 -145 324 13 44 -123 -102 -263 -131 -125 -1 -338 -151 52 -132
7850 -132 -106 -4 -77 -465 -224 -105 -147 -277 -233 269 -27 -82 157 -170 -271 -137 -18 -134 -251 -76 -107 -252
7872 -252 -307 -447 -337 80 -248 -382 -84 -1 -263 -415 -1 -310 -289 -230 -68 -225 -325 -61 77 -12 -46 -128
7894 -128 -187 157 -77 -63 -177 78 -14 41 38 18 123 334 284 -176 534 66 156 86 299 54 150 -231 187 165
7918 165 172 387 277 -38 215 235 182 224 315 69 56 250 217 258 274 383 295 280 422 357 124 504 172 51
$$ packed form
7758d19K63L0O3J57m25L36K0j41j70j09N87l99K05J70O8k61Q6J95j79N8NK02k40
7781A02o3J32k0j49K58k28j86M35j76K75k67o1R3p1K74Lj94Q7K01m71J64K45J08
7804D91l52K71o6K3j24J49l8j3L69k44l89K25r5l49M08j65K5J9m2J91l62n5L7
7827h6J19k15L37Q3j62r3l06L50j45k7M69l11L1j67K1j61J32OJ24l37J87K03j84
7850a32K6J02p3l88K41J19m2j30M4N02k96n5K39l27j01J34J19j16j17J75l1j45
7872b52n5j40J10M17l28j34K98Q3k62j52M14l09K1N9J62j57j00K64J38q9l4q2
7894a28n9L44k34J4j14K55r2N5lk0J05K11n0m60P10m68R0p0K13k45R6l81M18k2
7918A65PK15j10l15K53K0n3M2R1k46j3J94l3M1J6J09q8j5J42o5k33L80l32j21
$$ plain form
7942 51 255 87 394 263 684 229 366 257 169 98 -91 167 77 -67 24 213 62 267 -98 -145 -214 39
7964 39 -65 -85 128 -273 -164 252 -74 132 42 -146 -152 -150 -43 -42 -375 -377 20 -409 43 -109 -165 -348 -260 -309 -150
7989 -150 -159 -27 -138 -522 -56 -226 -246 -326 6 -364 -232 -483 -445 -265 -249 -396 -280 -126 -3 -178 -96 137
8011 137 -124 -149 -224 3 -105 -168 -121 -165 -122 201 -195 60 128 -197 152 41 -42 -283 -274 350 -126 -150 277 -80
8035 -80 138 32 73 128 92 75 195 318 276 271 60 56 265 248 193 232 60 266 290 -231 126 287 439 -25 81
8060 81 205 363 77 337 84 275 -115 -28 170 90 180 -30 -113 80 438 213 345 163 -53 -140 399 -8
8082 -8 304 -36 193 232 189 -139 73 45 60 127 20 64 158 -364 2 271 -52 34 52 156 -280 -192 -419 -50
8106 -50 -467 1 -48 -566 -116 -216 -278 -90 -188 -161 -261 -116 -312 -323 -66 -171 -186 -333 -45 -297 -221 71 91
$$ packed form
7942E1K04j68L07j31M21m55J37j09q8p1j89K58r0j44R1J89j51K05l65m7o9K53
7964C9j04k0K13m01J09M16l26K06r0j88oKJ07Jl33kL97m29M52j52n6j83Q8m9J59
7989a50rJ32j11l84M66j70k0q0L32l70J32k51L8J80J6j47J16J54J23j75Q2K33
8011A37k61k5p5K27j08o3M7m4M3L23l96K55O8l25L49j11q3k41RO24m76k4M27l57
8035h0K18j06M1N5l6j7J20J23m2nk11mK09j7n5L9j72K06K4n21L57J61J52m64J06
8060H1J24J58k86K60k53J91l90Q7J98q0R0k10q3J93L58k25J32j82k16q7N39m07
8082hL12l40K29L9m3l28K12k8J5O7j07M4R4n22L66K69l23Q6J8J04m36Q8k27L69
8106e0m17M68m9n18M50j00o2J88r8K7j00J45j96j1K57j05j5j47K88k52P6K92K0
$$ plain form
8129 91 -379 -100 -154 -443 122 -114 -112 -86 47 -224 -27 194 141 -242 -252 -46 -155 -201 -150 -41 -241 -129 -253
8152 -253 -178 53 59 68 -294 -218 72 -156 224 195 -106 -179 293 87 209 -95 -79 21 79 340 38 222 317 -96
8176 -96 71 164 245 81 169 368 171 251 152 234 34 75 109 -73 326
$$ packed form
8129I1m70K79n4k89N65k36KK6J33k71J97K21n3l83j0K06j09m6N1J09k00J12j24
8152b53P5K31ORl62P6K90k28L80k9l01p3M72k06J22l04J6J00N8K61l02J84R5m13
8176i6J67R3Q1j64Q8J99j97Q0r9Q2k00M1L4j82L99
8191C26
$$ Imaginary data points
##PAGE= N=2
##DATA TABLE= (X++(I..I)), XYDATA
$$ plain form
0 0 0 0 0 0 0 0 -8 8 -8 8 -16 16 -16 24 -32 32 -40 48 -56 68 -80 92 -106 124 -140 162 -186 210 -236 267
30 267 -302 334 -374 422 -468 522 -580 644 -714 792 -876 970 -1072 1190 -1318 1462 -1628
47 -1628 1817 -2034 2287 -2590 2957 -3414 3997 -4772 5862 -7503 10254 -15719 30791 -157965
61 -157965 -552193 -227887 174102 187822 -130975 -298314 -175160 64831 91575 -126243
71 -126243 -312032 -188954 60011 84174 -159663 -315407 -161975 96900 98991 -135716 -264316
82 -264316 -117901 73628 74820 -78687 -187259 -136341 8488 65981 -21014 -99948 -37478
93 -37478 68686 59850 -51366 -111435 -41619 57864 35807 -69439 -78422 35237 105123 50541
105 50541 -40200 -77508 -37043 43011 56518 -25903 -59323 32558 90451 4460 -86961 -48293
$$ packed form
0@%%%%%%qJ6j6J6k4L2l2M0n6O4p2Q8j04J24j48J72j98K30k64L02l48L96m46N03
30B67n69O36p08P96q90R90j102J224j358J506j668J846k042K262k508K780l090
47a628L445l851M321m877N547o371P411q769J0634j3365J7757k5973M6510j88756
61a57965l94228L24306M01989J3720l18797j67339J23154K39991K6744k17818
71a26243j85789J23078K48965K4163k43837j55744J53432K58875K091k34707j28600
82b64316J46415J91529J192j53507j08572N0918J44829N7493q6995p8934O2470
93c7478J06164q836j11216o0069O9816R9483k2057j05246q983J13659O9886n4582
105E0541r0741l7308M0465Q0054J3507q2421l3420R1881N7893q5991r1421L8668
$$ plain form
117 -48293 54294 95967 39214 -63172 -92830 6434 108751 67582 -52329 -69255 45613
128 45613 137485 84413 -40721 -71025 18495 89344 53980 -17920 -22937 56630 138015 103503
140 103503 -34564 -94378 17263 139505 106223 -13843 -55534 16257 108184 109593 12366
151 12366 -57808 -8769 73652 70466 4079 -34879 -10481 45612 58465 -7201 -56739 2536
163 2536 84154 59214 -28531 -64924 -37375 5372 28681 11402 -22321 -16726 18945 21097 -12530
176 -12530 -32308 -23274 -9702 -10000 -18356 -8677 21037 25229 -9075 -31953 -19997 -5571 -4482
189 -4482 -8402 -18234 -18444 1279 -1340 -38089 -39290 12376 36735 186 -39630 -45723 -25923 2147
203 2147 505 -42949 -60834 -12281 33996 15481 -34189 -56348 -36533 -3964 -8556 -48694 -53991
$$ packed form
117d8293J02587M1673n6753j02386k9658R9264J02317m1169j19911j6926J14868
128D5613R1872n3072j25134l0304Q9520P0849l5364p1900n017P9567Q1385l4512
140A03503j38067n9814J11641J22242l3282j20066m1691P1791R1927J409r7227
151A2366p0174M9039Q2421l186o6387l8958K4398N6093J2853o5666m9538N9275
163B536Q1618k4940q7745l6393K7549M2747K3309j7279l3723N595L5671K152l3627
176a2530j9778R034J3572k98q356R679K9714M192l4304k2878J1956J4426J089
189d482l920r832k10J9723k619l6749j201N1666K4359l6549l9816o093J9800K8070
203B147j642m3454j7885M8553M6277j8515m9670k2159J9815L2569m592m0138n297
$$ plain form
216 -53991 403 37911 10947 -34593 -49244 -28373 9973 20515 -21143 -55851 -26494 20899
228 20899 19557 -12289 -26635 -10074 17850 23225 -3202 -19369 -3096 9152 -617 -7803 -3726
241 -3726 7263 30373 40152 9370 -20978 -9017 7619 -3099 -3578 18222 28285 20781 13314
254 13314 5847 6032 19602 18758 -8141 -17361 6934 28890 25258 5046 -11906 -1643 30140
267 30140 32575 -2690 -15834 11566 28751 12390 -13189 -22690 2413 49570 54646 1244 -35890
280 -35890 -10797 26960 24409 -8918 -33102 -14130 36698 55574 15586 -21667 -10227 17962
292 17962 21657 -109 -25873 -18122 28142 48869 6560 -34463 -18037 21201 34172 17405
304 17405 -13287 -28328 -4048 24437 13641 -11726 -8904 10081 20067 15698 -1899 -16620 -8310
$$ packed form
216e3991N4394L7508k6964m5540j4651K0871L8346J0542m1658l4708K9357M7393
228B0899j342l1846j4346J6561K7924N375k6427j6167J6273J2248r769p186M077
241c726J0989K3110R779l0782l0348J1961J6636j0718m79K1800J0063p504p467
254A3314p467J85J3570q44k6899r220K4295K1956l632k0212j6952J0263L1783
267C0140K435l5265j3144K7400J7185j6361k5579r501K5103M7157N076n3402l7134
280c5890K5093L7757k551l3327k4184J8972N0828J8876l9988l7253J1440K8189
292A7962L695k1766k5764P751M6264K0727m2309m1023J6426L9238J2971j6767
304A7405l0692j5041K4280K8485j0796k5367K822J8985R986m369j7597j4721Q310
$$ plain form
317 -8310 1904 -12748 -25445 -8512 12025 16569 12909 -1216 -21166 -21172 -7533 -7910 -12868 -5440
331 -5440 -4084 -14254 -13272 -5582 -5907 -7784 -10698 -23549 -26296 -7700 516 -14118 -24760 -20096
345 -20096 -12498 -478 6204 -6248 -18438 -11264 -10072 -26667 -33465 -19729 -2913 10706 11230
358 11230 -12973 -30844 -12882 9715 1909 -20654 -29963 -21116 4293 23671 8222 -20515 -20573
371 -20573 -2287 2101 -4312 -10617 -13228 -1634 12361 -700 -23379 -13380 17564 27092 12151
384 12151 -9248 -22472 -10634 14998 14054 -10376 -14996 5398 22542 26582 15742 -6199 -13347
397 -13347 4936 13883 3470 3468 17308 23182 20127 14450 1957 -930 16093 26138 14038 3933
411 3933 5287 9732 21315 31605 22505 8031 13647 23892 22723 20222 16299 4658 2411 16468
$$ packed form
317h310J0214j4652j2697J6933K0537M544l660j4125j9950oJ3639l77m958P428
331e440J356j0170R82P690l25j877k914j2851k747J8596Q216j4634j0642M664
345b0096P598J2020O682j2452j2190P174J192j6595o798J3736J6816J3619N24
358A1230k4203j7871J7962K2597p806k2563r309Q847K5409J9378j5449k8737n8
371b0573J8286M388o413o305k611J1594J3995j3061k2679R999L0944R528j4941
384A2151k1399j3224J1838K5632r44k4430m620K0394J7144M040j0840k1941p148
397a3347J8283Q947j0413kJ3840N874l055n677j2493k887J7023J0045j2100j0105
411C933J354M445J1583J0290r100j4474N616J0245j169k501l923j1641k247J4057
$$ plain form
425 16468 22573 18734 23340 28447 19328 9906 4875 -2232 1931 19170 23062 10756 6750 10903
439 10903 9673 9813 8021 -4690 -13413 -5057 1559 -1362 133 -170 -10369 -12666 -4283 -3043 -5267
454 -5267 -3111 -10886 -26011 -24230 -13121 -13928 -15656 -8172 -5323 -11161 -15016 -21946 -28334 -19893 -10108
469 -10108 -17898 -25697 -16588 -4252 2011 -881 -19590 -38566 -26503 -2089 -3890 -20573 -22108
482 -22108 -12449 -6130 -3124 -11440 -23812 -14903 5193 1872 -18916 -26539 -17764 -3756 4059 -6090
496 -6090 -21405 -13035 9077 9353 -9692 -21460 -21876 -12547 3630 7576 -4024 -2475 13676 12847
510 12847 -3630 -10366 -7472 -948 11102 14620 1817 -3988 9475 19374 15716 9671 5212 4601
524 4601 14781 21451 13736 8193 12641 13170 13414 22458 25612 17161 17053 20260 8697 -233 10468
$$ packed form
425A6468O105l839M606N107r119r422n031p107M163J7239L892j2306m006M153
439A0903j230J40j792j2711q723Q356O616k921J495l03j0199k297Q383J240k224
454e267K156p775j5125J781J1109q07j728P484K849n838l855o930o388Q441R785
469a0108p790p799R109J2336O263k892j8709j8976J2063K4414j801j6683j535
482b2108R659O319L006q316j2372Q909K0096l321k0788p623Q775J4008P815j0149
496f090j5315Q370K2112K76j9045j1768m16R329J6177L946j1600J549J6151q29
510A2847j6477o736K894O524J2050L518j2803n805J3463R899l658o045m459o11
524D601J0180O670p715n543M448N29K44R044L154q451j08L207j1563q930J0701
$$ plain form
539 10468 20507 18082 19275 23962 20529 15415 14789 11117 7929 9009 7729 7100 14295 18268 13936
554 13936 12245 9601 -1750 -1656 15234 16604 -555 -4654 4267 4672 3235 6325 3046 -1377 5145
569 5145 8328 -4483 -15816 -13787 -5615 1146 597 -10047 -10966 4235 9023 -6124 -18036 -21027
583 -21027 -20916 -10387 2589 -5708 -21107 -14620 -1333 -8338 -20742 -20481 -16257 -11357 -6560 -12296
597 -12296 -23619 -21522 -8206 -1540 -5316 -16258 -23177 -12770 492 -7879 -24857 -23201 -12888
610 -12888 -8098 -1131 3414 -7485 -15749 -4478 -755 -15465 -20148 -6893 2690 1306 -2011 -7643
624 -7643 -8788 -1428 1625 -4446 -9080 -10193 -6626 4815 10632 -2695 -11884 -102 8283 1053
638 1053 1062 7507 1633 -7575 -2407 2306 -519 3719 12418 12588 7269 5757 5268 5292 5558 3793 6599
$$ packed form
539A0468J0039k425J193M687l433n114o26l672l188J080j280o29P195L973m332
554A3936j691k644j1351R4J6890J370j7159m099Q921M05j437L090l279m423O522
569E145L183j2811j1333K029Q172O761n49j0644r19J5201M788j5147j1912k991
583b1027J11J0529J2976q297j5399O487J3287p005j2404K61M224M900M797n736
597a2296j1323K097J3316O666l776j0942o919J0407J3262q371j6978J656J0313
610a2888M790O967M545j0899q264J1271L723j4710m683J3255R583j384l317n632
624g643j145P360L053o071m634j113L567J1441N817j3327r189J1782Q385p230
638A053RO445n874r208N168M713k825M238Q699J70n319j512m89K4K66j765K806
$$ plain form
655 6599 14738 14568 8505 15329 22228 11962 1343 6487 10601 10767 18833 22676 10642 4622 16576
670 16576 22674 16077 12272 13506 14088 16700 14339 5051 3446 12751 18231 15916 13513 8178 6582
685 6582 14899 15719 -663 -10177 1503 14511 16287 13319 4630 -5490 -2115 6873 840 -10268
699 -10268 -8179 632 3766 1470 -5863 -11632 -4668 2953 -3546 -13164 -13140 -10900 -8052 -3972 -11429
714 -11429 -24513 -19553 -3135 -3189 -12528 -13967 -16431 -23048 -20292 -14007 -17912 -18113 -8802 -5929 -11961
729 -11961 -14447 -16233 -20448 -18081 -13474 -15620 -16352 -11671 -8062 -5661 -1818 -7857 -18098 -13362 -280
744 -280 2026 -2354 -5645 -10339 -8401 4200 8519 -625 -2746 5670 7493 1732 -1930 -4366 -1476
759 -1476 9022 11683 3947 2870 11082 13653 9283 2951 -6294 -7556 6263 14722 7146 3415 8276
$$ packed form
655F599Q139j70o063O824O899j0266j0619N144M114J66Q066L843j2034o020J1954
670A6576O098o597l805J234N82K612k361r288j605R305N480k315k403n335j596
685F582Q317Q20j6382r514J1680J3008J776k968q689j0120L375Q988o033j1108
699a0268K089Q811L134k296p333n769O964P621o499r618K4K240K848M080p457
714a1429j3084M960J6418n4r339j439k464o617K756O285l905k01R311K873o032
729a1961k486j786m215K367M607k146p32M681L609K401L843o039j0241M736J3082
744b80K306m380l291m694J938J2601M319r144k121Q416J823n761l662k436K890
759a476J0498K661p736j077Q212K571m370o332r245j262J3819Q459p576l731M861
$$ plain form
774 8276 5380 -127 5053 7617 3038 2870 6602 3120 1283 7157 8617 3097 2958 7150 9554 8638
790 8638 3343 -903 3812 9137 3067 -369 10720 19577 16469 10896 3558 -5065 1555 18048 14928
805 14928 -1894 -1643 13829 19731 12822 2793 -3190 3362 15137 12159 -980 -2960 6537 13661
819 13661 13405 963 -12537 -3866 19391 18660 -6239 -18012 -7745 2615 7068 4810 -5744
832 -5744 -9224 4272 12369 -1259 -16670 -15031 -2828 4768 -1009 -13770 -10765 5040 7259 -7637
846 -7637 -17494 -15844 -8756 1942 5049 -10144 -21247 -7621 5072 -3654 -14217 -10848 -5318 -4471
860 -4471 -7187 -13644 -15766 -8096 -4341 -10705 -13214 -6811 -1778 -830 -5829 -17992 -20500 -6280 654
875 654 -9891 -13337 -1310 3891 -4182 -12934 -15551 -10479 1585 4095 -8630 -14379 -2282 9270
$$ packed form
774H276k896n507N180K564m579j68L732l482j837N874J460n520j39M192K404r16
790H638n295m246M715N325o070l436J1089Q857l108n573p338q623O620J6493l120
805A4928j6822K51J5472N902o909j0029n983O552J1775k978j3139j980R497P124
819A3661k56j2442j3500Q671K3257p31k4899j1773J0267J0360M453k258j0554
832e744l480J3496Q097j3628j5411J639J2203P596n777j2761L005J5805K219j4896
846g637r857J650P088J0698L107j5193j1103J3626J2693q726j0563L369N530Q47
860d471k716o457k122P670L755o364k509O403N033R48m999j2163k508J4220O934
875F54j0545l446J2027N201q073q752k617N072J2064K510j2725n749J2097J1552
$$ plain form
889 9270 6875 -4599 -13307 -6866 11708 14197 -5710 -15010 -657 11358 8101 -837 -6536 498
903 498 18394 22413 893 -15548 -3537 15598 18023 6677 -3717 1023 19652 25745 5794
916 5794 -10689 -2952 13264 17683 11158 1343 988 16617 25254 9344 -6895 763 17052 20017
930 20017 11089 -234 -3473 8496 19623 11612 158 4161 13674 14471 9007 890 -3053 5751
944 5751 14135 7285 -406 6889 14757 9767 2025 -2705 -4005 1670 7720 2683 -3456 3432 9743
959 9743 4158 -3716 -5519 -3350 3321 5211 -5417 -12175 -2694 5341 -2174 -10412 -9455 -4109 2195
974 2195 2317 -9782 -19339 -10630 1206 -3664 -13564 -13152 -4867 3599 1853 -14589 -25793 -14252
988 -14252 95 -3876 -13566 -15640 -10382 -1739 2001 -9866 -22070 -14111 586 -1325 -12038 -14510
$$ packed form
889I270k395j1474q708O441J8574K489j9907r300J4353J2015l257q938n699P034
903D98J7896M019k1520j6441J2011J9135K425j1346j0394M740J8629O093j9951
916E794j6483P737J6216M419o525r815l55J5629Q637j5910j6239P658J6289K965
930B0017q928j1323l239J1969J1127q011j1454M003R513P97n464q117l943Q804
944E751Q384o850p691P295P868m990p742m730j300N675O050n037o139O888O311
959I743n585p874j803K169O671J890j0628o758R481Q035p515q238R57N346O304
974B195J22j2099r557Q709J1836m870r900M12Q285Q466j746j6442j1204J1541
988a4252J4347l971r690k074N258Q643L740j1867j2204P959J4697j911j0713k472
$$ plain form
1002 -14510 -10221 -3042 -91 -8921 -17680 -9046 3929 1430 -8220 -12354 -11570 -5789 1894 24 -7703
1017 -7703 -3027 6399 2400 -6079 -6967 -4813 -2387 1565 57 -3045 2075 9244 4257 -2979 -998
1032 -998 1263 2635 5655 4949 1590 5185 9616 4118 -1620 5359 11927 10565 6936 2844 1239
1047 1239 8481 14333 7428 912 7914 17033 17108 12356 5693 1079 7479 15021 9045 1904 8871
1062 8871 19299 17966 9691 1965 102 9742 18882 11741 221 3583 12783 14125 8601 1793
1076 1793 -1563 5845 14568 7926 -3509 -1774 6066 5114 511 -2709 -2926 4607 11838 4102 -9653
1091 -9653 -9344 -1721 -1318 -4277 -5646 -6521 -2331 1577 -4022 -12812 -10393 -4149 -7159 -11514 -9967 -6660
1107 -6660 -2734 -1530 -10639 -19263 -12204 -2177 -5276 -12485 -12356 -9620 -7872 -6881 -12442 -16289 -7301
$$ packed form
1002a4510M289P179K951q830q759Q634J2975k499r650m134P84N781P683j870p727
1017g703M676R426l999q479q88K154K426L952j508l102N120P169m987p236J981
1032i98K261J372L020p06l359L595M431n498n738O979O568j362l629m092j605
1047A239P242N852o905o516P002R119P5m752o663m614O400P542n976p141O967
1062H871J0428j333q275p726j863R640R140p141j1520L362R200J342n524o808
1076A793l356P408Q723o642j1435J735P840r52m603l220k17P533P231p736j3755
1091i653L09P623M03k959j369q75M190L908n599q790K419O244l010m355J547L307
1107f660L926J204r109q624P059J0027l099p209J29K736J748R91n561l847Q988
$$ plain form
1122 -7301 1861 -3476 -13411 -13241 -7792 -3624 -4243 -12545 -17341 -4951 7699 1582 -11244 -12842 -7901
1137 -7901 -2623 -39 -5290 -10573 -1941 9728 4504 -8394 -9407 -2348 4125 5352 -2014 -8926
1151 -8926 -1884 9681 6792 -3943 -5817 -535 6852 11290 5749 -4428 -2029 7746 6389 -329
1165 -329 921 6173 9480 11752 7164 -2013 -815 8839 9002 3635 4488 8941 11199 13085 10568 2928
1181 2928 3243 10879 10711 5618 7326 11077 9464 9383 8291 3493 5588 13514 13099 5086 4252 7675
1197 7675 7196 5640 4447 2772 6210 12043 8822 854 195 2318 1193 509 -402 -2747 2122 10104
1213 10104 5645 -5552 -5912 -518 -659 -2179 -2779 -5389 -3641 2174 225 -9044 -9341 -2597 -988
1228 -988 -2379 -4133 -7922 -7811 -1667 -2905 -10928 -9897 -2547 -1251 -3016 -4196 -8892 -12079 -7519
$$ packed form
1122g301R162n337r935J70N449M168o19q302m796J2390J2650o117j2826j598M941
1137g901N278K584n251n283Q632J1669n224j2898j013P059O473J227p366o912
1151h926P042J1565k889j0735j874N282P387M438n541j0177K399R775j357o718
1165c29J250N252L307K272m588r177J198R654J63n367Q53M453K258J886k517p640
1181B928L15P636j68n093J708L751j613q1j092m798K095P926m15q013q34L423
1197G675m79j556j193j675L438N833l221p968o59K123j125o84r11k345M869P982
1213A0104m459j1197l60N394j41j520o00k610J748N815j949r269k97O744J609
1228i88j391j754l789J11O144j238q023J031P350J296j765j180m696l187M560
$$ plain form
1243 -7519 -5117 -9539 -9660 -4313 -2883 -4112 -4789 -8667 -11387 -7555 -5353 -7556 -6541 -4377 -6446
1258 -6446 -7370 -4199 -6909 -10373 -6854 -3031 -4756 -4490 -2889 -7008 -8510 -2412 -1222 -4690 -2963
1273 -2963 558 -711 -683 -1502 -7031 -8043 39 4932 946 201 2712 1996 1935 2935 -1032 -3136 3240
1290 3240 7898 4527 3370 4876 4180 3940 4159 1139 1225 8556 10665 4692 2688 4576 4971 6953
1306 6953 9840 6807 4379 8911 10970 5654 3204 5663 6125 7394 9678 8430 7513 11813 10829 2167
1322 2167 1547 7813 8850 8584 10621 7351 3695 7899 10063 2958 -773 5338 8585 6012 3732
1337 3732 1921 1535 5181 5368 -527 -2600 2395 4732 2687 -500 -5919 -8175 -878 3502 -3704
1352 -3704 -7612 -1671 279 -4423 -7432 -9298 -9749 -4736 -496 -5817 -9605 -6790 -4197 -5451 -7976
$$ packed form
1243g519K402m422j21N347J430j229o77l878k720L832K202k203J015K164k069
1258f446r24L171k710l464L519L823j725K66J601m119j502O098J190l468J727
1273b963L521j269K8q19n529j012Q082M893l986p45K511p16o1J000l967k104O376
1290C240M658l371j157J506o96k40K19l020Q6P331K109n973k004J888L95J982
1306F953K887l033k428M532K059n316k450K459M62J269K284j248r17M300r84q662
1322B167o20O266J037k66K037l270l656M204K164p105l731O111L247k573k280
1337C732j811l86L646J87n895k073M995K337k045l187n419k256P297M380p206
1352c704l908N941J950m702l009j866m51N013M240n321l788K815K593j254k525
$$ plain form
1367 -7976 -12263 -13705 -6170 -956 -7160 -11537 -7161 -6195 -9026 -7585 -5848 -8507 -6399 -2227 -6299
1382 -6299 -11788 -8282 -3556 -4503 -5311 -4922 -5362 -3077 -2223 -5694 -7854 -4144 -3034 -4061 -491 2182
1398 2182 -1130 -1906 -141 -4213 -6600 345 3833 -1023 -2277 1566 1792 834 1432 -72 -437 3298
1414 3298 4381 1603 2111 3096 1013 2245 5056 2287 1266 7748 8831 1011 -1412 3857 4023 2709
1430 2709 6265 7021 4604 6160 8289 4854 2647 3297 3820 5362 7471 6277 5023 7874 7372 2066
1446 2066 3312 8599 6748 3824 6719 8066 4077 4038 6463 4201 4300 7655 7739 4464 3208 2859 2523
1463 2523 4677 3892 119 3437 9272 6183 394 783 1498 -839 900 2671 -1854 -3234 3556 4802
1479 4802 -2645 -6012 -3719 -1401 707 -798 -6310 -6167 -240 -342 -5903 -7616 -5919 -4710 -1549
$$ packed form
1367g976m287j442P535N214o204m377M376R66k831J441J737k659K108M172m072
1382f299n489L506M726r47q08L89m40K285Q54l471k160L710J110j027L570K673
1398B182l312p76J765m072k387O945L488m856j254L843K26r58N98j504l65L735
1414C298J083k778N08R85k083J232K811k769j021O482J083p820k423N269J66j314
1430B709L556P56k417J556K129l435k207O50N23J542K109j194j254K851n02n306
1446B066J246N287j851k924K895J347l989l9K425k262R9L355Q4l275j256l49l36
1463B523K154p85l773L318N835l089n789L89P15k337J739J771m525j380O790J246
1479D802p447l367K293K318K108j505n512J43N927j02n561j713J697J209L161
$$ plain form
1494 -1549 -1358 -9406 -12374 -4630 -2176 -8081 -10742 -6755 -3749 -1980 -3912 -10314 -12256 -6047 -3434
1509 -3434 -7274 -8527 -6721 -5406 -3130 -3498 -10352 -11682 -3882 -1341 -6938 -8369 -3934 -3121 -3018 -3116
1525 -3116 -6587 -7488 -977 1837 -4109 -6383 -2926 -908 -1082 -1782 -4279 -2782 4194 5664 -1455 -3741
1541 -3741 357 1994 1797 2018 -404 -67 6999 8952 609 -2803 2773 5901 5096 3695 1549 3070
1557 3070 8865 9769 2801 -441 5059 8852 8682 6777 2216 816 8099 11594 4442 517 6066
1572 6066 10157 8825 7485 3948 1761 6370 9916 4988 1391 5153 8882 9053 6903 1903 -1434
1587 -1434 4322 8906 4106 62 3786 5365 4297 3764 1566 -1323 2049 6225 2545 -2462 -935
1602 -935 2060 1446 531 -1704 -3452 600 3671 -944 -5475 -3442 -1380 -2996 -2637 -2036 -4261 -2316
$$ packed form
1494a549J91q048k968P744K454n905k661L987L006J769j932o402j942O209K613
1509c434l840j253J806J315K276l68o854j330P800K541n597j431M435Q13J03r8
1525c116l471r01O511K814n946k274L457K018j74p00k497J497O976J470p119k286
1541c741M098J637j97K21k422L37P066J953q343l412N576L128q05j401k146J521
1557C070N795R04o968l242N500L793j70j905m561j400P283L495p152l925N549
1572F066M091j332j340l537k187M609L546m928l597L762L729J71k150n000l337
1587a434N756M584m800m044L724J579j068n33k198k889L372M176l680n007J527
1602i35K995o14r15k235j748M052L071m615m531K033K062j616L59O01k225J945
$$ plain form
1618 -2316 894 -3747 -8958 -6042 -2783 -4574 -6257 -6221 -6561 -3603 -988 -5466 -10256 -7184 -3316 -4994
1634 -4994 -5764 -6217 -7833 -5727 -2303 -6248 -10690 -6054 -1278 -3194 -5933 -7154 -8518 -5791 -1457
1649 -1457 -3377 -7686 -4824 -452 -1080 -2993 -4620 -7186 -4954 132 -991 -5686 -2996 1372 237
1664 237 -1083 -1290 -3995 -2473 2932 2611 -2336 -2020 1911 2018 1748 2616 121 349 5124 5370 835
1681 835 943 3109 2740 3655 6135 4681 3875 8043 7574 2674 2057 4736 4747 4873 7333 6287 4282
1698 4282 7010 8109 4783 4570 6076 5324 5724 7585 6113 4065 6851 7199 3979 4332 7029 5648
1714 5648 3890 5560 4216 1120 3579 5801 3476 3179 5192 3824 2254 2873 686 -1941 601
1729 601 2298 -331 -506 2122 728 -1204 -288 -2231 -4653 -1797 976 -2205 -4671 -2389 -2479 -3627
$$ packed form
1618b316L210m641n211K916L259j791j683L6l40K958K615m478m790L072L868j678
1634d994p70m53j616K106L424l945m442M636M776j916k739j221j364K727M334
1649a457j920m309K862M372o28j913j627k566K232N086j123m695K690M368j135
1664B37j320k07k705J522N405l21m947L16L931J07k70Q68k495K28M775K46m535
1681H35J08K166l69R15K480j454q06M168m69m900o17K679J1J26K460j046k005
1698D282K728J099l326k13J506p52M00J861j472k048K786L48l220L53K697j381
1714E648j758J670j344l096K459K222k325k97K013j368j570O19k187k627K542
1729F01J697k629j75K628j394j932R16j943k422K856K773l181k466K282r0j148
$$ plain form
1745 -3627 -2964 -3910 -6242 -4042 -1450 -4718 -7713 -6464 -5836 -5382 -3460 -4440 -7245 -5040 -2475 -5382
1761 -5382 -8830 -6938 -6270 -6360 -3935 -4311 -7182 -6042 -2671 -4931 -7627 -6502 -4949 -4777 -2374 -2684
1777 -2684 -6152 -4722 -1572 -2876 -4958 -3023 -2399 -3357 -1293 -1128 -4394 -3781 644 -73 -2291 172
1793 172 1453 -517 52 439 -1582 -1250 2500 2115 580 2534 3542 1016 991 1754 787 2093 4691
1810 4691 3493 1419 4388 6136 3433 2857 4397 3202 4011 6475 4578 2158 4412 6379 4321
1825 4321 3573 5548 5853 6294 7370 4809 1649 4578 7198 4828 4275 6344 5319 5257 6867 4278
1841 4278 601 3202 6460 4073 3108 5132 4992 4107 4789 3317 349 2234 5297 2477 761 1561
1857 1561 1170 975 2217 932 -1541 1103 3109 -371 -2784 -881 -1072 -2139 -978 -1619 -4061 -1358
$$ packed form
1745c627O63r46k332K200K592l268k995J249O28M54J922r80k805K205K565k907
1761e382l448J892O68r0K425l76k871J140L371k260k696J125J553J72K403l10
1777b684l468J430L150j304k082J935O24r58K064J65l266O13M425p17k218K463
1793A72J281j970N69L87k021L32L750l85j535J954J008k526k5P63r67J306K598
1810D691j198k074K969J748k703n76J540j195Q09K464j897k420K254J967k058
1825D321p48J975L05M41J076k561l160K929K620k370n53K069j025o2J610k589
1841D278l677K601L258k387r65K024j40q85O82j472k968J885L063k820j716Q00
1857A561l91j95J242j285k473K644K006l480k413J903j91j067J161o41k442K703
$$ plain form
1873 -1358 1620 -2287 -6916 -5308 -3605 -4028 -3369 -4061 -5640 -3347 -854 -4649 -7964 -6045 -4248 -4613
1889 -4613 -4593 -6235 -7999 -4367 -1155 -5845 -9944 -7063 -3018 -3190 -4276 -6783 -9396 -5830 -1085 -3521
1905 -3521 -8386 -5873 -1767 -976 -2868 -6152 -8161 -4200 642 -2444 -6802 -3625 1143 1731 88
1920 88 -3745 -6451 -1971 4900 1673 -4940 -3279 2463 3321 1242 -1162 -2396 964 6541 3462 -2455
1936 -2455 -1865 3251 5263 3307 899 -523 4415 9425 5774 -1756 163 5495 5909 4420 2990
1951 2990 2255 5121 10068 7712 175 621 6602 8568 5631 2968 2425 6257 10096 6665 547 2414
1967 2414 7421 8041 5331 3191 1612 3943 9043 6758 -756 799 8160 8506 3407 130 -422 1867
1983 1867 5927 3827 -1929 -2177 3861 5461 1553 -2234 -4074 -887 4062 1313 -5023 -4236 1451
$$ packed form
1873a358K978l907m629J608J703m23O59o92j579K293K493l795l315J919J797l65
1889d613K0j642j764L632L212m690m099K881M045j72j086k507k613L566M745k436
1905c521m865K513M106P91j892l284k009L961M842l086m358L177M768N88j643
1920H8l833k706M480O871l227o613J661N742Q58k079k404j234L360N577l079n917
1936b455N90N116K012j956k408j422M938N010l651p530J919N332M14j489j430
1951B990p35K866M947k356p537M46N981J966k937k663n43L832L839l431o118J867
1967B414N007O20k710k140j579K331N100k285p514J555P361L46n099l277n52K289
1983A867M060k100n756k48O038J600l908l787j840L187M949k749o336P87N687
$$ plain form
1998 1451 1858 -2424 -5167 -5978 -3420 1280 -133 -7694 -8918 -2221 172 -3694 -7001 -7201 -4213 421
2014 421 -1674 -8331 -9298 -4351 -2322 -4266 -5976 -6908 -5211 -238 -908 -8838 -9952 -2721 -533 -4361
2030 -4361 -6150 -5407 -3615 -651 -1239 -6360 -8368 -3247 414 -1865 -4058 -5340 -3632 135 282 -4996
2046 -4996 -5323 703 2395 -1504 -2517 -2539 -1691 1141 2677 -1580 -3254 2029 5344 2214 -1103 -1367
2062 -1367 -326 3613 4447 414 209 4842 5843 2314 1522 2241 2243 4669 5878 2435 97 4801 7423
2079 7423 4279 1731 2685 4260 6315 7131 3360 873 4013 5781 4079 3714 4254 4295 5262 6310 2697
2096 2697 174 3733 6316 3511 1863 3480 4119 4769 5065 2049 -483 2107 3975 2550 1732 2350
2112 2350 1415 1386 2921 513 -1532 1191 3378 220 -1443 -158 -766 -1486 -126 -388 -2245 -1250 300
$$ packed form
1998A451M07m282k743q11K558M700j413p561j224O697K393l866l307k00K988M634
2014D21k095o657r67M947K029j944j710r32J697M973o70p930j114P231K188l828
2030d361j789P43J792K964n88n121k008N121L661k279k193j282J708L767J47n278
2046d996l27O026J692l899j013k2Q48K832J536m257j674N283L315l130l317k64
2062a367J041L939Q34m033k05M633J001l529p92P19KK426J209l443k338M704K622
2079G423l144k548R54J575K055Q16l771k487L140J768j702l65N40M1R67J048l613
2096B697k523L559K583k805j648J617O39O50K96l016k532K590J868j425q18O18
2112B350r35k9J535k408k045K723K187l158j663J285o08p20J360k62j857R95J550
$$ plain form
2129 300 -1746 -3199 -2710 -3290 -3915 -2428 -2778 -3997 -2120 -1344 -4753 -5583 -3151 -3948 -5719 -3776 -3542
2146 -3542 -5561 -5244 -3284 -4609 -5785 -3875 -4200 -5592 -4228 -4140 -5177 -4430 -4118 -5635 -4591 -1898
2162 -1898 -2941 -4840 -3243 -2610 -5297 -4915 -2328 -3298 -3783 -735 -468 -3033 -2398 -509 -1346 -1989 -1584
2179 -1584 -1832 -547 1440 430 -1494 58 924 -150 796 2302 367 -339 3035 3065 -623 761
2195 761 4463 4140 2295 2644 2999 2543 3620 3098 1243 2105 4271 4744 5198 5251 2541 2466 5823 5183
2213 5183 1694 2460 6386 5716 3751 4439 4245 2483 4434 5545 3360 2464 4077 5122 4378 3494 1700
2230 1700 2038 5762 5922 1759 1910 4095 3029 1281 2193 1466 -108 2781 4834 1297 -1297 992
2246 992 2048 560 -606 -1270 -444 1902 1864 -1896 -3077 -1163 -1026 -2057 -1534 -2480 -4025 -1231 425
$$ packed form
2129C00k046j453M89n80o25J487l50j219J877P76l409q30K432p97j771J943K34
2146c542k019L17J960j325j176J910l25j392J364Q8j037P47L12j517J044K693
2162a898j043j899J597O33k687L82K587r70m85L048K67k565O35J889q37o43M05
2179a584k48J285J987j010j924J552Q66j074R46J506j935p06L374L0l688J384
2195G61L702l23j845L49L55m56J077n22j855Q62K166M73M54N3k710p5L357o40
2213E183l489P66L926o70j965O88j94j762J951J111k185q96J613J045p44q84j794
2230A700L38L724J60m163J51K185j066j748R12p27j574K889K053l537k594K289
2246I92J056j488j166o64Q26K346l8l760j181J914J37j031N23r46j545K794J656
$$ plain form
2263 425 -3546 -5834 -3088 -1353 -3054 -3629 -3600 -4390 -3204 -2474 -4919 -5983 -3648 -2601 -3242 -3618 -4842
2280 -4842 -5981 -3970 -2311 -5641 -7001 -3577 -1861 -3795 -3663 -4286 -5437 -4262 -1921 -3678 -5580
2295 -5580 -3349 -1577 -2322 -3059 -3371 -4016 -2157 16 -1977 -3579 -1588 -517 -1486 -1272 -1017 -2511 -266
2312 -266 2643 943 -2143 -708 1159 540 993 1218 213 1221 4132 3129 583 1176 2223 1707
2328 1707 2630 3241 1446 2047 5287 4287 1251 2384 4280 4047 3939 4441 2578 2448 5300 5150 2416
2345 2416 2911 4574 4553 5605 5520 2788 2016 4464 4869 2476 3674 5384 4808 4489 4795 2543 1623 4109
2363 4109 4442 1653 1580 3226 3144 3041 2532 -165 -554 2617 3327 248 -478 251 -481 -411 -4 -1452 -2334
2382 -2334 -14 1317 -2502 -3607 -2547 -2389 -2121 -2022 -3979 -4542 -1294 -236 -3394 -5190 -4390 -3944 -3303
$$ packed form
2263D25l971k288K746J735j701n75K9p90J186P30k445j064K335J047o41l76j224
2280d842j139K011J659l330j360L424J716j934J32o23j151J175K341j757j902
2295e580K231J772p45p37l12o45J859K173j993j602J991J071r69K14K55j494K245
2312b66K909j700l086J435J867o19M53K25j005J008K911j003k546N93J047n16
2328A707R23O11j795O01L240j000l036J133J896k33j08N02j863j30K852j50k734
2345B416M95J663k1J052q5k732p72K448M05k393J198J710n76l19L06k252r20K486
2363D109L33k789p3J646q2j03n09k697l89L171P10l079p26P29p32P0M07j448q82
2382b334K320J331l819j105J060J58K68R9j957n63L248J058l158j796Q00M46O41
$$ plain form
2399 -3303 -2269 -4421 -5676 -2870 -1037 -4220 -6295 -4610 -3319 -2880 -2695 -4226 -5804 -3760 -1105
2414 -1105 -3465 -5281 -3905 -3105 -2512 -1753 -3709 -5922 -3831 -1185 -3154 -4634 -2430 -1386 -1142 -734
2430 -734 -2581 -4756 -2662 529 -823 -2415 -1394 -323 -259 761 -414 -2381 -377 2374 913 -605
2446 -605 1177 1831 1187 2321 1696 236 1986 5013 3602 524 1452 2623 2522 3566 3415 1607 3076
2463 3076 5343 4075 2145 2552 3156 3079 3888 3790 2068 3706 6161 4385 1413 2776 3966 3706 4239
2480 4239 3914 1874 2704 4937 4210 1750 2060 3787 3464 3951 3317 1279 1461 3592 2664 477 2011
2497 2011 2991 2007 2761 2227 -187 -277 2430 1955 -644 -84 1405 288 33 4 -1828 -1991 -80 -178
2515 -178 -2236 -1600 -1474 -2032 -1934 -1749 -3573 -3591 -1800 -1960 -4215 -3358 -2557 -4211 -4309 -2892 -3955 -4545 -2905
$$ packed form
2399c303J034k152j255K806J833l183k075J685J291M39J85j531j578K044K655
2414a105k360j816J376Q00N93P59j956k213K091K646j969j480K204J044K44M08
2430g34j847k175K094L191j352j592J021J071O4J020j175j967K004K751j461j518
2446f05J782O54o44J134o25j460J750L027j411l078R28J171j01J044j51j808J469
2463C076K267j268j930M07O04p7Q09r8j722J638K455j776k972J363J190k60N33
2480D239l25k040Q30K233p27k460L10J727l23M87o34k038J82K131r28k187J534
2497B011R80r84P54n34k414r0K707m75k599N60J489j117k55k9j832j63J911r8
2515a78k058O36J26n58R8J85j824j8J791j60k255Q57Q01j654r8J417j063n90J640
$$ plain form
2534 -2905 -2724 -5076 -4694 -3112 -4349 -4382 -2948 -3470 -3927 -2578 -2906 -4773 -4125 -2803 -4401 -4251 -2198
2551 -2198 -2471 -3665 -2132 -1760 -3502 -2615 -1062 -2202 -3063 -1572 -1264 -2112 -1544 -950 -2276 -1183 577
2568 577 -742 -1115 232 78 -945 400 695 38 1425 2965 1166 23 2103 2291 599 1532 2661
2585 2661 1655 2192 4770 2869 1488 3313 3680 2720 3203 3884 3182 3375 4723 3096 2071 4014 4484
2602 4484 3073 3526 4514 3365 2965 4287 2945 1597 3333 5072 3426 3444 3695 2601 2406 3310 2464
2619 2464 1110 2795 3706 2438 1737 2163 1134 1299 2837 1460 -192 1124 2474 564 176 644
2635 644 -558 -772 1025 757 -1887 -947 35 -1447 -2588 -1379 -1780 -2066 -438 -807 -3351 -3251 -1706
2652 -1706 -2459 -3399 -3346 -3757 -3351 -1617 -1973 -4441 -4256 -2720 -3589 -3843 -2875 -3997 -4483 -2542 -2400 -5054
$$ packed form
2534b905J81k352L82J582j237l3J434n22m57J349l28j867O48J322j598J50K053
2551b198k73j194J533L72j742Q87J553j140q61J491L08q48N68N94j326J093J760
2568E77j319l73J347j54j023J345K95o57J387J540j799j143K080J88j692R33J129
2585B661j006N37K578j901j381J825L67r60M83O81p02J93J348j627j025J943M70
2602D484j411M53R88j149m00J322j342j348J736J739j646J8K51j094j95R04q46
2619B464j354J685R11j268p01M26j029J65J538j377j652J316J350j910l88M68
2635F44j202k14J797k68k644R40R82j482j141J209m01k86J628l69k544J00J545
2652a706p53r40N3m11M06J734l56k468J85J536q69k54R68j122m86J941J42k654
$$ plain form
2670 -5054 -4626 -2282 -2751 -3441 -3098 -3784 -3936 -2063 -1978 -4269 -3928 -2136 -1707 -1861 -1112 -2635 -3532 -1124
2688 -1124 -564 -2802 -2675 55 29 -1313 -609 -617 -1796 -130 1178 -641 -1312 453 1274 829 903 78
2706 78 32 2323 2896 868 512 2337 1919 1321 2554 1920 761 2768 5154 2756 1090 3081 3677
2723 3677 2747 2591 3189 2177 3515 4814 2808 2046 3451 3866 3398 4002 3291 2073 4059 5958 3021
2740 3021 911 3027 4190 3182 2988 3055 1538 2000 4101 2961 635 1793 2867 2601 2111 1161 -36
2757 -36 1591 2773 544 -1129 863 1847 591 539 -341 -1963 -1054 1762 22 -3378 -1786 240 -949
2774 -949 -1512 -1843 -3022 -2198 -510 -1426 -4161 -2841 -2279 -2559 -2718 -2982 -4560 -3211 -699 -2272 -5286
2791 -5286 -3838 -1550 -2736 -3752 -3180 -4001 -3795 -1407 -2102 -4990 -4694 -2918 -2518 -2799 -2919 -4385 -3062
$$ packed form
2670e054M28K344m69o90L43o86j52J873Q5k291L41J792M29j54P49j523q97K408
2688a124N60k238J27K730k6j342P04qj179J666J308j819o71J765Q21m45P4q25
2706G8m6K291N73k028l56J825m18n98J233o34j159K007K386k398j666J991N96
2723C677r30j56N98j012J338J299k006p62J405M15m68O04p11j218J986J899k937
2740C021k110K116J163j008j94O7j517M62K101j140k326J158J074k66m90r50j197
2757c6J627J182k229j673J992R84j256n2q80j622R09K816j740l400J592K026j189
2774i49n63l31j179Q24J688r16k735J320N62k80j59k64j578J349K512j573l014
2791e286J448K288j186j016N72q21K06K388o95k888K96J776M00k81j20j466J323
$$ plain form
2808 -3062 -369 -1912 -4750 -3256 -760 -1975 -2505 -1999 -2623 -2483 133 -74 -3036 -2745 62 478 -557
2825 -557 -1251 -1837 -839 1709 821 -1282 -137 1993 1304 829 997 220 263 2590 2776 -230 474 3595
2843 3595 3511 2224 1825 1307 2264 4242 3859 1302 1414 3755 3600 2683 3155 2603 2446 4472 4605 1784
2861 1784 1444 4275 4313 2425 2830 2782 2856 4310 4330 1521 1059 3296 3518 2223 2558 1986 1748 3369 3533
2880 3533 13 22 2917 2636 1188 971 1243 879 1918 2060 -46 -993 1273 1624 124 -240 -537 -843
2898 -843 -78 462 -1923 -2107 132 271 -1827 -2170 -1996 -2567 -1737 -741 -3156 -4224 -1531 -1200 -3015 -3565
2916 -3565 -2905 -3227 -2474 -2212 -3733 -4364 -2215 -2165 -3653 -3685 -3522 -3505 -2620 -1920 -3784 -4767 -2586 -1841 -3291
2935 -3291 -3726 -2368 -2946 -2487 -1375 -2502 -4034 -2041 -1210 -2056 -2201 -1627 -1633 -1072 -101 -1824 -2933 -217
$$ packed form
2808c062K693j543k838J494K496j215n30N06o24J40K616k07k962K91K807M16j035
2825e57o94n86R98K548q88k103J145K130o89m75J68p77M3K327J86l006P04L121
2843C595q4j287l99n18R57J978l83k557J12K341j55r17M72n52j57K026J33k821
2861A784l40K831L8j888M05m8P4J454K0k809m62K237K22j295L35n72k38J621J64
2880C533l520RK895k81j448k17K72l64J039J42k106r47K266L51j500l64k97l06
2898h43P65N40k385j84K239J39k098l43J74n71Q30R96k415j068K693L31j815n50
2916c565O60l22P53K62j521o31K149N0j488l2J63J7Q85P00j864r83K181P45j450
2935c291m35J358n78M59J112j127j532J993Q31q46j45N74oN61R71j723j109K716
$$ plain form
2953 -217 748 -1504 -789 412 -214 -501 978 370 -1159 535 2031 356 -53 1101 1476 1476 1571 763
2971 763 687 2788 3230 1460 1659 2906 1519 1653 3233 2731 993 3214 4185 2627 1606 3093 3433
2988 3433 2851 3619 3199 2661 3229 4165 2379 2208 3208 2769 2599 3592 3408 1746 2548 3768 1738 1191
3006 1191 3063 3055 1309 2081 2385 1135 846 1818 832 224 1293 1225 406 747 753 -886 -47 914 -927
3025 -927 -1357 322 -12 -1576 -851 -858 -1994 -1611 -314 -1630 -2841 -1470 -870 -2581 -2361 -2079 -2747 -2446
3043 -2446 -1354 -2778 -3483 -2010 -2004 -3607 -3043 -2439 -3112 -2974 -1732 -3065 -4167 -2583 -2068 -3632 -3372
3060 -3372 -1977 -2665 -2548 -1787 -2455 -3641 -2134 -1472 -2668 -2245 -1715 -2243 -1988 -923 -1797 -2601 -1250 -252
3078 -252 -1459 -1838 -167 -966 -1274 100 -330 -1265 -123 1314 -178 -349 602 83 247 1165 755 -268
$$ packed form
2953b17R65k252P15J201o26k87J479o08j529J694J496j675m09J154L75%R5q08
2971G63p6K101M42j770J99J247j387J34J580n02j738K221R71j558j021J487L40
2988C433n82P68m20n38N68R36j786j71J000m39j70R93j84j662Q02J220k030n47
3006A191J872qj746P72L04j250k89R72r86o08J069o8q19L41Oj639Q39R61j841
3025i27m30J679l34j564P25pj136L83J297j316j211J371O00j711K20K82o68L01
3043b446J092j424p05J473Oj603N64O04o73J38J242j333j102J584N15j564K60
3060c372J395o88J17P61o68j186J507O62j196M23N30n28K55J065q74q04J351R98
3078b52j207l79J671p99l08J374m30r35J142J437j492j71R51n19J64R18m10j023
$$ plain form
3096 -268 1469 2662 1383 805 1716 1634 1676 2318 1963 871 2416 3515 2186 1325 2525 2649 2322 3733
3114 3733 2537 1712 2815 4116 2598 1735 3434 3214 2646 3220 3062 1364 2403 3865 2519 1377
3130 1377 2215 2436 2235 3025 2688 734 1235 2998 1960 848 1844 1766 715 1414 1512 11 -9 2106
3148 2106 1088 -353 -142 457 -140 206 -39 -1715 -1122 487 -13 -1589 -996 -868 -1376 -1026 -735 -2731
3166 -2731 -2275 -142 -1288 -2511 -2280 -1790 -2324 -1840 -1568 -3334 -3571 -1205 -1728 -3651 -3159 -2653 -2999 -2486
3184 -2486 -1843 -3641 -3558 -1603 -2157 -3838 -3531 -2529 -2919 -1985 -1489 -3046 -3366 -1772 -1452 -3137 -2523 -1863
3202 -1863 -1892 -1400 -837 -1955 -2315 -173 -273 -1749 -1402 -542 -274 70 657 -823 -1769 644 1733 -204
3220 -204 -223 905 386 1189 1902 764 -167 1745 2346 1198 940 1991 1487 1816 2685 1088 745 2844
$$ packed form
3096b68J737J193j279n78R11q2M2O42l55j092J545J099j329q61J200J24l27J411
3114C733j196q25J103J301j518q63J699k20n68N74j58j698J039J462j346j142
3130A377Q38K21k01P90l37j954N01J763j038j112R96p8j051O99R8j501k0K115
3148B106j018j441K11N99n97L46k45j676N93J609n00j576N93J28n08L50K91j996
3166b731M56K133j146j223K31M90n34M84K72j766k37K366n23j923M92N06l46N13
3184b486O43j798Q3J955n54j681L07J002l90R34M96j557l20J594L20j685O14O60
3202a863k9M92N63j118l60K142j00j476L47Q60K68L44N87j480r46K413J089j937
3220b04j9J128n19Q03P13j138r31J912O01j148k58J051n04L29Q69j597l43K099
$$ plain form
3238 2844 3660 2012 1702 2540 2084 2648 3650 2367 823 2680 4038 2320 1887 2448 2220 2487 3213
3255 3213 2342 1674 2517 3599 1930 1529 2413 1989 1930 2788 1656 508 1902 3081 1204 292 1627
3272 1627 1320 721 1910 1310 -275 206 1321 310 -417 541 280 -289 72 -299 -1842 -474 76 -1292
3290 -1292 -1766 -776 -657 -2013 -952 -1552 -2675 -2037 -906 -2060 -2701 -1768 -1956 -2684 -2016 -2133 -3210 -2505
3308 -2505 -1805 -2346 -3251 -2136 -2321 -3468 -2571 -1963 -2680 -2532 -1329 -2091 -3439 -2144 -2046 -2901 -2366 -1748
3326 -1748 -2578 -2209 -1052 -1385 -2379 -1569 -1108 -2024 -1207 -349 -1574 -1168 -325 -828 -1389 -344 370 -1061
3344 -1061 -402 553 -228 -315 766 506 -359 838 1666 519 926 1669 873 605 1710 1392 1237 2142 2446
3363 2446 1213 1657 2657 2223 1614 2503 2039 1693 2768 3322 1939 1590 2907 2339 2339 3100 2914 2219 2724
$$ packed form
3238B844Q16j648l10Q38m56N64J002j283j544J857J358j718m33N61k28K67P26
3255C213q71o68Q43J082j669m01Q84m24n9Q58j132j148J394J179j877r12J335
3272A627l07n99J189o00j585M81J115j011p27R58k61n69L61l71j543J368N50j368
3290a292m74R90J19j356J061o00j123O38J131j154o41R33j88p28O68j17j077P05
3308b505P00n41r05J115j85j147Q97O08p17J48J203p62j348J295R8q55N35O18
3326a748q30L69J157l33r94Q10M61r16Q17Q58j225M06Q43n03n61J045P14j431
3344a061O59R55p81q7J081k60q65J197Q28j147M07P43p96k68J105l18j55R05L04
3363B446j233M44J000m34o09Q89m64l46J075N54j383l49J317n68%P61j86o95N05
$$ plain form
3382 2724 3189 1695 2020 2853 3033 1819 2642 2323 1544 2298 2888 1434 892 1846 2469 1411 1765 1091
3400 1091 367 1082 1948 844 220 1066 919 167 301 236 -980 150 1037 -616 -1664 107 189 -824
3418 -824 -1048 -1024 -1937 -1280 -363 -1353 -2154 -1335 -1345 -2067 -1486 -1601 -2625 -1985 -856 -2037 -3283 -1868 -1565
3437 -1565 -2707 -2501 -1714 -3240 -2743 -1471 -2281 -3337 -2752 -2059 -2218 -1916 -2165 -2914 -2448 -1131 -2219 -3312
3455 -3312 -2005 -1088 -2355 -1852 -1000 -2041 -2310 -255 -484 -2473 -1644 -37 -477 -665 -505 -1307 -1124 35
3473 35 73 -1179 -367 576 251 753 808 -612 -328 1621 1913 -312 512 1990 1609 1017 1537 1181 980
3492 980 2350 2554 1108 1445 2261 2044 2424 2398 1292 1636 3331 3277 1250 1741 2715 2076 2210 2730 1859
3511 1859 1272 2952 3664 1874 1305 2762 2632 2319 2230 1161 1069 2436 2752 772 797 1741 1305 1552 1561
$$ packed form
3382B724M65j494L25Q33J80j214Q23l19p79P54N90j454n42R54O23j058L54o74
3400A091p24P15Q66j104o24Q46j47p52J34o5j216J130Q87j653j048J771Q2j013
3418h24k24K4r13O57R17r90q01Q19j0p22N81j15j024O40J129j181j246J415L03
3437a565j142K06P87j526M97J272q10j056N85O93j59L02k49p49M66J317j088j093
3455c312J307R17j267N03Q52j041k69K055k29j989Q29J607m40j88J60q02J83J159
3473C5L8j252Q12R43l25N02N5j420K84J949K92k225Q24J478l81n92N20l56k01
3492I80J370K04j446L37Q16k17L80k6j106L44J695n4k027M91R74o39J34N20q71
3511A859n87J680P12j790n69J457j30l13q9j069r2J367L16j980K5R44m36K47R
$$ plain form
3530 1561 376 -94 1219 1863 -162 -347 745 614 -132 119 -559 -1218 52 441 -888 -1248 -341 -557
3548 -557 -715 -499 -1440 -2445 -867 -43 -2403 -2583 -950 -1101 -1990 -1442 -1802 -2774 -1913 -753 -1666 -3145
3566 -3145 -2377 -2089 -2270 -1871 -2632 -3080 -1753 -867 -2845 -3319 -1905 -1805 -2521 -1853 -1894 -3000 -1886 -754
3584 -754 -1931 -3179 -2152 -987 -1072 -1318 -1744 -1785 -1125 -426 -1594 -1464 -363 -673 -693 -250 -10 -1065 -562
3603 -562 895 -57 -1211 199 1262 447 387 1163 286 558 1707 1011 541 1563 1812 1252 1874 1713
3621 1713 921 1467 2698 1717 899 1882 2755 1623 1732 2229 1805 2110 2887 2162 1442 2178 2395 2255 2133
3640 2133 2171 1423 1815 3122 2575 979 2175 2859 1506 1552 2349 1660 1205 2197 1795 583 779 1980
3658 1980 819 1182 1285 658 693 1331 649 -492 318 764 21 -296 269 -526 -970 -111 -434 -1592 -725
$$ packed form
3530A561j185m70J313O44k025j85J092j31p46K51o78o59J270L89j329l60R07k16
3548e57j58K16r41j005J578Q24k360j80J633j51q89N48l60r72Q61J160r13j479
3566c145P68K88j81L99p61m48J327Q86j978m74J414J00p16O68m1j106J114J132
3584g54j177j248J027J165q5k46m26m1O60O99j168J30J101l10k0M43K40j055N03
3603e62J457r52j154J410J063q15o0P76q77K72J149o96m70J022K49n60O22j61
3621A713p92N46J231r81q18R83Q73j132J09M97m24L05P77p25p20P36K17j40j22
3640B133L8p48L92J307n47j596J196O84j353M6P97o89m55R92m02j212J96J201
3658A980j161L63J03o27L5O38o82j141Q10M46p43l17N65p95m44Q59l23j158Q67
$$ plain form
3677 -725 -242 -778 -1652 -780 -1030 -1495 -913 -1306 -2186 -1871 -810 -1686 -2079 -1821 -1876 -2238 -1424 -1575 -2671 -2318
3697 -2318 -1098 -2161 -2755 -1661 -1971 -2700 -1686 -1570 -2441 -2467 -1450 -1965 -2427 -1984 -1767 -1729 -1360 -1217 -2209
3716 -2209 -1891 -862 -1481 -1876 -934 -843 -1492 -617 -357 -1568 -1403 -211 -332 -792 -482 -42 -490 206 646
3735 646 -341 -118 768 707 34 778 1135 -48 564 1664 653 759 1937 1792 804 1597 2047 1270 1672
3754 1672 2119 1637 1431 2483 2256 1785 2026 2211 1462 1989 2625 1952 1953 2869 2272 1180 1837 2490 1609 1467
3774 1467 2180 1571 1154 2367 1683 830 1690 1756 934 916 1725 850 672 1074 1044 3 516 1394 628 251
3794 251 703 443 -230 -22 290 -929 -444 270 -476 -868 -397 -591 -1369 -650 -782 -1495 -1200 -369 -1090 -1880
3814 -1880 -1346 -1398 -1682 -1446 -767 -2473 -1947 -625 -1695 -1876 -1599 -1647 -2144 -1726 -1290 -2246 -2192 -1274 -2159 -2297
$$ packed form
3677g25M83n36q74Q72k50m65N82l93q80L15J061q76l93K58n5l62Q14j51j096L53
3697b318J220j063n94J094l10p29J014J16q71k6J017n15m62M43K17L8L69J43r92
3716b209L18J029o19l95R42R1o49Q75K60j211J65J192j21m60L10M40m48O96M40
3735F46r87K23Q86o1o73P44L57j183O12J100j011J06J178j45r88P93M50p77M02
3754A672M47m82k06J052k27m71K41J85p49N27O36o73JR16n97j092O57O53q81j42
3774A467P13o09m17J213o84q53Q60O6q22j8Q09q75j78M02l0j041N13Q78p66l77
3794B51M52k60o73K08L12j219M85P14p46l92M71j94p78P19j32p13K95Q31p21p90
3814a880N34n2k84K36O79j706N26J322j070j81K77m8m97M18M36r56N4R18q85j38
$$ plain form
3834 -2297 -1907 -1852 -2222 -1345 -1377 -2285 -1938 -961 -1505 -2258 -1457 -1197 -1903 -1207 -973 -1642 -1581 -773 -531 -1279 -843
3855 -843 -602 -780 -794 92 -699 -981 90 256 -412 471 415 -18 377 1295 64 -98 1252 1513 273
3874 273 1074 1008 810 1200 1920 1114 960 1941 2054 1593 1465 1857 1316 1613 2445 1466 1077 1992 2415 1312
3894 1312 1609 2161 1505 1855 2486 1936 1188 2077 2358 1628 1600 2342 1291 1466 2005 1342 222 1381 1817
3913 1817 801 942 1233 504 1025 1224 687 -113 616 1128 -50 -117 515 -456 -223 542 -211 -926 -570
3932 -570 361 -652 -1013 -662 -902 -1046 -357 -770 -1996 -1442 -774 -1322 -1590 -1427 -1939 -1749 -940 -1655 -2381
3951 -2381 -1802 -847 -1539 -2404 -1444 -1775 -2413 -1496 -1350 -2518 -2238 -1216 -1764 -2178 -1613 -1682 -2160 -966 -1334
3970 -1334 -2489 -1717 -792 -1182 -1477 -1383 -1524 -1553 -486 -211 -1948 -1607 -18 -527 -875 -582 -347 -727 -3
$$ packed form
3834b297L90N5l70Q77l2r08L47R77n44p53Q01K60p06O96K34o69O1Q08K42p48M36
3855h43K41j78j4Q86p91k82J071J66o68Q83n6m33L95R18j231j62J350K61j240
3874B73Q01o6j98L90P20q06j54R81J13m61j28L92n41K97Q32r79l89R15M23j103
3894A312K97N52o56L50O31n50p48Q89K81p30k8P42j051J75N39o63j120J159M36
3913A817j016J41K91p29N21J99n37q00P29N12j178o7O32r71K33P65p53p15L56
3932e70R31j013l61L51k40j44O89m13j226N54O68n48k68J63n12J90Q09p15p26
3951b381N79R55o92q65R60l31o38R17J46j168K80J022n48m14N65o9m78J194l68
3970a334j155P72R25l90k95R4j41k9J067K75j737L41J589n09l48K93K35l80P24
$$ plain form
3989 -3 236 -741 -911 498 205 -171 238 281 358 953 931 -452 157 1414 1442 558 1058 844 667 1597 2245
4010 2245 756 744 1702 2034 1416 1519 1773 1234 1687 2273 1317 1151 2055 2020 1448 1577 1704 1365 1788 2570
4030 2570 980 967 1923 2226 1090 1424 1702 853 1400 1671 674 456 1409 1444 768 1095 1234 476 858 1153
4050 1153 55 -6 873 598 -327 -178 265 -316 -112 726 -337 -1163 -336 87 -850 -857 -688 -1222 -990 -343
4070 -343 -1443 -1527 -950 -743 -1442 -1334 -1278 -1600 -1350 -952 -1705 -2272 -1271 -1075 -1945 -1899 -1289 -1797 -1565 -1102
4090 -1102 -1741 -2367 -1572 -1104 -2243 -1804 -1414 -1668 -1731 -1184 -1234 -1620 -1172 -912 -1517 -1267 -700 -1278 -1293 -633
4110 -633 -437 -1416 -463 -419 -919 -956 -103 -258 -217 348 -209 -748 426 694 -26 -33 858 591 118 1141 998
4131 998 99 869 1317 429 767 1850 1460 1044 1593 1441 1072 1294 2036 1376 1461 1865 1473 997 1767 2283
$$ packed form
3989cK39r77j70J409k93l76M09M3P7N95k2j383O09J257K8q84N00k14j77R30O48
4010B245j489j2R58L32o18J03K54n39M53N86r56j66R04l5n72J29J27l39M23P82
4030B570j590j3R56L03j136L34K78q49N47K71r97k18R53L5o76L27J39p58L82K95
4050A153j098o1Q79k75r25J49M43n81K04Q38j063q26Q27M23r37pJ69n34K32O47
4070c43j100q4N77K07o99J08N6l22K50L98p53n67J001J96q70M6O10n08K32M63
4090a102o39o26P95M68j139M39L90k54o3N47n0l86M48K60o05K50N67n78j5O60
4110f33J96r79R53M4n00l7Q53j55M1N65n57n39J174K68p20pQ91k67m73J023j43
4131I98q99P70M48q88L38J083l90m16N49j52l69K22P42o60Q5M04l92m76P70N16
$$ plain form
4151 2283 1216 1781 2249 1130 1076 2044 2150 1068 1584 1705 1220 1263 1985 1201 676 1473 1325 661 1231
4170 1231 1557 1006 817 1186 897 355 993 1106 -170 177 927 421 -165 365 -66 -514 170 204 -723 -384
4190 -384 -51 -612 -612 -202 -820 -1013 -220 -321 -1116 -1340 -717 -1060 -1317 -818 -1366 -1850 -912 -686 -1935 -1948 -1480
4211 -1480 -1334 -1716 -1087 -1587 -1885 -1187 -794 -2025 -1725 -1264 -1555 -1854 -1053 -1624 -2234 -1039 -679 -1598 -1798
4230 -1798 -1160 -935 -1351 -1054 -1139 -1756 -853 -426 -1199 -1301 -541 -793 -886 -257 -628 -1086 -16 777 -694 -1036
4250 -1036 13 652 -157 383 302 -224 443 1041 600 334 903 1091 942 1133 937 619 1182 2000 1150 849
4270 849 1496 1472 1145 1387 1644 738 1438 2293 1607 946 1130 1861 1755 1375 1302 1247 1537 2193 1516 865 1296
4291 1296 1485 1295 1465 1419 674 1096 2137 1275 38 817 1483 665 597 1078 191 177 948 588 -356 22
$$ packed form
4151B283j067N65M68j119n4R68J06j082N16J21m85M3P22p84n25P97j48o64N70
4170A231L26n51j89L69k89n42O38J13j276L47P50n06n86N30m31m48O84L4r27L39
4190c84L33n61%M10o18j93P93j01p95k24O23l43k57M99n48m84R38K26j249j3M68
4211a480J46l82O29n00k98O98L93j231L00M61k91k99Q01n71o10J195L60r19k00
4230a798O38K25m16K97q5o17R03M27p73j02P60k52r3O29l71m58J070P93j471l42
4250a036J049O39q09N40q1n26O67N98m41k66N69J88j49J91j96l18N63Q18q50l01
4270H49O47k4l27K42K57r06P00Q55o86o61J84P31j06l80p3n5K90O56o77o51M31
4291A296J89j90J70m6p45M22J041q62j237P79O66q18o8M81q87j4P71l60r44L78
$$ plain form
4311 22 397 -81 198 14 -715 -122 649 160 -1155 -350 -105 -613 -740 -261 -1518 -1291 -247 -450 -1778
4330 -1778 -1393 -898 -1133 -846 -1254 -2056 -1603 -780 -938 -1642 -1596 -1111 -1635 -1484 -1145 -1766 -2275 -682 -908 -1975
4350 -1975 -1872 -1159 -1358 -1533 -1192 -1645 -1581 -757 -1330 -1481 -1332 -1018 -1186 -976 -647 -1216 -1424 -121 -127 -1520
4370 -1520 -1220 42 -415 -700 -21 -426 -793 -117 556 -450 -287 212 332 143 336 -31 31 1085 1159
4389 1159 -62 318 1353 1065 698 1059 1188 398 1243 1687 814 924 1268 1553 1138 1474 1621 909 1246
4408 1246 1966 1210 1082 1969 1527 1240 1587 1635 1035 1060 2211 982 785 1473 1327 1116 1375 1376 645 1156
4428 1156 1630 943 163 901 956 357 584 717 168 663 953 276 -257 399 250 -414 26 105 -479 -260
4448 -260 208 -321 -1009 -111 -447 -1065 -785 -610 -1222 -1177 -355 -1145 -1626 -849 -724 -1363 -1160 -871 -1787 -1554
$$ packed form
4311B2L75m78K79j84p29N93P71m89j315Q05K45n08j27M79j257K27J044k03j328
4330a778L85M95k35K87m08q02M53Q23j58p04M6M85n24J51L39o21n09J593k26j067
4350a975J03P13j99j75L41m53O4Q24n73j51J49L14j68K10L29n69k08J303oj393
4370a520L00J262m57k85O79m05l67O76O73j006J63M99J20j89J93l67O2J054P4
4389A159j221L80J035k88l67L61J29p90Q45M44q73J10L44K85m15L36J47p12L37
4408A246P20p56j28Q87m42k87L47M8o00K5J151j229j97O88j46k11K59Jp31N11
4428A156M74o87p80P38N5n99K27J33n49M95K90o77n33O56j49o64M40P9n84K19
4448b60M68n29o88Q98l36o18K80J75o12M5Q22p90m81P77J25o39K03K89r16K33
$$ plain form
4468 -1554 -786 -1355 -1834 -934 -879 -1650 -1295 -1025 -1589 -1330 -1237 -1361 -1900 -1369 -1030 -1778 -1362 -1086 -1783 -1357
4488 -1357 -760 -1059 -1318 -928 -826 -1525 -1019 -366 -924 -962 -152 -457 -1353 -901 -59 -679 -616 391 -162 -335
4508 -335 258 277 -414 256 536 -263 105 687 307 347 928 536 380 790 1341 560 532 1290 776 798 1335
4529 1335 1132 443 1199 1782 1353 1124 1697 1388 913 1349 1602 1272 1409 1833 1172 817 1709 1266 815 1488
4549 1488 1520 571 1139 1512 735 687 1297 1352 762 941 1295 581 399 1521 494 447 526 550 2 439 450
4570 450 179 -36 545 -67 -532 196 18 -350 -186 71 -859 -557 -116 -755 -1194 -538 -500 -975 -905 -945 -1240
4591 -1240 -1575 -931 -859 -1421 -544 -980 -1209 -1205 -920 -1692 -1495 -830 -1303 -1913 -1289 -726 -1513 -1547 -1037 -1641 -1473
4612 -1473 -742 -791 -1865 -1573 -516 -1299 -1257 -917 -1098 -1198 -575 -504 -1250 -580 -405 -706 -837 -58 -654 -525
$$ packed form
4468a554P68n69m79R00N5p71L55K70n64K59R3j24n39N31L39p48M16K76o97M26
4488a357N97k99k59L90J02o99N06O53n58l8Q10l05q96M52Q42o20O3J007n53j73
4508c35N93J9o91O70K80p99L68N82l80M0N81l92j56M10N51p81k8P58n14K2N37
4529A335k03o89P56N83m29k29N73l09m75M36K53l30J37M24o61l55Q92m43m51O73
4549A488L2r49N68L73p77m8O10N5n90J79L54p14j82J122j027m7P9K4n48M37J1
4570D50k71k15N81o12m65P28j78l68J64K57r30L02M41o39m39O56L8m75P0m0k95
4591a240l35O44P2n62Q77m36k29MK85p72J97O65m73o10O24N63p87l4N10o04J68
4612a473P31m9j074K92J057p83M2L40j81j00O23P1p46O70J75l01j31P79n96J29
$$ plain form
4632 -525 39 -233 -639 -470 520 -74 -182 246 123 -86 935 865 48 433 952 923 419 656 603 694 1138
4653 1138 1103 401 526 1304 1138 869 1065 827 762 970 1441 821 988 1637 1362 1052 1770 1398 953 1349
4673 1349 1714 734 909 1597 1639 995 1241 880 634 1430 1583 712 393 1169 810 457 1018 806 250 882
$$ packed form
4632e25N64k72m06J69R90n94j08M28j23k09J021p0q17L85N19k9n04K37n3R1M44
4653A138l5p02J25P78j66k69J96k38o5K08M71o20J67O49k75l10P18l72m45L96
4673A349L65r80J75O88M2o44K46l61k46P96J53q71l19P76l59l53N61k12n56O32
$$ [...]
8191I3
##END NTUPLES=NMR FID
##END=
