##TITLE=1H_EC-3194
 CDCl3, 8 sc, 
 29.4.2019
##JCAMPDX= 6.0         $$ Bruker NMR JCAMP-DX V2.0
##DATA TYPE= NMR FID
##DATA CLASS= NTUPLES
##ORIGIN= UXNMR, Bruker Analytische Messtechnik GmbH
##OWNER= root
$$ XWIN-NMR		Version 3.5
$$ Tue Apr 30 14:11:23 2019 Russian Standard Time (UT+4h)  she@DPX200
##.OBSERVE FREQUENCY= 200.1315
##.OBSERVE NUCLEUS= ^1H
##.DELAY= (6, 6)
##.ACQUISITION MODE= SIMULTANEOUS
##.ACQUISITION SCHEME= undefined
##.AVERAGES= 8
##.DIGITISER RES= 18
##SPECTROMETER/DATA SYSTEM= spect
##.PULSE SEQUENCE= zg30
##.SOLVENT NAME= CDCl3
##.SHIFT REFERENCE= (INTERNAL, CDCl3, 0, 15.7039)
##AUDIT TRAIL= $$ (NUMBER, WHEN, WHO, WHERE, WHAT)
$$ ##TITLE= Audit trail, XWIN-NMR		Version 3.5
$$ ##JCAMPDX= 5.01
$$ ##ORIGIN= Bruker BioSpin GmbH
$$ ##OWNER= she
$$ F:/spectra/data/she/nmr/H-F/1/audita.txt
$$ ##AUDIT TRAIL=  $$ (NUMBER, WHEN, WHO, WHERE, WHAT)
(   1,<2019-04-30 14:10:14.12 +0400>,<she>,<DPX200>,
      <created by zg, POWCHK disabled, PULCHK disabled
       configuration hash MD5:
       00 E9 B6 7A A2 85 ED C7 34 08 36 98 17 FE 4E 26
       data hash MD5: 16K
       97 87 83 95 5D 97 A0 6E 71 E7 20 3E 26 96 84 0B>)
$$ ##END=
$$ 
$$ hash MD5
$$ 9B 4A 8F B3 F7 F9 6B B6 AF 4D 97 B6 F9 15 85 CA
##$RELAX= 
##$RELAX= 
##$RELAX= 
##$RELAX= 
##$RELAX= 
##$RELAX= 
$$ Bruker specific parameters
$$ --------------------------
##$DU= <F:/spectra>
##$EXPNO= 1
##$NAME= <H-F>
##$PROCNO= 1
##$TYPE= <nmr>
##$USER= <she>
##$AMP= (0..31)
100 100 100 100 100 100 100 100 100 100 100 100 100 100 100 100 100 100 
100 100 100 100 100 100 100 100 100 100 100 100 100 100 
##$AQSEQ= 0
##$AQ_mod= 1
##$AUNM= <au_zg>
##$AUTOPOS= <>
##$BF1= 200.13
##$BF2= 200.13
##$BF3= 200.13
##$BF4= 200.13
##$BF5= 200.13
##$BF6= 200.13
##$BF7= 200.13
##$BF8= 200.13
##$BYTORDA= 1
##$CFDGTYP= 0
##$CFRGTYP= 5
##$CHEMSTR= <none>
##$CNST= (0..31)
1 1 145 1 1 1 1 1 1 1 1 1 1 1 1 1 1 1 1 1 1 1 1 1 1 1 1 1 1 1 1 1 
##$CPDPRG= <>
##$CPDPRG1= <>
##$CPDPRG2= <>
##$CPDPRG3= <>
##$CPDPRG4= <mlev>
##$CPDPRG5= <mlev>
##$CPDPRG6= <mlev>
##$CPDPRG7= <mlev>
##$CPDPRG8= <mlev>
##$CPDPRGB= <>
##$CPDPRGT= <>
##$D= (0..31)
0 1.2 0 0 0 0 0 0 0 0 0 0.03 0 0 0 0 0 0 0 0 0 0 0 0 0 0 0 0 0 0 0 0 
##$DATE= 1556619013
##$DBL= (0..7)
120 120 120 120 120 120 120 120 
##$DBP= (0..7)
150 150 150 150 150 150 150 150 
##$DBP07= 0
##$DBPNAM0= <>
##$DBPNAM1= <>
##$DBPNAM2= <>
##$DBPNAM3= <>
##$DBPNAM4= <>
##$DBPNAM5= <>
##$DBPNAM6= <>
##$DBPNAM7= <>
##$DBPOAL= (0..7)
0.5 0.5 0.5 0.5 0.5 0.5 0.5 0.5 
##$DBPOFFS= (0..7)
0 0 0 0 0 0 0 0 
##$DE= 6
##$DECBNUC= <off>
##$DECIM= 24
##$DECNUC= <off>
##$DECSTAT= 4
##$DIGMOD= 1
##$DIGTYP= 9
##$DL= (0..7)
0 120 120 120 120 120 120 120 
##$DP= (0..7)
150 150 150 150 150 150 150 150 
##$DP07= 0
##$DPNAME0= <>
##$DPNAME1= <>
##$DPNAME2= <>
##$DPNAME3= <>
##$DPNAME4= <>
##$DPNAME5= <>
##$DPNAME6= <>
##$DPNAME7= <>
##$DPOAL= (0..7)
0.5 0.5 0.5 0.5 0.5 0.5 0.5 0.5 
##$DPOFFS= (0..7)
0 0 0 0 0 0 0 0 
##$DQDMODE= 0
##$DR= 18
##$DS= 0
##$DSLIST= <SSSSSSSSSSSSSSS>
##$DSPFIRM= 0
$$ [...]
##$SUBNAM2= <"">
##$SUBNAM3= <"">
##$SUBNAM4= <"">
##$SUBNAM5= <"">
##$SUBNAM6= <"">
##$SUBNAM7= <"">
##$SUBNAM8= <"">
##$SUBNAM9= <"">
##$SW= 24.9337058887773
##$SWIBOX= (0..15)
0 0 2 0 0 0 0 0 0 0 0 0 0 0 0 0 
##$SW_h= 4990.01996007984
##$TD= 16384
##$TD0= 1
##$TE= 0
##$TE2= 300
##$TE3= 300
##$TEG= 300
##$TL= (0..7)
0 120 120 120 120 120 120 120 
##$TP= (0..7)
150 150 150 150 150 150 150 150 
##$TP07= 0
##$TPNAME0= <>
##$TPNAME1= <>
##$TPNAME2= <>
##$TPNAME3= <>
##$TPNAME4= <>
##$TPNAME5= <>
##$TPNAME6= <>
##$TPNAME7= <>
##$TPOAL= (0..7)
0.5 0.5 0.5 0.5 0.5 0.5 0.5 0.5 
##$TPOFFS= (0..7)
0 0 0 0 0 0 0 0 
##$TUNHIN= 0
##$TUNHOUT= 0
##$TUNXOUT= 0
##$USERA1= <user>
##$USERA2= <user>
##$USERA3= <user>
##$USERA4= <user>
##$USERA5= <user>
##$V9= 5
##$VALIST= <valist>
##$VCLIST= <CCCCCCCCCCCCCCC>
##$VD= 0
##$VDLIST= <DDDDDDDDDDDDDDD>
##$VPLIST= <PPPPPPPPPPPPPPP>
##$VTLIST= <TTTTTTTTTTTTTTT>
##$WBST= 1024
##$WBSW= 4
##$XGAIN= (0..3)
0 0 0 0 
##$XL= 0
##$YL= 0
##$YMAX_a= 919650
##$YMIN_a= -1032699
##$ZGOPTNS= <>
##$ZL1= 120
##$ZL2= 120
##$ZL3= 120
##$ZL4= 120
##$ABSF1= 10
##$ABSF2= 0
##$ABSG= 5
##$ABSL= 3
##$ALPHA= 0
##$AQORDER= 0
##$ASSFAC= 0
##$ASSFACI= 0
##$ASSFACX= 0
##$ASSWID= 0
##$AUNMP= <proc_1d>
##$AZFE= 0.1
##$AZFW= 0.1
##$BCFW= 1
##$BC_mod= 2
##$BYTORDP= 1
##$COROFFS= 0
##$CY= 11.3945322036743
##$DATMOD= 1
##$DC= 2
##$DFILT= <>
##$DTYPP= 0
##$F1P= 18.9103706918063
##$F2P= -1.10871071338519
##$FCOR= 0.5
##$FTSIZE= 0
##$FT_mod= 4
##$GAMMA= 1
##$GB= 0.15
##$INTBC= 1
##$INTSCL= 1
##$ISEN= 128
##$LB= 0.24
##$LEV0= 0
##$LPBIN= 0
##$MAXI= 10000
##$MC2= 0
##$MEAN= 0
##$ME_mod= 0
##$MI= 1.114404
##$NCOEF= 0
##$NC_proc= 0
##$NLEV= 6
##$NOISF1= 3.799351
##$NOISF2= 2.8
##$NSP= 1
##$NTH_PI= 0
##$NZP= 0
##$OFFSET= 15.70392
##$PC= 1
##$PHC0= -8852.507
##$PHC1= 12.40026
##$PH_mod= 1
##$PKNL= yes
##$PPARMOD= 0
##$PSCAL= 0
##$PSIGN= 0
##$REVERSE= no
##$SF= 200.130013532006
##$SI= 16384
##$SIGF1= 3
##$SIGF2= 2
##$SINO= 400
##$SIOLD= 16384
##$SREGLST= <1H.CDCl3>
##$SSB= 0
##$STSI= 0
##$STSR= 0
##$SW_p= 3612.71676300578
##$SYMM= 0
##$S_DEV= 0
##$TDeff= 0
##$TDoff= 0
##$TI= <>
##$TILT= no
##$TM1= 0
##$TM2= 0
##$TOPLEV= 0
##$USERP1= <user>
##$USERP2= <user>
##$USERP3= <user>
##$USERP4= <user>
##$USERP5= <user>
##$WDW= 1
##$XDIM= 8192
##$YMAX_p= 0
##$YMIN_p= 0
$$ End of Bruker specific parameters
$$ ---------------------------------
##NTUPLES= NMR FID
##VAR_NAME=  TIME,          FID/REAL,        FID/IMAG
##SYMBOL=    X,             R,               I
##VAR_TYPE=  INDEPENDENT,   DEPENDENT,       DEPENDENT
##VAR_FORM=  AFFN,          ASDF,            ASDF
##VAR_DIM=   8192,          8192,            8192
##UNITS=     SECONDS,       ARBITRARY UNITS, ARBITRARY UNITS
##FACTOR=    0.0002004,     1,               1
##FIRST=     0,             0,               0
##LAST=      1.6414764,     0,               0
##MIN=       0,             -1032699,        0
##MAX=       1.6414764,     919650,          0
$$ Real data points
##PAGE= N=1
##DATA TABLE= (X++(R..R)), XYDATA
0@%%%qJ8j8K4m0N6p2R6j20J44j76K16k64L12l73M45n20O15p24Q37r67J116j282
26f85J466j666J890k140K411k712L048l415L814m253M736n263N841o479P179p949
42d177Q801r748J0798j1969J3290j4785J6496j8477K0795k3554K6909l1092L6474
55A9761m3696N3972o9880R8078j63078N72207L82982q25236P9373M26552L88615
66I19650k00658k96712j17777J55211k5167k03653j78879J31296K00588M0510
76D24409k08917k08904q5792N0261L3072K3245J9176p573j27793j38461j0368
87b37645J19120O8944m3526p6890O436M9440q768p8076n836J11344Q2910p6359
99h8906j31660l301J48440J33867j9749j25008m9991R6229J17550J7716l5038
$$ y = [0, 0, 0, 0, -8, 10, -8, 16, -24, 32, -40, 56, -64, 80, -96, 120, -144, 168, -205, 240, -280, 335, -389, 448, -519, 597, -685, 781, -885, 1005, -1135, 1276, -1436, 1612, -1803, 2011, -2242, 2494, -2769, 3072, -3407, 3772, -4177, 4624, -5124, 5674, -6295, 6995, -7790, 8706, -9771, 11024, -12530, 14379, -16713, 19761, -23935, 30037, -39843, 58235, -104843, 467364, 850346, 25110, 104483, 531035, 919650, 718992, 422280, 304503, 459714, 434547, 230894, 52015, 183311, 383899, 424409, 215492, 6588, -79204, -28943, 4129, 27374, 46550, 38977, -88816, -227277, -237645, -118525, -49581, -93107, -169997, -163561, -114121, -122889, -200965, -206801, -95457, -12547, -88906, -220566, -223867, -75427, 58440, 38691, -86317, -136308, -40079, 77471, 95187, 60149]
110F0149P655M3852J3201l2867l2059J8914N7860M6989J4820r561n2416q4087
122E2450j3524J19164J36680j0960j49026j12008N0103J34348K7168j22785r5776
133A5834P4036J27477k0696j60967j01808Q0453J45646J2189j34886r2329N3976
144a075P0557m8946r5115o14P9275K0580r1697r3370L1458J07802J4131j11086
156a18100p4570P1372J15892N404j03612o9359N7169J01857L534q2512k6367P2260
168d7032N5803l6129n8906J0756O7861L7124l2270l4130L2021N1422j6382n9176
180b9038l213O4433M7383k8891o7843k1650M7489M0912k7994m5939J1968M1301
192B8918q566n3747k6445L0053L8114j5111n3852j7299L8163J9030m1313m0375
$$ y = [60149, 67804, 111656, 124857, 91990, 59931, 78845, 136705, 183694, 198514, 188953, 136537, 52450, 38926, 158090, 294770, 283810, 134784, 22776, 72879, 207227, 234395, 111610, 15834, 89870, 217347, 196651, 35684, -66124, 14329, 159975, 172164, 37278, -55051, -1075, 69482, 20536, -74579, -75193, 4082, 24662, -67035, -160405, -128947, -21145, -7014, -118100, -192670, -121298, -5406, -2, -103614, -172973, -115804, -13947, -10413, -92925, -119292, -47032, 8771, -27358, -86264, -75508, -7647, 29477, -2793, -36923, -4902, 46520, 30138, -29038, -32251, 32182, 79565, 50674, -17169, -38819, 8670, 49582, 21588, -24351, -12383, 28918, 20352, -33395, -59840, -29787, 8327, -6784, -60636, -77935, -39772, -20742, -62055, -102430]
204a02430J7483M5562J5360k8823l6696q3L3050K2086l739l51N941j1837j4787
217e9264J9357L9393P645l5801k9192L2890P0343R097q2602n9180O3182J10211
229H6079J3249r4572p6205L7960R7490K7287p2455n7319L9109O4479q722o0571
241d191k2103L6956L5058j9448m0933O521L7822j3042o4683j6721O5684M9382
253E0302m5731q4881j3511P4608N3170n2540q6049P840Q7840L4460o5203o7376
265a07071J9513O9665J8441n7315m3029M4050O4417j7057p2189j7478N5927M4903
277B777k0694m2079O261M7295J0178m9434k8806M6973N8072o049m2278p412L2873
290G677J7076k7618k5772L8570P3087P031p3724n3297L5191O8060J6550l8635
$$ y = [-102430, -84947, -39385, -24025, -52848, -89544, -89627, -56577, -34491, -38230, -38581, -32640, -44477, -59264, -39907, -514, 7131, -28670, -57862, -24972, 45371, 54468, -28134, -87314, -24132, 86079, 99328, 4756, -71449, -33489, 64001, 91288, 18833, -38486, 623, 65102, 56380, -4191, -26294, 10662, 45720, 26272, -14661, -8140, 29682, 16640, -48043, -64764, 920, 50302, 4571, -80310, -93821, -19213, 33957, -18583, -104632, -96792, -8952, 25508, -39695, -107071, -87558, -17893, 548, -56767, -99796, -55746, 8671, -8386, -80575, -98053, -42126, 2777, -17917, -59996, -53735, -6440, 3738, -45696, -74502, -27529, 30543, 24494, -17784, -25196, 7677, 24753, -2865, -28637, 9933, 83020, 90051, 16327, -36970, -1779, 66281, 82831, 44196]
302D4196k6553K6270L5012k0795n5190j0014M4629L6202n900k4576k2454k1351
314e24j3877R008L5532K8910k7124o8174k4814N0683M4713l6268p2055q115P0067
327a2038N3739m8065j02175k1434Q9056P3188m0859q7875j5027O9286N5633l0005
339a6576o9378j1742N7818M3681j5036k8048K771J3444k136p255J1211K7374J3258
352A9386j6869j2443K2113J9693k7970l5924K7389P3806K8535o1019q0225M797
364c8731Q7235N1247n5332p3687J9528Q1162K0483p5732p6447K3855R6928M4505
376A05014o4955q5507k031O1324L3562k7475m2730p760K9087K3071j0565k4622
388a3587j5716p039Q723L3895K7797k2574n4355j7962M2538N2086n585n9052k8698
$$ y = [44196, 17643, 43913, 78925, 58130, 2940, -7074, 37555, 73757, 67857, 43281, 20827, -524, -14401, -5393, 30139, 59049, 31925, -36249, -61063, -10380, 34333, -1935, -73990, -82105, -12038, 41701, -6364, -108539, -129973, -40917, 32271, -8588, -96463, -111490, -42204, 13429, -16576, -85954, -97696, -39878, 3803, -11233, -39281, -36510, -23066, -25202, -32457, -21246, 6128, 19386, 2517, -9926, 12187, 31880, 3910, -32014, -4625, 69181, 97716, 36697, -43528, -38731, 48504, 99751, 44419, -29268, -9740, 71422, 91905, 16173, -60274, -36419, 60509, 105014, 40059, -45448, -47479, 13845, 47407, 19932, -22798, -30558, -1471, 21600, 11035, -13587, -29303, -36342, -27619, 6276, 34073, 11499, -42856, -60818, -18280, 33806, 28221, -30831, -59529]
401e9529N3571O8184j4260p7167l3885N2887P3740Q507n6568l7618L2969M9845
413F0676o821m2428p333L6473L0411p553k8860j4086P223O056k723R544J9518
426F0097q388l9298j8964K3891K7171j2568l7137q800L8070L0197l7217o6266
438d9212l753O5042M1773l5667o0478n445N1984L0049l9954n0399J8875O3591
450B6406J6756m6370l8444J7317M3078J0569k6616j4045K8815K9021j6143k9513
462H31P900L2623J0218j7211p867K2161K4852j4715l8485q06M7525K9122k8751
475F7397l8509O310L5477J0245l1753k8183K0006M0618l491m5814k0965K6923
487C8261K6541j3212l0527l787K6708J2247k8598l1170J4839L4719n031l8453
$$ y = [-59529, -5958, 62226, 47966, -29201, -63086, -10199, 63541, 72048, 15480, -22138, 10831, 60676, 53855, 11427, 4094, 40567, 70978, 63425, 34565, 20479, 27702, 33758, 31035, 40579, 60097, 51709, 12411, -6553, 17338, 44509, 31941, -5196, -13996, 24074, 54271, 17054, -49212, -52965, 12077, 53850, 18183, -42295, -47740, 4244, 34293, -5661, -56060, -37185, 26406, 43162, -3208, -41652, -24335, 18743, 29312, 2696, -11349, 17466, 46487, 30344, 831, 8731, 41354, 51572, 34361, 26494, 48655, 73507, 58792, 20307, 19501, 67026, 96148, 67397, 28888, 35198, 70675, 80920, 49167, 20984, 40990, 81608, 78117, 32303, 11338, 38261, 64802, 51590, 21063, 17276, 43984, 56231, 27633, -3537, 11302, 46021, 40990, 2537]
499B537j4134K5295K3205j7068l8679p477L2684K0613k7059l1705J0341K7542
511F095k496k7961j1957K2095K2958j2654l3132R76L5193J1750l0862k1661K6040
524a5616L7259m835m1478j7847L9976M6228j4967n2113p837N0579L6208k5090
536C0467m5202k38M7339L2065k5935m1723M963L9536J3841k2849j6729J0585J6520
549D2640m347j7590m93J8594K177k3885j0194K5496J9097k5526l9201K881M4699
562C4348K7485l3312n5977p18N5282K8139m0242m8542J0789N1196J9636m0276
574G808m8524Q042N0329K0052l1222l1538M228J8236J703j0749n001P081K030
587g525j2822o430J4391P758k3862k2335J8814L8309K432m3178l5167K2208N2833
$$ y = [2537, -11597, 13698, 36903, 19835, -18844, -26321, 6363, 26976, -83, -31788, -21447, 6095, 3599, -24362, -36319, -14224, 8734, -3920, -37052, -36076, -883, 10867, -19995, -41656, -15616, 21643, 16808, -24670, -42517, -2541, 43687, 28720, -23393, -31230, 19349, 55557, 30467, -14735, -14973, 32366, 64431, 38496, -3227, 1736, 41272, 55113, 32264, 15535, 26120, 42640, 38293, 20703, 20210, 38804, 40981, 17096, 6902, 32398, 51495, 25969, -13232, -10351, 34348, 61833, 28521, -27456, -28174, 27108, 55247, 15005, -33537, -22748, 28448, 48084, 7808, -40716, -32674, 17655, 37707, 6485, -25053, -20825, -2589, -886, -11635, -16636, -9555, -7525, -20347, -26777, -12386, -4628, -28490, -50825, -32011, 6298, 8730, -34448, -69615, -47407, 5426]
600E426P018n4584l6306L8065N8017l786o1164l7370L4828O1791R133m9485l2357
613f0774K5590L7270l519k7410n430K2720K0563m289j6525j955P822j760j714
626i411K1057K4101j2399l9858j2961L3694L8732q238m6207j6632M3183M0413
638E5474k8202o1640q698N7432M8753k1954o3148k1217M4821M3356j5773m2715
650a3511n951L0588K0228j2296k2584m610J3194P183n212J646P708r303k1686
663a4606O98K5578J2340k6374l3480N912M4172K1105m3243n7090P711N9892K7070
676B9685m1969n1861N219M8344J8464m2050m3748J7967N2378J1889l9915l6284
688g1881O783K9981J3331j2102q692R780M244j5654o797K1863K1771p072j8123
$$ y = [5426, 12444, -42140, -78446, -40381, 17636, 13850, -47314, -84684, -49856, 11935, 21068, -28417, -60774, -35184, 2086, -1433, -28843, -34273, -11553, 9010, 4721, -11804, -13759, -5937, -7697, -9411, 11646, 35747, 23348, -16510, -29471, 4223, 42955, 34717, -11490, -28122, 15061, 55474, 27272, -34368, -43066, 14366, 63119, 41165, -21983, -43200, 1621, 44977, 29204, -13511, -19462, 11126, 31354, 19058, -3526, -8136, 5058, 12241, 7029, 8675, 16383, 7080, -14606, -13908, 11670, 24010, -2364, -35844, -29932, 14240, 35345, -7898, -64988, -57277, 2615, 29685, -12284, -64145, -58926, -10582, 7882, -34168, -77916, -59949, -7571, 4318, -35597, -71881, -65098, -35117, -21786, -33888, -42580, -32800, -28556, -44210, -51007, -29144, -7373, -14445, -32568]
701c2568O747K8145J1026k4577k3904K6060N3750J0378m6232l3824K7388N4411
713E6800J2175l9539l2138K3845M7109K344m1856k0878K7126L1520p961l1726
725B6821j3199J7895J7018j2139k0414J388R834j0346j7935L188J8079K40k7027
738f597k5439P810K7553K877l3989k1736K0381K4722j5026l7848q943L3915L1702
751f18j6993m3782q873L5110K3992j7697k3869Q091K5154L122k2622j3205K1004
764c1186K7328n294k6244j851K5689J2457j6354j6042J2721K7278K652k9478j6328
777c4652K6454L1659j0329l3765m643K9820K0010j6382k6539N149L1375Q814l0530
790c559k2577K0690L2100m520l2534j6036K1182K5108j0226l1537k388L1777J3553
$$ y = [-32568, -25821, 2324, 13350, -11227, -35131, -9071, 44679, 55057, 8825, -24999, 2389, 56800, 68975, 29436, -2702, 21143, 68252, 70596, 28740, 7862, 34988, 66508, 58547, 26821, 13622, 31517, 48535, 36396, 15982, 17370, 27204, 16858, -1077, 2111, 20190, 20430, -6597, -32036, -24226, 3327, 6204, -27785, -49521, -29140, -4418, -19444, -57292, -66235, -32320, -618, -17611, -61393, -70266, -35156, -11164, -28861, -52730, -44639, -19485, -16363, -38985, -52190, -31186, -3858, -9152, -35396, -37247, -11558, 899, -15455, -31497, -18776, 8502, 11154, -18324, -34652, -8198, 23461, 13132, -20633, -25276, 4544, 24554, 8172, -18367, -13218, 18157, 26971, -3559, -26136, -5446, 26654, 22134, -10400, -26436, -5254, 19854, 9628, -21909, -24297, 7480, 21033]
803B1033k9303l0023J2027L5360R302k9518k6964J1746L0346K66k6261q653K0919
816i723J4487j2092j9270J690J9925R260j5522j2986J3025J7009j0812k0879P156
829a8732K8387Q591k6152k6413J4435M0511P510l8842k6790K6061L9044m797l9311
842a6498j9515K7961L5991o802m0967j6521K8450K7254j1039k8881o939J7470
854a0036J3477q593j5395R43R383l922r310R304J5925q452k5691m181K7563K4624
868A5639j4036l7308o332L9508L0589k4762m4148K019M8165L0880k7183m8495
880c5464l485M9104L4725k4114m2085k52L4019J8498j6030k1960K558K0366P838
893B3718j2944q652O042L122m303K285J1465p6j8778j6930J0678L1172J0161l2961
$$ y = [21033, -8270, -38293, -26266, 9094, 18396, -11122, -38086, -26340, 4006, 4272, -21989, -30642, -9723, 4764, -7328, -26598, -24908, -4983, 4277, -11245, -24231, -11206, 5803, -5009, -25888, -18732, 9655, 18246, -7906, -34319, -19884, 20627, 28137, -10705, -37495, -11434, 27610, 22813, -16498, -36013, -8052, 27939, 21137, -19830, -36351, -7901, 19353, 8314, -20567, -27506, -10036, 3441, -5152, -20547, -19604, -10221, -14143, -23453, -14149, 1776, -6676, -32367, -36548, -8985, 15639, 1603, -35705, -42037, -2529, 28060, 3298, -40850, -38831, 9334, 40214, 13031, -35464, -38949, 10155, 44880, 20766, -21319, -21571, 12448, 30946, 14916, -7044, -4486, 15880, 23718, 10774, 2122, 8164, 11286, 6983, 9268, 20733, 20657, 1879, -15051, -4373, 26799, 36960, 3999]
907C999l5833J2269M2955J1810l5975l2550J4231M0308O408m0102l1531K3295
919b0716M3746J400l8832k6661J4523L0625P410j9064j4819Q005J1193o344p551
932a7085Q391J0766m043j1118J858J3405L043j6776j1846K2125L1194o470m0948
945a7504j8379L1133M0478m27l7138k2504K2272L3269n022l1540p892K8014K0467
958C5227j4739k9062m931K3756J9055r831j9054M04R429m825r883P846J6746j045
972A9093k2082j6273J2983K5837j012k8963j2754K4119K2658j3584l2357o176
984b8511L1369K8368j3550l8497r415L0342K3934j1799k2955j023J5457P159j1463
997e84r386R495J4125m715j4698J176J2091P79j0495p15J4682R310j5064k5668
$$ y = [3999, -31834, -19565, 23390, 35200, -775, -33325, -19094, 21214, 27622, -12480, -44011, -20716, 23030, 24430, -14402, -41063, -26540, 4085, 11495, -7569, -22388, -14383, -3190, -9534, -17085, -8694, 2072, -1971, -13089, -11231, 2174, 5217, -11559, -23405, -1280, 29914, 23444, -17504, -35883, -4750, 35728, 35301, -1837, -24341, -2069, 31200, 26178, -5362, -13254, 14760, 35227, 20488, -8574, -13505, 10251, 29306, 19475, 421, 825, 10254, 5429, -4454, 3392, 20138, 19093, -2989, -19262, -6279, 19558, 18546, -10417, -23171, 948, 23606, 10022, -22335, -28511, 2858, 31226, 17676, -20821, -30236, 106, 24040, 12241, -10714, -11737, 3720, 10879, -584, -9970, -475, 13650, 8935, -5763, -4587, 7504, 8283, -2212, -2927, 11755, 21065, 6001, -19667]
1011a9667J267L4336K1309k3860l6736N45L3428J8983j9852k8742M542L1002R210
1024B5765k9269k5832J4017K9974M949k2441j9588M941J6088K180j0498l33J1091
1037A044j157j5649n672J4712J3075o643j7152r21J8010R072k0071j9503J6264
1050a4591L2601K116l2584k2419J8015L6183P048k9509k1025J7634K7691l987
1062A7173k4426n639K1890J8874r597k4106l415K3190J5914j1676j4893M880J1706
1075A9875l334j2227r13J3273Q884j3006j9009K284J7958K821j6386p760J1216
1088C676R692r463j8799l326J9892J3318j5491k4075J954K0958M275j7683j2265
1101b7337J1522J8522m498k5216r233K3111K2083j1584k6590l055K1435J4006
$$ y = [-19667, -18400, 15936, 37245, 13385, -23351, -22806, 10622, 29605, 9753, -18989, -14447, 16555, 25765, -3504, -29336, -15319, 14655, 19604, -2837, -22425, -17484, -1396, 784, -9714, -10047, 1044, -113, -15762, -21434, -6722, 6353, -290, -17442, -18363, -353, 8719, -11352, -30855, -14591, 18010, 20126, -12458, -34877, -16862, 19321, 26369, -3140, -24165, -6531, 21160, 17173, -7253, -12892, 8998, 27872, 18275, -5831, -9246, 13944, 29858, 18182, 3289, 8169, 19875, 16541, 4314, 3401, 16674, 25558, 12552, -6457, -4173, 13785, 16606, 220, -7540, 3676, 13368, 3905, -14894, -18220, 1672, 14990, -501, -24576, -22622, -1664, 2611, -15072, -27337, -15815, 2707, -1791, -27007, -36240, -13129, 8954, -2630, -29220, -32275, -10840, 3166]
1113C166j0938j8858L295K2156Q401j7015j4359J1285J8068K115j0552n132P719
1126f49O728m620o333Q172J3246o662j8478J127K1780J0718j6222k0980O619L0008
1140B4454J1260k7602k8078J5362L8708P666l3160k8471J4527L8226R516l2591
1152I817k8986J6090L4020M038k8412k0000J0247K0772M127j6389j3881K365O477
1165B85j127q27J847n372j2761k666J2824J1189r644k3598p312K4731K3477j6455
1179e409l8374p339L5163K9597j5619m1101j2225L3769L3313j3074l8073o928
1191d6300L0759K4318j0729k6631o958K1497K1609k379j5971n303O933O486N161
1204B492O204o20r132o694Q275J7449N219j9459j9479J3531L2451M223l3248k5603
$$ y = [3166, -7772, -26630, -23335, -1179, 7222, -9793, -24152, -12867, 5201, 7316, -3236, -8368, -649, 6079, 1459, -4874, 3298, 16544, 9882, -8596, -7469, 14311, 25029, 8807, -12173, -5554, 24454, 35714, 8112, -19966, -4604, 34104, 41770, 8610, -19861, -5334, 32892, 42408, 9817, -19169, -3079, 30941, 34979, 6567, -13433, -3186, 17586, 21713, 5324, -8557, -6192, 285, -842, -1669, 178, -5194, -17955, -20621, -7797, 3392, -6252, -29850, -37162, -12431, 11046, -5409, -43783, -51122, -15959, 13638, -1981, -43082, -55307, -21538, 11775, -1299, -39372, -46300, -15541, 8777, -1952, -28583, -35541, -14044, 7565, 5186, -10785, -16088, -9155, -2669, 2492, 8696, 8076, -1056, -7750, 525, 17974, 23193, 3734, -15745, -2214, 30237, 34460, 1212, -24391]
1218b4391J8601L9002Q216l5672l2998J6476M3089R031l4019k8078J2873L2234
1230B4364Q148k3946k1533R985K3260J468j8523r337P880P728r40l000n7j331
1244D166q281o537Q954J7283j118k3799j4113J5362K1476l977k4119j1993J9238
1257g458K3990p652l3437j2438K5272K6050p525k7470j1369J5992J7444n616j8472
1270b2689p35J6211N163j1691p638O541Q319j130p124J070J0939L781j2196q544
1284a9723J2697J7016l927j9258n036J7728J7961o638k2559n487K0899J6338j2124
1297G887j7317M191J7926N003j3851j2442P857J8138J822j5319n897J1845O868
1310A6711j0392j0165Q299J7612K665k0463j6006J2316K2479k347k2841o756J7983
$$ y = [-24391, -5790, 33212, 41428, 5756, -27242, -10766, 32323, 41354, 7335, -20743, -7870, 24364, 32512, 8566, -12967, -2982, 20278, 21746, 3223, -6114, 1766, 9494, 8554, 5554, 5497, 4166, -4115, -10652, -1698, 15585, 14467, -9332, -23445, -8083, 13393, 9416, -14703, -26696, -7458, 16532, 8880, -24557, -36995, -11723, 14327, 6802, -20668, -32037, -16045, 1399, -4217, -22689, -23424, -7213, -2050, -13741, -21379, -14838, -6519, -7649, -14773, -13703, -2764, 1017, -11179, -19723, -7026, 9990, 6063, -13195, -18231, -503, 17458, 10820, -11739, -17226, 3673, 20011, 7887, -9430, -5239, 12687, 17690, 3839, -8603, -746, 17392, 19214, 3895, -2002, 9843, 16711, 6319, -3846, 4453, 22065, 24730, 4267, -11739, 577, 23056, 20709, -2132, -8888, 9095]
1323I095J4371j1516k3904l722K2615J6972j3660k3288j46J7696O287j2452j1443
1336a3095N474J2871k79j4850o877J0745R289r478j1463N599J3098j211j4066
1349a4243o689J1974J4035o704j8727j25K1255J1072j4939j8797L347K1392J0947
1362A3798j3103j6475O507K0129J605j7431q983J3509J5558k343j4629n197J1073
1375D018P695q883q584R117J3417n103j6082l784J3234J1104o374j5381O24J8080
1389A3098O152j8011j5759J0451K0746K055j8989j3623J0814J8491k633j9819
1401g027m939J7042J0643j1485j4709L792J5104K863j5698j1049J2721J8441o365
1414I334k2644n233J8789J4732j0580k0663j133K1213J1954j7073k1841O066K2367
$$ y = [9095, 23466, 11950, -11954, -15676, 6939, 23911, 10251, -13037, -13183, 4513, 10800, -1652, -13095, -7621, 5250, 4971, -9879, -16756, -6011, 3278, -6200, -17663, -12064, 1034, -177, -14243, -20932, -8958, 5077, -1627, -20354, -20479, 776, 11848, -3091, -21888, -18541, 2851, 13798, 695, -15780, -9273, 10856, 12461, -4970, -13953, -444, 15114, 12771, -1858, -7055, 4018, 11713, 2830, -5754, 3363, 16780, 11677, -4405, -8189, 5045, 16149, 9775, -5606, -4982, 13098, 19250, 1239, -14520, -4069, 16677, 18732, -257, -13880, -3066, 15425, 12792, -7027, -11966, 5076, 15719, 4234, -10475, -6683, 8421, 11284, -4414, -15463, -2742, 15699, 9334, -13310, -18543, 246, 14978, 4398, -16265, -17398, 3815, 15769, -1304, -23145, -17079, 5288]
1427E288N560j5979j3700O165J4705J381j3481n638J1715Q086p597q654N174R338
1441B363j818j0083j927J2818J0049j0830j8288M112K3529Q669j8623j8681Q556
1454a0154K4563P254k0621j9698J0341K5698L403k0451j3717R925J6621J599j3148
1467A615r189P486J0418k169p670J128M206l072m737M002P963j740j3363q053
1481a3175J2890J7855m606k5016r241K1653K1301q829k7589q860K3315K4752r335
1494A5115l1566r157K4814K1735q958k4427o543J7871J6191p414j8048n24J4459
1507C548O630p598n664K498K323k780k276N753P209m310j4496k773J7092J1815
1521A6971j2458j9675J896K3444J2841j7957k6846J245K9419J6726k0004k6713
$$ y = [5288, 10848, -5131, -18831, -12666, 2039, 3420, -10061, -15699, -3984, 4102, -3495, -12149, -6975, 2363, 545, -9538, -11465, 1353, 11402, 572, -17716, -13604, 9925, 18594, -29, -18710, -10154, 14409, 21663, 1042, -18656, -8315, 17383, 20786, 335, -13382, -3457, 13164, 14763, 1615, -7574, -88, 10330, 8161, 491, 1619, 5825, 2753, -1984, 2018, 9981, 8241, -5122, -13175, -285, 17570, 12964, -12052, -21293, 360, 21661, 12832, -14757, -23617, -302, 24450, 15115, -16451, -25608, -794, 20941, 11983, -12444, -18987, -1116, 15075, 7661, -10387, -10911, 3548, 10178, 2580, -3084, -586, 1737, -1043, -3319, 2434, 9643, 5333, -9163, -11936, 5156, 16971, 4513, -15162, -13266, 10178, 23019, 5062, -21784, -20539, 8880, 25606, 5602, -21111]
1533b1111K151K4167J1810j4915k0006K736K0585P397j3363j2311L394R498J369
1546A401m062j289K232j182m960m11R004N700r880j1327P122J7598K854j7010
1560d210j3901R090K2143M331k0529j4540J3041K0523k167j9836r130J4477J8636
1573A7928j315j8385q084J1948J1388n161r644K705Q920M69q352n707O370P923
1587A1003l657q943M103J1623j553j6057p720J2655J6763k547k0324j1016J4031
1600a639J7464o429k0766n027J7045J3599q773j8618m249J5567J1125r530j3699
1613a3930L399J1760M89r828m553P040O945l855r682K770J3265K846j3824q882
1627a6040R963J4920R8j3345n364J1137J1978n383j5473O44J7790R223j0250j2672
$$ y = [-21111, -18960, 5207, 17017, 2102, -17904, -15168, 5417, 12814, -549, -12860, -9466, 32, 1401, -2661, -3950, -1718, -2900, -7860, -8271, 733, 6433, -3447, -14774, -7652, 9946, 12800, -4210, -18111, -9021, 13122, 17453, -3076, -17616, -4575, 15948, 13781, -6055, -15185, -708, 17928, 16613, -1772, -9856, 2092, 13480, 8319, -1325, 1380, 10300, 10769, 2417, -3290, 3080, 11003, 7346, -1597, 2506, 14129, 12576, -3481, -11201, 1454, 18217, 15670, -4654, -15670, -1639, 15825, 9396, -11370, -16397, 648, 14247, 5474, -13144, -17393, -1826, 9299, -231, -13930, -10531, 1229, 1718, -8110, -12663, -5623, 1322, -2533, -12215, -9445, 3820, 6666, -7158, -16040, -6077, 8843, 8941, -4404, -9768, 1369, 13347, 7964, -7509, -6865, 10925, 20148, 9898, -2774]
1641b774K230J2426L925r492o235R812J1738o601j6736j921J4597R692p675j3013
1655b7o06J1896M419j2829r928Q558J3273k652j3745n759Q761Q622n163j1547
1669f727k69J2337M319j2000r752O185J1039j273j1120m906R338J0613n707j3776
1683a1699N98J4114M376j0528q494P125J3252r1j5214r068J1853J6866k041j6462
1697e413m798J1969J0003n129j2509j035J3389Q159q458j1445J594Q543J137l986
1711B021m38N170J489o838n622O101J1856j164j2975l949J3147R810q548j5851
1725e791j059J7525J3400j0604k1018p75J9823J0991j1554j5329Q44J4974P583
1738A9010j0326j2881L403J1871R55q598l439M968L723l591m244K895O100k065
$$ y = [-2774, -544, 11882, 15807, 6315, 80, 9892, 21630, 15029, -1707, -3628, 10969, 20661, 12986, -27, -633, 11263, 15682, 2853, -7075, 1483, 14756, 12104, -1641, -7400, 1361, 9983, 4820, -6727, -6996, 5341, 9660, -2340, -12092, -5907, 5132, 3859, -7261, -12167, -2829, 7784, 2077, -11699, -11101, 3013, 7389, -3139, -11633, -4508, 8744, 8653, -6561, -15629, -3776, 13090, 11049, -5413, -10211, 1758, 11761, 6632, -5877, -6912, 6477, 14636, 6178, -5267, -3673, 4870, 6007, 2021, 1583, 6753, 8242, 1404, -4218, 1883, 13739, 12575, -400, -4349, 8798, 18608, 10060, -5791, -6850, 10675, 24075, 13471, -7547, -8322, 11501, 22492, 10938, -4391, -3547, 11427, 19010, 8684, -4197, -794, 11077, 12032, 3434, -5, 4963, 8686, 5095, 851, 3746, 9846, 7781]
1752G781r507j302J2129O007j1623j4120L912J5990O448j5159j6463N768K1076
1765A0937M440j9889j5064R656K0059L163j7224j4773O324J6938L162j3363q398
1778a4032O206Q065j152n208j320L687J202k724p35N943K138q288n941Q696J2220
1793H757j677j4059p053J1224J6374q95j6611p746J3953J6610l904j6438n482
1806f947J3087J3674k963j4176m888J0151Q193l738o774J376M157j43l964l20
1820F725L774J622n724m386N898P299o327j2234j485J1704Q205p754j5766k147
1834a0596J4762R144j2273j6422K317J6781O542j3200j5962K350J5785O273j1989
1847f488j1827M744J1177Q81q320l646M495N035k075m866K973P058j851r740j534
$$ y = [7781, -1726, -3028, 9101, 15108, 3485, -10635, -6723, 9267, 15715, 556, -15907, -10139, 10937, 15377, -4512, -19576, -9920, 10139, 13302, -3922, -18695, -12371, 4567, 7729, -5634, -14032, -7826, 239, -913, -6121, -7441, -3754, -2552, -5276, -6011, -68, 2070, -6218, -12159, -3463, 8757, 7080, -6979, -14032, -2808, 13566, 12671, -3940, -11686, 2267, 18877, 14973, -1465, -6947, 6140, 19814, 16851, 2675, -2213, 7938, 16131, 12393, 5619, 6995, 11152, 11009, 7045, 6725, 10499, 12121, 6397, 2011, 7909, 15208, 8881, -3353, -4838, 6866, 15071, 7317, -8449, -10596, 4166, 13310, 1037, -15385, -13068, 3713, 10255, -2945, -18907, -16557, -772, 5501, -6488, -18315, -13571, -2394, -1513, -9833, -13479, -8984, -3949, -6024, -10890, -7917, -859, -2710, -12450, -13984]
1862a3984J0733P991n809j1046J049J3154P537j0384j3719N115J8388O855j2857
1875C023j3033L448J4369N989q710q325N074J1001r54j0179l408O834O626j45
1889A1610n723j725K809j84m903j137P460L955o956q413J135P759K899p663p672
1904f749M474R815j024j1993n430Q262Q450l438j0550l567Q297P802n564j0202
1918a1417j16R118K300o694l670N403O421k938r680k449J0661P403n675q562L523
1933f372Q955o5j0278m357R845J3240j314j5163p260J0205J1097l253r817P3J0067
1948E603M401j0211j1125M797J4966L057j2473q265O382R263l117j0325k039J1260
1962B174P761q706j3583J384J3461M980r492r895L856J0889K853r981p461O237
$$ y = [-13984, -3251, 4740, -1069, -12115, -11066, 2088, 9625, -759, -14478, -9363, 9025, 15880, 3023, -10010, -6562, 7807, 13796, 5086, -3239, 1835, 12836, 11882, 1703, -1705, 5129, 11755, 11610, 5887, 4162, 6971, 6787, 1884, 747, 8207, 12162, 5206, -3207, -2072, 5687, 8586, 923, -6749, -2275, 7540, 6516, -5477, -10907, -2645, 5805, 2367, -8183, -11750, -3453, 4349, -1215, -11417, -11533, -2415, -115, -6809, -10479, -5076, 1345, -1593, -11273, -13722, -3061, 4342, -1333, -9895, -6372, 2583, 2518, -7760, -12117, -2272, 10968, 9654, -5509, -12769, -2564, 8533, 5280, -4537, -4464, 5603, 10004, -207, -11332, -6535, 8431, 11488, -985, -9250, -2868, 6395, 3278, -7047, -9086, 2174, 9935, 1229, -12354, -10970, 2491, 7471, -2021, -11916, -8060, 2829, 5682, -4299, -11760, -5523]
1976e523R240j693q911j250P715M579m136n708Q37O708M41n377J89P703K518p778
1992d46p686M394J0927K921q566q218M604J0523j336j1938l752J0732R657m617
2006G199j2932m568Q511R240l293r260qO366q6o064k322M814L335k895n380J000
2022f343O641p6q980l697R299R223m984j2947k777J2141J1424o419j6264p01J6288
2037A828J0042j0287j4565J698J5056P849r696j2395L063J4344L953r969q295
2050g374N166Q816R39o177l362M918L793m300n287L838P542j822q631k264P645
2065C440N945o170j0302O44J2702O084j0779j3144K805J3645N341r353j1397J276
2079i263J1692N001q775q678L061Q489J965n258l855J637K892jp75J525J919l290
$$ y = [-5523, 3717, 2024, -6887, -8137, -422, 4157, 21, -5687, -4850, 1858, 2299, -3078, -2889, 4814, 7332, -446, -8132, -3738, 7189, 10110, 1544, -6674, -2070, 8453, 7117, -4821, -8573, 2159, 11816, 7199, -5733, -10301, -1790, 7450, 4157, -5103, -5111, 1255, 1169, -4895, -7217, -2403, 932, -1963, -7343, -6343, 298, 222, -8758, -12455, -3156, 6067, 1083, -11864, -14641, -2500, 8924, 2505, -13759, -14460, 1828, 11870, 1583, -12982, -11284, 3772, 11621, 1925, -10470, -7407, 6937, 10890, 921, -7374, -2208, 6608, 7547, 1370, -1992, 2926, 6719, 2419, -2868, 970, 8512, 6690, -1941, -4205, 3440, 9385, 3215, -7087, -6443, 6259, 12343, 1564, -11580, -8775, 4870, 10211, 858, -10539, -9263, 2429, 7430, -1345, -10023, -6962, 1527, 3492, -1766, -5621, -3984, -1092, -1093, -1868, -343, 1576, -1714]
2095a714m438L567P875L92q051m629N697R790N44j0177o978Q223J1603r25j1388
2110f09n067P117R769r70r777l641P506O123m127p054J183N801K58m916k282M015
2126C329K851l526o265K284Q096M77r761n457O722R756k313j1858n974J0656J2468
2141A1485m784j6766l741J3843J2156o903j5650k403J3936J0666p467j3585k55
2154i468J2482O814n961q123J168P883K626m951l824M707N191k589m946K596N832
2169I437o47o470k346P744P845m644j1297k083J0505P249o266r814O47R009M259
2184A3128p535r619J870R465L451p984o750K397N033n24n194j664L998K112m691
2199b507m591K357M449k297m826J054N486J269o126n037M038Q389M61r263m385
$$ y = [-1714, -6152, -2585, 5290, 5682, -2369, -6998, -1301, 8489, 9033, -1144, -8122, 101, 11704, 10779, -609, -5676, 1441, 11210, 10240, 463, -3178, 4328, 10451, 6324, -730, 453, 6254, 6512, 1596, -686, 3329, 6180, 2654, -3611, -1327, 6769, 7246, -2515, -7972, -1250, 8506, 6193, -5665, -11639, -983, 11485, 6701, -10065, -13806, 37, 12193, 5290, -10360, -12763, 1173, 11839, 4372, -9213, -9468, 3014, 9828, 3867, -4256, -3088, 4795, 7421, 2470, -1354, 3353, 8544, 5955, 1009, 3605, 9437, 8790, 2320, -26, 7718, 15563, 10919, -378, -2461, 8044, 15293, 9027, -787, -140, 8869, 13128, 5593, -4026, -2156, 7309, 10760, 2776, -3974, -1577, 3456, 2932, -2262, -3926, 72, 2184, -2507, -7098, -4741, -292, -2589, -7415, -6361, -875, 394, -5732, -10769, -6731, 1658, 2119, -7144, -11529]
2214a1529Q432Q623l041r781k248R237Q924m461j0652R64J1820M769r170q071
2228f184N167J1679K393r335o803O671R436k447j0050n06J0211N959o872j0878
2242a559K53J0541N823p474r288K972R085m54r708m245O275P194k734r417j880
2257d616O344L033o242o202M164P847k078q642m607N954Q232k312j0503k054R582
2272b100O804o072r336k48R249O044n380p882J321Q885K169n178l857K748M944
2287B111J231j327q23J385N7k249J032M842K576m628m685K432O506R56o485n518
2303b587N405R574o84j2032o872Q576J0388k375j1642n128P375Q657l018j1217
2317e580l624Q834O288m207p462r46N076K690l518l640K133M013k340m665J733
$$ y = [-11529, -3097, 5526, 2485, -7296, -9544, -307, 8617, 4156, -6496, -5532, 6288, 11057, 1887, -6184, -1017, 10662, 13055, 3720, -3083, 3588, 13024, 10577, 527, 21, 10232, 16191, 9319, -1559, -1306, 9235, 15058, 7584, -1704, 1268, 10353, 9899, 191, -4054, 2221, 9415, 6681, -2736, -4616, 1728, 4761, -1481, -7683, -3519, 4328, 2250, -6392, -10999, -5045, 3187, 875, -9628, -11682, -2100, 4704, -1368, -10704, -10952, -1703, 4341, -1039, -8921, -7600, 1285, 3454, -1724, -5581, -2833, 2111, 3342, 2015, 1192, 2577, 2634, 385, 1417, 6259, 8835, 4207, -478, 1954, 8460, 9416, 2931, -2587, 2818, 12392, 11708, -324, -7196, 1380, 11768, 9393, -2249, -7377, -2, 8655, 5637, -5580, -9204, -370, 5918, 1711, -5751, -6697, -1621, 1069, -2449, -6089, -3956, 57, -2283, -6948, -5215]
2332e215O356j57o866l020O481Q600j752j1404m139J0593J0064m277j2112j945
2346h793J1198R083n658j2423j952J1900R033o857j0599p73Q711N402m913o976
2360c617L95N655J259n413k305K904J620l086k585K937K655k244n764p16N910
2375b395M509n118p845J278Q625L469p237p039J890R797L497p120p249M313Q898
2390B273P47o215l322L860N550k9m780m68M032J878l022j260L904K715l238l912
2406a287J439O353K604o692o387L437R302Q66r915o290O074Q819q61r946o055
2421h539O548P869k371r459k385O197L988m063o082j13M864J178n229l584M270
2436f911L908l833n789J430O585J645o234n816L555R062L92q809m807P486Q738
$$ y = [-5215, 1141, 984, -5882, -8902, -2421, 6179, 4427, -6977, -11116, -523, 9541, 5264, -6848, -8793, 2405, 11488, 5830, -6593, -8545, 3355, 12388, 5531, -5068, -5841, 2870, 8272, 3359, -3617, -3222, 2433, 3692, -1721, -4026, -1122, 498, -2588, -5173, -2236, 419, -1825, -7589, -8305, -2395, 2114, -3004, -10849, -9571, -946, 2523, -4714, -11753, -9863, -66, 3431, -3689, -10938, -6625, 2273, 3020, -3195, -6517, -2657, 2893, 2864, -1916, -2384, 1648, 3526, 504, -756, 3148, 5863, 2625, -1287, 152, 6505, 9109, 2417, -3970, -533, 8769, 9635, -280, -6570, -496, 8323, 7462, -2484, -8539, -1991, 5878, 3507, -5952, -8337, -2140, 1848, -2215, -8297, -8410, -3546, -2368, -7597, -11181, -6911, -3003, -6836, -12625, -11195, -4610, -2965, -9199, -15015, -11460, -2398, -2006, -10815, -15622, -8136, 602]
2451F02k471q771k668P679Q322k450q844j052P855N006l644n475J061N465K745
2466C360m010k744L174L733j545l848J795M626J62m910k872M126N261j582p514
2481b788k463P308N229n132p950P0O922L921m865p275O02O914J915o919m973L822
2497e662N116n60n868k195L284L835k278m441J816M696j49n893j694M616M887
2512d90k607n706O6O051L807m798o559L107Q172K009o782m869L522P674Q29p104
2528c678l623N858O223l395o055J75O228K932l647n309K255O337L85o208l037
2543d559N401M199k532o137p90N989L504m307o959J443P278J737n780m261K724
2558c050M822q24m687k311M342L990l951m654J356M795M07m199k126M115M329
$$ y = [602, -1869, -10640, -13308, -5629, 2693, 243, -8601, -9653, -1798, 3208, -436, -5911, -4850, 615, 3360, -650, -3394, -220, 3513, 1968, -1880, -85, 4541, 4703, -207, -3079, 1047, 6308, 4726, -2788, -5251, 2057, 7286, 2154, -5796, -5726, 1196, 5117, 252, -7023, -6421, 493, 2408, -4511, -9484, -5662, -546, -1106, -6974, -9169, -5885, -2050, -4328, -8769, -6953, -2257, -2406, -8299, -9993, -5377, -490, -3097, -8803, -8737, -2686, 1121, -3677, -10236, -7129, 1043, 3052, -3730, -8599, -5077, 2597, 3426, -3678, -7301, -1443, 4780, 1385, -4670, -4495, 1733, 4665, 1018, -4291, -2036, 4301, 4686, -1522, -4559, 842, 5041, 2509, -3628, -4418, 1571, 5075, 768, -6191, -4748, 2530, 4267, -1513, -5774, -3050, 1772, 948, -3739, -6050, -1708, 2282, -1669, -6323, -4967, -172, 235, -3964, -6090, -1975, 2354]
2573B354k194o815p91P024M941m659o342Q57O925K876m662n183K465P162J693
2588E651o384l951M150N005R6m968j388L291K811k313k704J575L318q87m271L73
2604e96L978K145m047n389J954O611J279p359n463M669Q041n98q488n042M975
2619c330Q264m89q686m067N887O231k247o725j265M868M159k513m536m78M444
2634d83R49k433l99K678J323l185k012K964M922o8n634k955N890N883k039p914
2650b513j022P231O244l917p886j679Q096O203m635q077K03O676L207l919n224
2665a012N79M622J142l964k383K420J964k302k209J182K231j181l798q06M048
2680E33L337m083o473R90P509L009n808o671J894P283K611n883o590L693P966
$$ y = [2354, 160, -6655, -7446, -422, 4519, -140, -6482, -5625, 1300, 4176, -486, -5669, -3204, 3958, 5651, -733, -4684, -534, 4471, 4567, -401, -1789, 1502, 4313, 2000, -704, 871, 4189, 3302, -969, -596, 3382, 5527, 1480, -3909, -1955, 4656, 5935, -1424, -6887, -2218, 5823, 5225, -3263, -8305, -3330, 4934, 4445, -4241, -8308, -2421, 3810, 1563, -5162, -6427, -1559, 2600, 87, -4449, -4927, -483, 466, -1967, -2366, 312, 1635, -1550, -3562, -598, 4324, 4256, -1378, -4333, 1557, 7440, 5401, -2513, -3535, 3696, 9940, 6023, -1863, -3542, 4554, 10757, 6122, -1955, -1752, 4924, 8131, 4212, -1012, -433, 4189, 5331, 1367, -1016, 1404, 3368, 1066, -1143, 39, 2270, 1089, -2709, -3515, 533, 3870, -213, -6686, -5696, 1813, 4822, -986, -7657, -5763, 1520, 4131, -1752, -8342, -4649, 3317]
2695C317P22o226m063L506N407M11m657j765L518K934k146l071J853L569q79l565
2711a135l58L757K032k820m271J194O200J222o020m663L596O555L01o952m323
2726e685M401O967j447p179k584N015M758k137n297j311M407L066l182l780J641
2741b347L736o36l538l51L015J903k505l402J456N061Q76n396k943M264N474j301
2757C366o385j546N054N213k057o964o79O031L935l803n466J109M935J677l740
2772F80l481J967M523m71m826j011L937J783l079l248J286M082O36n010l100L662
2788a670M629k051n426q77M589K661l241m832N73N580K214m851m595K505N447
2803F55l91m553j905L305L602j744m926J33N247K333m348l187K243M533J90m348
$$ y = [3317, 4039, -2187, -6250, -2744, 2663, 3074, -1583, -3348, 170, 3104, 958, -2113, -260, 3309, 2430, -1135, -1493, 2264, 4296, 1476, -2795, -1601, 4599, 5821, -199, -4862, -1266, 5289, 5590, -1362, -5685, -1284, 5683, 4236, -2943, -5527, -512, 4246, 2109, -3188, -4499, -92, 2974, -208, -3988, -2347, 1389, 753, -2785, -3136, -121, 1782, -723, -4125, -2669, 2392, 3268, -2128, -5071, -807, 4667, 3366, -3019, -4565, 489, 5702, 3645, -3319, -3998, 2033, 5968, 2165, -3301, -2192, 2743, 4420, 680, -2801, -834, 3689, 3218, -1608, -2619, 1318, 3101, 22, -3226, -1940, 2142, 2778, -2232, -5332, -1670, 2959, 908, -4518, -5395, -806, 1855, -1386, -6218, -5645, -65, 2149, -2702, -7297, -4792, 655, 264, -4289, -6194, -2889, 713, -1031, -5957, -5824, -577, 1756, -2592, -5779, -3536, 997, 1187, -3161]
2819c161j741L621M072j577n344l44N064L399l239m068N87M576J548l803k655
2834c065K723M117j413m955k40L720K347l134l862J209M614R1n248k566M068M339
2850B745k148o387j725M428M830k515o174j279N329K914m020m620J241M809P66
2865a806l908l427K374M202q17l763j39L133J112k578j782K245L894l97m218j657
2881g532M758L727k361n096Q47O433K400m208n206J840P135K783n769m851K711
2896b389O073N64m482k600K589L798o59m653o28L527J688k410k489R11J768n12
2912I6k606p55K892J758l786m509K212N439J82n763l762L043N537l60o343l214
2928i939M712N046j396o408j854N020L765j322n014m26M025K559k775k272K063
$$ y = [-3161, -4902, -1281, 2791, 1214, -4130, -4474, 590, 3989, 750, -3318, -2731, 1845, 3393, -410, -3065, -342, 3775, 2362, -2593, -2833, 887, 3234, 100, -3762, -2553, 2061, 2152, -3096, -5662, -1594, 2745, 597, -5790, -7515, -3087, 1743, -772, -6946, -8225, -2896, 18, -4002, -8622, -7381, -2572, -1806, -5714, -9141, -6767, -2565, -3382, -7145, -7284, -4151, -3039, -5617, -7399, -5154, -1260, -1657, -5875, -7532, -2774, 953, -1408, -6504, -5657, 776, 3176, -1032, -6238, -4398, 2737, 5520, -249, -5100, -2389, 3684, 4248, -234, -2834, -245, 3553, 2894, -1759, -2387, 1140, 2828, 418, -2071, -1160, 608, 96, -2510, -3265, -373, 1385, -2401, -6910, -4698, 741, 923, -4840, -8602, -5559, -22, -382, -6725, -9939, -5227, -181, -1577, -7985, -9839, -4819, -1054, -2376, -7390, -7816, -3791, -1232, -4007, -6279, -4216]
2943d216K952p65k347k89L075K239k574k562K038M263j18m479k170M707M593k091
2959B256n355j736N105M509k273n930o92N430K456l130m898R02M529J600l957
2974a184l352K305L278j123l077L94K054Q67k455k241J858L710o56m595j244M382
2990a079L250k460m411K5M663L289l154n432J335N753J920m171l336K005L772
3005A969J158l585k046K456L139r77l077m07L226R08k330j772J431K450n40m004
3021b001r10L933K636l282m792J301M713J672m223l951J276N377J068n143l624
3036e950L111M465o45m051k062L062L420j327l408l78L654J490k428k489K617
3051i19K461n77k463l06L232K106k826l139K112M351Q37m220k501K700M356N2
$$ y = [-4216, -1264, -2029, -4376, -4665, -1590, 649, -1925, -4487, -2449, 1814, 1696, -2783, -4953, -246, 4347, 2256, -3099, -4835, 270, 4779, 2506, -3424, -4116, 1314, 3770, 640, -4258, -3356, 1173, 2773, -1184, -4536, -2231, 1047, -76, -3153, -2759, -705, 162, -2293, -4534, -2676, 1034, 378, -4217, -5461, -1079, 2171, -289, -4700, -4675, -12, 3277, 123, -5309, -3974, 1779, 3699, -472, -3808, -1803, 1969, 3127, -458, -2504, -48, 3091, 2114, -963, -1370, 1856, 2764, 434, -1338, 93, 2543, 2003, -2001, -2911, 1022, 3658, 376, -4416, -3115, 1598, 3270, -953, -4904, -3628, 1749, 2817, -2326, -5950, -2839, 1626, 981, -3070, -5132, -2070, 1350, 23, -3385, -3763, -109, 1381, -1047, -3536, -919, 1542, 965, -1498, -1804, 1428, 3534, 708, -2431, -319, 4032, 4869, 649, -1852, 848, 5204, 5256]
3067E256m893k448M023L943j689m751j72L578K627k407l602r5L953R35l623k171
3083a536K133K736j802l056r0K798J151k228l579J415L762o6m282j692K921L525
3099B110j683l974j032L362L525k323m313L82M562J060l209k274J891L442K80
3114A806l875j290L530K682k001l485O71L759J672l254k996K239M185K29m437
3129e65j965L480L659j273l948o17L265K631k676l479P62M131P97l365j977K049
3145I09J953m59k862p54K642K310k799k872J107L436K20l879j856K528L208r32
3161A900m025j471L924K664k000l893J86L863J532k512l248Q69L558O49k914j552
3177b470K100J791j068j739P0L019P73k824j362J991L143j427l716J48L923J406
$$ y = [5256, 363, -2085, 1938, 5881, 4192, -559, -731, 2847, 5474, 3067, -535, -630, 3323, 4258, 635, -1536, 597, 3333, 1531, -1525, -1615, 1183, 2334, 106, -3473, -2058, 1704, 1638, -2644, -4336, -1415, 2110, 427, -3547, -4579, -1217, 2308, -15, -4328, -3946, 616, 1676, -1533, -3807, -1916, 1526, 1806, -2069, -3359, 171, 2853, 852, -2633, -1962, 1797, 3469, 215, -2781, -542, 3643, 3872, -565, -2530, 950, 4609, 3336, -612, -1229, 2036, 4667, 1991, -1488, -726, 3405, 4202, 837, -1140, 909, 2862, 2403, -459, -1213, 1429, 3739, 940, -1932, -825, 2611, 2831, -1048, -2904, -376, 2832, 1900, -2125, -3596, 328, 2992, 992, -2901, -2715, 1148, 2680, 168, -3080, -2211, 1347, 1996, -918, -2470, -370, 1421, 353, -1386, -1316, 1703, 2476, -348, -1710, 281, 3424, 1997, -1719, -1571, 2352, 3758]
3193C758k339m001J9M884K127l107m376J585M384P51l789l034K047L771K64l948
3209a004j883K843K371j500k550K96K427M73k566j775J894K614p53l298o30L434
3225C93K022k378l793J468L512J421l405l225K000M550P07m637k275K688L796
3240B844j84l617j867K599K984j067k972M28K471M02j421j212J040J526m56k225
3256g27rK798O33k655k484J824L171j68l899j634K643L800j257m747j060L762
3272iL038k411m052M0L163J655k067k605L34K689O88k283j190J738J195j239j716
3289c032N13K558L58k721j683K695K938j275l344p37L818K809k169m129j04M639
3305A134K524l350l667J144M008J477l237k711J475L597L43l241j783K586K174
$$ y = [3758, 1419, -2582, -2563, 2321, 4448, 1341, -3035, -1450, 2934, 3685, -104, -3138, -1091, 2680, 2944, -1004, -2887, -44, 2327, 827, -1723, -1427, 1000, 1473, -1093, -2868, -974, 1640, 887, -2411, -3041, 393, 2415, 37, -3756, -2288, 1224, 2645, -760, -3985, -1985, 2565, 3272, -1365, -3640, -952, 2844, 2660, -957, -2824, -225, 2759, 1692, -1280, -852, 1619, 2021, 600, -612, 428, 1954, 1498, -727, -736, 2062, 2695, 40, -2444, -620, 2551, 2383, -1516, -3150, -507, 3293, 2036, -2711, -3771, -9, 3029, 618, -3434, -3394, -231, 1424, -643, -3248, -2914, -225, 463, -1820, -3010, -1272, -77, -1316, -3032, -2519, 39, 397, -2324, -4007, -1312, 1626, 351, -2993, -3730, 88, 2897, 728, -3401, -3505, 1134, 3658, 308, -3359, -2215, 1793, 3270, 33, -2678, -1203, 2394, 2737, -504, -2287, 299, 2473]
3320B473j044k605QK209R65k307k059J497K649p92l106m40K560J608j824k782
3336b990K16L600R22k866k873J487L601j91l332j483K073K742l72l145r06K576
3352i41J907j800k212J072K255l1k218j016J714K798j025k836j90K885J248k461
3368h51k300J588K617L27k444k067K114K793o51l569l48K745J995j913k784N07
3384b241K837J108k917j754J748K634r57k937k16K837J858j931l008P18K841J213
3400A833k672k543K010K821L83l252j789K531K957n23l520m64K770J267j555j615
3416a361L35K262M78k144j276J395K323q54k686M67K438R93k330j974R76K815
3432A857R87l525k049K238L106p66l623n94K290K179j193k839n76K731J648j811
$$ y = [2473, 1429, -1176, -1168, 1041, 2006, -301, -2360, -863, 1786, 994, -2112, -2552, 8, 1616, -208, -2990, -2774, 826, 1748, -1118, -3991, -2504, 1097, 906, -2426, -3909, -1836, 906, 534, -2611, -3517, -941, 966, -834, -3046, -1974, 281, 250, -1968, -2984, -1270, 1528, 503, -2333, -2523, 362, 1610, -851, -3151, -1563, 1054, 1381, -1063, -3130, -1016, 1777, 1126, -2443, -2791, -46, 1949, 36, -2748, -2241, 596, 1704, -1213, -2967, -1219, 1415, 458, -2479, -2695, 142, 2000, 69, -2939, -2221, 620, 1833, -839, -3382, -1372, 1449, 1832, -1420, -3209, -678, 2279, 1756, -1764, -2228, 542, 1809, 254, -1361, -1026, 1236, 1714, -430, -1706, -311, 2012, 1158, -1528, -1061, 1377, 2370, 40, -1934, -958, 1857, 2844, -681, -2730, -492, 2614, 1848, -1775, -2369, -79, 2100, 907, -1932, -2508, 223, 1871, 60]
3448F0k396Q92K246j02j537j206J156J447m74j735M98J687L14k347j059J832K184
3465A460n09k768p69L080K251k022l004M52L427J380k232k669N37L427Q01k352
3481D90k090J548K623m58k743n0J554J536j087k128K05K673p7k209j035J895J763
3498B410j033k267p55K563K078j901l203K27L330J068k519k441J026L354R6k925
3514h92j852K269K924j478k521j29J645J417j527j831L08J965Q49k605q34J883
3530d09J906q92k095k18K241J176j836k382J604K845J94k749j952K061K730j86
3546B038k196j328K108J937p75k321j59K349Q33j313j498J002J448L3k476p7J994
3563A599J435j618k865J396K708m01k313j638J665K855n36l028j415K570J982
$$ y = [60, -2336, -1444, 802, 700, -837, -2043, -887, 560, 86, -1649, -1151, 536, 850, -1497, -2556, -724, 1460, 951, -1817, -2586, 494, 2745, 723, -2281, -1829, 1598, 2978, 746, -1923, -1386, 2041, 2842, 490, -1600, -52, 2571, 2113, -630, -680, 874, 2410, 1323, -805, -600, 2073, 1996, -213, -1248, 647, 2410, 1377, -890, -1645, 918, 2996, 1095, -2108, -1881, 1449, 2517, -2, -2443, -1417, 1937, 2033, -892, -2744, -475, 2449, 971, -1550, -1679, -34, 1383, -144, -1975, -1667, 298, 1147, -1458, -2292, -409, 1497, 605, -1490, -1708, 533, 1709, -127, -2509, -905, 1940, 2134, -615, -2567, -506, 2224, 2038, -158, -1486, 622, 2559, 1784, -537, -696, 1653, 2486, 1173, -325, 677, 2125, 2158, -318, -395, 1599, 3034, 1416, -1449, -53, 2655, 2254, -59, -1697, -32, 2823, 2287, -741, -2156, 414, 2396]
3578B396q24l019m28K205J521j491k167J59K817K62j983j476J782J316p60j979
3594a669j45K120J059j573j499O64K447Qk404q62J736K532j125k796p61K685K288
3611B705j976k808J75L017J570k384k456J095K876N46k284j847J770J625k70k174
3627h20P3J287R52j053j504Q23J692k66k071l30J964J259j138k396J18K669R20
3644B179j970k179J098K600K50j903j744J569J884l92j828o20J370J687j511j524
3660a034M39J852K15j502j117J117J798m47k349l02K365J387j478k398M28K333
3676A307N28j834j680J123K434n09k201r39J923K101j056k628k07K079J438j795
3692H4k021J161K144J4k050j172J578J911n45k076l10J819J221j510k009J007
$$ y = [2396, 1572, -1447, -1875, 330, 1851, 360, -1807, -1648, 1169, 1431, -552, -2028, -246, 1070, 310, -1669, -1814, 306, 1365, -208, -1707, -1043, 1404, 1412, -992, -1854, -118, 2414, 1289, -1507, -2268, 417, 2705, 729, -2079, -1904, 1113, 2683, 299, -2157, -1062, 1814, 2360, 76, -1771, -1, 1624, 1354, -820, -747, 540, 1492, 439, -1065, -242, 1450, 1184, -887, -1217, 747, 2006, 868, -1528, -1410, 1259, 2179, 209, -1970, -872, 1728, 1978, 75, -1669, -100, 1784, 1392, -436, -1056, 314, 2001, 490, -1034, -595, 1257, 1472, -30, -1147, -30, 1768, 1321, -1028, -1330, 1035, 2422, 944, -1454, -1026, 1307, 1835, 1, -1679, -556, 1878, 1369, -832, -1771, 152, 2253, 1197, -1431, -1638, 441, 1879, 84, -1937, -776, 1368, 1382, -668, -1840, -262, 1649, 1104, -972, -1282, 537, 1758, 248, -1761, -754]
3708g54K035N37k350j360J250K283n3k543q03K404J480j135j997l61K126J192
3724A951j231j956Q43J738r7j675n17J623Q49r91j477RK053N49k106j341J348
3741d28K371n67k476p59J745J734m90k510k87K034J647k202j476N14K035q9j267
3758d71o33L51K141q26j784l68J899J111j387j600O72J564O99j778j110Q69K249
3775A598o34k189o99K466J260r98k088M3K044J129k111j857J304K022J50k079
3791f39p85J083J691n44j906o0J786J176j664j279R69J155l73j284m60J416J214
3808A496q90k183J26K347Q49j527j829O73J867O87j745j787J136K070M1k157o14
3825a440J572R52j016r00rJ951J87j665n17K96K045p25j949J27J658R42q71j899
$$ y = [-754, 1281, 1818, -532, -1892, -642, 1641, 1588, -955, -1758, 646, 2126, 991, -1006, -1367, 759, 1951, 720, -1236, -393, 1345, 1248, -427, -944, 679, 1528, 537, -940, -931, 1122, 1671, -435, -1776, -428, 1943, 1376, -1100, -1859, -114, 1620, 1130, -1380, -1667, 367, 2014, -188, -1664, -1150, 885, 796, -471, -1104, -753, 1388, 562, -1222, -1590, 309, 1420, 33, -1567, -895, 669, 1368, -410, -1520, -651, 1598, 964, -1225, -1924, 542, 1802, 804, -1284, -1241, 803, 1932, -179, -2036, -732, 1290, 1440, -639, -1424, -341, 1350, 806, -1100, -1160, 626, 1802, 138, -1141, -172, 983, 610, -674, -1134, 282, 1496, 606, -1577, -1451, 896, 1745, 218, -1611, -938, 929, 1616, -129, -1916, -780, 1290, 1331, -826, -1440, 132, 1084, 68, -832, -841, 1110, 1297, -368, -885, -589, 1456, 731, -1218, -1091, 567, 1509, 638, -1261]
3843a261O6K213O92j719j614Q27J984N4j541j048J144J855m06k630o2J845R89
3860A388j107j646L47J646K39r52j224O81J621o01j428q1J113J087j069j248J60
3877a074J744M54j662j330J749J874p54k671l32K114J460q45j661m41K095P56
3893A476j620j258J166J111J16j463q12J335Q03n63j237L3J908M09j607j389J174
3910d18J905k68j794q24J562J798j258j957J16J814O10j352j069K84K154K90k047
3927d54p41J141J619r09j810M3J576J221j275j340K43J648K05j328j405J091J360
3944H85k34j464m75J681Q33q02j676j32J891P42j584r53N78J575K01j656j019
3961a609J361J357m03j508KJ100M02o27j083O51J233l62j122n99J597P54n93j756
$$ y = [-1261, -1195, 1018, 1710, -9, -1623, -796, 1188, 1242, -299, -1347, -203, 1652, 1246, -1384, -1446, 399, 1388, 281, -1365, -1018, 628, 867, -85, -1309, -628, 993, 392, -1036, -1117, -4, 1083, 14, -1234, -1074, 670, 1124, -538, -1868, -119, 1755, 1001, -1670, -2002, 112, 1572, 727, -934, -1375, 720, 1476, -144, -1402, -236, 875, 991, -472, -1284, 51, 854, 291, -946, -913, 995, 1404, -203, -1592, -418, 1487, 1219, -575, -1399, 163, 1961, 703, -1254, -1138, 676, 1286, -66, -1135, -851, 1303, 1593, -454, -1195, -54, 1565, 656, -1154, -1111, 465, 1686, 411, -929, -686, 962, 1167, -161, -1566, -475, 885, 651, -813, -1288, 393, 1226, 424, -1252, -1384, 507, 1249, -335, -1288, -710, 865, 1066, -590, -1609, -248, 1109, 706, -802, -800, 300, 702, 75, -1008, -357, 876, 514, -608, -1207, 390, 1144, 551, -1205]
3979a205O6J827P61j342j683P61J757M44j612r91R49J239L78j536n02P96P61m32
3997D36j013J78J039J49j392l41J220J047n35j636J03P20J286j205j536Q72J320
4014G12O38j853q23Q36K037o30j867j031J762J460l23j842m07J575Q73r88j270
4031a141K72J035P12j564p05R18J301m46j004n54J281J032j057j581Q87J394K98
4048A078j552q63J227J334k52j454q31J452J436j128r94n22J715O45j011j264
4064i84L23J617N26j796o01Q09J072o07r23N4Q81L07o70p32K42J572m12j261m20
4083a003J114Q86p49r82j29J041Q08j109j130O65J189k59j071l27P27Q18j65j587
4101a263j40J403P21r71j043O47J023M90j284l41J94J343k14j620K8J107J209
$$ y = [-1205, -1139, 688, 1449, 107, -1576, -815, 942, 1386, -226, -1217, -268, 971, 1349, -187, -689, 107, 868, 436, -577, -399, 640, 789, -603, -944, 276, 1323, 788, -848, -745, -25, 1261, 56, -1480, -608, 712, 1350, -503, -1326, -490, 1547, 917, -950, -1981, -219, 1241, 918, -924, -1331, 244, 1117, 129, -1141, -869, 166, 878, -686, -1391, -473, 828, 382, -622, -1176, 105, 1137, 80, -1501, -614, 780, 1078, -474, -1337, -110, 1224, 972, -482, -1313, 139, 1575, 447, -547, -1069, 646, 1291, 280, -984, -661, 956, 1482, -314, -915, -106, 966, 359, -564, -510, 371, 678, 8, -724, -482, 1090, 678, -583, -1003, 111, 997, 248, -734, -863, 178, 986, -123, -1253, -588, 601, 342, -729, -1056, -329, 489, 324, -1263, -1403, 0, 721, -250, -1293, -646, 377, 867, -417, -758, -564, 779, 565, -1055, -1027, 80, 1289]
4118A289j346j234M47J251O10j213j203J131J035p2j501m25J397Q22m96j230J19
4135f19Q08M74o49j445J041J323q7j699m17J294J153r95q04l05J063J127j245
4152A8j111O24R59N25j362o50O84R87R1j331l82Q54R29n75q51M5R72L50p59j026
4172a009O66J040l40r74j44Q76O84r10q85L08J340K66j226p34P45J293m14j177
4190e95m38R66Q92l05j462K33R78Q84j142o59J66R39L43j080n32P16R38m75q86
4209e19j23R18L65r10m92N81J224k29j025n78J173Q29n69j549QJ519N39q25j054
4228g17PJ203P01j138r49O86J044%j119n85Q49M71L7j389K67R19O05o90q50L48
4248c00J006J40j449J2N48J248n38j327K56Q33M45q80j005L60J386l2q17r87P14
$$ y = [1289, -57, -1291, -844, 407, 1017, -196, -1399, -268, 767, 695, -806, -1231, 166, 988, 492, -738, -619, 189, 663, 14, -1431, -390, 933, 846, -853, -1270, 24, 1177, 182, -622, -927, 136, 1263, 18, -1093, -469, 490, 1015, -347, -997, -313, 674, 765, -566, -948, -94, 835, 260, -591, -546, 426, 776, 17, -1009, -343, 697, 357, -617, -761, 115, 799, -111, -996, -688, 652, 918, -308, -1042, -297, 996, 582, -595, -1033, -67, 825, 520, -942, -709, 269, 1153, 11, -648, -482, 457, 800, -280, -812, -96, 842, 367, -519, -642, 276, 641, -269, -761, -180, 1044, 815, -210, -788, 385, 1214, 645, -904, -896, 623, 1162, 337, -717, -710, 493, 1194, 56, -893, -207, 837, 837, -282, -867, -18, 453, 490, -899, -632, 287, 892, 202, -648, -300, 706, 846, -603, -591, -43, 1205, 667, -660, -404, 429, 874, -6, -1011, -651, 735, 703, -114, -1101, -387]
4267c87J213k18q16o15J051P08q76q97K51Q95L98q83o93N89R56l31r42M0Q58K50
4287E51j86j210J57J374L09j209p84Q09R94K66j466l69Q95N43l12p26K03R85K9
4306H53r63n82K02J086j26p08n2O34N79o47r76J07J150Q22j407j005Q26Q66K90
4325I49j360m36O07J251k29j370j78P96N03kj348L43N74N60n77j051P65Q85j43
4344E39q75k16N18R70n98r36J04R11M43j126l72N50J029k46j116l91R66O89m30
4363D13j022j5J191K63q87p50L37Q50K79r58l17N79N88m21p62r7P05O80r13k79
4383e36K26N99K37p69m62O04R01n25q95j6R38M21r76p11P31J001k83q90l41O67
4403g9P76k00p83m62Q48L69n88p70M73J004R3p71p19P92R37j05j048o60J063M60
$$ y = [-387, 826, 608, -208, -823, 228, 936, 60, -837, -586, 309, 707, -176, -869, -280, 676, 345, -597, -557, 301, 551, 365, -845, -688, 686, 995, -214, -998, -189, 805, 1071, -395, -764, 131, 674, 362, -364, -161, 824, 853, -110, -692, -490, 596, 470, -238, -290, 344, 923, 276, -700, -593, 557, 1379, -28, -1033, -207, 659, 949, -411, -847, -240, 1011, 782, -588, -766, 30, 533, 531, -817, -474, 100, 660, 83, -968, -203, 682, 539, -336, -552, -34, 936, 338, -598, -494, 417, 860, -266, -638, -88, 941, 695, -421, -812, 154, 843, 413, -609, -624, 567, 830, -57, -807, -470, 380, 659, -299, -616, -37, 551, 130, -632, -729, -24, 656, -257, -536, -310, 289, 526, -243, -705, -101, 800, 275, -620, -636, 302, 723, -253, -964, -233, 768, 485, -405, -746, -79, 697, 497, -286, -748, 100, 469, -119, -889, -416, 588, 681, -90, -809, -17, 920, 815, -233, -893, 170, 630]
4423F30l93j098L62R58M82p46j015J33J159J32r25m78P77N48l20n19m68P78O16
4442F13j87j202K46P99M54r66m63L96J011r9r62l69O12O14n14l98n8R02K15q43
4462a99n02M56N55K29j038m77R02O30n93m90j7R39l81k42n31M25R71k98p09k85
4482f55N38R13r91n88M22P69R5q41m61M52P49j0q83m99O48J056k56q51j20Q48
4502C35K75m43p73O2O97J06o14n92O45Q52l17r48j44R20K45n86m38K18P19J79
4522C98p07p83N53J092m13q98k15N64J001k85p64l89Q67O63n51r24L82N94M2o58
4542d31m1J48N07j12n82m7P88j21j13o65L41N94K59q98l36P35M22k51j267J23
4562i47R98R65j393m58M77R94l8p03p94L07N99L99r53j50O86N01o65n07L24N66
$$ y = [630, 237, -861, -499, 459, 941, 195, -820, -687, 472, 604, -321, -799, -22, 526, 206, -313, -781, -3, 613, 426, -776, -530, 269, 723, -243, -706, -310, 701, 602, -360, -729, -117, 497, -17, -415, -473, 429, 644, -199, -701, -245, 310, 539, -499, -976, -74, 556, -37, -527, -544, 395, 14, -228, -759, -334, 637, 339, -370, -655, -117, 796, -195, -783, -361, 408, 503, -338, -799, -347, 402, 392, -491, -990, -342, 714, 458, -393, -513, 335, 610, 167, -606, -544, 153, 259, -355, -947, -302, 550, 233, -715, -859, 61, 306, -280, -718, -500, 219, 398, -309, -1092, -539, 553, 140, -758, -973, -409, 592, 307, -457, -846, 21, 684, 133, -791, -409, 185, 227, -431, -472, -324, 183, 71, -511, -558, 230, 109, -4, -669, -328, 266, 525, -373, -709, 26, 448, 197, -1070, -947, 51, 1016, -377, -835, -358, 636, 598, -105, -899, -592, 7, 406, -547, -697, -11, 490, -175, -682, -358, 208]
4582B08J20p65j28O55N32l44o90R3P93J10p83n64L17J013N98j262o62P12R86k56
4602F83j089k37O11P84n42p67Q4O34N88o33p52K41O22K11m42l84N6J039m42m37
4622a72j17M48M77p08m69L24P84m38j60k75O51K74j40o31L9N33K71l62r48M85
4642a34R31K60j065n66O90N72j85o95l51P02N17m65m82r8P56M58p02q74O91N69
4662E29M4q83k04P60K86k34o58J99Q16J49q50m78L82P45J9r49j63J018K62k63
4682E27r01o7P95M42q01n89N20L84L45o28j137J019P93l49o27k24Q03L09l86p16
4702d88p3J352N1o75l45L85N79l1n85o40P51P83r86n08L18M06L68p89k91L39O57
4723E78m9n43n93R22N23l63j121L58Q51M7m24q85L39J045J74j026l62M32P84n46
$$ y = [208, 328, -437, -565, 90, 622, 278, -412, -319, 474, 584, -199, -763, -446, 567, 1165, -97, -759, -47, 939, 683, -406, -643, -32, 752, 210, -557, -473, 161, 749, 116, -636, -395, 227, 438, -4, -388, -332, 707, 265, -172, -289, 159, 636, -72, -541, -217, 567, 129, -31, -306, 345, 619, 479, -152, -113, 420, 691, 329, -619, -134, 797, 1057, -8, -574, 116, 688, 503, -192, -543, 159, 676, 211, -271, -369, 387, 845, 143, -731, -40, 529, 573, -310, -514, 246, 532, 298, -360, -161, 655, 804, -46, -524, -142, 603, 622, -327, -490, 528, 790, 527, -374, -441, 354, 796, -5, -594, -74, 310, 655, 27, -1110, -91, 702, 353, -274, -498, 305, 614, 228, -488, -561, 791, 842, 167, -178, 207, 786, 755, 170, -470, 281, 1064, 78, -430, -112, 294, 662, -127, -418, -79, 578, 529, -14, -607, 315, 838, 475, -646, -288, 563, 610, 186, -699, -360, 685, 859, -167, -529, -97, 687, 141]
4743A41k75n7M74M33l70o74L23M77K05j032j47N30P05j50p79l22O50N45k53j036
4763f12K88R39r0l92o32O25N99m75m77n51J019L37l16l06L9N86M07r95k96L50
4783D7L58J37o80m66Q57K78j11n64j43P44R0k67r20M88R26l21o01j11L47M78j78
4804C88o88m33J021N08q29q45O64P15N6p52n73J028K46N1m84o59R00L63o52o88
4824f63M62P37M9q52k15Q64J71J51j106k34Q05Q06n83o99k25R47L35o08n80J88
4844b50P96K4p34k95N38M90k80o98K58L30J35k5n56L63K12j16l72L7Q0O10m31
4865A16m59n29J402k7n70n21K52P48L39r96n59P23Q82l29r94J52M62M64l55r80
4885g79M81Q27p3m87o44L92Q85l17p82J20M56M81m52r67N64M35K97m04j026Q66
$$ y = [141, -134, -191, 283, 716, 346, -328, -5, 472, 677, -355, -502, 28, 733, 583, -196, -518, 132, 677, 424, -612, -324, 615, 525, 133, -499, 126, 725, 250, -227, -778, 241, 578, 262, -44, -5, 581, 988, -7, -303, 47, 405, 542, -138, -604, 253, 531, 420, -144, -287, 457, 547, 280, -640, -152, 774, 453, -148, -259, 88, 566, 388, -300, -733, 288, 796, -33, -878, -214, 501, 557, -195, -768, 260, 506, 557, 73, -586, 314, 677, 25, -663, -201, 536, 585, -267, -482, 382, 553, 704, -402, -636, 169, 975, 392, -307, -532, 415, 750, 142, -438, -250, 546, 570, -164, -459, 79, 569, 289, -409, -151, 179, 314, 289, -267, 96, 308, 192, -180, -143, -63, 547, 116, -343, -872, 530, 503, -67, -588, -336, 412, 751, -245, -804, -81, 801, 472, -522, -370, 92, 556, 201, -779, -298, 529, 456, -31, -675, -283, 602, 285, -497, -377, 79, 560, 108, -859, -295, 140, 437, 33, -993, -127]
4905a27R51l18j007j35Q27M24o27p92L61R18p6l70o40O8P03J53k73r35P26R07
4925G38m03n83j88O60K47n94J0l04J109n61l16n05O09O80n45o93K64N29M92m18
4945B28j039K35R91J15r83j12L72O16n1q42j16P39M60n21o03K39M21N50n17o91
4965e09L86M16J9n01m00P30N39o13o67J89O64K49n38o39M54P53p6o35m45O97L80
4986D53n4j008k68J172N15j137k82K26O87km24o34Q84O66n58o79l23J013R9k19
5006A27p69L59O59l3k84n20O28K43n3r09k81R81N62l66q66L16P23kq32j08K76
5027a49Q86l66n60m02N68Q83m58q42j68Q78M26o82m73J05P74P9p64mM91L13j9
5048E16o22k23R17J49r91j61L75M31J12n30o08O79O86n25p38j06R92K86k82r63
$$ y = [-127, 824, 506, -501, -636, 191, 615, -12, -804, -443, 475, 399, 29, -611, -543, 160, 313, 40, -895, -169, 738, 335, -248, -436, 224, 471, -123, -113, -417, 692, 131, -185, -690, -81, 599, 54, -639, -375, 154, 646, 228, -811, -576, 415, 530, -453, -565, -193, 423, 372, -470, -586, 153, 613, 92, -511, -272, 149, 699, 182, -509, -123, 293, 312, -189, -589, 141, 680, 67, -600, -411, 253, 502, -36, -675, -221, 532, 456, -179, -624, 73, 453, 399, -609, -877, 295, 810, -327, -609, -383, 304, 302, -122, -756, 128, 794, 236, -443, -766, 247, 346, 127, -642, -283, 376, 343, 59, -461, 167, 410, 357, -552, -833, 148, 710, 344, -522, -206, 517, 515, -317, -425, -149, 737, 371, -189, -591, -23, 860, 402, -440, -608, 270, 696, 14, -459, -354, 420, 499, -265, -269, 222, 535, 516, -106, -329, 588, 737, -254, -415, -40, 391, 503, -27, -635, 44, 730, 205, -533, -639, 353, 639, 357, -606]
5068f06L30P21N18j106k1j11P47R3o57l85P30N34k96r85J74P73r3l01l34K55Q33
5089H13k73p32P2O53L38n61r58M35P21r9n09m64K48J068O4j127n04Q79P74o44
5109A94m07j17Q75K91n32r78L99Q33J93r19k84P52M23k92m87m17O44L95k95j009
5129g38O50M58K15o68m11P45M22j51q95j14P87N26r43p53N19J001l9p27o26K64
5149d78J426j72r93k87O70M48k69o48R1N76K22l47p11K50M99M74o28m61M89J71
5169C22k9p39L34N18K86p40j49J05N82l7o47n60R70P99q48n14J44P29L61o57n38
5190c08L24P41K69q58n05K35Q71j42n35p05Q34M12o56j40j11J032m09m64j63J44
5210a34N71j20n29J18K46M91n03o86K54Q69M07q83o85O40O28P3q72l33P49L36
$$ y = [-606, -276, 445, 963, -143, -164, -275, 472, 565, -92, -477, 253, 787, 491, -494, -320, 453, 360, 59, -275, -20, 813, 540, -192, -120, 533, 871, 310, -648, -213, 508, 409, -100, -564, -316, 752, 816, -311, -815, 64, 838, 194, -213, -330, 545, 836, 304, -674, -275, 558, 751, -168, -452, 300, 723, 431, -56, -473, 171, 566, 271, -738, -88, 370, 585, -83, -494, 251, 673, 522, -373, -487, 300, 826, -117, -870, -351, 650, 611, -116, -742, -478, 948, 776, -217, -504, 166, 614, 345, -303, -212, 364, 586, 239, -472, -222, 277, 751, 123, -338, 151, 322, 293, -446, -112, 406, 692, -48, -197, -92, 490, 453, -194, -754, 216, 1015, 167, -347, -203, 526, 887, 230, -308, 16, 757, 1026, 168, -337, -102, 769, 627, 92, -613, 221, 633, -23, -163, -274, 758, 349, -115, -278, -134, 437, 317, -212, -94, 152, 643, 140, -546, -292, 577, 984, 101, -584, 56, 684, 757, -115, -448, 301, 637]
5230F37k27o96k13J195P0n82o67K96O54K45n03n71M73L31l34r3j34O21k13l75
5250h6j53K13O39l04l29m18L54Q13m12q18j45Q03J97K0r60K18J179K28j268m75
5270g04Q12N40J1p19m65O76O26k62q30L4L76M13n87l63J07O89J25o32k24M52N08
5291E83j66q35K33R75l41n32n50N17Q69k73q32l77O31Q99l50j041j07Q63L98m66
5311I8r05M39Q16J23n46o09M41N20q7n23j17L86N33l98o09J82Q70K61j032k63
5331d20K06P28l35n44j66M16P03o04m84J30N72J91m17m00L32P01k25p34k37M23
5351a64Q86o62l98j84Q30L70o92m45J12R49l79q66K16L71M66j21p91J30O52J56
5371D36m40n92J78O15L33r07l88N72O45m69l23k78Q40M81r41l94j32Q27K50n46
$$ y = [637, 410, -286, -499, 696, 766, 184, -483, -187, 467, 712, 209, -362, 111, 442, 108, 15, -119, 502, 289, -86, -239, -26, 613, 309, -20, -438, -84, 729, 317, -501, -646, 157, 354, 374, -586, -368, 811, 1039, -229, -704, 108, 648, 659, -60, -525, 151, 777, 515, -315, -281, 95, 508, -79, -442, -335, 354, 479, -153, -377, 75, 583, 417, -418, -185, 790, 449, -83, -633, -116, 753, 480, -352, -729, -98, 801, 451, -590, -697, 166, 564, 98, -807, -368, 448, 571, 25, -584, -143, 377, 290, -233, -350, 36, 569, 171, -438, -256, 614, 875, -157, -420, -214, 514, 179, -365, -531, -115, 588, -16, -500, -370, 202, 393, -24, -424, -92, 609, 384, -350, -587, -164, 722, 60, -338, -522, 308, 678, -14, -459, -347, 602, 223, -643, -427, -56, 410, 289, -502, -372, 280, 436, -4, -596, -418, 197, 530, -377, -765, -193, 452, -17, -340, -618, 222, 703, -238, -632, -764, 63, 313, -233]
5391b33k10L23K47R0p13m00R33L40l05p04JO52O74j261J10L85O91k16p51l35O63
5412a9O10k27p19o3L31N09p2j124K11Q48K65p94k22P5R06j98r75R5O17N46j89
5433D11r65K60O06k28k25l31L67M45j30p64k19R92J87l12q57N25P80L6p97m17
5453f36O68O15r0r58j83P78O29o29q32q0Q99L79o63l80K56P77l70l92n57Q75K34
5474C40j40m32j51Q74K1m93n79N21M57J90j022r5O78N19l16o84n4N79N12m28r84
5495f87M10N68L65r47p45P13J008P9j003j24K32K68Nm02j04M63J81j21q46L62
5515c25R80n44p03L30J87P11m11o86J34O50L19o75o24O32P86j83n65m11J64Q42
5535F08k29q70k86R61M94o71m35J20M52M64n39o29P52m6K31o31k49O65M80l31
$$ y = [-233, -443, -120, 127, 217, -496, -896, 37, 377, 72, -632, -631, 21, 695, -566, -456, -71, 620, 404, -347, -682, -19, 591, 364, -355, -418, -87, 422, 350, -774, -563, 285, 550, -244, -466, -391, 515, 317, -658, -563, 54, 600, 411, -554, -294, 312, 84, -141, -472, -105, 340, 210, -554, -773, 219, 406, 94, -763, -238, 542, 578, -219, -636, 32, 647, 557, -401, -584, 194, 823, 194, -638, -718, 181, 560, -103, -483, -227, 550, 180, -212, -769, 106, 340, 200, -232, -383, 491, 512, 19, -560, -39, 418, 608, -414, -509, 169, 688, 372, -312, -366, 213, 725, 297, -687, -277, 291, 656, -291, -1036, -323, 685, 764, -239, -363, -131, 137, 142, -260, -364, 99, 280, 159, -687, -325, 655, 111, -592, -262, -75, 636, 225, -461, -327, 323, 642, -33, -657, -25, 761, 578, 13, -398, -234, 608, 379, -491, -777, 184, 678, 7, -428, -308, 144, 608, 69, -560, 192, 146, 377, -254, -503, 162, 642, 311]
5555C11r63K82Q36j59n18k73M18O39k14j157L57J086On04q05L34J097j65r58m45
5575g95Q25N07K9j035k48O96Q60l29p30k10P70M91q75m53J59O22J91p20J5M23
5595A93P98o31r33k60J226L87o90m66K08Q35j55q74k14M36J291k31r82n54R30
5614C14K25j46j094K31Q99M09p11q33Q06M95k89n64j83K71O15m5n56m45J306r6
5634F09k48q61J61R47j82j077Q9O63P23l58j059m9J188M87j154o14R96R9K36n93
5654Cp99O60P53N5o94m42P45Q1j36m11l11R36J88o72l94K41O23J8q04K59K41M63
5676F03l11r40K23J002oo31n81L84P59j49q25n37J128P26m17j091j41R00Q12j034
5696a26l34K58N83K95p87m36K40O94k3p99K15L47M39q22J1j54O90J60j017kQ20
$$ y = [311, -652, -370, 466, 307, -211, -484, -66, 573, 359, -798, -441, 645, 651, 147, -658, -324, 773, 608, -350, -795, 30, 537, 566, -469, -717, -21, 839, 510, -220, -430, 340, 831, -44, -497, -338, 284, 475, -245, -230, 193, 991, 360, -573, -833, 393, 780, 90, -376, -168, 667, 512, -362, -576, -140, 1151, 920, -62, -616, 314, 539, 393, -701, -470, 429, 838, 127, -706, 100, 595, 306, -258, -441, -170, 445, 400, -156, -601, 705, 609, 361, -500, -339, 608, 426, -651, -562, 101, 824, 466, -593, -642, 546, 1033, -121, -735, 261, 360, 596, 3, -796, -136, 617, 672, -22, -464, 281, 362, 226, -185, -496, 440, 628, -44, -438, -197, 426, 444, -360, -101, 140, 603, 292, -648, -425, 577, 571, -60, -641, -257, 502, 353, -472, -1009, 119, 845, 428, -663, -804, 96, 908, -126, -460, -202, 381, 676, -111, -547, -307, 387, 364, -435, -220, 127, 566, -256, -245, -399, 291, 451, -566, -568, 252]
5717B52L60o03o31R9Q33M4k71q21M07Q17J90q74o38N59P21q7o77n18O30P15k13
5738B94p78K68K92M7j76m84K61L55J47m19j46P6N08m9p61n1N74O04p73m39M67
5759a83P79p9j070O3O37N08k60j168K96O49P12o92j140K37J116k8n92o17K73J019
5779D60j70r33J66M03J50j37j43j27P23O9j020J3Q2Q16n4q85j99J002K55l92o41
5800e62J54K15L60n36m17L08P92K2q76m01N15N93o6o20j71Q04L42k73p46m1O53
5821D9J52m99k34M14M33m82k9n26O68N41n91m59L51N92n3m33n90Q67O97l44r59
5842d35j65O80N75p24p78K12R56K08n07o86Q0J047P5o68m36K26O69j30n33j49
5862d83N26M73r44j60N81J29Ko03k14N51M15j23p58j9R46M7m04o53K35P13J53
$$ y = [252, 612, 9, -622, -523, 310, 354, 83, -738, -331, 486, 676, -198, -836, -277, 444, 357, -320, -838, -208, 507, 294, -484, -216, 76, 123, -53, -537, -276, 79, 226, -193, -339, -263, 245, 196, -565, -616, -42, 562, -211, -650, -183, 596, 517, -553, -490, 147, 655, 395, -773, -477, 172, 884, 192, -948, -711, 405, 377, -215, -832, -559, 460, 290, -643, -477, -74, 76, -61, -204, -331, 392, 461, -559, -546, -464, 352, 298, -587, -786, 216, 471, 79, -562, -408, -193, 167, -369, -786, -478, 314, 336, -540, -941, -426, 167, 101, -519, -690, 114, 456, 183, -563, -604, 49, 201, -298, -532, -118, 315, -167, -196, -722, -54, 487, -104, -563, -212, 380, 327, -106, -696, 171, 868, 524, -435, -600, 80, 655, -69, -847, -635, 321, 529, 22, -664, -584, 463, 538, -130, -566, -340, 329, 199, -334, -483, 43, 516, -428, -588, -7, 122, 124, -479, -693, -142, 273, 150, -608, -627, 319, 366, -38, -691, -456, 257, 410]
5883D10p39m68O16R51k88q74j49N31N71j68q10j21Q30K16o76o47N87N18j8p42
5903d70K27K87O15o99k53J90N47Q7o69o15O55P64m66q10l73J056M81l00q19M3
5923e22J019J99q26m93K86Q15o7p54k62K67Q78k98n39l29O29L66k00p53L31Q03
5943E50m08m50k28O09J80q2n26k03J014R3l61q55J88J112K87j269p52O34J178
5962G11k24r38l15Q23L28K68j203L22M42N12o20q31M74P75k5o86l42O56L35r8
5982C64r71J20J010K97q97l23K25R23l2q60n22O82P29k35r64l11J251J60p38n00
6002e92K59R16J80o96m36J71Q90r7n38o10R58K11m25o70K53J85O84o12o55M81
6022a43N25m3o51m09O82N69o58m80O3J022K60q52q86N95Q99l8p95m15Q99N82n22
$$ y = [410, -329, -797, -181, 770, 482, -392, -541, -10, 561, 393, -417, -538, 292, 508, -168, -815, -228, 290, 272, -470, -243, 44, 659, -40, -293, -103, 444, 531, -138, -753, -98, 666, 200, -610, -983, 73, 554, 254, -565, -522, 497, 696, -130, -623, -337, 478, 411, -343, -605, -338, 540, 242, -297, -626, 3, 369, 169, -584, -253, 550, 142, -308, -536, 73, 253, 171, -355, -558, 456, 549, 188, -667, -479, 633, 920, -349, -1101, -467, 711, 487, -451, -766, 57, 385, 653, -550, -228, 214, 726, 106, -725, -251, 524, 499, -187, -529, 127, 462, 364, -607, -487, 523, 820, -77, -400, -175, 748, 716, -144, -666, 16, 745, 510, -454, -765, 486, 646, -92, -592, -333, 583, 763, 67, -369, -198, 692, 595, 57, -553, 405, 616, 191, -479, -226, -41, 643, 31, -624, -143, 382, 339, -312, -721, -39, 530, -128, -608, -545, 477, 737, -115, -1001, -406, 493, 455, -340, -755, 144, 726, 204]
6043B04p56l04P60O15l38r75J65O80Q10p88p27M78P70k25n92k42Q72R2j89n37
6063b27l76J076q1r47o2J30J283l23o80o72J312J10k06j098R9Q32P29j051o85
6082h37N79R69N1r54l92M81P37l01q01q9P02L55m71k94K83J92M10j126J50M79
6102A23O02n99q90N38L10O27o50n80J12R64J71r08m64N23Q75J6j114l00J039K99
6122F94m43o46k76J054K42n02p23N37L16J98l41o32N67O12m48r53M25Q07J83q66
6142a95m70N12N96J28j044l24R61P99n96q67k31J148M89p46r90o3J184N53q76
6161c2r05M97Q34R0p44n83Q46K37p4o80J82M75J63p79K8L74O39j15r58j4P52M81
6183G14m61j112J4J483M39j229p15K82J264N8j014q09J063P61rq17l03N92L60
$$ y = [204, -552, -856, -96, 519, 181, -794, -629, 51, 861, 73, -654, -176, 594, 369, -223, -465, 407, 499, 310, -227, -603, 473, 392, -555, -617, -487, 796, 473, -207, -879, 433, 543, 337, -761, -662, 170, 899, -152, -837, -258, 711, 762, -192, -584, -103, 634, 333, -468, -557, 145, 500, 29, -265, 18, 210, 620, -506, -356, 123, 725, 126, -764, -226, 84, 711, 61, -519, -407, 557, 728, -180, -644, -121, 754, 770, -344, -644, 395, 694, 251, -395, -671, 383, 625, 123, -600, -63, 253, 451, 110, -522, 45, 657, 209, -744, -319, 488, 671, -195, -665, -153, 443, 571, -473, -797, 164, 963, 367, -500, -731, 417, 906, 160, -830, -893, 291, 844, -32, -937, -440, 394, 484, -260, -843, 3, 240, 166, -514, -332, 143, 306, -473, -445, -71, 568, 453, -505, -519, 233, 714, 253, -859, -845, 638, 1077, -152, -867, -585, 679, 737, -277, -1086, -23, 738, 729, -88, -391, 201, 561]
6202E61m80n55J01M60N96r39k50M97M06j73j011J37R89J07o33l28J01J020P0r97
6222c21q27Q84P10l8p50l98R13O59o33q31j29P47Q21r32o34O99L69L25p35o10
6242g11M80O80j53r84J48P34K87m62o38O60N46j4r97l51P52J152p80q81M3O70
6262A81O28p29j027P79Q71k8r63m10O80P32j75r81n09Q87J122r01q12K6J130k
6282D99l18m57j06Q71Ro36n33O56N01n00n25J72Q02j5p19l31K73P67O8j124m18
6303a064J161N82l85r21o2J214M0m43j209M59Q55M44p53o06N24Q49l90q56n7O54
6323C6N48l81p40K85Q95N1p71m76L56O68pj016p8Q70M00o35r27O56Q48k02q32
6344d52l81Q20P29j73q58n90R65P97m56j002j37R30O88o06j146L65J090Q4r70
$$ y = [561, 81, -474, -373, 87, 683, -256, -506, -9, 397, 224, -787, -650, 339, 446, -187, -515, -414, 606, 676, -321, -1148, -264, 446, 408, -342, -740, 173, 832, 199, -632, -761, -14, 807, -125, -759, -60, 309, 634, -101, -711, -231, 449, 296, -688, -540, 194, 481, 19, -619, 41, 587, 573, -424, -775, -23, 1129, 349, -532, -489, 181, 809, 80, -947, -168, 703, 675, -288, -698, -18, 714, 539, -442, -951, -64, 1058, 157, -655, -629, 501, 499, 181, -276, -382, 489, 498, -138, -671, -15, 486, -14, -539, -367, 435, 420, -299, -630, -357, 410, 478, -646, -1064, 97, 679, 294, -627, -689, 525, 565, 122, -1087, -628, 227, 671, -82, -688, -164, 685, 295, -561, -618, 36, 584, 203, -537, -252, 643, 694, -77, -553, -197, 471, 464, -552, -630, 240, 640, 5, -922, -266, 582, 380, -452, -833, -13, 716, 543, -315, -905, 60, 857, 401, -601, -738, 192, 880, 274, -872, -507, 583, 667, -303]
6363c03k65L78P37k07n47j00N56M79p02o98L81P60k43n65l98J055K58m39o81k92
6383h36J368J20l23q56J11P88M54j090p68O22J317j53j183m24J015M92l44o76
6401c66R6L82K3j44p15M09P78M1j038j23Q12L53l02p01J7R72K39r18l78L01J045
6422G83j81r50l91P14R81m68q46n18Q90R27o53j029L86P60L75p96n58L3O93L48
6442E00r92j71P76O41r14n19K57Q38q2p20l80P16N71M0j247k96J240O11q31q22
6462g84nJ104N04p45j012K26J266J05j102l08O53L36J87o15l84P17O30p80p68
6481g75O34P34j30q30j37P02J88j02p72j15J146K34o91q55M33Q05N21j318o17
6500i45P03R73Mr89k20M82R74p97o36K36M37L57l57q61N15N79K24n85o52P27K33
$$ y = [-303, -568, -190, 547, 340, -207, -307, 249, 728, 26, -672, -291, 469, 226, -339, -737, 318, 576, 137, -544, -836, 532, 652, 329, -527, -416, 372, 826, -264, -1032, -410, 907, 754, -429, -853, 162, 654, 310, -366, -270, 112, 135, -9, -724, -315, 463, 504, -534, -657, 155, 508, 206, -495, -478, 494, 733, -185, -563, -262, 783, 602, -348, -739, -25, 956, 488, -358, -876, 14, 941, 288, -741, -355, 405, 780, -16, -574, -541, 152, 500, -492, -663, 113, 754, -160, -679, -422, 416, 334, -386, -766, -50, 521, 561, -686, -982, 258, 869, 38, -784, -789, 315, 819, 74, -938, -712, 554, 659, -443, -751, -98, 238, 425, -190, -574, 143, 773, -7, -775, -141, 593, 463, -367, -504, 198, 386, 284, -488, -603, 543, 777, 86, -769, -336, 469, 990, -328, -945, -242, 731, 735, -254, -474, 8, 982, 185, -451, -215, 222, 579, 222, -639, -124, 455, 679, 94, -558, 169, 402]
6521D02J4q80k44J109J29n14o53M94J119k98q61n41P92N48k59j075J01Q11K94
6540D88m92m31r0R81K65q11n90K63P84o7q53P4M69N79m81o38J50M98L21o72k74
6561e27N67P59o26n20j22N04L83m26p84J77J130L94j273m95L59J291k80n55n56
6580f00O16N49j04p36l30R77N44q72r67O17R16K9j054k86Q44M91j47p34m52R50
6600B51L02p04l22J28J020K33j298l28O90N82l14j024J80J015M62p49q21J65J326
6619G94K02j066o30J63R13K26p81p96O24J067r3j111j09J067K05n97l45r5R87
6638F25l1r94J07K29P14m24n10j56Q85m2m66m62M0J157k04j034l8N48Q16l57j255
6659h52k8J078P16q36q15R2J197Q3p21o60L29P46K18j129P5P54K36j53m80r2O73
$$ y = [402, 416, -464, -708, 401, 530, 16, -637, -143, 976, 678, -183, -724, 68, 616, 357, -718, -617, 194, 488, -4, -435, -525, 456, 721, -90, -680, -417, 367, 300, -553, -479, -10, 569, 88, -550, -400, 98, 419, -253, -527, 40, 799, 173, -347, -469, 35, 418, -8, -792, -615, 515, 909, -364, -859, -500, 791, 511, -44, -600, 16, 565, 461, -275, -605, 372, 916, 44, -923, -306, 610, 639, -415, -701, 143, 634, 487, -247, -699, 251, 553, -151, -473, -345, 675, 908, -390, -718, -28, 554, 240, -784, -604, 411, 873, 124, -697, -532, 794, 996, -70, -700, -537, 376, 602, -179, -975, -351, 716, 623, -488, -597, 470, 675, 78, -267, -362, 625, 594, -400, -293, -64, 650, 226, -284, -440, 445, 403, -63, -525, -485, 672, 468, -566, -604, -56, 760, 403, -852, -880, 198, 914, 78, -737, -645, 552, 635, -86, -746, -417, 329, 547, -582, -507, 247, 483, 330, -150, -242, 431]
6680D31k07l54n75R00J98J63r12k23R71L15n95q22R5J143L24j081o75N85Q82K69
6700H32j271l08O61P26j0p77l34J54R90n06p28K67N75K76n87m95L99O43n31m30
6720d54K28N30J98q80l10K65R56J55j167k80O38J162p17p97m52Q56R86n20j257
6739h60L3J135M37q68l73Q5Q33K29q00m1J38N78l01l74k55Q58jl23n37O30N67
6760G90l77q03l25Q31O77n77o16k44P50Q72o27j190N88Q93K27m56j014o3J122
6779D58K75q61n19N96P35k72r19j6Q17K72l02n40J82O09k40n21l00N91N23n47
6799B1p57J60Q52L71r44p78P65R32j79j106k36M53J009j99j028K4M97R06p61o44
6819f42p3J094K12r58K5J37O84J44q43o14Q45P22o14p41L32O95K45p40m28M00
$$ y = [431, 224, -130, -705, 195, 393, 556, -356, -579, 392, 707, 112, -710, -615, 528, 852, -229, -904, -319, 563, 832, -439, -747, -86, 640, 630, -147, -481, -327, 663, 157, -571, -304, 271, 547, -40, -535, -136, 507, -24, -454, -226, 304, 502, -378, -688, -423, 533, 688, -479, -759, -121, 1041, 324, -473, -925, -69, 917, 397, -860, -827, 308, 745, -123, -496, -411, 422, 651, -149, -190, -52, 526, 225, -149, -404, 454, 453, 130, -407, 223, 790, 413, -390, -715, 116, 793, 216, -400, -644, 106, 978, 351, -839, -251, 642, 869, 413, -601, -664, 458, 733, -128, -647, -51, 684, 412, -507, -523, 294, 566, 264, -276, -94, 515, 275, -246, -546, 45, 568, 21, -736, -576, 276, 647, -297, -1075, -310, 622, 443, -663, -899, -446, 563, 364, -664, -640, -143, 763, 2, -642, -715, 379, 591, -367, -342, -205, 479, 623, -220, -834, 11, 733, 119, -622, -290, 405, 650, -90, -518, -118]
6839a18P91k04r90J60K76R42m57j498N69R78M30q37p97L12J095O3q72o52J078
6858B69K53j71m89o55O92N99k09o42j09R05k0q49m6M18P05m56m44m64Q90O35r81
6879a69m77J77J293k81o12p73L94J260m00j088K67M20R21q57p88J23P43K01j48
6898B06p53J74P36K89q28m65N29N00k38n84j38Q38N85p25o95J73Q92k09q78J70
6918d21M84L56m98j45o91J068M66q15m18J38Q64L51r91l26K23Q52M00j018l83
6937e04N19Q76l37j045p4P15Q6k34p61L11P80j5k94p73O71M84p49r2J40L12M43
6958D59o59n36M77P34Lj255k39P48R10l96j249J1R45J035j052r38L52Q09K78q00
6978c63l33L43O88L55j503O0O91N47o17k07n1P55j47l26m03L26N49k68q40J7J002
$$ y = [-118, 673, 469, -521, -361, -85, 857, 400, -1098, -529, 449, 879, 42, -755, -443, 652, 715, -157, -809, 269, 522, 351, -138, -793, -101, 498, 289, -353, -462, 443, 423, -426, -472, -54, 651, 195, -249, -713, 177, 812, -169, -646, -469, 824, 543, -69, -842, -448, 812, 412, -676, -409, 11, 932, 75, -713, -590, 153, 354, 206, -547, -373, 363, 652, -176, -641, -112, 388, 150, -434, -572, 266, 851, 126, -569, -396, 496, 287, -591, -421, 63, 419, -79, -224, -915, 153, 619, -196, -614, -476, 388, 739, -252, -578, -355, 497, 897, -121, -504, 15, 891, 554, -491, -565, 150, 236, 2, -759, -448, 332, 317, 23, -750, -79, 405, -344, -436, -296, 16, 459, -200, -736, -259, 475, 478, -777, -1016, -268, 642, 246, -1003, -992, -47, 988, -64, -1002, -650, 159, 437, -363, -696, -353, 335, 690, -813, -753, -62, 485, -132, -339, -390, 365, 218, -108, -511, -185, 364, 96, -744, -727, 275]
6999B75O18q99p36K84Q16M92r26p96P42J013r3r27o33N79Q36k13q48p4N22K82
7019C14j60m39k50O15k09k84J80j45O89k3r18J85K65O11p40o01L58O49K58q92
7039e37m87P84R74m47j135j82J133M84o09q32K62O21Q93r66o81L32O74K03n56
7058g2k17L06L80k13k33k92N20K58p97k03O35M66k84q94K5Q27L47m40q26J69Q64
7079C26N26j063n35R4J234J06j052m09J70R44L4q58l66Q57K85j73q90R1Q60M07
7099E88p23o02M73O99l27o37J31N62P45j061n92J30J089l8p38m51L23J022k30
7118C63o46m79O16R52k67j033j27P42N35m94r32M95O01N17r67q63J381L17l57
7137C54n59k61R82K43p14o09L73L10L32l47o99N47P37m55q21K2O36O04m94q80
$$ y = [275, 893, -6, -742, -458, 358, 850, -76, -872, -130, 883, 790, -137, -770, -191, 645, 432, -416, -490, 32, 314, 154, -285, -535, 80, -129, -413, -233, -378, 311, 288, -630, -445, -180, 431, -309, -910, -552, 97, 355, -537, -1024, -240, 734, 287, -848, -1030, 103, 587, -22, -854, -592, 29, 922, -44, -725, -393, 281, 484, -72, -289, 17, 397, 184, -49, -341, 179, 437, -360, -563, 72, 538, 254, -640, -615, 212, 559, 119, -707, -538, 326, 852, -211, -746, -652, 582, 688, -364, -773, -603, 341, 375, -483, -849, 8, 293, 120, -770, -679, 181, 588, -135, -737, -264, 435, 108, -529, -398, 164, 909, -152, -744, -614, 475, 437, -301, -752, -429, 593, 363, -283, -762, -146, 806, 539, -494, -621, 121, 656, 162, -770, -275, 326, 843, -124, -987, 394, 711, 354, -205, -466, 516, 759, 45, -564, -191, 119, 451, 104, -595, -48, 689, 234, -587, -565, 71, 675, 181, -699]
7157f99L70Q38J01p25o93Q51M91J17q80m08L79Q01l78n64N0O59L04k28r11J82
7177c43J039o8r37p5M39L90m6r00Q1M77O13p93j35K01Q48m18k88o84O68P82l32
7198E19q66l77Q31N34r23j55k10R08K95o04n10K74Q14j19n05m71M31L30K93r83
7218d94N9N10J71l59m95O12M53j6j093r8Q67J14J46r38J65P90L30j090k28M54
7238a40O95L27q95p27N99Q48Q9j240K9N93O19l27q82j22P06M61p06n46O43M54
7258D78j65p47J22O31p0k82n85J48O70J4q19K6O74K95k06n51l84J059J41j67q57
7279e75%R01K38l97q11K39P32L03p37o12M20M69J25o54r4L05O17n65n23M78M92
7300C51J18q68j62R59J92k69r74L96O04L43l18j120K62J016n3p91l24J78R46O8
$$ y = [-699, -329, 509, 610, -115, -808, 43, 534, 651, -229, -637, -258, 543, 165, -399, -349, 310, 614, 386, -525, -343, 696, 628, -309, -384, 55, 445, 399, -501, -420, 57, 670, -123, -258, -57, 791, 373, 85, -599, 69, 851, 519, -347, -724, 107, 641, -282, -437, -647, 261, 556, -48, -558, -284, 530, 411, -94, -565, -134, 196, 489, -494, -435, 75, 246, -113, -608, 4, 457, 441, -652, -750, 117, 231, 377, -561, -396, 394, 724, -366, -594, -140, 555, 882, -13, -740, -141, 707, 796, -444, -415, 178, 797, 470, -412, -534, 172, 633, -73, -619, 24, 478, 313, -434, -312, 319, 249, -33, -618, -470, 200, 214, -605, -579, 95, 390, 184, -367, -751, 308, 449, 282, -575, -575, 326, 564, 167, -644, -405, 327, 630, -107, -719, -299, 170, 295, -359, -453, -148, 469, -96, -619, -141, 351, 469, -399, -561, 398, 590, 321, -653, -257, 347, 690, 372, -748, -486, 530, 477, -314, -638, -460, 486, 554]
7320E54j067l01M21J142n47o81j67M81N83n12l41K66N16p6l55k02M39N68q34n35
7340f48L92R55m05n86l12K74R59pr04m01O77N37l00o62j42O09P56l71j092L76
7360b95P67K7m20m32P8M27J85l38n05K72O82m69k43J46N30k47n11j78N22M17j68
7381B47q88j55O77P48m17j346M22J140N1m08j139M47Q90M88j229m09O11O48m66
7400h8k23m84M82P49n60l64MR10J15q51k73M74R62n41q26j12P41M22m01o64L98
7421a30Q20j65o11l66L91Q71l13q63j67O13P94p61r75L38Q48L40m06o94j27Q15
7441B52P2q36k27N53M47l87n06L4N55J75k53l54j61Q37K39j071jM26M24j16q17
7462g15J91N03O80q75q16L28J079K66j029m28P14J28K04o09k63O21P93o31r27
$$ y = [554, -513, -814, -393, 749, 202, -479, -646, -165, 418, -94, -435, -169, 347, 271, -84, -286, 153, 721, -113, -648, -256, 699, 294, -292, -604, -330, 629, 622, -282, -683, -6, 531, 231, -431, -573, 36, 792, 421, -671, -295, 472, 499, 79, -353, -275, 152, 337, -1, -506, -234, 448, -21, -264, -118, 412, 165, -346, -524, -2, 415, 247, -641, -796, -119, 629, 212, -1134, -712, 428, 479, 71, -1068, -621, 269, 757, -472, -881, -270, 378, -88, -311, -795, -313, 436, -124, -488, -484, 426, 541, -310, -583, -109, 853, 312, -514, -626, 115, 537, 136, -528, -130, 690, 525, -86, -452, -61, 810, 497, -366, -533, 80, 874, 113, -862, -524, 324, 664, 258, -436, -563, 252, 324, -512, -739, -186, 261, -126, -632, -598, -43, 132, -121, -475, -636, 201, 440, -631, -632, -206, 218, 102, -715, -524, -21, 659, -216, -1032, -704, 375, 641, -388, -816, -102, 26, 230, -379, -642, -21, 772, 141, -786]
7481g86O2J007L73o52p13K78P88j18p75J5L03N11r3p70J48P65L24p48n43N15L83
7502B74J18p66m13O74N03j54j109J96P11O99m17j043J82R67K59j030j87J73P85
7521D22J8p25m62O63R71o92q34L59L96J99m23j57L66L40k09n54n9Q19L47p52o44
7542f11K85Q94J39p70q54O28J115l92p10k21N04O28k18q51j96P38N80m74p31p9
7562e96O39M07q15j1M75j05K79l01n45P64L08q18k24K86O50K02p21l74J49P50
7582C99l0r82j34O79Q54o71p09q3J250L12p34q86N99P18k36m09o5K11L16l3n06
7603a40K47M0L28l24n13L4R99o27n22J78N23M74n13q52J98P57N74q62p38K48Q01
7624C10L19j073n79Q81O40J7o40n45P11N8J06p41L40P9P44o32j86J20L26k03j48
$$ y = [-786, -724, 283, 656, 4, -709, -431, 357, 239, -536, -521, -218, 293, 200, -570, -422, 343, 667, -81, -624, -109, 274, 392, -374, -787, -113, 390, 236, -873, -677, 34, 733, 316, -727, -545, 422, 681, -349, -536, -363, 422, 440, -285, -747, -84, 887, 195, -639, -280, 116, 315, -108, -265, 101, 441, 232, -322, -381, 438, 785, 33, -611, -326, 568, 707, -63, -917, -289, 826, 434, -276, -497, 7, 635, 417, -434, -630, 108, 688, 214, -517, -596, 43, 450, -365, -376, 99, -6, 273, -28, -573, 191, 499, -319, -543, -257, 393, 595, -126, -500, -351, 399, 369, -613, -747, -68, 786, 115, -594, -677, 573, 885, 151, -735, -136, 582, 346, -63, -128, 83, 399, 366, -140, 107, 147, 475, 151, -362, -328, 671, 44, -478, -300, 223, 697, 184, -668, -470, 287, 861, -1, -739, -491, 310, 629, -444, -1023, -142, 498, 515, -125, -670, 41, 99, 205, -536, -196, -117, 627, -5, -191, -71, 255, 52, -96]
7645i6j61N30M6j43o79K51R76J3q18p24N69J155l23q68m88R13P28m53j032J72
7665d32M78R11m34j078J67R38J75p43k44rO84O5n80k15Q67l9o65j27J57L15M2
7686B33l17l80M93N82l18o78j92R01q2j8n63k40Q00N36q49p02M39R10m5r66r7
7707e53M86Q94p79j12k64K50N16n06l57L68K73J01m02j01J91L52j24o15j6O64
7727B66K62n67k21m6R43l18k60p30O86Q99k47j123nP01M87o44n93N6P09O04q62
7748co70N90N23J36p38n41O50K31K19j125O4P87J2j32m59J93O18J14q18q8O22
7769A85K42k24p01Q7M98M25k23r14M59Q44k85m11q18Q76O43k46q08l87J051K90
7789E83k76r58J10P15L93l17o76M18K29L1j54n12M64J41Q5r71N41K69K74o45l14
$$ y = [-96, -257, 273, 319, 176, -503, -252, 724, 737, -81, -805, -236, 919, 596, -272, -760, 153, 881, 428, -604, -432, 46, 957, 523, -555, -388, 550, 725, -18, -262, -271, 413, 478, -102, -317, 550, 511, -154, -281, -124, 191, 233, -84, -464, 29, 611, 293, -385, -577, 324, 242, 224, -339, -579, 221, 757, -92, -794, -355, 555, 510, -456, -553, -67, 827, 48, -64, -328, -78, 438, -68, -425, -57, 216, 317, -85, -186, 5, 357, 233, -382, -398, 266, 528, -39, -260, -306, 637, 319, 59, -671, 15, 914, 667, -456, -461, 240, 727, 83, -510, -454, 255, 859, -3, -673, -83, 440, 576, -162, -703, -53, 178, 397, -728, -664, 123, 135, 3, -456, -263, 355, 469, -349, -437, 185, 427, 203, -498, -411, 87, 512, 289, -625, -166, 678, 393, -18, -836, 40, 683, 437, -371, -758, 293, 583, 307, -651, -541, 174, 567, 250, -426, -8, 221, 252, 98, -414, 50, 191, 276, -695, -154, 115, 389, -256, -570]
7810e70M66K60K46p07m07P28O60m26n89o52J280K31o69m98L16N52L99p30k81J82
7830b09P21q5o91l63R68J9k23k66j44N49j0k45m33P98K8k22o57M78P8M52n13n79
7852e49M00L31K86p29m42K60Q96l53k63l83L04R82n12m19m89N39M49m61j02l65
7872f20R16j71l43m18L42N04l32j09j84N68n3l76l29M69O87k94n73m91P00N75
7892D68n77m00N1M90K25k41n50m5P92L51n60p16P13L90km35l5j4M98r6o86M53
7914G4Q6J13n39n9L20M93j37o37M5J89R09o93q58K96Q60N1j037l18N71N97L2n78
7936b20m13J90K85M70o52k76O60K53k52n54K57O29J88o54m42M31K80J45r19K67
7956c27N42N55n77o94L6Q97m5m28j54L86J99l1o04k02J42Q01m25o85J1P69K72
$$ y = [-570, -104, 156, 402, -305, -712, 16, 676, 250, -339, -991, 289, 520, -149, -647, -331, 221, 620, -110, -391, -209, 512, 427, -264, -627, 341, 360, 137, -129, -273, 276, 266, 21, -412, 386, 414, 192, -465, 13, 91, 543, 30, -549, -149, 182, 468, -261, -703, -443, 453, 100, -163, -546, -242, 740, 228, -191, -680, -141, 308, -153, -255, -620, 296, 125, -218, -636, -294, 210, -122, -231, -415, 153, 100, -276, -605, -136, 551, 257, -316, -807, -107, 468, -109, -509, -458, 32, 257, 16, -534, -579, 213, 564, 4, -712, 1, 391, 389, -46, -81, -95, 403, 307, -379, 74, 160, 273, -266, -325, -5, 488, 351, -286, -241, -52, 857, 164, -694, -398, 462, 513, -524, -842, -271, 326, 358, -220, -633, -443, -158, 312, -340, -616, 44, 297, 45, -509, -252, 377, 565, -89, -531, -100, 180, 325, -594, -327, 215, 770, 193, -501, -465, 432, 387, -41, -195, 191, 390, 359, -245, -447, -305, 496, 71, -614, -603, 166, 438]
7977D38n93n63L43P85l6o53k31L76J36r1k56l50N88O31m42q38L21L53J43l85m60
7998g84Q64J93l66n01N7R30K61o53m09M7M16O06r51q3J05P64L0p49Q5J09P60l89
8020C42m59j3M72L11m46p13M97N07k61j90n36O07M36o62m02R9O92j34m50o5%P27
8042C59M4o56k98M61N33k05n21m51J277m00l66j92o0R45K32o47o22m0Q09J27q20
8063d91L05N3N38k89o56L56M91n6k75l33R3Q05m03p5k46K85K36j41n17J42O53
8084D75P1p34j11L58O86j54p28k66N43M22p1l85o64N58N39j11r81k9R23K14o46
8105i1p8k5O41k94k01k29L21O1k08j79J02J16J65m40k21N70K84L8r22M05L88J81
8127C84q2p70J98N74K14m07l91L91J24M31q75J67P6K31N4n07k82O36L99k52j89
$$ y = [438, -155, -718, -375, 410, 374, -279, -510, -134, 2, -89, -345, -695, -107, 524, 82, -756, -435, -82, 61, -324, -784, 80, 273, -93, -594, -537, 393, 654, 1, -408, -361, 55, 661, -290, -373, -268, 496, 526, -223, -138, -29, 731, 342, -117, -130, 342, 653, 207, -506, -9, 498, 237, 47, -489, 118, 554, -108, -510, -411, 281, 147, -303, -368, -368, 359, 403, -253, -551, -90, 443, 238, -283, -734, 543, 143, -223, -415, -475, 470, 702, 55, -567, -607, 202, 329, -491, -186, -133, 405, 116, -540, -184, 307, 251, -24, -357, -264, 541, 138, 63, -183, 102, 338, 197, -320, -178, 475, 546, -188, -299, 59, 745, 591, -137, -403, 140, 562, 491, 106, -558, 0, 539, 428, -553, -582, 341, 555, -91, -169, -194, 447, 153, -48, -277, 44, 105, -103, -282, -180, -64, 101, -339, -560, 10, 294, 332, -590, -185, 203, 384, 302, -468, -270, 304, 518, 111, -280, 111, 235, 666, -209, -42, 34, 265, 319, -188, -470, 166, 565, 313, 124]
8148A24l41M75P4p4l86J1L67j6m48j02N89K49p01m68L04P74Q5o01r57Q50Q93k04
8170D97p69j24K54L47M3n66R7M22p0R9k61m02N97J95m36n96Q21J30m8o22J01
$$ y = [124, -217, 258, 332, 258, -128, -117, 250, 234, -214, -316, 273, 522, -179, -647, -343, 431, 516, -85, -1042, -192, 701, 497, -272, -396, -142, 205, 248, -318, -221, 201, 131, 230, -31, -433, 164, 359, -77, -673, 148, 278, 230, -392, -291]
8191b91
$$ Imaginary data points
##PAGE= N=2
##DATA TABLE= (X++(I..I)), XYDATA
0@%%%Qj6Qj4K2k4L7m5N6p2Q8j04J25j54J86k18K52k93L42l98M61n30O06o93P90
28D20q96J012j140J283j437J606j796K002k227K473k744L043l369L730m131M574
44B403n065N617o243O952p766Q711r823J1160j2796J4852j7532K1188k6503L4983
58B0138n0696Q9604l62008p29737L79102O25140K77468l29931l35751j895K45632
69a72934N3895j34497m8340K21148K12051l2791k30007j36988N8715J63168R1285
80D4705J2773j3134l1394r6950p1459O2458J42938M0943r1570r6145J892M0548
92e4395k3587p8414r124Q0045K4845j19192j24954L1384J42472O4586r8691j49473
104c14498k5303J13969R3970l5476q1142j2856L4325K004l3516j1401M4339O6648
$$ y = [0, 0, 0, 0, 8, -8, 0, -14, 8, -16, 21, -24, 32, -40, 48, -56, 69, -85, 101, -117, 135, -158, 184, -214, 247, -283, 323, -370, 420, -476, 536, -604, 679, -758, 848, -948, 1054, -1173, 1300, -1444, 1599, -1770, 1960, -2171, 2403, -2662, 2955, -3288, 3664, -4102, 4609, -5214, 5946, -6850, 8002, -9530, 11658, -14845, 20138, -30558, 59046, -302962, -1032699, -653597, -28457, 249011, -80920, -416671, -418566, -172934, -119039, -253536, -301876, -80728, 131323, 98532, -131475, -268463, -209748, -46580, 44705, 57478, 44344, 12950, -84000, -155459, -93001, 49937, 90880, -690, -96835, -94943, -54395, -77982, -156396, -165520, -85475, -60630, -179822, -304776, -273392, -130920, -66334, -165025, -314498, -339801, -225832, -131862, -167338, -248480, -261336, -227011, -225007, -258523, -269924, -225585, -158937]
116a58937L2316j2459k4654k6724j6955N4177J37846R8642o0022j45070m4251
127a66091J19418J46856M638j21269n5557J06709J16540n0640j51091m0230J28427
138C7710J29664l9987j59044p2636Q0918P2036o1269r4954J2532P4112n224j02084
150a28226p0193N4270R4599j8721j22191n3729Q8730R2089m2521j23562m6587
161b76042P9409Q8609k6237r5077j6939P9946M5480n0704n2163L2021P5491K4739
173i1467m1210k8625M0571N2540j4511m3784K0562P6871L6313l9816n2125J2744
185g1937P1225M5820k7645l6471K6131M8803o693m3309l881M6989L6095k1427
197F3700m7684k440M5603J7205m1764l1188K8965M1551o129m5982l4557P816L1880
$$ y = [-158937, -126621, -139080, -163734, -190458, -207413, -153236, -15390, 83252, 23230, -121840, -166091, -46673, 100183, 104821, -16448, -72005, 34704, 151244, 100604, -50487, -90717, 37710, 167374, 127387, -31657, -104293, -23375, 48661, -12608, -107562, -95030, -20918, -26142, -128226, -198419, -144149, -49550, -68271, -190462, -244191, -155461, -63372, -105893, -229455, -276042, -196633, -108024, -134261, -229338, -246277, -166331, -120851, -171555, -223718, -191697, -116206, -91467, -132677, -161302, -120731, -68191, -82702, -126486, -105924, -29053, 7260, -32556, -84681, -71937, -712, 45108, 17463, -19008, 7123, 55926, 49233, 5924, 2043, 49032, 85127, 63700, 16016, 13576, 59179, 76384, 34620, 3432, 32397, 73948, 67819, 21837, -12720, -4904, 26976]
210B6976P954k6452k2400p235j5649j7034J0246K0013j4643m6475k4166L0932
222g7933M4867j9840q3818l5566P7875Q8237k8145j10039m7323P2545R6678J587
234b0875q3321m1324O1544O9834j7286n7156LN8019L8553k0096l1129J7653M4643
247A9062l134m3540Q037P5004L8383n5137o6053K1615Q7070L8201o3279p0902
259a4673L2042R0020J3013q2011n6609M0367O7850l713o8675l6749M5233M7995
271G4090l8959p6765o420O1266K8575m3800n1345O441L8731l251n2532k1262M9377
284c5854M3893k9513n5409n003L5833J3684k6942j6580L8820N1275j8465p8177
296h2438k9397O2705P1492j617n0668k0798L3985L3134k0904m0539J2431N9989
$$ y = [26976, 34930, 8478, -13922, -21157, -36806, -53840, -43594, -23581, -38224, -84699, -108865, -77933, -33066, -52906, -136724, -172290, -94415, -6178, -34323, -144362, -191685, -119140, -22462, -20875, -104196, -145520, -83976, -14142, -31428, -88584, -88581, -30562, 7991, -12105, -43234, -25581, 19062, 15928, -27612, -19575, 55429, 93812, 38675, -27378, -5763, 81307, 119508, 56229, -14673, 17369, 107389, 120402, 38391, -18218, 22149, 89999, 86286, 17611, -19138, 26095, 74090, 35131, -41634, -48054, 13212, 41787, -2013, -53358, -46917, -8186, -11437, -63969, -85231, -35854, 8039, -21474, -76883, -81886, -46053, -32369, -59311, -75891, -37071, 14204, -4261, -82438, -111835, -49130, 22362, 20745, -29923, -50721, -16736, 16398, -4506, -45045, -32614, 27375]
308B7375L0838k3452l3359j1536L000J1496K5340L1003R569l5891n2684J389O2928
321D6016L6942m5377o0280J4883P2212K7912o7452q5182J2850R9846M8371p1148
333B9593q9348P721P7991L3417n5250o9708N167O4443K8893m0012m2695K411J7117
346c0260k677q544Q552J7884r5k3964j4354J8826J6542k2196k1545L5429O0316
359C3914p95p0956n3966M0346R5139L2095o8507o1005M2334Q3234J994p7569m4499
372d8241N9040R6373J4308q5963p0085L2335Q0379K3239m4304m1286P650L6513
384E9958J5041k3241l0118p370Q202J4325K0218L317l8170m9261q85M8895L3787
397E4698k8392o1852j5265N5845M6518m0208p9375j1336O9338N7836k3248p0960
$$ y = [27375, 58213, 34761, 1402, -10134, -7134, 4362, 29702, 60705, 70274, 34383, -18301, -16912, 46016, 82958, 37581, -22699, -7816, 64396, 92308, 24856, -60326, -47476, 52370, 100741, 29593, -59755, -52034, 25957, 59374, 4124, -65584, -60417, 4026, 32919, -7093, -49788, -47377, -30260, -32937, -41481, -32929, -15045, -15140, -39104, -53458, -34632, -18090, -40286, -61831, -26402, 33914, 33119, -37837, -91803, -51457, 43682, 75777, 7270, -53735, -11401, 71833, 73827, -3742, -48241, 10799, 107172, 121480, 35517, -34568, -2233, 78146, 101385, 57081, 15795, 23445, 59958, 74999, 51758, 21640, 14270, 22472, 36797, 57015, 60332, 22162, -27099, -27984, 20911, 54698, 26306, -35546, -50811, 5034, 51552, 11344, -68031, -79367, -10029, 47807, 24559, -46401]
409d6401k7712M4969M6215j8626m5548R29M2730K1268k2308l1422m568K0741J6082
422c651Q18M712J2337j0614k9804k856L6585K7035j5686k9756L521L9316J9207
435E1164l9812m9193K0765P0918K5345n3606n5695J3883N6932J7760m7018m1495
447c0052K9892N8071l200o0043l2008L0795M1573k503l6044j4927K5844J9191
459B6589k4853l1212J0675L1208J198k5354r966J7386J3571k0863l2138Q403M5400
472A0044J5010m0570l6788J7452L7784K365l3585j8339K7734L5432j2653m4765
484d0879r237L8457K6115j9404k8629M475K7913P595k8723k2862K1865L2894j1081
497a501l8729o549L1242J7366k3853l3086L577L6206J3501l1966k8592J7357K9545
$$ y = [-46401, -74113, -29144, 17071, -1555, -47103, -46174, -3444, 17824, -4484, -35906, -40474, -19733, -3651, -2833, 1879, 14216, 3602, -26202, -29058, 7527, 34562, 18876, -10880, -7359, 31957, 51164, 11352, -37841, -17076, 53842, 79187, 25581, -30114, -16231, 40701, 58461, 11443, -30052, -160, 57911, 54711, -5332, -37340, -6545, 35028, 32525, -3519, -18446, 7398, 26589, 1736, -29476, -18801, 12407, 13605, -11749, -21715, -4329, 9242, -11621, -43759, -35356, 10044, 25054, -15516, -52304, -34852, 2932, 5297, -28288, -46627, -18893, 16539, 3886, -40879, -50116, -11659, 14456, -4948, -33577, -29102, -1189, 6406, -22317, -45179, -23314, 9580, -1501, -40230, -46779, -15537, 1829, -22024, -55110, -51533, -15327, -1826, -33792, -62384, -45027, -15482]
510a5482p137k8418m816K5295J7611j8168k8948P312L5102O819l3288j5635K9952
523b9801L0652j6111l9498m669M3886L3729k6971n0200M913N4807K4035l8259
535a3487m0753J4120M9726J8488l7192l8018J6472M3709O550l0660j5398J6103
547a0340J7004o653j5512J799J8302J384k0805n768K4829J3606k8053k9027J5617
560b3617M3342J0485m3413m5538J5571N6869J3799n1460m2281K3401M8667J481
572G306n0833l9297K2462M9405M282m6166l1938J3279K3464j890j5874n594O694
585f4700J900j0034m817J3163P564j8442j2761K5488L3375p747m0534j6131L8765
598e4911N0047k999n1322j7118N2928N4040j7578n8287j1823N6760N9237q014
$$ y = [-15482, -22619, -51037, -55853, -30558, -12947, -31115, -60063, -52751, -17649, -10830, -44118, -59753, -29801, 851, -15260, -54758, -59427, -15541, 18188, -8783, -58983, -54070, 737, 24772, -13487, -54240, -40120, 9606, 28094, -9098, -47116, -30644, 13065, 19615, -11045, -26443, -10340, 6664, 11, -15501, -13702, 4600, 5984, -14821, -20589, 4240, 17846, -10207, -39234, -23617, 19725, 30210, -13203, -58741, -43170, 13699, 27498, -23962, -66243, -42842, 5825, 7306, -43527, -82824, -60362, -10957, -6675, -52841, -84779, -71500, -48036, -49926, -65800, -71394, -64700, -62800, -72834, -77651, -64488, -56924, -75366, -88127, -62639, -29264, -37011, -77545, -93676, -54911, -4864, -7863, -59185, -76303, -23375, 30665, 13087, -45200, -57023, -263, 58974, 50960]
610E0960n4743j9878M1294M0879r885k9937R55K6772J5202j3677k0683j702J1580
623C7137J080m449R776Q171k4682l8195l194L5378K3008k6659m9120r529M1049
636b29K4044m2587n6549Q330O0699K7197m5653o2692l227N5218L4556l0896m6116
649g7905L591L7581J4932k1528k2316M320K0068R776n634j485P388m104j2108
662d7424R323K7593Q437k4830j9163K0630M3650R249m5195l8360L0794O4729J2382
675E1815n2043m0868K4457N2987P882m5479l1991L1962M9691m131n0275k7966
687c3959K2838L5604N091k1858j4091O692M479j3359m897J9248J4181j6232k0820
700a7083N744K1619L54k7688j6656K7868L9271r598n3869k4010L9732M6901p350
$$ y = [50960, -3783, -23661, 17633, 58512, 48627, 18690, 19645, 46417, 61619, 47942, 27259, 25557, 37137, 38217, 33768, 43544, 51715, 27033, -11162, -14356, 21022, 44030, 17371, -31749, -41278, -229, 23815, -18772, -75321, -66991, -6292, 20905, -24748, -87440, -90667, -35449, -893, -31789, -77905, -74314, -36733, -21801, -43329, -65645, -61325, -41257, -31481, -37115, -38600, -31212, -35316, -47424, -38101, -10508, -2071, -26901, -46064, -25434, 18216, 27465, -17730, -56090, -25296, 39433, 51815, -228, -41096, -16639, 36348, 44230, -1249, -33240, -1278, 48413, 44282, -5993, -33959, -11121, 24483, 29574, 7716, -6375, 317, 4796, -8563, -13460, 5788, 19969, 3737, -17083, -11339, 10280, 10634, -17054, -33710, -5842, 33429, 23831, -30038, -54048, -14316, 32585, 25235]
713B5235m8475k3534L2628M1721j0106m5296j1925L5980K7641j6878l2493l111
725b8613K6121J6859j4618j9556O076J4722n600j3174P244J7110l909k5330j4165
738c6833J7086K6982m388l3429j4152K5707K1611j9914l3030L075L6519J9185
750H419k8547m1229K113M0530J7711k7104k5699J2438K3714k708k3109p394K3911
763b6954K2440j2098k6452L094K8587R814j8543j1381J7570K4865l766k5705n893
776b4422L1940K8311j6024l0942N186L5333J5451k1429k2681J2164L0546K180
788D5613l1422j5913K6305K7503j4145l4973q299K6142J9983j7271l1220J320
800f377K9699N465l5088k4212J9481L1637l223l6397k1969J8854K8244o537k9864
$$ y = [25235, -23240, -46774, -14146, 27575, 17469, -27827, -39752, -3772, 23869, 6991, -25502, -28613, -2492, 14367, -251, -19807, -13731, 991, -4609, -17783, -10539, 6571, 2662, -22668, -36833, -19747, 7235, 2847, -30582, -44734, -19027, 2584, -17330, -50360, -47285, -10766, 8419, -20128, -61357, -59244, -18714, -1003, -28107, -53806, -41368, -17654, -20362, -43471, -50865, -26954, -4514, -16612, -43064, -39970, -11383, -1569, -20112, -31493, -13923, 10942, 7176, -18529, -24422, 7518, 35829, 19805, -11137, -5951, 29382, 44833, 23404, 723, 12887, 43433, 45613, 14191, -1722, 24583, 52086, 37941, 2968, -5331, 20811, 40794, 23523, -7697, -6377, 23322, 28787, -6301, -30513, -11032, 20605, 17382, -19015, -40984, -22130, 6114, -423, -30287]
813c0287o558K2948J0695j7434j7356O933K0524M296j7642j0908J5065J6004j0694
826a4414j6763J1097K6855J576k7036j5884K3939L6568k165l9373j6272L5409
838C537L5265j4638l9432o408L6211K9939j7404l9537n149L6145K4072k0049k9697
851g145J157K3778J1084j3241j5643L834J2000k262r185O308J1107j1272k1798
864a1278L133K7218J3770k3551l3521L650L9768J7957l4961l9394J4233M7620
876B4644J4115m0616m2724J2174N1710K0546l8414m1497J1642L9534J1278k4609
888b217k1583R790K2751L751j6093q450R710P865l498J016Q023k105j5402o687
902a3129J7735K6215n80l4283k3692K4742M2870qm1199k3998K6024L7627m439
$$ y = [-30287, -36845, -13897, -3202, -20636, -37992, -31059, -10535, -6239, -23881, -34789, -19724, -3720, -14414, -31177, -20080, 6775, 8351, -18685, -34569, -10630, 25938, 23773, -15600, -31872, 3537, 38802, 24164, -15268, -21676, 14535, 44474, 27070, -12467, -17616, 18529, 42601, 22552, -7145, -5988, 17790, 28874, 15633, -10, 3824, 15824, 13562, 4377, 10685, 21792, 10520, -11278, -8145, 19073, 32843, 9292, -24229, -20579, 19189, 37146, 2185, -37209, -22976, 24644, 38759, -1857, -44581, -32407, 19303, 39849, 1435, -40062, -28420, 11114, 22392, -2217, -23800, -14010, 8741, 12492, -3601, -12051, -2341, 5524, 2026, 3042, 11065, 8960, -6442, -13129, 4606, 30821, 30241, -4042, -27734, -2992, 39878, 39870, -1329, -25327, 697, 38324, 33885]
915C3885m2297k0021L3217L8501j2529m5352j6187K7301L0041l155k7081j4606
927a8283J1862J2300p629r614O790Q113p936j1761K200J1358j071j4881o240K0220
941d572K1233j6628l7738n146L9906L1906j5771m1070j1594L1439L0551j1479
953A1037l1851o32L1410J5224k0906k4580O264K9534J5284j6256k0019M644J5152
966A4305q92p729P985J3335n901k0467p529J8392K2088p764k9086o294K6047J6805
980C3295k0719k9271L569L2164J6391k5743l7555r3L5148J7141k3296k6921K451
993b3439J8145L275j4276r338R499J1298q389j5788K420J3455l87j0169j74J2240
1007a1628L854j5498j6706J1252L2959J0992l0180k9827J4000L8384J1981k5601
$$ y = [33885, -8412, -28433, 4784, 43285, 30756, -14596, -30783, -3482, 26559, 23404, -3677, -18283, -6421, 5879, -1750, -11364, -4574, 3539, -4397, -16158, -13958, -2600, -3671, -18552, -24792, -4572, 16661, 33, -37705, -42851, -2945, 28961, 13190, -27880, -39474, -8035, 22516, 11037, -20814, -21446, 9964, 25188, 4282, -20298, -14034, 15500, 30784, 14528, -5491, -847, 14305, 13413, 5684, 13669, 27004, 21103, 636, -6893, 11499, 33587, 25823, -3263, -9557, 16490, 33295, 12576, -16695, -13126, 19038, 35429, 9686, -27869, -27962, 7186, 24327, 1031, -25890, -23439, -5294, -2019, -16295, -25633, -16134, -4836, -13225, -29013, -26593, -13138, -13525, -23694, -23868, -11628, -7774, -23272, -39978, -28726, 4233, 15225, -14955, -44782, -30782, 7602, 19583, -6018]
1019f018k3658J3048L1534L337l0378j6688K4359L0734l999k6867j2994J4782
1031b808J9854O26j1963j561J0098j088j3335j760J5296R751j1224j6388J529
1044b973J6537M398j9780j4078J8797K5833r020l5635j2876K6424L0515n929l5099
1057a2886j6327K2762K5219j0754k6606j066K3371J2243j6905k2802K822K4943
1069D014J0747j8188j6971P457J2687m347j1764J477J3015M477j4312j4716Q134
1082a8290J9600J185j7137n731J3566Q882j0567j4400M104K0325Q466j8689j9562
1095b8248R170K3811J564j8821p955J5343J5538q422k1980k094K6317J6588j8038
1108B773k5369M891K4909J0009j5951j6229P855K1460L636k0031j1325J4833J7759
$$ y = [-6018, -29676, -16628, 14906, 18243, -12135, -28823, -4464, 26270, 22271, -4596, -17590, -2808, 17046, 17672, 5709, 4148, 14246, 13158, -177, -1937, 13359, 23110, 11886, -4502, -2973, 13564, 17962, -1818, -15896, 2901, 28734, 19714, -15921, -28797, -2373, 28142, 22213, -12886, -29213, -6451, 18768, 8014, -18592, -19658, 3713, 15956, -949, -23751, -20929, 4014, 14761, -3427, -20398, -12941, -254, -4601, -16365, -14888, -1873, 2604, -11708, -26424, -18290, 1310, 2495, -14642, -20373, -6807, 2075, -8492, -22892, -18788, 1537, 10003, -8686, -28248, -19078, 4733, 6297, -12524, -20479, -5136, 10402, 1980, -20000, -22094, 4223, 20811, 2773, -22596, -17705, 7204, 17213, 1262, -14967, -7112, 14348, 17984, -2047, -13372, 1461, 19220]
1121A9220m099j5236m219Q929O586n690o483O806R453q238j6176M657K0781N089
1135B1380k0232j5603J2398K5657J890l0931k0064K2543L4251m893l8427j9642
$$ y = [19220, 15121, -115, -4334, 4595, 11181, 5491, -992, 5814, 15267, 7029, -9147, -4490, 16291, 21380, 1148, -14455, -2057, 23600, 25490, -5441, -25505, -2962, 31289, 26396, -12031, -31673]
$$ [...]
8191i2
##END NTUPLES=NMR FID
##END=
