##TITLE=1H_EC-3192
 CDCl3, 8 sc, 
 12.4.2019
##JCAMPDX= 6.0         $$ Bruker NMR JCAMP-DX V2.0
##DATA TYPE= NMR FID
##DATA CLASS= NTUPLES
##ORIGIN= UXNMR, Bruker Analytische Messtechnik GmbH
##OWNER= root
$$ XWIN-NMR		Version 3.5
$$ Fri Apr 12 14:17:03 2019 Russian Standard Time (UT+4h)  she@DPX200
##.OBSERVE FREQUENCY= 200.1315
##.OBSERVE NUCLEUS= ^1H
##.DELAY= (6, 6)
##.ACQUISITION MODE= SIMULTANEOUS
##.ACQUISITION SCHEME= undefined
##.AVERAGES= 8
##.DIGITISER RES= 18
##SPECTROMETER/DATA SYSTEM= spect
##.PULSE SEQUENCE= zg30
##.SOLVENT NAME= D2O
##.SHIFT REFERENCE= (INTERNAL, D2O, 0, 15.7039)
##AUDIT TRAIL= $$ (NUMBER, WHEN, WHO, WHERE, WHAT)
$$ ##TITLE= Audit trail, XWIN-NMR		Version 3.5
$$ ##JCAMPDX= 5.01
$$ ##ORIGIN= Bruker BioSpin GmbH
$$ ##OWNER= she
$$ F:/spectra/data/she/nmr/H-F/1/audita.txt
$$ ##AUDIT TRAIL=  $$ (NUMBER, WHEN, WHO, WHERE, WHAT)
(   1,<2019-04-12 14:15:42.46 +0400>,<she>,<DPX200>,
      <created by zg, POWCHK disabled, PULCHK disabled
       configuration hash MD5:
       00 E9 B6 7A A2 85 ED C7 34 08 36 98 17 FE 4E 26
       data hash MD5: 16K
       C4 1A BD 17 31 9A 2D 1E 8E 2D 25 4F 78 16 2E E5>)
$$ ##END=
$$ 
$$ hash MD5
$$ 38 8F 7F 00 FD B8 24 9E F6 9C 02 9E 8A 03 9F 6E
##$RELAX= 
##$RELAX= 
##$RELAX= 
##$RELAX= 
##$RELAX= 
##$RELAX= 
$$ Bruker specific parameters
$$ --------------------------
##$DU= <F:/spectra>
##$EXPNO= 1
##$NAME= <H-F>
##$PROCNO= 1
##$TYPE= <nmr>
##$USER= <she>
##$AMP= (0..31)
100 100 100 100 100 100 100 100 100 100 100 100 100 100 100 100 100 100 
100 100 100 100 100 100 100 100 100 100 100 100 100 100 
##$AQSEQ= 0
##$AQ_mod= 1
##$AUNM= <au_zg>
##$AUTOPOS= <>
##$BF1= 200.13
##$BF2= 200.13
##$BF3= 200.13
##$BF4= 200.13
##$BF5= 200.13
##$BF6= 200.13
##$BF7= 200.13
##$BF8= 200.13
##$BYTORDA= 1
##$CFDGTYP= 0
##$CFRGTYP= 5
##$CHEMSTR= <none>
##$CNST= (0..31)
1 1 145 1 1 1 1 1 1 1 1 1 1 1 1 1 1 1 1 1 1 1 1 1 1 1 1 1 1 1 1 1 
##$CPDPRG= <>
##$CPDPRG1= <>
##$CPDPRG2= <>
##$CPDPRG3= <>
##$CPDPRG4= <mlev>
##$CPDPRG5= <mlev>
##$CPDPRG6= <mlev>
##$CPDPRG7= <mlev>
##$CPDPRG8= <mlev>
##$CPDPRGB= <>
##$CPDPRGT= <>
##$D= (0..31)
0 1.2 0 0 0 0 0 0 0 0 0 0.03 0 0 0 0 0 0 0 0 0 0 0 0 0 0 0 0 0 0 0 0 
##$DATE= 1555064141
##$DBL= (0..7)
120 120 120 120 120 120 120 120 
##$DBP= (0..7)
150 150 150 150 150 150 150 150 
##$DBP07= 0
##$DBPNAM0= <>
##$DBPNAM1= <>
##$DBPNAM2= <>
##$DBPNAM3= <>
##$DBPNAM4= <>
##$DBPNAM5= <>
##$DBPNAM6= <>
##$DBPNAM7= <>
##$DBPOAL= (0..7)
0.5 0.5 0.5 0.5 0.5 0.5 0.5 0.5 
##$DBPOFFS= (0..7)
0 0 0 0 0 0 0 0 
##$DE= 6
##$DECBNUC= <off>
##$DECIM= 24
##$DECNUC= <off>
##$DECSTAT= 4
##$DIGMOD= 1
##$DIGTYP= 9
##$DL= (0..7)
0 120 120 120 120 120 120 120 
##$DP= (0..7)
150 150 150 150 150 150 150 150 
##$DP07= 0
##$DPNAME0= <>
##$DPNAME1= <>
##$DPNAME2= <>
##$DPNAME3= <>
##$DPNAME4= <>
##$DPNAME5= <>
##$DPNAME6= <>
##$DPNAME7= <>
##$DPOAL= (0..7)
0.5 0.5 0.5 0.5 0.5 0.5 0.5 0.5 
##$DPOFFS= (0..7)
0 0 0 0 0 0 0 0 
##$DQDMODE= 0
##$DR= 18
##$DS= 0
##$DSLIST= <SSSSSSSSSSSSSSS>
##$DSPFIRM= 0
$$ [...]
##$SUBNAM2= <"">
##$SUBNAM3= <"">
##$SUBNAM4= <"">
##$SUBNAM5= <"">
##$SUBNAM6= <"">
##$SUBNAM7= <"">
##$SUBNAM8= <"">
##$SUBNAM9= <"">
##$SW= 24.9337058887773
##$SWIBOX= (0..15)
0 0 2 0 0 0 0 0 0 0 0 0 0 0 0 0 
##$SW_h= 4990.01996007984
##$TD= 16384
##$TD0= 1
##$TE= 0
##$TE2= 300
##$TE3= 300
##$TEG= 300
##$TL= (0..7)
0 120 120 120 120 120 120 120 
##$TP= (0..7)
150 150 150 150 150 150 150 150 
##$TP07= 0
##$TPNAME0= <>
##$TPNAME1= <>
##$TPNAME2= <>
##$TPNAME3= <>
##$TPNAME4= <>
##$TPNAME5= <>
##$TPNAME6= <>
##$TPNAME7= <>
##$TPOAL= (0..7)
0.5 0.5 0.5 0.5 0.5 0.5 0.5 0.5 
##$TPOFFS= (0..7)
0 0 0 0 0 0 0 0 
##$TUNHIN= 0
##$TUNHOUT= 0
##$TUNXOUT= 0
##$USERA1= <user>
##$USERA2= <user>
##$USERA3= <user>
##$USERA4= <user>
##$USERA5= <user>
##$V9= 5
##$VALIST= <valist>
##$VCLIST= <CCCCCCCCCCCCCCC>
##$VD= 0
##$VDLIST= <DDDDDDDDDDDDDDD>
##$VPLIST= <PPPPPPPPPPPPPPP>
##$VTLIST= <TTTTTTTTTTTTTTT>
##$WBST= 1024
##$WBSW= 4
##$XGAIN= (0..3)
0 0 0 0 
##$XL= 0
##$YL= 0
##$YMAX_a= 486022
##$YMIN_a= -472429
##$ZGOPTNS= <>
##$ZL1= 120
##$ZL2= 120
##$ZL3= 120
##$ZL4= 120
##$ABSF1= 10
##$ABSF2= 0
##$ABSG= 5
##$ABSL= 3
##$ALPHA= 0
##$AQORDER= 0
##$ASSFAC= 0
##$ASSFACI= 0
##$ASSFACX= 0
##$ASSWID= 0
##$AUNMP= <proc_1d>
##$AZFE= 0.1
##$AZFW= 0.1
##$BCFW= 1
##$BC_mod= 2
##$BYTORDP= 1
##$COROFFS= 0
##$CY= 11.3945322036743
##$DATMOD= 1
##$DC= 2
##$DFILT= <>
##$DTYPP= 0
##$F1P= 18.9103706918063
##$F2P= -1.10871071338519
##$FCOR= 0.5
##$FTSIZE= 0
##$FT_mod= 4
##$GAMMA= 1
##$GB= 0.15
##$INTBC= 1
##$INTSCL= 1
##$ISEN= 128
##$LB= 0.24
##$LEV0= 0
##$LPBIN= 0
##$MAXI= 10000
##$MC2= 0
##$MEAN= 0
##$ME_mod= 0
##$MI= 1.114404
##$NCOEF= 0
##$NC_proc= 0
##$NLEV= 6
##$NOISF1= 3.799351
##$NOISF2= 2.8
##$NSP= 1
##$NTH_PI= 0
##$NZP= 0
##$OFFSET= 15.70392
##$PC= 1
##$PHC0= -8853.55
##$PHC1= 13.60026
##$PH_mod= 1
##$PKNL= yes
##$PPARMOD= 0
##$PSCAL= 0
##$PSIGN= 0
##$REVERSE= no
##$SF= 200.130013532006
##$SI= 16384
##$SIGF1= 3
##$SIGF2= 2
##$SINO= 400
##$SIOLD= 16384
##$SREGLST= <1H.CDCl3>
##$SSB= 0
##$STSI= 0
##$STSR= 0
##$SW_p= 3612.71676300578
##$SYMM= 0
##$S_DEV= 0
##$TDeff= 0
##$TDoff= 0
##$TI= <>
##$TILT= no
##$TM1= 0
##$TM2= 0
##$TOPLEV= 0
##$USERP1= <user>
##$USERP2= <user>
##$USERP3= <user>
##$USERP4= <user>
##$USERP5= <user>
##$WDW= 1
##$XDIM= 8192
##$YMAX_p= 0
##$YMIN_p= 0
$$ End of Bruker specific parameters
$$ ---------------------------------
##NTUPLES= NMR FID
##VAR_NAME=  TIME,          FID/REAL,        FID/IMAG
##SYMBOL=    X,             R,               I
##VAR_TYPE=  INDEPENDENT,   DEPENDENT,       DEPENDENT
##VAR_FORM=  AFFN,          ASDF,            ASDF
##VAR_DIM=   8192,          8192,            8192
##UNITS=     SECONDS,       ARBITRARY UNITS, ARBITRARY UNITS
##FACTOR=    0.0002004,     1,               1
##FIRST=     0,             0,               0
##LAST=      1.6414764,     0,               0
##MIN=       0,             -472429,         0
##MAX=       1.6414764,     486022,          0
$$ Real data points
##PAGE= N=1
##DATA TABLE= (X++(R..R)), XYDATA
0@%%%qJ6j6J6k4L2m0N6o5Q1j04J28j52J80k20K62l07L60m20M87n65O50p46Q53
27D54r71J103j246J406j584J777j990K224k479K761l071L409l779M186m636N132
43B696n682O294o977P746q618R615j0767J2118j3724J5674j8105K1230k5421L1379
57A7458m0588N6898r4557L39753K07058l25147J04458M4775K4779M660Q2535n5503
69C66579o9373n2233l2827r1617j6202N9203Q5179j9768j01711j16234k9708Q531
81a0181K9413L9532K1124n5540m2850J5974l605o5467l900Q2537O9500m212m7139
94B5186o3197j7280N3379N5825O434k644r607k9252p632J5125k3890k2101M4820
107B5166L0081m9295l8345m846m6078k9493O2620L4779p1992m6106K8854j5659
$$ plain form
0 0 0 0 0 -8 8 -8 8 -16 16 -24 32 -33 48 -56 72 -80 100 -120 142 -165 195 -225 262 -303 347 -399 454
27 454 -517 586 -660 746 -838 939 -1051 1173 -1306 1455 -1616 1793 -1986 2200 -2436 2696
43 2696 -2986 3308 -3669 4077 -4541 5074 -5693 6425 -7299 8375 -9730 11500 -13921 17458
57 17458 -23130 33768 -60789 278964 486022 160875 265333 310108 334887 339547 422082 366579
69 366579 297206 244973 212146 120529 104327 163530 248709 228941 127230 10996 -18712 -10181
81 -10181 19232 58764 79888 24348 -18502 -2528 -6133 -71600 -75500 7037 76537 72325 25186
94 25186 -38011 -55291 -1912 53913 60347 57703 48096 18844 11212 26337 2447 -19654 25166
107 25166 55247 5952 -32393 -37239 -83317 -112810 -50190 -15411 -87403 -133509 -104655 -120314
119a20314n5063J4167M3458j3249j9008K2814M339l6096j2007L9895M3428Q92
131h6744j6005K3234L8732j3278k2695M2607M4950k2369m288N8247J3602m8774
143G219K170M6064j618j9411J6441P252j7899j213L450r980L725L033k3644o969
157H620J9467j1768k1414K5637J3581l9656p521M1121m555l5764K0311M0036o094
170D2001j1486J3475N40j0855J0745K0203J4086J1605k951j3414L64J734q018
183F8029R841J9058p672j0297N443k2802l8632J2983L0503k2094k6080J4871m605
196B8546l6042o924N743k1013M35L1939n757l9776q940J0614o20P460J2410n106
210b7031k796O385j2271o389K7054J1680j7390R669K2806k3698k8419K2739K6546
$$ plain form
119 -120314 -175377 -161210 -117752 -131001 -150009 -127195 -122856 -158952 -170959 -131064 -87636 -86744
131 -86744 -102749 -79515 -40783 -54061 -76756 -34149 10801 -11568 -15856 42391 55993 7219
143 7219 9389 55453 53835 34424 50865 58117 40218 39005 42455 32475 36200 39233 15589 8620
157 8620 28087 16319 -5095 20542 34123 -5533 -13054 28067 23512 -12252 8059 48095 42001
170 42001 30515 43990 44530 33675 44420 64623 78709 90314 87363 73949 74313 76047 68029
183 68029 77870 96928 89256 78959 84402 61600 22968 35951 66454 44360 18280 33151 28546
196 28546 -7496 -14420 -8677 -29690 -29255 2684 -3073 -42849 -51789 -41175 -41795 -34335 -21925 -27031
210 -27031 -29827 -23442 -35713 -42102 -15048 -3368 -20758 -11089 11717 -11981 -40400 -17661 8885
223H885p548o136j71j5824r318P161k677n997O086o10p196k820k1364k7342J8505
238f6366L7708j3115k7544R200J195k5725P410K9929n769j2218K0232R420j7542
251e3185l444R021M484J9552K1530j1533j5810J0436P309l356J5616J1580j3159
264i59J43J5501j1373j9039J3127J3320m673L530l89k5986r493K2618P069j1205
278g809K598q93j6621K324J4282r472o812J9211P535j1259j757j825q253J5173
292c578K3586p625r706J2306l360j6639J4242K1490j0837n306J9015k560k1971
305I057K01J0342j41R438Q432j5979j4277O858j967n614J2421L605j2716L677
319A3337P788k3516j6013K3162J5001j0260J373L052j7623p638J3301J823o70
$$ plain form
223 8885 1337 -4799 -4970 -20794 -30112 -22951 -25628 -31625 -25539 -26149 -33345 -36165 -57529 -84871 -66366
238 -66366 -28658 -41773 -69317 -60117 -58922 -84647 -77237 -47308 -53077 -65295 -45063 -35643 -53185
251 -53185 -56629 -47608 -43124 -23572 -2042 -13575 -29385 -18949 -11640 -14996 620 12200 -959
264 -959 -816 14685 3312 -15727 -2600 10720 6047 9577 9188 -16798 -26291 -3673 3396 -7809
278 -7809 -5211 -6104 -22725 -20401 -6119 -15591 -22403 -3192 4343 -6916 -8673 -10498 -18751 -3578
292 -3578 20008 12383 2677 14983 11623 -5016 9226 30716 19879 14573 33588 31028 9057
305 9057 9258 19600 19459 28897 37329 21350 7073 13931 11964 6350 18771 22376 9660 13337
319 13337 21125 -2391 -18404 4758 19759 9499 10872 13924 -3699 -11337 1964 3787 3117
332C117J5500J502j6887j480M496j1430L494K4909J898j4290J748j076j7306L092
346b713J7961j946l755J1355m339k0181k506M309l350J3738J6851j5885j9326
359i787Q198K535j4336O949J7214l394l816M752j2855j4798J1851J2704l474M685
373F428N512j5142p126J1650m242q830J6323J2479j3692o018O050j0517o331J8554
387E098R665r939q60R92j0378K840J2956p627o903J7039N310j7333k153P169o285
402d09L048J7304m685j7630O070R403p619j386P165m197K9J1028p946j4547R646
417E274J0725r064R24J0179j1165j1526J2940P124j0756J649O908q625k147R915
431A2355n781r007J1228P260r992o10M031r431J5J5449k577j3188O723O470j2436
$$ plain form
332 3117 18617 20119 3232 1752 6248 -5182 -1688 23221 25119 10829 12577 11501 -5805 -2713
346 -2713 15248 13302 9547 20902 16563 -3618 -6124 -1815 -5165 8573 25424 9539 -9787
359 -9787 -1589 946 -13390 -6441 10773 7379 3563 8315 -4540 -19338 -7487 5217 1743 6428
373 6428 11940 -3202 -10328 1322 -2920 -11750 4573 17052 3360 -2658 3392 -7125 -13456 5098
387 5098 14763 4824 3964 4956 -5422 -2582 10374 2747 -4156 12883 18193 860 -1293 5876 -409
402 -409 2639 19943 15258 -2372 3698 13101 5482 4096 11261 7064 7093 18121 10175 -4372 5274
417 5274 15999 6935 7859 18038 6873 -4653 8287 15411 4655 6304 13212 4587 2440 12355
431 12355 6574 -2433 8795 16055 6063 5453 9484 53 68 15517 12940 -248 6475 12945 509
446E09k179R245m671l086J0045m111j4492M773P251j0588j759J2496m886j0817
460a2270O342P06j2370L645J1868o215n062N783m377o778R288J252j1636N383
474a4441J1898j0045p197J0955l126j1982J0889J2435j3492q336J0333J339n182
487a5952M870k148q975O858R566o587n550L340m627P86J3941m733j8834P126J8274
502b645o632r553N441k022o356J2975R216j4303n300J1861J175m271M781l001
516h634o128J2528J0904j1266p954M591q15L809J3839m057j8509M949J4994o040
530B211q311N407j927j791J5112K102k2570o392J6451O609l514N18m974n032R079
545B978M379j0210j028Q793n35K260P876j2183j6567J4288J8195q881o576P542
$$ plain form
446 509 -1670 7575 2904 -182 9863 5752 -8740 -3967 3284 -7304 -9063 3433 -1453 -12270
460 -12270 -5928 -5222 -17592 -13947 -2079 -8294 -13356 -7573 -11950 -18728 -9440 -8188 -19824 -14441
474 -14441 -2543 -12588 -19785 -8830 -11956 -23938 -13049 -614 -14106 -22442 -12109 -10770 -15952
487 -15952 -11082 -13230 -22205 -15347 -5781 -12368 -17918 -14578 -19205 -18419 -4478 -9211 -28045 -20919 -2645
502 -2645 -9277 -18830 -13389 -15411 -21767 -8792 424 -13879 -19179 -7318 -6143 -10414 -5633 -8634
516 -8634 -14762 -2234 8670 -2596 -10550 -5959 -6774 -2965 10874 6817 -11692 -6743 8251 2211
530 2211 -6100 -693 -2620 -4411 10701 12803 -9767 -16159 292 6901 3387 3905 -1069 -6101 2978
545 2978 7357 -2853 -3881 4912 4377 6637 14513 2330 -14237 51 18246 9365 2789 10331
559A0331n855r868J3228P323j5818l685J6081L726r162o308o815J423J5168M499
573A4268j3750l721M491n238p60R347n912j0993J3226J1303j6116j1004R389K068
587c402l134J0325L616j3836l730Q219P02j356L299k479K02R523k565j4816K295
602g137J0285k231K004R574j1055j4908J2269J1266j2974m364J3494j170r256
615d203O106J192j2863J868J3965p4o184k82l159q43O853p90o866O485N391q740
631b144j099R476p391j0318J3152R062j3544m722J0775l222p805P680K563r632
645g169R6P523j073k528k37n395J192R874m458r907R681P786j1247j099J2504
660E543o353j2152J2868J1526r529j563J0101o338r605Q929P709m531R60M844
$$ plain form
559 10331 4476 -5392 7836 15159 -659 -4344 11737 15463 6301 -7 -6822 -5399 9769 14268
573 14268 518 -3203 1288 -3950 -4710 4637 -1275 -12268 958 12261 -3855 -14859 -5470 -3402
587 -3402 -6536 3789 7405 -6431 -10161 -1942 -1240 -2596 703 -1776 -1574 7949 5384 -9432 -7137
602 -7137 3148 917 2921 12495 1440 -13468 -1199 10067 -2907 -7271 6223 5053 -4203
615 -4203 1903 3095 -9768 -7900 6065 5991 -193 -475 -3634 -4477 2376 1586 -5280 1205 6596 -2144
631 -2144 -3243 6233 -1158 -11476 1676 10738 -2806 -7528 3247 25 -7780 -100 2463 -7169
645 -7169 -7073 450 -623 -3151 -3388 -8783 -7591 2283 -2175 -12082 -2401 5385 -5862 -6961 5543
660 5543 -810 -12962 -94 11432 1903 340 10441 4103 -5502 3427 11136 6605 7565 12409
674A2409k968k406p92p254J311J3348J291q564P22j387j2229K045J2409m294p856
689d215J1382L462j5799n197P322j726O77J3926L486j0515m612Q04j031Q471Q500
704A4935m289K005J0584m798j2054M341O853k599J1405J5571j3284j9812P969
717A6827R837q453J73J2289r51p472m64o582j0970K538Q768K849J540n780j5701
732a552m299P747k676n016R024M004j1358r97M115j3028q261J6872J2809p102
746B82m460Nq032q86J0156k40l387P550K695p884k222j587r374N116J5519l633
762c82j4458J061J529j0460L71Q291p469p664R996R02j5534m223O560j260k37
777c2977N239m832p810K687K931o01L822m16p536M559J1633n658q007R160M684
$$ plain form
674 12409 9441 7035 6243 -1011 300 13648 14939 6375 7097 5710 -6519 -4474 7935 3641 -4215
689 -4215 7167 10629 -5170 -10367 -3045 -4771 -4094 9832 13318 2803 -1809 -1005 -2036 6435 14935
704 14935 10646 12651 23235 18437 6383 10724 17577 14978 26383 41954 28670 8858 16827
717 16827 26664 18211 18384 30673 29722 22250 21786 15204 4234 6772 15540 18389 19929 14149 -1552
732 -1552 -5851 1896 -780 -5796 3228 7232 -4126 -5123 -1008 -14036 -22297 -5425 7384 282
746 282 -4178 -4173 -12205 -13091 -2935 -3175 -6562 988 3683 -4201 -6423 -8010 -17384 -12268 3251 -382
762 -382 -14840 -13779 -12250 -22710 -22339 -14048 -21517 -29181 -19185 -18283 -33817 -38040 -31480 -32740 -32977
777 -32977 -27738 -32570 -40380 -37693 -34762 -35363 -31541 -31957 -39493 -34934 -23301 -28959 -36966 -27806 -23122
792b3122n577M664P014j0836l702J6263M166j1979r8P263k849j412M360l198j848
807b0891P379k95p426K269K374o716L438J2219m891r831O319M986o361M747Q816
822c864n634l066J0982K526p773J691P804J609M135K872o965k320R137J251m502
837G883O152L329p874l39N604o981m841R837K172r342J233L226j0479l869J0333
852F044k82p968L739K571q281j315M842m635j727R010J365p231R35J286n540L727
868c460Q690l644l948P361j563r085L514O986n430j353O918m511p731L540J789
883a927o959J061M322o270m134L295n040n911P043J845j0598K65O704o029m529
898b6862P748O86o494M795N101p635j560Q889L77k474O553O40o400M541O756m619
$$ plain form
792 -23122 -28699 -24035 -17021 -27857 -31559 -15296 -11130 -23109 -23207 -15944 -18793 -20205 -15845 -19043 -20891
807 -20891 -13512 -13807 -21233 -18964 -16590 -23306 -19868 -7649 -12540 -22371 -16052 -11066 -17427 -12680 -3864
822 -3864 -9498 -12564 -1582 944 -6829 -5138 2666 4275 8410 11282 4317 1997 11134 12385 7883
837 7883 14035 17364 9490 9151 14755 7774 2933 12770 14942 5600 6833 10059 -420 -4289 6044
852 6044 5762 -2206 1533 4104 -4177 -5492 -650 -5285 -7012 1998 3363 -3868 -2933 -1647 -7187 -3460
868 -3460 5230 1586 -2362 4999 3436 -5649 -2135 4851 -579 -1932 4986 475 -7256 -3716 -1927
883 -1927 -8886 -7825 -3503 -9773 -13907 -10612 -15652 -21563 -14520 -12675 -23273 -23008 -16304 -22333 -26862
898 -26862 -19114 -18428 -24922 -20127 -15026 -22661 -24221 -15332 -14955 -17429 -10876 -10236 -16636 -12095 -5339 -9958
914i958o62Q150j363m631O915J790r196J483R092j742l042L657m836n796Q347
929a792N221q212k055P167k709l995M971j151n777P955P154q795m709O779Q55
944I07j005P447J406q147K437P304l163j264O764o87l512P954K779j1351k372
959E497R299J479n90L382n583q581O248O168p731k869P065j314l710L019n490
974F289r600O840J0279l880n268K697m367n357P199K422o175K083P572m384n060
989A290J807m621k866J2179P362j0359o025L235k726j119P726q52p459N156O312
1004I040r064p532L485Q68K128Q754k514j3142l9O861l055j752O295j439m246
1019e352O431m63j1497j142J0043K546o70L782n745q954O131P195m953r22O615
$$ plain form
914 -9958 -10620 -2470 -3833 -8464 -1549 241 -8955 -7472 1620 -122 -3164 493 -4343 -10139 -1792
929 -1792 3429 -4783 -6838 329 -2380 -6375 -1404 -2555 -8332 -377 6777 -2018 -6727 52 907
944 907 -98 7349 8755 608 3045 10349 7186 5922 12686 11999 8487 16441 19220 7869 5497
959 5497 14796 16275 15685 19067 13484 4903 11151 17319 9588 6719 13784 12470 8760 11779 6289
974 6289 -3311 3529 13808 9928 4660 7357 2990 -2367 4832 7254 1079 3162 10734 6350 1290
989 1290 3097 -1524 -4390 7789 15151 4792 -1233 2002 -724 -1843 5883 5031 -2428 2728 9040
1004 9040 -24 -7556 -4071 -3203 -1075 7679 5165 -7977 -8016 -1155 -4210 -5962 333 -1106 -5352
1019 -5352 1079 616 -10881 -12023 -1980 566 -104 3678 -2067 -11021 -4890 2305 -2648 -3570 3045
1034C045j572k841M215l350q982O300J1640j894m612Mn063j171R648L108q899
1049d24K118P880m114m220K949j866k089J0219N248j0463l982N584j214j376O448
1064A0698p08o258M193L814p006k280N201k248j126Q337j242j1926K53P425j912
1079E215p53N025l271n608N456K782q303M36P817j165k396L168l935o213O620
1094D875N282n894k96N532m965n781N610Q99n375K994M096o415k178M182m684
1109b118n453O186L133o817l34K632o534k455O686j316n668M495K870p268n88
1124a2549M934l594k631P740R73o212L004K842o951Q48R043j265n501L512K259
1139c548m521J649K588n616K82Q034j901o800K400O79m957L488M844o764l016
$$ plain form
1034 3045 1473 -1368 2847 -503 -9485 -3185 8455 6561 1949 1953 -3110 -4281 5367 8475 -424
1049 -424 1694 9574 5460 1240 4189 2323 234 10453 15701 5238 1256 6840 5626 4250 10698
1064 10698 9990 3732 7925 11739 4733 2453 7654 5406 4280 12617 11375 -551 -298 7127 5215
1079 5215 4462 9487 6216 608 6064 8846 543 979 8796 7631 5235 8403 4468 -1745 4875
1094 4875 10157 4263 3967 9499 4534 -1247 4363 5262 -113 2881 6977 562 -1616 2566 -2118
1109 -2118 -7571 -1385 1748 -5069 -5403 -2771 -9305 -11760 -5074 -6390 -12058 -7563 -4693 -11961 -12549
1124 -12549 -7615 -11209 -13840 -6100 -5127 -11339 -8335 -5493 -12444 -11596 -2553 -3818 -9319 -5807 -3548
1139 -3548 -8069 -6420 -3832 -9448 -9166 -1132 -3033 -9833 -7433 -6754 -11711 -8223 -3379 -10143 -13159
1154a3159Q085j164p329L240L578n026J933P582l480n386N339J250l230N041M415
1169A689n843O02R163k224n785M549L581k964M715N636p131l739P789J701n439
1184F300J781L433k928J026L675n892m360N558J580l421K047J063o425J466N427
1199A0330m877m525P070K594n121K961K572p874R2J0194l91o050M156L193n546
1214H778K340M873n532l244Q768K416o840n78L19m206L430N960o442o953N388
1229H477J736p756n62J598m166Q83O118n286r164J640L536k033J346J232n599
1244h000q90N696l102m798M209J778l201N297M136j0417n132J0273L584n215K936
1259b846K302o976N27P500m758p506O357O383l998k057r97o110P60Q045j020o649
$$ plain form
1154 -13159 -5074 -6238 -13567 -10327 -6749 -11775 -9842 -2260 -5740 -11126 -5787 -4537 -7767 -2726 1689
1169 1689 -4154 -3552 5611 3387 -2398 2151 5732 2768 7483 13119 5988 2249 10038 11739 6300
1184 6300 8081 11514 8586 9612 13287 7395 3035 8593 10173 6752 8799 9862 3437 4903 10330
1199 10330 5453 928 7998 10592 5471 8432 11004 3130 3222 13416 13025 6975 11131 14324 8778
1214 8778 11118 15991 10459 7215 15983 18399 11559 10981 11300 7094 10524 16484 10042 3089 8477
1229 8477 10213 2457 1895 3493 -673 210 6328 1042 -8122 -6482 -2946 -4979 -3633 -2401 -8000
1244 -8000 -8890 -3194 -6296 -11094 -6885 -5107 -8308 -3011 1125 -9292 -14424 -4151 -567 -5782 -2846
1259 -2846 -544 -7520 -6993 507 -4251 -11757 -5400 983 -3015 -5072 -6069 -12179 -11419 -3374 -4394 -11043
1275a1043K736J704m636Q80K747n295m20Q739J156o368J19J965l274M185P344
1290E39l253l902M835J858l139L057J645m103M797P727m961o623M754K711l049
1305B893M631L587q169j671R470j480r022L899N745l877m04M363m664m542N544
1320F303L318m049J009K062l392J341M454l304l371N179J580l671L700K257o999
1335F417j71Q491j390o485L204K862l685Q06K668n591k363N550j073m892K016
1350F364R04n349J163L336p054l281P269J54p541K776L628p723j663P007j174
1365a184n758M026K920n348q4L322l460j448N502J4l253J899n11m011J914L888
1381a572m828r98O059j865o764K988K359o081J220N878l967n119N161M90p105
$$ plain form
1275 -11043 -8307 -6603 -11239 -10359 -7612 -12907 -13327 -4588 -3432 -9800 -9681 -7716 -10990 -6805 539
1290 539 -2714 -6616 -1781 77 -3062 -5 1640 -2463 2334 10061 5100 -1523 3231 5942 2893
1305 2893 7524 11111 2942 1271 10741 9261 239 4138 9883 6006 5602 9965 5301 759 6303
1320 6303 9621 5572 6581 8643 5251 6592 11046 7742 4371 9550 11130 7459 11159 13416 6417
1335 6417 6246 14737 13347 6862 10066 12928 9243 10049 12717 7126 4763 10313 9240 4348 6364
1350 6364 7268 1919 3082 6418 -636 -3917 3352 3506 -4035 -1259 2369 -5354 -7017 -10 -1184
1365 -1184 -6942 -2916 4 -5344 -5428 -2106 -5566 -7014 -1512 -1498 -4751 -2852 -3363 -7374 -5460 -1572
1381 -1572 -6400 -7398 -1339 -3204 -9968 -6980 -4621 -10702 -9482 -3604 -7571 -12690 -7529 -7039 -14144
1396a4144J043N110l152j185M109k407l878M301O59m819K882N575l842j859N397
1411f210j532n160O424M188n723K45O630k050m229M553J954m061K592M006l010
1426a383q14K669k483j526N680K8n362J881L964l580j090M615l657l645P442L010
1442E749p755j125O013j500k209M066o77l944M423M178n768k008M957j268m43
1457B689M527r48n647K793M574l795j149M435k953k863P638J326q975j286N659
1472F025m74j036K950l325m225M797L500o659k213M404l68N0L183m389o435M597
1488C82N412m705j311L953k950k413N565j92q472J988O995j329k345J425l781
1503a778l585O651L291o305j510L279j284n15L463m184n470O632N506o033k814
$$ plain form
1396 -14144 -13101 -7991 -11143 -12328 -8219 -10626 -14504 -10203 -9544 -14363 -11481 -5906 -9748 -11607 -6210
1411 -6210 -7742 -12902 -6478 -2290 -8013 -7768 -1138 -3188 -7417 -2864 -910 -4971 -2379 1627 -1383
1426 -1383 -2197 472 -2011 -3537 2143 2171 -3191 -1310 2654 -926 -2016 2599 -1058 -4703 2739 5749
1442 5749 -2006 -3131 2882 1382 -827 3239 2562 -1382 3041 7219 1451 -557 4400 3132 2689
1457 2689 7216 6268 621 3414 7988 4193 3044 7479 4526 1663 9301 10627 1652 366 6025
1472 6025 5551 4515 7465 4140 -85 4712 8212 1553 -660 3744 3376 3426 6609 2220 -4215 382
1488 382 5794 1089 -222 3731 781 -1632 3933 3741 -4731 -2743 4252 2923 578 2003 -1778
1503 -1778 -5363 1288 4579 -1726 -3236 43 -1241 -1756 1707 -2477 -7947 -1315 4191 -1842 -4656
1518d656K476k524l14O168p36p542K567N043k711l149K576j694p82O082O22p503
1534f077n95N042j387l70M083l295l814M309L702n613p57L882j620m89N275j686
1550E90p354K865N633k415j050K665k834j979N398Q04o433J441N419k302n86K499
1566B361k911k758N653K457n896J038M975l205k566N425n61m540L180L204l518
1581B338n58L434k908j725O128o5n055R89L344k837K09L790k721l383N032J746
1597G758n692R54M472l285j875L971p74l690L346J812m873O46M564l482l014M498
1613E336K64l975K126J547m103N79M307l071l971M347J484m823R52K877m273r23
1629a320N112j157m838L115J243m688R88L817l082k211M280m89l941K222K91m052
$$ plain form
1518 -4656 -2180 -4704 -5018 1150 414 -7128 -4561 482 -2229 -5378 -2802 -4496 -5278 804 1426 -6077
1534 -6077 -6672 -1630 -3017 -3387 696 -2599 -6413 -2104 1598 -4015 -4772 -890 -2510 -2999 2276 590
1550 590 -6764 -3899 1734 -681 -1731 934 -1900 -3879 1519 2323 -4110 -2669 2750 448 -138 2361
1566 2361 -550 -3308 2345 4802 -1094 -56 4919 1714 -852 4573 4012 -528 2652 5856 2338
1581 2338 1780 5214 2306 581 6709 6644 1589 2578 5922 3085 3294 7084 4363 980 6012 7758
1597 7758 2066 3020 7492 4207 2332 6303 5529 1839 5185 6997 2124 2770 7334 3852 838 5336
1613 5336 5600 1625 3751 5298 1195 1774 6081 3010 -961 3386 4870 47 999 3876 -397 -1320
1629 -1320 3792 2635 -2203 912 2155 -2533 -1545 2272 -810 -3021 1259 770 -3171 -949 -658 -4710
1645d710K006N203l447m578L331Q02l744K575K433m592k92N205k089n396K399
1660d894K055k036K101K007m822j710N174n44m105K980J851l398J516L541m365
1675d649l293N454J786l273K020J498m857O38N100j444l664L328J469k735K082
1690e40J733n029m59P092n02m285K049O54l109L223L067m589j547N601N21m216
1706c36J230J494k520K072M159l483m025M219J503l116J657J960l856L98M872
1721F228j713l954K300J330k506L028K501n607k222N931N42l983J287J110l265
1736A007J993L659m531l252N034J035l181Q42o8l887J572N372l855l821L551J134
1752B604l919J554K215m580m60N057r27m585J262J076k977K501L189m681k805
$$ plain form
1645 -4710 -2704 2499 -948 -5526 -2195 -1393 -5137 -2562 -129 -4721 -5013 192 -1897 -7293 -4894
1660 -4894 -2839 -4875 -2774 -767 -5589 -7299 -2125 -2669 -6774 -3794 -1943 -5341 -3825 -284 -4649
1675 -4649 -7942 -2488 -702 -3975 -1955 -457 -5314 -4676 424 -1020 -4684 -1356 113 -2622 -540
1690 -540 1193 -3836 -4295 2797 2295 -1990 59 713 -2396 827 3894 -695 -2242 3359 3880 -336
1706 -336 894 2388 -132 1940 6099 2616 -1409 2810 4313 1197 2854 4814 958 1356 6228
1721 6228 4515 561 2861 4191 1685 4713 7214 1607 -615 5316 5858 1875 3162 4272 1007
1736 1007 3000 6659 2128 -1124 3910 4945 1764 2606 2538 -1349 223 5595 1740 -2081 1470 2604
1752 2604 -1315 239 2454 -2126 -2586 2471 1544 -3041 -1779 -703 -3680 -1179 2010 -2671 -5476
1767e476L620L19l074J632M68l409J974M611m284m496M375J433k989J561J791
1782a944m274k51M482j571l960K557K018k540J402J817m088j111M339j65k605
1797e894K935K29l829J669L975l787k412M945M72l304K042J995m814J93N554j156
1813a187l852K740J775k296J235J340l261Q40M487j405l011L531O33l468K253
1828C54L478l754j036N055q20m062K637L144m075L47M276j965k682K492O37k444
1844A582K118J249k968L16L732k321k341L429o0l287K541L048m865j121N073j310
1860D815m081L284K213l286l92L169k051k333L185l53k604K458J553l000m68K011
1876D120k251q38L533q99m071K326K721m626j327L896r65l230K804J261m550j44
$$ plain form
1767 -5476 -1856 -1537 -4611 -2979 -2511 -5920 -3946 665 -3619 -8115 -3740 -2307 -5296 -3735 -1944
1782 -1944 -6218 -6469 -1987 -3558 -7518 -4961 -2943 -5483 -4081 -2264 -6352 -7463 -3124 -3289 -5894
1797 -5894 -2959 -2730 -6559 -4890 -915 -4702 -7114 -2169 -1697 -5001 -2959 -964 -5778 -5585 -31 -1187
1813 -1187 -5039 -2299 -524 -2820 -1585 -245 -3506 -2666 1821 416 -2595 936 1569 -1899 354
1828 354 3832 78 -958 4097 3277 -785 1852 4996 921 1268 5544 3579 897 3389 4026 1582
1844 1582 3700 4949 1981 2297 6029 3708 1367 4796 4736 1449 3990 7038 2173 1052 6125 4815
1860 4815 734 4018 6231 2945 2553 5722 3671 1338 4523 4170 1566 4024 5577 2577 2109 4120
1876 4120 1869 1031 4564 3665 -406 1920 4641 15 -1312 2584 1619 -1611 1193 2454 -2096 -2240
1892b240L184k102j708L113j083k887K190O62k883N71K332k637m35M145k377m546
1908f701L133L565l701j337L919k196k542L783O55m521O35L971j290k195J457
1923c365j290j240L368L39l384Q10K416k684n12L275j498l275L635L112m234j214
1939e741L281j752j434M648J128n017J107L644j603j000J983r84n14M673k13m635
1955b429R05L338j442l1L039j833l288M480K279n005q43M268p59j963L455l68
1971C803m026J364L377j586o87J725j478j026L507k65l622J654K250k048O64K373
1987E979l182k514N318K188n050p81L800j007j332K655j060l660K472K782l109
2002C499j302K185j329n74K811j253l958J697K415k858l24K517k625k789L993
$$ plain form
1892 -2240 944 -1158 -2866 247 -836 -3723 -1533 -871 -3754 -3183 -851 -3488 -3923 222 -2155 -6701
1908 -6701 -3568 -3 -3704 -5041 -1122 -3318 -5860 -2077 -1422 -5943 -5308 -1337 -2627 -4822 -3365
1923 -3365 -4655 -5895 -2527 -2188 -5572 -4762 -2346 -5030 -5542 -2267 -3765 -7040 -3405 -293 -4527 -5741
1939 -5741 -2460 -4212 -5646 -998 130 -4887 -3780 -136 -1739 -2739 -756 -1740 -2254 2419 2206 -2429
1955 -2429 -1524 1814 372 341 3380 1547 -1741 2739 5018 13 -830 3438 2679 716 4171 3803
1971 3803 -223 1141 4518 2932 2245 3970 2492 1466 4973 4708 1086 2740 4990 2942 3606 5979
1987 5979 2797 283 5601 7789 2739 1958 5758 4751 3419 6074 5014 1354 3826 6608 3499
2002 3499 2197 4382 3053 2479 5290 4037 79 1776 4191 1333 1009 3526 901 -1888 2105
2017B105J350m812l62L334j479j368K197j515k965K754K122k615q52J427j697
2032b376L10K456j708l197K944K002l460m15K524k297k083M321L43m693Q49L173
2048a307k630j490L140m27k908K314J359k559m98J832j775L8L573j126l091K087
2064c468J654l254R80K831j632j361M069j86m305J586L253k118o48K938n77k060
2080b298K002K23k682J948K701k683k00L521j486k677K677P44k985J946L369l220
2096I00k051L980J88l298J588K432j593l68K849j578k168K432R31k097J282K114
2112E543k656o93L008j302j987K424J131k897J049K457l015k322L580L86k343
2127B363J571O79l318O06L119k806k042K599R09j830P21J63l174N61L675j892
$$ plain form
2017 2105 3455 -1357 -1719 1615 136 -1232 965 -550 -3515 -761 1361 -1254 -2106 -679 -2376
2032 -2376 -2066 390 -1318 -4515 -1571 431 -3029 -3444 -920 -3217 -5300 -979 -636 -5329 -4480 -1307
2048 -1307 -3937 -5427 -2287 -2714 -5622 -3308 -1949 -4508 -5006 -3174 -4949 -4911 -1338 -2464 -5555 -3468
2064 -3468 -1814 -5068 -4088 -1257 -2889 -4250 -181 -367 -4672 -3086 167 -1951 -2599 339 -238 -2298
2080 -2298 -296 -73 -2755 -807 1894 -789 -989 2532 1046 -1631 1046 1790 -1195 751 4120 900
2096 900 -1151 2829 3017 -281 1307 3739 2146 1778 4627 3049 881 3313 4244 2147 3429 5543
2112 5543 2887 2194 5202 3900 1913 4337 5468 2571 3620 6077 3062 740 4320 4706 2363
2127 2363 3934 4613 1295 1901 5020 2214 172 2771 3680 1850 2571 2734 -440 121 3796 1904
2143A904k255K101L88l179J392K301l002j692L619K92l033J097L96k905J115K991
2159A530k081k210K104J73j978J246J45l306J491M198k678l228J888O66j966J943
2175b063J351l438p40L992o16l497J653R91j790J652J868k999j410K636P33k225
2191c902K081N21k969J251L169k349k306K892M60j154J699O77l574K77M394o99
2207D68k841J105J564j611J207J766l214m40L638M34k539Q90L04j321J623K753
2223C786l146j642L402N87k392J189J376l342J152L680j444k872J877R66j945
2238A232J881J496l421k49L252n12k163J431Q3j583K349J522l938j173L842K71
2254D320k827J322P26k600R94K571k075k261K573R83k793R40J508l124k37K839
$$ plain form
2143 1904 -351 1750 2138 -1041 351 2652 -350 -2042 1577 1869 -1164 -67 329 -2576 -1461 1530
2159 1530 -551 -2761 -657 -484 -2462 -1216 -1071 -4377 -2886 1312 -1366 -4594 -2706 -2040 -4006 -2063
2175 -2063 -712 -4150 -4890 -898 -1514 -5011 -3358 -2367 -4157 -2505 -637 -3636 -5046 -2410 -1677 -3902
2191 -3902 -1821 -1300 -4269 -3018 151 -2198 -4504 -1612 -1152 -2306 -607 70 -3504 -3227 1167 468
2207 468 -2373 -1268 296 -1315 -108 1658 -1556 -1996 1642 2076 -463 427 731 -590 1033 3786
2223 3786 640 -1002 2400 2987 595 1784 3160 -182 970 4650 3206 334 2211 3177 1232
2238 1232 3113 4609 1188 939 4191 3679 1516 2947 3030 1447 3796 5318 1380 207 4049 4320
2254 4320 1493 2815 3541 941 1935 4506 2431 170 2743 3726 933 1873 3381 257 20 2859
2270B859j070k022K087m42k545J845J593k932j365L475o99k406J500L47k746J491
2286a030K351k629j934K525O30k475J142J042k555K90L043k009k101K425rk018
2302c312R72J989k915n24L170j520j989K405O39l037P76K918j913j503K383l90
2318a851j965J991P72k503K23L318j659j861K748k88k047J972J417k568P2L338
2334A109j803j932K718N91k400J042K103j831j47K294j267j609K541R05k667N49
2350A96K388j515k38J870r47k029K349K029k869n59K626j201j381K402N06k676
2366I51J083K386k393m55K382j321j820K627O94k561N08J869j719n65K239j019
2382B886k271K339J661l063l59J936j242j193K725p93k773J891J961k288j429
$$ plain form
2270 2859 1789 -233 1854 1412 -1133 712 2305 -627 -1992 1483 784 -1622 -122 225 -2521 -1030
2286 -1030 1321 -1308 -3242 -717 -87 -2562 -1420 -378 -2933 -2643 400 -1609 -3710 -1285 -1294 -3312
2302 -3312 -2340 -351 -3266 -3790 -620 -2140 -4129 -1724 -1085 -4122 -3346 -428 -2341 -3844 -1461 -1851
2318 -1851 -3816 -1825 -1053 -3556 -3333 -15 -1674 -3535 -787 -1075 -3122 -1150 267 -2301 -2229 1109
2334 1109 -694 -2626 92 683 -1717 -675 1428 -403 -550 1744 477 -1132 1409 2314 -353 196
2350 196 2584 1069 831 2701 1754 -275 2074 4103 1234 675 3301 2100 719 3121 3627 951
2366 951 2034 4420 2027 1572 3954 2633 813 3440 4134 1573 2081 3950 2231 1666 3905 2886
2382 2886 615 2954 4615 1552 1193 3129 1887 694 3419 2626 -147 1744 3705 1417 -12
2397a2J848q56j296K442k68k962M25J994j792o58K709j743k330K703J262l214
2413a748l18J660j074j08J865p87l050J301K294j837q83J802j407n45K819j284
2429a300l261J707K601j690r38K007j889j433L022M90l281O34K542j327j042J979
2445a179r23k266K416J673k185k30J651j662k57K769o60k642J700K449j923n65
2461a834J898j390j011K990Q48l405O42K300n98q59J471r31j200K812Q56l178
2477e89N18K043j207k30K379j183k601K222J679k042K23J867j679j276K827K04
2493C155l188O84K551j435m25J377j236j267K952M83k683J86J903r85n29K044
2509C587j467k175K576J349l357N48J831j646o34K007k10k726J182J411j695m83
$$ plain form
2397 -12 1836 980 -316 2126 1858 -1104 -679 1315 -477 -1135 1574 -169 -2499 204 1466 -1748
2413 -1748 -2066 -406 -1480 -1588 277 -510 -3560 -2259 35 -1802 -2685 -883 -2290 -2835 -16 -1300
2429 -1300 -4561 -2854 -253 -1943 -2881 -874 -2763 -4196 -1174 -684 -3965 -3331 -789 -2116 -3158 -1179
2445 -1179 -2102 -4368 -1952 -279 -2464 -2694 -1043 -2705 -2962 -193 -853 -3495 -1795 654 -1269 -1834
2461 -1834 64 -1326 -2337 653 1501 -1904 -1262 1038 440 -419 1052 121 -1079 1733 2589 -589
2477 -589 -71 1972 765 535 2914 1731 -870 1352 3031 989 1212 3079 1400 124 2951 3155
2493 3155 -33 651 3202 1767 1342 2719 1483 216 3168 3651 968 1154 3057 2072 1543 3587
2509 3587 2120 -55 2521 3870 513 1061 2892 1246 612 2619 2409 -317 865 2276 581 98
2525I8J923j311j466J851nk464J103P44j578J84K117j714k090K322Q89k802L14
2542a885J940j609p59K558r08k808J984J128j845l29J984j406q09K066m15j642
2558b755R58J353k462k44K694j294j842K142N74k372J000J394j802n03K399J91
2574e69k572J452J201j757K23K017j682p68K294j41k030J646J094k188L49K394
2590I63p42j955K497n6k256J459K092k375q82K709L5j936R44P84j650J146J907
2607B684k210q07K184J29j647J315Q48k194R24K441j698j453K720l09j997J388
2623B318J396k196m57K597l90k098J419K01j603J115J610k451j048K295J42j711
2639A139J169Q6k571J534K262k340j836K291L61j811J176M36k474N34K748j734
$$ plain form
2525 98 2021 710 -756 1095 1090 -1374 -271 473 -1105 -921 1196 -518 -2608 -286 603 -2199 -1885
2542 -1885 55 -1554 -2313 245 -663 -3471 -1487 -359 -2204 -2533 -549 -1955 -2764 -698 -1113 -2755
2558 -2755 -1797 -444 -2906 -3150 -456 -1750 -3592 -1450 -876 -3248 -2248 -854 -2656 -3159 -760 -569
2574 -569 -3141 -1689 -488 -2245 -2022 -5 -1687 -2455 -161 -302 -2332 -686 408 -1780 -1431 963
2590 963 221 -1734 763 707 -1549 -90 2002 -373 -1255 1454 1489 -447 497 1281 -369 777 2684
2607 2684 474 -333 1851 1980 333 1648 2496 302 1226 3667 1969 516 3236 2927 930 2318
2623 2318 3714 1518 1061 3658 3268 1170 2589 2790 1187 2302 3912 1461 413 2708 2850 1139
2639 1139 2308 2394 -177 1357 3619 1279 -557 1734 2095 284 1460 1896 -578 -44 2704 970
2655I70j505J647L10j542P21J177k058p29K644p07j692J461q4k411J504K001k703
2672i96j330K142L18j695J175K47k698R17K653j682k114J391P62j622Q24M85k184
2689c407L25L057j208k203J370K61j435J470J548k331n98K273r5j815J231R07
2705f50j897Q08J755r84j563J843J42j236J255J061k475N46K483j155j706J685
2721h8K06r77J583J031l027k41K903k32k093J712J052k127J059J384j546j103
2737e04K373j76j053R47R56k236P32K463j457j270K140l50j791J630J100k640
2753H64M5K684o41j493J002O44k512J561J696k146n39K140o12j631J291L47k023
2770F77J247J823k019j050J818r5k332J660J194k571O0K125j293j470J417R4k020
$$ plain form
2655 970 -535 1112 1422 -120 601 1778 -280 -1009 1635 928 -764 697 613 -1798 -294 1707 -996
2672 -996 -2326 -184 134 -1561 -386 -139 -2837 -1920 733 -949 -3063 -1672 -910 -2532 -1708 -1223 -3407
2689 -3407 -3082 -25 -1233 -3436 -2066 -1805 -3240 -1770 -222 -2553 -3151 -878 -973 -2788 -1557 -650
2705 -650 -2547 -1739 16 -968 -2531 -688 -546 -1782 -527 534 -1941 -1395 1088 -67 -1773 -88
2721 -88 118 -859 724 1755 -1272 -1513 1390 1158 -935 777 1829 -298 761 2145 599 -504
2737 -504 1869 1693 640 1587 2543 307 1039 3502 2045 775 2915 2565 774 2404 3504 864
2753 864 909 3593 2952 1459 2461 3105 593 2154 3850 1704 1165 3305 2693 1062 2353 2700 677
2770 677 1924 3747 1728 678 2496 2401 69 1729 2923 352 412 2537 1244 -226 1191 1285 -735
2787g35J318J095j705j066J885m82j659J660l32j965J112J838k192r17J856l87
2803f76j641J642L84k664Q29J972k118q75K043K94k267J206J003j623j57J897
2819g51j306p11J803Jk260R25J415j365m95J830o33j787K446J69k451P33K343
2836i4j399r17J899l75j959J748R45k023M28J693j306r20K418j7k048J183J554
2853H10j415k96J802j074q03K159P17k419N58J571q31l78J536q39j004J971Q21
2870B886k286R5J684j124k72J835o36j566J237J515j954l21J970j213j392K220
2886B678L03j954P80J150j212k24J486r78j814K235R61k561R9J729j106l50J499
2903B721j084j696J630J362j954n99J736j112q73J678J1k428J152J362j571m18
$$ plain form
2787 -735 583 1678 -27 -1093 792 310 -1349 311 -21 -1986 -874 964 -1228 -2145 -289 -676
2803 -676 -2317 -675 -291 -2955 -2126 -154 -2272 -3147 -1104 -810 -3077 -1871 -868 -2491 -2648 -751
2819 -751 -2057 -2768 -965 -964 -3224 -2299 -884 -2249 -2744 -914 -1547 -3334 -888 -719 -3170 -2437 -94
2836 -94 -1493 -2410 -511 -886 -2845 -1097 -152 -2175 -1747 -54 -1360 -2280 138 121 -1927 -744 810
2853 810 -605 -901 901 -173 -976 1183 1900 -519 39 1610 779 401 1937 1098 94 2065 2886
2870 2886 600 695 2379 1255 983 2818 2182 616 1853 3368 1414 1093 3063 1850 458 2678
2886 2678 2981 1027 1807 2957 1745 1521 3007 2029 215 2450 3411 850 949 2678 1572 1222 2721
2903 2721 1637 -59 1571 2933 979 380 2116 1004 131 1809 1820 -608 544 1906 335 -83
2919h3J599j349j261J932O66k365N98J179j550o05K512j351k101J761J119k044
2935a343m10J595q39r28K075o63k167R08K052j844n85J543j061n01J715j02k084
2952b639Q28J527j260n02J773p31j642J602R57k175M25J611j429k54K375p12j841
2969b087R56J488j542k59J395j333n22K641k39k370R42J638j588K29J477j133
2985c07o90K168L06k402O46J788j194q47K305o60j575J449P56j473K87J722j375
3002I04r32K179N5j817R98J014j692Q33J498j428r69J791K98k013N19J451j509
3019A180j34J758q41j701J851L05j779L99J618j377q07J522J75j781J135N54j525
3036E52J06K115j746r21J629K51k334J143R11j733kJ817j280j292J474J41j666
$$ plain form
2919 -83 1516 167 -1094 838 1504 -861 -263 916 -634 -1239 1273 -78 -2179 -418 701 -1343
2935 -1343 -1753 -158 -997 -1925 150 -513 -2680 -1772 280 -1564 -2149 -606 -1667 -2168 -453 -555 -2639
2952 -2639 -1811 -284 -1544 -2046 -273 -1004 -2646 -1044 -87 -2262 -1837 -226 -1655 -1909 466 -246 -2087
2969 -2087 -1131 357 -1185 -1444 -49 -1382 -1904 737 498 -1872 -930 708 -880 -651 826 -307
2985 -307 -997 1171 1477 -925 -279 1509 315 -532 1773 1113 -462 987 1743 270 557 2279 904
3002 904 -28 2151 2206 389 1387 2401 709 1542 3040 1612 643 2434 2732 719 1238 2689 1180
3019 1180 1046 2804 1963 262 2113 2418 639 1038 2656 1279 472 1994 2169 388 1523 2077 552
3036 552 658 2773 1027 106 1735 1986 -348 795 1706 -27 -29 1788 508 -784 690 831 -835
3053h35N99J122j968l76J963o50j760J611P20k399L05J864j232j452J474O8j524
3070b470J187M35j695n2K209j019j452J584M7j426P96J068k170J16K226o69j889
3087c174J642L75j898Q15J601j693m44K298n99j488J408O09j838M45J868j276
3103a349j016J751r8j868J746O87k017L09J943r8j537J356M31j438J097J438j989
3120f52j51J665L08j386Q76N66j239N86J313j247j112K468m0j586J196N02j559
3137E08L44J767q45j420J624j46j059P65J297k340k32K004l44j544J117K80j580
3154A96R57J607j545j064J776J99j869R67P4j263P78J308r73j326J419J55j428
3171c2P83P74j907k19J562q85o80J081M3j851J193J055j883p98J442j99j242J194
$$ plain form
3053 -835 -236 886 -1082 -1458 505 -145 -1905 -294 426 -1973 -1668 196 -1036 -2488 -1014 -946 -2470
3070 -2470 -1283 -848 -2543 -2595 -386 -1405 -2857 -1273 -1226 -2652 -1856 -788 -2958 -2842 -616 -1285 -3174
3087 -3174 -1532 -1157 -3055 -2240 -639 -2332 -2776 -478 -1077 -2565 -1157 -548 -2386 -1941 -73 -1349
3103 -1349 -2365 -614 -712 -2580 -834 -147 -2164 -1855 88 -10 -1547 -191 240 -1198 -101 1337 -652
3120 -652 -803 862 1170 -216 660 1226 -13 573 1886 639 -473 1995 1955 369 1565 2067 508
3137 508 852 2619 1774 354 1978 1832 773 1538 2835 495 263 2267 1923 379 1496 1776 196
3154 196 1153 2760 1215 151 1927 2126 257 1224 1298 35 813 2121 1148 -178 1241 1396 -32
3171 -32 751 1525 -382 -601 961 76 -604 477 520 -1331 -138 917 -966 -1764 -322 -521 -1763 -569
3189e69P4k185J046J452j140j324J472M61j927R28Q90k318O87J830j004j288J456
3206a459O7j355Q76J255j806j46J839r99j029J893l87j333O87J432j143q06J480
3223i34l17j153J371O10j533L87J819j511r99J816l52m61Q56N77j511MJ828m95
3241Bj132J596L75j891R04J480j419l79K044m58j090R02Q26j982N92J645p95j061
3259A59J843m12j178J178Q39j772J79J784q73r61J286l39j104J116Q68j765l5
3276H13J662r09r48J067P56j843Q79P70j178m63J527o92j187J036O78j587K8J303
3294A712j082o83J678n93j806J201R20j514n95J488l97j326J408q4j617Q62J027
3311E99j689l08J392m96r62R97J91j459N38J043j273l84J692p68j765J422J085
$$ plain form
3189 -569 -495 -2680 -1634 -182 -1322 -2646 -1174 -713 -2640 -1712 -822 -3140 -2453 -623 -1627 -2915 -1459
3206 -1459 -1392 -2747 -1871 -616 -2422 -2568 -729 -1728 -2757 -864 -1251 -2584 -1897 -465 -1608 -2414 -934
3223 -934 -1251 -2404 -1033 -423 -1956 -1569 250 -1261 -2260 -444 -796 -1257 -401 176 -1335 -1331 497 2
3241 2 -1130 466 841 -1050 -146 1334 -85 -464 1580 1122 32 934 1760 -222 370 2015 1220 159
3259 159 2002 1590 412 1590 2429 657 836 2620 1747 786 2072 1733 629 1745 2613 848 813
3276 813 2475 1566 618 1685 2441 598 1477 2247 1069 606 2133 1441 254 1290 1968 381 409 1712
3294 1712 630 -53 1625 1032 -774 427 1347 -167 -762 726 329 -997 411 327 -1290 -428 599
3311 599 -1090 -1398 -6 -502 -1464 -467 -276 -1735 -1197 -154 -1427 -1811 -119 -887 -2652 -1230 -145
3328a45j616Q9J270j215p27J631j0j819Q11J184j207l22Q93l25j041J688Q3j691
3346b469M95J124j095m52J468m22j305J551M48j146k9J324q08l88J692n89j133
3363a734P07Q67q58K92J081j121l49J391K74j571M72J418r00k10J449j083j197
3380a072J829Q66j700J39J254q10m91J502p10j020J338O14j430L08J176j025p88
3397b0J690L2j483O18R20j078K52J331j229j044J758L46j511o5J350r49j01J078
3415A895q68r92J098N85j535N39O89p39l86J471l96j627Q41Q51j617L20J148r28
3433C49q47J375k57j419P29M39j029J7J327q28j294J291N05j554M06O24r53l35
3451a454J412m59j419O83J067j356j47J043o31o30J350m93j409J095P14j425P3
$$ plain form
3328 -145 -1761 -1672 -402 -1617 -2344 -713 -723 -2542 -1731 -547 -1754 -2076 -1183 -1508 -2549 -861 -778 -2469
3346 -2469 -1974 -850 -1945 -2397 -929 -1351 -2656 -1105 -657 -1803 -1832 -508 -1316 -1704 -12 -601 -1734
3363 -1734 -1027 -160 -1018 -726 355 -766 -1115 276 550 -1021 -549 869 -31 -241 1208 125 -1072
3380 -1072 757 1623 -77 62 1316 506 15 1517 807 -213 1125 1739 309 617 1793 768 -20
3397 -20 1670 1702 219 837 1757 679 931 2262 1033 -11 1747 2093 582 517 1867 918 817 1895
3415 1895 1027 35 1133 1718 183 722 1411 672 286 1757 1361 -266 575 1426 -191 129 1277 349
3433 349 -498 877 620 -799 -70 369 -660 -643 684 -144 -1438 -147 358 -1196 -790 -166 -1119 -1454
3451 -1454 -42 -501 -1920 -1237 -170 -1526 -1673 -630 -1261 -1891 -541 -1034 -2443 -1348 -634 -2059 -1986
3468a986J388o52j019R35N06j110N41P67q54k74J364q39r29J165N08j106M77P82
3486c36j123j60J735o62j298J199Q48j051J27O79o00n89J818j45j737J388R79
3503A072j404j39J553p37q68J033J043j389J57J267j345r3J272Q2r39P17L25q65
3521G42K63J143q36o61J398j35j053O59O97j101M4Q59l35r95J558p4j430N63J250
3540B556j186p13J355k59j031O28K43j423Q91R77j129r79J540k82j264J132J48
3557A204j451N82J091j127q00J133K55j350M63Q72j274k16J318p83o97J193l01
3574A12j100N63P46r70q13J513l33j078P59N03j635L10J288q72l53O80j19q70
3592a669O48M82j265N16R33o42r34J040J61p89L32P27j210J47J206m19o69P58
$$ plain form
3468 -1986 -598 -1250 -2269 -1334 -828 -1938 -1397 -630 -1484 -1758 -394 -1233 -2162 -997 -489 -1595 -1118 -336
3486 -336 -1459 -1619 116 -546 -1844 -645 203 -848 -721 -42 -642 -1231 587 442 -1295 93 1072
3503 1072 -332 -471 1082 345 -523 510 1553 164 321 1588 243 150 1422 1504 565 1282 1607 742
3521 742 1005 2148 1312 651 2049 1914 861 1520 2217 1116 1160 2019 1684 689 2247 2173 743 1306 2556
3540 2556 1370 657 2012 1753 722 1350 1593 170 1061 2038 909 -70 1470 1188 -76 1056 1204
3557 1204 -247 335 1426 299 -501 632 887 -463 0 872 -402 -618 700 -83 -780 413 112
3574 112 -988 -425 321 -649 -1462 51 -282 -1360 -601 -98 -1733 -1423 -135 -1007 -1360 -680 -799 -1669
3592 -1669 -1021 -539 -1804 -1288 -355 -997 -1931 -891 -730 -1519 -1187 -460 -1670 -1523 -317 -736 -1405 -647
3610f47L78j556R92R84j005p45J464j73n90N86J031j683K75J112l33p35Q18J69
3628C42j092J131N84j339J25J538n13j043J065L94j267P19R77j391l86J426o9
3645A201j049P83O95j092k26J138n66l40Q61k42n65N04P62j183l70J473l86q01
3663E97R88k61j095Q08P22j028o39J495k27j248R22J10q50M22O85j180o52J451
3681A020o75o88P51N97j632N35J227j150p54J229j1j397N01J055j057m95J092
3698A48m59n38O63j5j006N56R47j315k26Q37j85j153J502%j261L60Q72r73m84
3717a730J471n14r08O81N48j077P7J178o95r62J398k23r03L97R95j019k19J048
3735d57l20o68J194K6j259N98P94r19m21J364n70n86O37O01j538L25J496p30n53
$$ plain form
3610 -647 -269 -1825 -833 151 -854 -1599 -135 -308 -898 -312 719 -964 -689 423 90 -645 173 342
3628 342 -750 381 965 -374 -249 1289 776 -267 798 1192 -75 644 1621 230 -156 1270 1201
3645 1201 152 935 1630 538 312 1450 884 544 1405 1163 598 1102 1864 681 311 1784 1398 597
3663 597 1585 1324 229 1037 1759 731 92 1587 1360 112 1034 1144 294 716 1401 221 -431 1020
3681 1020 345 -343 408 1005 -627 -92 1135 -15 -769 460 449 -948 -447 608 -449 -944 148
3698 148 -311 -849 -186 -201 -1207 -651 296 -1019 -1245 -408 -593 -1746 -244 -244 -1505 -1145 -273 -1246 -1730
3717 -1730 -259 -773 -1681 -1000 -452 -1529 -1452 -274 -969 -1931 -533 -756 -1659 -1262 -267 -1286 -1505 -457
3735 -457 -777 -1445 -251 -225 -1484 -886 -92 -1011 -1432 -68 -638 -1224 -587 14 -1524 -1199 297 -433 -986
3754i86J193j71r45Q20J76r79M12J321o66r19J006L26j029J72J614j040l28Q52
3772H29j90r28R71M61j207J98R72o69n9M51K29q33O14L92r39J23J122p04l62P58
3792A229p3p26K66N10p44p1J169o59j057J075L77r52j22R72m95j70P82l57j128
3811a74R65L32q58MR09n24p70J530j029p51Q67L62j208k3J156o91l16J91O09j233
3831f52J39J072j160k17J132l18r79N78N43j082R2Q63m78m61R89m95r19O80O25
3850d8r01P9P27n98m76J069r0j377Q77O29p33oQ02p03p82J004Kq00M16P34q24
3871i99l30J012R8q68P18O34j339K88Q25p80j19J360l94o01J71O37o53J44P52
3890E56o09j88J114lj379O10J022j196L64O06N3j246J410K22j381O08P53o04o43
$$ plain form
3754 -986 207 36 -909 -89 87 -892 -480 841 175 -744 262 588 -441 -269 1345 305 -23 829
3772 829 639 -289 682 1143 -64 134 1106 437 378 829 1058 225 839 1231 292 415 1537 833 471 1229
3792 1229 1156 430 696 1206 462 391 1560 901 -156 919 1296 344 222 1194 699 529 1311 954 -174
3811 -174 791 1123 265 269 1178 654 -116 1414 385 -366 501 863 -345 -368 788 97 -219 -28 581 -652
3831 -652 -513 559 -601 -818 314 -4 -983 -405 138 -944 -852 11 -467 -928 61 -434 -1353 -673 -48
3850 -48 -949 -870 -143 -741 -1217 -148 -238 -1615 -738 -109 -842 -848 -46 -749 -1531 -527 -525 -1325 -909 -175 -999
3871 -999 -1329 -317 -219 -1087 -369 265 -1074 -786 39 -741 -860 500 106 -495 -324 313 -340 -196 556
3890 556 -53 -241 873 870 -509 101 1123 -73 291 897 950 -296 1114 1336 -45 563 1316 712 69
3909F9J274j94r16N57M59n59L26P27j130o24J611k17q96J91R03p00l45R35m99
3928I72n59P07M04j021L67N59p08j27R52p10n78O58P70j265j52J168p66p54Q63
3947G80P9j099O70K63j157K27R15q31o59Q90J34o10p7M17l83p4P60m87p89O09
3967d22M93r20j11P25p50j40Q68m73p45J022K08r74L70Q32p58n84O98j32l91P7
3987a107J003j066j23J291o32j011J090N6n95L67L42p47J25J133m07j120J014
4004c87N99j195K63J251j043n03J022Q2q81N09M96p30J55Q70l23m83R77j86o22
4023a29O93O20j209%J127m81m59N76no84L73R76r01l46J224n53p80J009K12n92
4043F71m8O12o27j22P67j95o64M75O90p14n98Q70k61q62Q90Q8q98K89Q81n14p42
$$ plain form
3909 69 1343 1149 233 790 1249 690 1016 1743 613 -11 1600 1383 487 678 1581 881 536 1471 972
3928 972 413 1120 1524 503 870 1429 721 594 1546 836 258 916 1686 421 269 1437 671 -83 780
3947 780 859 -240 430 693 -464 -237 678 -153 -812 78 212 -398 -475 -58 -441 -515 245 -242 -1031 -422
3967 -422 71 -849 -960 -235 -985 -1125 -257 -730 -1475 -453 -245 -1219 -849 -17 -775 -1359 -661 -793 -1184 -1107
3987 -1107 -104 -1170 -1293 -2 -634 -1645 -555 -499 -1094 -727 -385 -1132 -1007 126 -281 -1401 -387
4004 -387 212 -983 -720 531 -512 -1015 7 89 -792 -283 213 -517 -362 508 185 -298 679 493 -129
4023 -129 564 1184 -25 -25 1102 621 162 738 733 49 422 1398 497 151 1375 822 42 1051 1263 671
4043 671 623 1235 608 486 1253 1058 394 869 1559 845 247 1117 856 -6 884 972 74 363 1244 730 -12
4064a2R25j64p98N78O14j163K30O41o95p17J232l1j010M09N27r38j32R93o10o32
4084g53J051l16p40M77M50l17m92O71m22k23L22L08r13K18N73o31m09J126m81
4103e01o73Q54J07j088J97J068q49l37P41L7o49L86M62q11M0R59r08m05J261J23
4123A4j230L15J046l84n57R27m40m22N09M30j165N95R79p95n1L07k5m87J72R50
4143F88p81l46J122l32o41N47L05j057O15M72m05j38Q89j52q23Q75L65r16L6Q65
4163A188q52j85J024m41n44P65N99r80r4O00l1o14P04k93n17O05M59p88p5O65
4183A195lr72Q59M3j157P92K73o40k75R81o6j017L92M99q89J67L01l3o68R66l95
4204C53n79N87K03r45L03L22K3p43O28j32p74N00O85j153k62R39j49p17N68r2
$$ plain form
4064 -12 913 749 -49 529 1143 -20 210 851 156 -561 671 640 -370 39 566 -372 -504 489 -121 -753
4084 -753 298 -18 -758 -281 169 -148 -640 31 -391 -614 -292 16 -897 -679 -106 -737 -1146 -20 -501
4103 -501 -1174 -320 -213 -1301 -1104 -36 -885 -1222 -481 -444 -1093 -707 -245 -1056 -1016 -57 -965 -1370 -109 14
4123 14 -1216 -901 145 -239 -796 131 -309 -731 -222 208 -957 -362 617 -178 -229 78 53 -434 -262 688
4143 688 -93 -439 683 351 -290 257 562 -495 120 592 187 49 938 786 -37 838 1203 287 323 1188
4163 1188 336 151 1175 734 190 955 1554 574 480 1080 1049 435 1139 846 329 934 1393 605 530 1195
4183 1195 1192 220 1079 1122 -35 757 1030 390 115 1096 1030 13 405 904 15 182 483 450 -218 748 353
4204 353 -226 361 564 -381 -78 244 267 -476 152 20 -754 -254 431 -722 -984 -45 -194 -911 -343 -435
4224d35o01K47J038r10p17J073j32q77P30L93q98L54K78l47l60Q58k11r27O03
4243h41N81q90l70J378n80p00J096K21r47M71J62k71l07P65n86l08Q31K89p65
4262g71L25L75o71n7J164k07r39O78M12p35q8Q95l81m35P36L81r72L45P58o66
4282A47P8P29q65%O85l92k26K23O78p41N2P84p09m66P70J69n71K40N26k33l59
4303E19P83j73j014N58L50p45J26P15o54m22Q41J70q68K3P62q19p7J105o69r13
4323d02R90J76q03j78Q19o13k51Q64Q2j026N69J46q24K55N84o50m34O45J19r54
4343h86P92J47p25L6J024n79p75N27M07r33J03M77n36q5O84j23j118J059L65j148
4363a287K27R48o74l19Q09k44r75N19N50q66L15L66l43l02P73J79r00O44K68n28
$$ plain form
4224 -435 -1036 -789 249 -661 -1378 -305 -437 -1314 -584 -191 -1089 -735 -457 -804 -1164 -306 -517 -1444 -841
4243 -841 -260 -1150 -1520 -142 -722 -1422 -326 -105 -1052 -581 -419 -690 -997 -232 -818 -1126 -295 -6 -771
4262 -771 -446 -71 -742 -799 365 158 -781 -103 309 -426 -514 381 0 -435 301 682 -290 55 813 147
4282 147 225 954 89 89 774 382 156 379 1057 316 368 1152 443 -23 747 916 345 585 1111 878 519
4303 519 1302 1129 115 673 1023 278 404 1119 465 43 884 1054 186 209 971 152 75 1180 511 -402
4323 -402 588 764 -39 -217 602 -11 -262 602 684 -342 227 373 -451 -196 388 -262 -696 -51 68 -886
4343 -886 -94 53 -672 -636 388 -191 -966 -439 -32 -965 -862 -385 -921 -1006 -322 -445 -1563 -504 -139 -1287
4363 -1287 -1060 -112 -786 -1105 -296 -540 -1515 -996 -446 -1312 -997 -631 -974 -1276 -503 -324 -1224 -580 -312 -840
4383h40l58J438p08p80P10N74q82J79R89p76m15J228j85p26M26M61o17r9J025
4402F44o71n59Q89M6o84M31N29o07K05K65J02n14N71k66j81M07P76j316j7Q36
4422H86l36q20J032K54q05m9J025m71l77R38l24m72J65N66o37j87O19k90o59R18
4442I76J28r21L56N53o91k19O38m52m69P69l3q84N39K76m91n56J023n91m19R75
4462E07P5j157L29P09o43o65J047k28o54M76M24q04J27L90l80n57P13M5r59N94
4482f11O71o46k31P33p03k08O95j81o42L74K80l21J03K55j32j28L38N9o11L1P33
4503a42l92o40J159j35p26N44M42q91K68Q55n60o32Q95K2q29L07N76m20k59R20
4523C62l07o15O41K90q48J92P71l40n76J026k28m47L41O08o10j73R05n07m30M94
$$ plain form
4383 -840 -1198 240 -468 -1248 -538 36 -846 -667 322 -454 -869 359 174 -552 -126 335 -282 -381 644
4402 644 -27 -586 303 349 -335 96 625 18 223 488 590 76 647 381 200 607 1383 67 50 886
4422 886 550 -270 762 1016 211 162 1187 716 339 1277 953 481 646 1212 575 388 1007 717 58 976
4442 976 1104 183 539 1092 401 182 820 368 -101 668 635 -249 290 566 75 -481 542 -49 -468 507
4462 507 582 -575 -246 463 -180 -845 202 -26 -680 -204 220 -584 -457 -67 -447 -1004 -291 -246 -1205 -611
4482 -611 60 -586 -817 -84 -787 -995 -300 -481 -1123 -749 -469 -790 -687 -432 -564 -692 -354 -295 -906 -875 -142
4503 -142 -534 -1174 -15 -150 -876 -332 110 -781 -513 342 -218 -850 45 67 -762 -455 121 -299 -558 362
4523 362 55 -560 81 371 -477 -285 486 146 -430 596 368 -79 262 870 260 87 992 485 55 549
4543E49K54m69P6M58q95K46R79p91k52L96M83r70L66O17o99K3O32m91m29N51K1
4564F55m78K16L47q5n50M74J15l76l3P97p58l32O28k99o26J024k16n16J45K94
4584D26l61n41R04J46p43K53M39m86J3O06p67k8M84k79o41M14K78p91K85K79Q8
4605b2n74O32l47p46N45O28o51j32N63k58l39N7L82p34M66P89p25l63L31ml06
4626h08K36L57n89J16L83m79p5N88J85o41O6P06o25j89P14n04l63R67n7n72j3
4647e97L81Nj66L63k94k35Q81l53m73L40M77l29l98O94k15l97N87K95o36J49N10
4668E89n28k25P95K55r88J94O91l50L7K99n6n79P24k5o60L09N73n10l30P22n68
4689C69k68M58L23o05j24Q08m59l25P31j34q60P03M94j074K22P38p02j71N99J76
$$ plain form
4543 549 803 334 410 868 -27 219 1198 407 155 551 1034 64 430 1047 348 371 1003 512 83 634 655
4564 655 177 393 740 655 105 579 694 318 285 1082 324 -8 620 321 -305 719 503 -13 132 426
4584 426 65 -476 428 574 -169 84 523 37 50 656 -111 -139 345 66 -575 -161 117 -674 -389 -110 -22
4605 -22 -596 36 -311 -1057 -512 116 -535 -667 -104 -362 -701 -644 -262 -996 -530 259 -466 -829 -498 -502 -808
4626 -808 -572 -215 -804 -688 -305 -784 -859 -271 -86 -727 -661 45 -580 -769 -55 -559 -922 45 -12 -584 -597
4647 -597 -216 -211 -377 -14 -308 -543 338 -15 -488 -148 329 0 -398 296 81 -316 271 566 -70 79 589
4668 589 61 -164 631 886 -102 92 783 433 470 769 713 134 858 833 173 482 1055 545 215 937 369
4689 369 101 559 882 277 153 961 502 177 908 774 -86 617 1111 37 259 997 295 124 723 899
4709H99j040L04K14m91j33Q32k37n08K60N98o12k11L83m13o11Q65M7m36K65M10
4729C85r48K7N92p74J12O29n6p69K73N05m74j14N90k50p38P79K14n27M9J93k37
4750e39j73N41j32m35K19J97l18qL94m73Q0M43m88l98P80M58q60j37M47k24l51
4771i77R06K35r78O76N54r00n25J110k77n85N81N47m98L6M63n20k69N78n6k37
4791a36J54M71q36J33Q00j06p39R79j56q56P46J22l54q7P69p34q3M18J51n90J15
4812A81O59m19k01P78m51l27L77L39q83K90M82o77k75Q12J24r48N49K54p79L02
4832A87N46p82j27N78m1l11J14M38m96k15P01n71k29N43K2r87N60N54m24m02L37
4853el12l14N72J56m13k17O24P2o59N34N2n72K06Q0m45J13O41o29l22O29K36o74
$$ plain form
4709 899 -141 163 377 -114 -247 585 348 -160 100 698 86 -125 258 -155 -766 99 146 -290 -25 385
4729 385 -563 -536 56 -718 -606 23 -33 -802 -529 -24 -498 -612 -22 -272 -1010 -231 -17 -544 -495 -302 -539
4750 -539 -712 -171 -303 -738 -519 -322 -640 -648 -254 -727 -647 -204 -692 -1090 -310 148 -712 -849 -402 -626 -977
4771 -977 -71 164 -814 -138 416 -484 -1009 101 -176 -761 -180 367 -131 -95 368 -152 -421 157 101 -136
4791 -136 18 489 -347 -214 586 480 -259 720 564 -292 454 576 222 135 904 170 87 505 656 66 181
4812 181 840 421 220 998 547 220 597 936 53 343 825 148 -127 685 809 -139 410 664 -115 187
4832 187 733 -49 -176 402 361 50 164 602 106 -109 592 21 -208 335 357 -630 -70 484 60 -342 -5
4853 -5 -317 -631 -59 97 -316 -533 91 163 -496 38 90 -482 -276 -196 -641 -528 113 -516 -838 -209 27 -647
4875f47j07K99p4P2L54m07m45O14r0k04q4M39m38k02O26L25r44N82J56r39N99
4896e15O11m38m1p0N03p15L24K59n42L5P92p9n35K61Q2l98M32J62k58j67P91j58
4918C36o25M84J48k59Q8M39m62m76N44m9q9L08K17p70j22Q49p5l78P1K46k33K61
4940D53O5n09j77J402o75m26L43J65n63J67L91k69n59Q23J42q30N81J42l87o9
4960B10L11k26q6O77k21o77N29K44o17k14M17p4k99N3J98n08J01O56o26k52O54
4981B50jn85J37J40l89K48N00l76m32L23K10n62N5N91l51j13L49l75k96L55K61
5002f1p88J79O16l34l38M40N9n55P21R7j095L33O37m88j99Q04j29l94L14K26n02
5023d57K42J30j64o07P10p0j87P6q6L69n69M57k32m53Q50j74k93L14L18j33p13
$$ plain form
4875 -647 -754 -455 -529 -457 -103 -510 -955 -341 -431 -635 -719 -280 -718 -920 -294 31 -913 -331 -175 -1114 -515
4896 -515 96 -342 -383 -453 50 -665 -341 -82 -624 -589 203 124 -411 -150 -68 -466 -34 128 -130 -297 494 336
4918 336 -289 195 343 84 172 611 149 -327 217 168 79 387 604 -166 -288 561 486 108 179 425 192 453
4940 453 518 9 -168 1234 559 133 476 641 78 245 636 367 -192 631 773 -57 524 666 279 210
4960 210 521 295 209 886 665 -12 517 761 144 -70 347 273 -26 27 225 -283 -182 474 -152 -404 250
4981 250 249 -336 -199 -59 -448 -200 300 -76 -508 -185 25 -537 -482 109 -242 -355 -6 -381 -677 -322 -61
5002 -61 -849 -670 -54 -388 -726 -286 -227 -782 -61 36 -1059 -726 -89 -577 -776 28 -101 -495 -181 45 -457
5023 -457 -215 -85 -249 -856 -146 -216 -403 -327 -413 -44 -613 -156 -388 -841 9 -165 -458 -144 174 41 -672
5044f72J185m09m56N79O2l86K57L06k11l24N68K65o72J43J96m26L45M67m27m71
5064h1L94L76q39N47M90o99K4O86j67o91N19J83n27M53q9m02k91Q36r8m81J15
5085B58L62k52K3N39l36m60K57L01p58P33j13k61l90L22r3k8L9J45l65Q7k8M8
5107C0k80R95l87p68M60J05n15J23L01n28J81N80l80m98J01O07l09n9k3K93n54
5128e25L45j79j72K36K53m25J13K20M07q03M93P7p58J60L59k61k87K37N8k20K37
5149d35J22n26L68L55n49j49M39J88l63k11P16j05l06L04J13n93O72J31n09N9
5169b79L12l10k39J047q11j69N43j72K3j08L30k35r6K24L92m68Q1M75m82J03J85
5190C46P9m89L97M05n63L3K68j50o7L23p8k54J68j8n5K0K57L2l32K65j26l22M95
$$ plain form
5044 -672 513 104 -352 227 289 -97 160 466 255 -69 499 764 92 235 431 5 350 817 390 -81
5064 -81 313 689 -150 397 887 188 212 898 731 40 559 742 215 668 579 177 -114 722 624 143 258
5085 258 620 368 391 930 594 134 391 692 -66 667 554 293 -97 225 132 104 143 288 -77 10 -18 30
5107 30 -250 745 358 -410 50 155 -360 -237 64 -464 -283 297 -83 -581 -480 127 -182 -241 -264 29 -525
5128 -525 -180 -359 -531 -295 -42 -467 -354 -134 273 -530 -37 40 -718 -558 -199 -460 -747 -510 -452 -672 -435
5149 -435 -313 -839 -471 -116 -665 -814 -375 -187 -550 -761 -45 -150 -456 -152 -39 -632 40 171 -338 -279
5169 -279 33 -277 -516 531 -280 -449 94 -78 -55 -163 167 -68 -164 60 452 -16 65 540 58 161 346
5190 346 425 -64 333 738 175 208 476 326 259 582 504 250 418 400 345 365 622 654 322 587 461 139 634
5213F34p6k50nK56m02j52O60n59rK46r8k38K1O60n85n14P29m7n36J56M43k66l21
5236b53M87k08m12M62K58j85m51J30M28m39J44K82p38M31K0m21M0M34l62k47L95
5257b05Qk70l0K22m12J15M37o6l35J59J68n82K88K10l28P6K16j61k67L22M07m59
5279d87l78N35j38k17N56j91m51L82N50p42k5N48k00o3J97L8j30R7L88m16k73
5300d20Q33m76l30L14K85j37j99L17q6k42N58k82l64M97R3m86r6M28M0l89O50
5321E08l25k35M24M17n79j56M93M0o88O15P6m02K99J25l35k27N80j26l15K16J76
5342E81m10K12O00n41l09K44n5l4J63k25L0j45J34j56k92M94K59r25K97O17n74
5363c5k11O52l18l85M45j59n0k4M53k82m27K05J64m71P39o65l6J43K67P9n86J52
$$ plain form
5213 634 558 308 303 559 157 5 665 106 97 343 245 7 28 688 103 -411 318 271 -265 -109 334 68 -253
5236 -253 234 26 -386 76 334 149 -302 -172 256 -183 -39 243 -495 -64 -44 -465 -425 9 -353 -600 -205
5257 -205 -197 -467 -497 -275 -687 -572 -135 -201 -536 -377 -209 -791 -503 -293 -621 -545 -329 -490 -757 -435 -28 -487
5279 -487 -865 -330 -468 -685 -129 -320 -771 -389 161 -581 -606 -58 -258 -321 -124 -86 -216 -119 269 -147 -420
5300 -420 413 -63 -393 -79 206 69 -130 187 101 -141 417 135 -229 268 361 -125 -221 207 247 -142 508
5321 508 183 -52 372 789 210 54 547 587 -101 514 590 188 487 612 277 50 630 504 189 405 581
5342 581 171 383 983 442 133 377 322 288 451 226 256 111 245 89 -203 291 550 -375 -78 539 -35
5363 -35 -246 406 88 -297 148 -11 -61 -85 368 86 -341 -136 28 -443 296 -369 -405 -262 5 84 -502 -350
5385c50L00o50N82q2l28P0M40l61j84M15K91o69K02N58m93l47N35k43j86K71J14
5406a15m97N20P4O8p85J52K87P1K72L04o86j7M31l68O7J23K70n79L39L01m13j11
5428b92N79n6m11K16Q6n5l34M60j55j44L65k58l74O60ol07J28M37j04k69K37M4
5450D47m49N63N4o79K1P97l59k20J55L76l60p3J89l56J32K67m5l40L75n3n56K44
5472A30L16k26J8K13l1n76M55K07n74J38K02p6m45P65k10o10N31k69k00n9O07
5493C06k01j91K70j41j49o2P11r02R8L01j88k88N57j37m53L07r8k7k82L10L51
5514I2l42PL44m63J19j2J08l18K00m9m04K8P96m48R6K68l47j72L60N4l32J52K43
5537b0l65j36N43k75k85L33K82p40L95K27r3m08N55Nl73M99K1l11j39K89J44l60
$$ plain form
5385 -350 -50 -700 -118 -200 -528 -458 -18 -379 -563 -148 143 -526 -324 234 -259 -606 -71 -314 -500 -229 -115
5406 -115 -612 -92 -18 50 -735 -583 -296 -225 47 351 -335 -352 79 -289 -222 -99 171 -408 -69 232 -181 -292
5428 -292 287 231 -180 36 122 67 -267 193 38 -106 259 1 -373 287 281 -26 102 539 435 166 403 447
5450 447 -2 561 615 -64 -43 754 395 175 330 706 346 273 462 106 238 505 460 120 495 442 -114 130
5472 130 446 220 238 451 420 -156 299 506 -68 70 272 196 -249 516 306 -304 227 -42 -242 -301 306
5493 306 105 -86 184 43 -106 -168 543 -359 -261 40 -148 -436 121 -16 -469 -162 -260 -287 -569 -259 92
5514 92 -250 -243 101 -362 -243 -255 -147 -465 -265 -314 -718 -690 106 -342 -246 22 -325 -497 -137 -83 -415 -263 -20
5537 -20 -385 -521 22 -253 -538 -205 77 -663 -268 -41 -134 -542 13 18 -355 144 165 -146 -285 4 148 -212
5559b12j50M19j99o3P74n79k46M61L4l50N10O9m02P7N03l61J8M5j42r3J98r7Q9
5582C03k19M45m09j79P70m3o80J80L47n53J3P14k75j68Q7K36l88J47J52j93k07
5603H0K16N5j66M4j12k8Q0k88L35j86P1lj65j7J10J34j80K49P8l34K87r5l69K24
5627B0K75n67K33l20N69m71N8N27r89M30K06k42j78K78J2j46J06L47m09n3M96
5648A82m76j6J30m0j92J50J21m15O0O52k29n18N54J15l62k2L72l87j59Q17l96
5669e9j38L2N0l38J01O74m34k18M85l48l24N68J27l72l6K76k9n66M77M19m81K40
5691A06P9m90O7P62l08l10J28L80m04M5M39m78L40L20m87j72M23K06n57K27K26
5712E42m37p6M17K2k19opK8j8M05m74j44M76L1n60J68M70k82k51J80J8j84M5Q3
$$ plain form
5559 -212 -362 57 -142 -205 569 -10 -256 205 239 -111 399 468 66 143 646 285 303 348 206 113 311 214 303
5582 303 84 529 120 -59 711 668 -12 168 515 -38 -25 689 414 246 333 569 181 328 480 287 80
5603 80 296 351 185 229 117 89 169 -119 216 30 101 98 -67 -84 26 160 -20 229 307 -27 260 165 -204 20
5627 20 295 -272 -39 -359 210 -261 -203 324 -665 -235 -29 -271 -449 -171 -159 -305 -199 148 -261 -314 182
5648 182 -294 -310 -180 -220 -412 -262 -141 -556 -496 156 -73 -591 -37 78 -284 -306 66 -321 -480 337 -59
5669 -59 -197 -165 -115 -453 -352 322 -112 -330 155 -193 -517 51 178 -194 -230 46 17 -549 -72 347 -134 106
5691 106 185 -305 -238 524 216 -94 34 414 10 55 494 16 356 676 189 17 440 646 89 316 542
5712 542 105 29 446 468 249 243 236 264 246 651 177 33 509 540 -20 148 618 336 85 265 283 99 144 227
5736B27n5l18M80l16j09M34l89K02J6M68n79J45J82l83l24N42J24m32k2K29l79
5757b57k49Q39m74j50N17k94k32J25L10k26k70J70K05n79N23j7k38J79k25J41
5777b02q3L01m38K64l83M39k93j19L51j91J11J0J78j69O4o8k01j31L49R4k5MP9
5800e9n3l45M73J40l52L1K68o10R8M32j60k17M51pm60J78L90l51k33N27k35K0
5822g4K79L56q12K70M98o15J90K12j07n01M21o4M8k48M88k49k30N45j33q2j2j22
5844E8K14p7K05m74Q1R10n12m78O87j58k58j15M33l13n4K27l19j24J43L08l97
5865a3j1L31r3RP7q3q08R18K49m08m48L63l38qK57j3j15JK49m73J71J60k90l4
5889c50L67j21j68L3K46m86J85L56j98k93P0J98N3l32M04j63j18K46m1k84J02
$$ plain form
5736 227 172 -146 334 18 -91 343 -46 156 172 640 61 206 388 5 -319 223 347 -85 -107 122 -257
5757 -257 -506 333 -141 -291 226 -68 -300 -175 135 -91 -361 -191 14 -565 -42 -59 -297 -118 -343 -202
5777 -202 -285 16 -422 -158 -541 -102 -395 -514 -163 -354 -243 -233 -55 -224 -160 -228 -429 -560 -211 -117 -142 -138 -59
5800 -59 -112 -457 16 156 -196 -165 103 -507 -409 23 -137 -354 97 90 -370 -192 198 -153 -386 141 -94 -74
5822 -74 205 561 -251 19 517 -98 92 304 197 -304 117 53 101 -147 341 92 -138 407 274 192 180 58
5844 58 272 195 400 -74 7 917 405 -73 614 456 198 83 516 203 149 376 57 -67 76 384 -13
5865 -13 -24 307 214 223 300 217 -591 327 576 168 -280 83 -255 -263 -6 -19 -134 -133 116 -357 -186 -26 -316 -350
5889 -350 17 -104 -272 -239 7 -479 -294 62 -136 -429 -359 -161 -108 -440 -36 -199 -317 -71 -112 -396 -294
5910b94L30p72N72M12n68l18M24P2m13N34k2l80L35J56k94l31L03M5k70Q4N14
5931A19l00oK76j3m15N4M70k57k38M67l39m8P57o75p5J10L82m69K01J60j40j75
5953a54N36r8j68k66N55k28l00M96j63j48L02J43o28K24K68k70j19M71p6p9N6
5974C54K50l63m35P06k32p70Q00L8k17K7M04p89J71L99p3k83K55K11j47k26K88
5995C68O9n65O32k89r2J51j06j32k79N13k17k00J50Q0j35J7L79m61q8K01J4l44
6017c34J55P3n71N55J37l50K94R0P5n63J72K80l73J38L71n23K08J75m03k4O44
6038B26k12l81k55O57J68r01J04N44k92k6R2j3L86j83K16l46K21k14K29k71J73
6059g8J25k13J06J53m57L46K8n0K91qm01Q8LJ45k35J21L07l62J3J94J98j72m9
$$ plain form
5910 -294 36 -736 -164 248 -320 -638 -214 -142 -555 -21 -43 -423 -88 68 -226 -557 -254 -209 -479 -395 119
5931 119 -181 -187 89 76 -339 -285 185 -72 -310 157 -182 -230 527 -148 -223 -113 269 -200 1 161 21 -154
5953 -154 382 284 116 -150 405 177 -123 373 210 62 364 507 -121 103 371 101 -18 453 377 298 354
5974 354 604 241 -194 512 280 -490 310 348 131 158 562 -227 -56 343 270 -13 242 453 306 80 368
5995 368 437 -128 504 215 123 274 168 36 -243 270 53 -147 3 83 -52 -35 344 -117 -205 -4 10 -334
6017 -334 -179 -106 -677 -122 15 -335 -41 49 124 -439 -267 13 -360 -222 149 -374 -166 9 -394 -418 226
6038 226 14 -367 -622 35 203 -698 -594 -50 -342 -368 -276 -289 97 -86 130 -216 5 -209 20 -251 -78
6059 -78 47 -166 -60 93 -364 -18 10 -40 251 243 -158 -70 -67 78 -157 -36 271 -91 -78 116 314 142 93
6082I3L75n53J54K71k11k38L42L3k07j10J87M7r7K51j21l60O23k62J1O0m64O59
6104D83m79K83Q5j68J79m33pM77l25j21J96K16j58m7k1j24p1J65N6j87j22K71
6126A48L37r00N43K50o41K97J70r4m8J11l14J8P3J62Mk12m1j10J11K71n6l65L27
6149D1o9p6J2J12j69j64N02k92j75J16R7j07L2J1q9K22r2k60Qj35O33l14J7r0
6173b29L18k19l64M93j36o2K3K55m73K51n1r4m7J68J38k07J71k1K05Jk82M6l0
6196a46K34j92K5L33k42m58L27L00l19n7N26j41n23K94M20m60k4L88j63j00K09
6217B31P0n09L78J76k37k20K02J75n15M51J48m48J98J89k07k48M01j38K05l8j54
6238A10l46M99n0J3k46N13l11j65K80J37l13o2j03k98K88r9K33q9K09k50j38J44
$$ plain form
6082 93 468 -85 69 340 129 -109 233 266 59 -51 136 183 86 337 216 -144 479 217 228 288 -176 483
6104 483 4 287 372 204 383 -50 -57 420 95 -26 170 386 228 181 160 36 -35 130 186 -1 -123 148
6126 148 485 -415 128 378 -263 34 204 110 62 173 -141 -123 -50 112 116 -96 -137 -247 -136 135 79 -286 41
6149 41 -28 -104 -92 20 -149 -313 189 -103 -278 -162 -65 -172 -140 -129 -218 4 -88 -348 -340 -475 158 -156 -139 -229
6173 -229 89 -130 -494 -1 -137 -199 -176 79 -394 -143 -194 -288 -335 -167 -29 -236 -65 -86 119 120 -162 -116 -146
6196 -146 88 -104 -79 254 12 -446 -119 181 -138 -195 331 190 -333 -39 381 -79 -103 285 122 22 231
6217 231 301 -208 170 346 109 -111 91 266 -249 202 350 -98 100 289 82 -166 235 97 302 264 110
6238 110 -236 263 213 226 -20 493 182 17 297 434 121 59 -44 -342 -54 -153 80 -9 200 -50 -188 -44
6260d4M41n96N5K36K10n26M56j63j14O9P8m67L07K15qk24j94L47k58n9K6R1j82
6283c04N5J80O4q4Q8j78L00j52k10M1J4J10k56l0M02l13N9l9j3j47K34K4j7J05
6307f7k12J38k98O27j18qM1j97m3j63M08l73J38J18QLm44K74J93k01K3K39J66
6330B52j89O9l51K17M67n45Q5J82k91k14J48N2P6M1J99j39L0K88lm12j82M56l32
6353i6L12J16qj34m9l5Q6N8L4k59Oj56L21L8j23q1O6L47m79L60l68M94l64k2J55
6378B19J03k5k86K29K4j74N6m5l3j3Q0J27n19N00k4k81J56K64k23m00L26j04j90
6401b33K48j63j79J45L45k24l36J36Q3n9L59m8k42lL97l35j4K66m6m75O7P9m2
6424b74Q4j5p9J56K57j84r7N6M44q51K11M33k37J26j10K07k79K98R2k71o06N87
$$ plain form
6260 -44 397 -199 -144 92 302 -224 232 69 -45 24 102 -365 -58 157 149 -75 -269 78 -180 -239 -213 -122 -304
6283 -304 -249 -69 -5 -89 -1 -179 121 -31 -241 -200 -186 -76 -332 -362 40 -273 -214 -253 -266 -413 -179 -155 -172 -67
6307 -67 -279 -141 -439 188 70 62 103 -94 -137 -300 108 -265 -127 -9 -1 2 -442 -168 25 -176 -153 86 252
6330 252 63 132 -219 -2 465 -80 5 187 -104 -318 -170 -118 -42 -1 198 59 89 377 374 -38 -220 236 -96
6353 -96 216 332 324 190 141 106 192 250 284 25 31 -125 196 234 111 30 96 443 -36 324 -44 450 86 64 219
6378 219 322 297 11 240 264 90 146 101 68 55 135 262 -257 243 219 -62 94 358 135 -265 61 -43 -233
6401 -233 15 -148 -327 -182 163 -61 -397 -261 -178 -237 122 74 -168 -171 226 -109 -123 143 97 -378 -311 -232 -274
6424 -274 -190 -205 -284 -128 129 -55 -152 -96 348 -503 -292 141 -96 30 -80 127 -152 146 238 -33 -639 -52
6446e2k46J68R7J7j89J37L28m12m6O8L11m42N30n75K66j19L62k03K1J24k04j53
6468b12J1M94l07K03j99J11l1N9K9r0m14R38j21k17K4k27P4j0r8j51K70L9q2k25
6492a32K95J13r8KQ1j47j64m4J1k2L1j7L8K58J50n02M19k74K98m52L79k66J2j7
6516d8M88m75n1K74j08P0J78k74k9j32N28k76j98O8j30k90M41L1k85m4K59Qj85
6539a80JJ63k60K89O6k74J6j9j83o5L02k11J52N79n11K42l72J70o1N7k34J40R6
6562i7p3L70k63O7j41K02k9k86K31k42R1K88r0k05L14j27k57N90n59Q2j72P40
6584D34K2m58R0k42P9j16M89l37k04L93k88j21N41p6l74J85N18m97j85O4J95j67
6606e5l8K89k53l3M10j6n32Q27m14k57K56j45O9K05j09J15l77K60Qk35L1L01j46
$$ plain form
6446 -52 -298 -130 -33 -16 -205 -68 260 -152 -198 -130 181 -261 269 -306 -40 -159 203 0 21 145 -59 -212
6468 -212 -201 293 -14 189 -10 101 70 129 158 68 -346 592 471 254 278 51 125 115 17 -134 136 175 93 -132
6492 -132 163 276 178 180 261 114 -50 -94 -83 -105 -74 -91 -53 205 355 -147 272 -2 296 -156 223 -43 -31 -48
6516 -48 440 -35 -86 188 80 150 328 54 25 -107 421 145 -53 15 -115 -405 36 67 -218 -262 -3 5 -180
6539 -180 -179 -16 -276 13 79 -195 -179 -198 -381 -446 -144 -355 -203 376 -135 107 -265 -95 -156 -99 -333 -193 -97
6562 -97 -170 200 -63 4 -137 65 36 -250 -19 -261 -170 118 28 -177 137 10 -247 343 -216 -134 -306 434
6584 434 456 -2 88 -154 -75 -191 298 -39 -243 150 -138 -259 282 206 -168 17 535 38 -147 -83 112 -55
6606 -55 -93 196 -57 -90 320 304 -228 599 185 -72 184 39 108 313 204 319 -58 202 210 -25 6 307 161
6629A61m1O5Q8l13j72N00Nk35K16k52j45N3m9Q8L81k53k84J91q2M29k96N9j94
6652h0l5K43k77Q0l7L8J28k62K01J74n66J33N19m22j84L53Q3n04L72J70n07P0
6674c10J05K94k29J95K0k44Q4Q0k21n0j71J79P4k63N94l25J56n4k18J31J60n1
6696f4J02j98M79l79k70L08J20k43p6M34m75L0M37m71J54P5J41n00L09L59Q2n78
6718b24M05j57m38P01m71M3L09J63j31L7j78k08L32n0J68m85J15M43l67J98O4
6739B69J33m28J69L8k38j83L58R2l24L06m50J83j42M39k36o2M54m39j52L48k23
6760h8R1J64k84J10l9L20m75J68J16M5k20J52J65n30K00K25J06M0m65J49Kk15
6782b63M57m44KJ54j70J19K7M60m09R3R7k77o3ln9k03O79K8m64k6K44M7l0L53
$$ plain form
6629 161 120 185 273 -40 -212 288 293 58 274 22 -123 -70 -119 -31 350 97 -187 4 -78 351 55 114 -80
6652 -80 -115 128 -149 -69 -106 -68 60 -202 -1 173 -393 -260 259 -163 -347 6 89 -415 -43 127 -380 -310
6674 -310 -205 89 -140 55 75 -169 -85 -5 -226 -276 -447 -268 -194 -457 137 -188 -32 -86 -304 -173 -13 -64
6696 -64 38 -160 319 -60 -330 -22 98 -145 -221 213 -262 -232 205 -266 -112 -37 104 -396 -87 272 354 -224
6718 -224 181 24 -414 287 -184 -141 168 331 200 237 59 -149 183 133 301 -184 -69 374 7 205 269
6739 269 402 -26 143 181 -57 -240 118 210 -114 192 -258 -75 -217 222 -14 -76 378 -61 -213 135 -88
6760 -88 3 167 -117 -7 -46 274 -201 -33 83 128 -92 60 225 -305 -105 120 226 266 -199 -50 -48 -263
6782 -263 194 -250 -248 -94 -264 -145 -118 342 -67 26 123 -154 -217 -220 -279 -482 197 225 -239 -265 -21 26 -4 349
6806C49m01J62k20K03k87j36L6L67k38q5pL2J04L1l9m8Q7P1J4j07J4k07O5K69
6830B9J34n85N87k04k68L0O16m83lJ72j11k79L46J56j51k9M92l18k80K80j70Q8
6852D9J20J83j78k6R5j78r7K10j17k0J21L7j25j38K25mj77n2L25k47p5L77o0j00
6876A48n0n5j3K93k97n1J05M0j02k47M23j21O4j3K19l01n8J45j70K18l20L03k16
6899e6j36K80p2j28O4k06J20L15k04p8j02K11l9kq0L83n31L87N3k00r9J48Ll58
6923c27K58L6r5J82ok6j93J91j55Q1j47j25N8J01KQ0K66l29M5k31JL24l52O1K25
6948g5k1K32j39J95n19R1L60k43o4R0K94l48J83j22l58J12L30m7j07K84o1o3P3
6971G7L00l33m09N22l47K82RJ95o30L73k14J63j25K62k03l8M72l29k86M16j39
$$ plain form
6806 349 -52 110 -110 93 -194 -330 -294 73 -165 -250 -257 -225 -121 -90 -129 -177 -90 -19 -5 -112 -98 -305 -240 29
6830 29 163 -422 165 -39 -307 -277 339 -144 -147 25 -86 -365 -19 137 -14 -43 449 131 -149 131 -39 49
6852 49 169 352 174 148 243 65 -32 178 61 41 162 199 74 -64 161 157 -20 -72 253 6 -69 308 248 148
6876 148 98 43 30 323 26 -25 80 120 18 -229 194 73 137 124 343 42 -16 129 -41 177 -143 160 -56
6899 -56 -192 88 16 -112 -48 -254 -134 181 -23 -101 -203 8 -31 -33 -113 270 -261 126 179 -21 -120 28 31 -327
6923 -327 -69 -33 -128 54 48 22 -171 20 -135 -54 -201 -326 -268 -167 -165 -85 181 -148 -103 -334 -333 -9 -361 -300 -75
6948 -75 -96 136 -3 192 -327 -236 124 -119 -183 -93 201 -147 36 -86 -444 -332 -2 -49 -156 128 67 4 77
6971 77 377 44 -365 157 -190 92 101 296 -334 39 -175 -12 -137 125 -78 -116 356 27 -259 157 18
6992A8j36L49j47L8k28J13J41J76k63j20J44k7M36j30l95K62J26l51R1j67o2j
7014a33L31j84L19M2l74K23j71O2k0j82R9R4j59oN8k88J62K7J25j3P9J24r8j61
7038d4L3r7r9J34r3L64k28J15j12l23M51j28mq6p9Q2J69J24L0n64N73l65j74O72
7062C51l69k44K52Q6j07j06K56m42Q8J90K59l22k2K80m44L45n3K63n82M12Q5r2
7084H4p9j11p3j00M65j48n22K09L66j32O7o1n0l13K55j36J21j67K51K23q6J66
7106B29j13O4j55M5J24o7J25j0n28N00r0m41J50N54k77o1L4J40k70L15k68o2L61
7129B99j29l30K36K05k58N5K15j87m7m2j87J04L29o8k89J78J46l87K72k35J69
7150D9r6K88j47rJ51j48j51j03j11L48L3j28O7J4K6j89k42L5L6L40jk14J30j04
$$ plain form
6992 18 -118 231 84 122 -106 7 148 324 61 -59 85 58 494 364 -31 231 357 6 97 -70 -132 -133
7014 -133 198 14 333 375 1 224 53 115 95 -87 12 106 -53 -59 -1 -289 -127 -100 25 12 91 215 117 -44
7038 -44 -11 -108 -207 -73 -166 198 -30 85 -27 -350 101 -27 -31 -117 -196 -114 55 179 209 -355 218 -147 -321 351
7062 351 -18 -262 -10 76 -31 -137 119 -323 -235 -45 214 -108 -130 150 -294 51 -2 261 -321 91 176 84
7084 84 5 -106 -179 -279 186 38 -484 -275 91 -41 26 -35 -85 -398 -143 -279 -158 -325 -74 149 63 229
7106 229 116 180 25 70 194 127 252 242 -286 214 124 -317 -167 387 110 49 83 223 -47 268 0 -62 299
7129 299 170 -160 76 281 23 78 293 106 59 17 -170 -66 263 195 -94 84 230 -157 115 -120 49
7150 49 -47 241 94 85 236 88 -63 -166 -277 71 104 -24 43 57 83 -106 -348 -313 -277 63 62 -152 -22 -126
7174a26L17k71J04J0qP2j44M9k62J33K43m02J62K49n3k33K9O8Kk90N7K00%j19
7198b13k36P68m76L9J3o3pk46K30K43k93J56O1K78l80L51k97J88l20K80j78M2
7220f0J01n1k94M60Qk72N4M8L6j24J27q1j09M35j57J87j63j67P8m6Q0J3k89k6
7244b12M01p6p2l30M68l97R7J50J33l21M22r6k49K23n9J4j02J47j33m4R6m1j84
7267a65L50k37K8R6n12K64J31J43J50o0kj67J41Q4K4k80K26k04N5k15j7M16l94
7290a45J86j64K5J24M4k32K11n9Nj77K35q0q5K06k66k26O67j77j65j38Q2N9j08
7313a78J11P9j50p9L56j65n1K59o7p0j08Q8k68J28J0r2K08p3K40j28j46K3k62
7336c35L05K69m13M18n57L50j25J83o19P71o3k33K79n06P6%j7l1L87l76K51l3
$$ plain form
7174 -126 191 -80 24 34 26 98 -46 3 -259 -126 117 -285 -123 126 73 -160 -131 -63 -61 -351 -294 -94 -94 -213
7198 -213 -449 319 -157 -118 -105 -168 -175 -421 -191 52 -241 -85 -24 254 -126 225 -72 116 -204 76 -102 -60
7220 -60 41 -10 -304 156 164 -108 -54 -6 30 -94 33 -48 -157 278 121 308 145 -22 56 10 90 103 -186 -212
7244 -212 189 113 41 -289 179 -218 -121 29 162 -159 263 167 -82 141 82 96 -6 141 8 -36 60 19 -165
7267 -165 185 -52 -24 72 -440 -176 -45 98 248 188 186 19 160 244 268 -12 214 10 65 -150 -167 249 -145
7290 -145 41 -123 -98 26 70 -162 49 -10 -5 -182 53 -27 -112 94 -172 -398 269 92 -73 -211 -129 -70 -178
7313 -178 -67 12 -138 -217 139 -26 -77 182 115 45 -63 25 -243 -115 -105 -197 11 -62 178 50 -96 -73 -335
7336 -335 -30 239 -174 244 -313 37 -88 95 -524 247 184 -49 230 -276 -200 -200 -217 -248 139 -237 14 -19
7358a9p7Qk25L19J27q7k7Q2M1MM1j91RQ2P5l74O7K28j72j10Q4j5j62L55Pq5O2
7385D7l7k78K06M49l49J09q0R2J15l68J06j44J62p0K64k11P4O3j35L1J62M9k64
7408gJ75n44K50r1L90k20K11j24j56pM64k95K14j47j49o5k17L17L44n34j7J00
7430a08j5K20J38k31P8j30R5j4J69j89j26Rm0K28r3o1K21m77M04N5j14k90M87
7453B16k41R3k39M05n91j79O86l44L28k39j15Q4J10j04J16q4K07l45K35J6l07
7474b92J94o6K76l2j68N7L7j55O7J00k37K57M0k90M49j14k92J6L70%l29J13j16
7497a15N5k24K96K08m31L22P6M8j01J71Nk40J4P0q5l6K48l83M77k8l63K05k01
7520a2K79k4j39j12j9k94L95p4J79k64j62J81L5QK61K3j90K14m42l5J69N8k47
$$ plain form
7358 -19 -96 -88 -313 6 133 46 19 101 142 146 187 -4 5 87 162 -212 -145 83 -89 -199 -115 -130 -292 63 70 -15 47
7385 47 10 -268 -62 387 38 147 67 159 274 -94 12 -132 30 -40 224 13 87 150 15 46 208 257 -7
7408 -7 168 -376 -126 -217 173 -47 164 40 -116 -123 341 46 260 113 -36 -101 -318 -1 343 -191 -208 -108
7430 -108 -123 97 235 4 82 -48 47 33 202 13 -113 -104 -144 84 -9 -70 151 -326 78 133 19 -271 216
7453 216 -25 68 -171 234 -357 -536 150 -194 134 -105 -220 -136 -26 -130 -14 -98 109 -236 -1 15 -292
7474 -292 -98 -164 112 80 -88 -31 6 -149 -82 18 -219 38 78 -212 237 123 -169 -153 217 217 -112 1 -115
7497 -115 -60 -284 12 220 -211 111 187 235 134 305 310 70 84 154 69 33 281 -102 375 347 -16 189 -12
7520 -12 267 243 104 -8 -27 -321 74 0 179 -85 -247 -66 -31 -23 238 261 71 285 -157 -192 -23 35 -212
7543b12J33J7N1J45j24k40K62M8j24J56k83K8K4l5J50r0Q9J28j8k22L10k02j75
7566a84P5K55qj19J17k51k2p8K83j74J16k65K24J54k75P3j7N3j77O1Q7l1p0j52
7590c25L00k5k15M2L07m21K96J33j55L91k02Q6m97M33Q5j86k06K29n28N13k16
7611a61K0J33J1m5j29K19k3j86O6P9P4k86K76J78l06M2L08l22j59J27J78n4k85
7634b45p8K80o9K16MJ57k35R0j57K0L29l00j61L83l1k87K23k97J18J34j38o5J13
7657DK17k77k2J28km39M71K53k96J20k80K21j45l44N36k36J37N2J1l47K76J19
7679A57j59R7j42O4q1L0P4m4M9lJ2J27l22K04j59K39p1K18j14pk22K14k44J39
7703E6M7j89L80k85k58K69M6j60J45N5l97L16K32m70J69J18j00J12j56J07l8J21
$$ plain form
7543 -212 -79 -62 -11 134 10 -230 32 80 -44 112 -171 -143 -119 -154 -4 -94 -5 123 105 -117 193 -9 -184
7566 -184 -109 146 138 19 136 -115 -137 -215 68 -106 10 -255 -31 123 -152 -79 -96 -43 -220 -159 -72 -103 -173 -325
7590 -325 -25 -50 -265 -223 84 -337 -41 92 -63 328 126 212 -285 148 233 47 -159 70 -458 55 -161
7611 -161 -141 -8 3 -42 -171 48 25 -161 -95 -16 58 -228 48 226 -80 -38 270 -52 -211 -84 94 40 -245
7634 -245 -323 -43 -112 104 108 265 30 120 -37 -17 312 12 -149 234 203 -84 139 -158 -40 94 -44 -109 4
7657 4 221 -56 -78 50 48 -391 80 333 37 157 -123 98 -47 -391 145 -91 46 98 109 -238 38 157
7679 157 -2 95 -47 17 -64 -34 40 -4 45 42 54 181 -141 63 -96 143 72 290 176 169 -53 161 -83 56
7703 56 103 -86 294 9 -249 20 66 -94 51 106 -291 25 257 -213 -44 74 -26 86 -70 37 -1 120
7725A20n5j40K06j78j87j9K6K66p6K69r4j53L59m95L81J45m44k9j19J69k1R7k65
7748b37M40K2k02K08n1L8m64O52n34L35j28n3k36L68k37K03m3j8N2j8J61j04k1
7771A33kJ55k26LP0k27K89j27j2j95P6q8J77J30k74J73L2l81M0J04J98J06l61
7794b07K73J27k49j54J76J99k50n5K07j31J85r4j95K31j33k16J65O23n82q0J44
7815a6m3K54l5k08l7j27K2J09rJ17j85K49k36J72Pj63K09pK5m6k95L64J52l91
7839a18K5K93l40J91m7L6r0k31M48r6J96k07j03p8k45M44r7J79O4l64Q0J29J00
7862A69j52M12k86n1j65N7j28K7L97m24Q0L4l7J70N9l0j68n7L32j88MJ40l5k20
7886f0K24l98L14j04j9LJ24n8j27J38j46K07K5j89j31L19l5j3k68L81k93L68k37
$$ plain form
7725 120 65 -75 131 -47 -234 -253 -227 39 -37 232 138 -15 344 -151 230 375 -69 -98 -217 -48 -69 28 -237
7748 -237 203 225 23 231 180 218 -246 406 -128 207 79 26 -210 158 -79 124 81 63 115 97 258 154 133
7771 133 131 286 60 63 133 -94 195 68 56 -139 -63 -151 26 156 -118 55 87 -294 -254 -150 48 154 -207
7794 -207 66 193 -56 -210 -34 165 -85 -140 67 -64 121 27 -168 63 -70 -286 -121 502 -80 -160 -16
7815 -16 -59 195 160 -48 -85 -212 -190 -81 -90 27 -158 91 -145 27 34 -129 80 73 98 52 -243 121 273 -118
7839 -118 -93 200 -140 51 4 40 -50 -281 167 71 267 60 -43 -121 -366 78 -19 160 224 -140 -60 69 169
7862 169 17 429 143 92 -73 -16 -144 -117 280 -144 -64 -30 -67 103 162 132 -36 -93 239 51 55 195 160 -60
7886 -60 164 -234 80 -24 -43 -40 84 26 -101 37 -109 98 123 -66 -197 122 87 74 -194 187 -106 262 25
7909B5j54M03l15k39M67n9j66O6R6n4nl01P0N6J14k39M27j87k1k5J49Q1m31K18
7933b4j15K89k24j1kJ7n4J81j74J87j43l2L48j57j63N0Q8P9j13O7L7J00j20R2
7957B03j69J8j06P8j05K77j06J44Nj38k99K52m2Q5J49k97K5l17L46J06J25j61
7979G3Q7l71K51J3l88K75kN32m90J52k81M8Q4k1k19K78K9j6M7m3l07K12M8J12
8003A03k75J27m2Q5J00k33q7n8L07l7j54J23K47j35n6n3L26j47k69n6K64m5P4
8026A09q3r8o3K99k59J61L3j67j05L79j72k21K27j31J85Q6r9j28L1KO0J26l21
8049a49O8Q2R7J83m46K42JR9l23J95M1k06K03k86J40n9l8J82L2O5J52n59K58K93
8073B67m40J19R9L0J76k73J00k73J42P1R1j36j7n1J31L10o45L85j62k70L76j22
$$ plain form
7909 25 -129 274 -41 -280 187 128 -38 28 124 70 65 -236 -166 -110 4 -235 192 5 -16 -41 108 189 -242 -24
7933 -24 -139 150 -74 -85 -87 -70 -124 57 -117 70 -73 -105 243 86 -77 -27 61 140 27 94 131 231 111 203
7957 203 34 52 -54 24 -81 196 90 234 239 101 -198 54 12 97 246 -51 -26 -343 3 109 234 73
7979 73 160 -211 40 53 -335 -60 -62 470 -20 132 -149 -101 -17 -38 -257 21 50 34 81 38 -269 -57 -9 103
8003 103 -172 -45 -87 -2 98 -135 -222 -280 27 -10 -164 -41 206 71 15 -38 288 141 -128 -184 80 35 109
8026 109 26 -72 -135 164 -95 66 99 -68 -173 206 34 -187 40 -91 94 180 81 -47 -16 -14 46 172 -149
8049 -149 -81 1 98 281 -165 77 78 177 -146 49 90 -116 87 -199 -59 -118 -156 26 58 123 275 -284 -26 267
8073 267 -173 -54 45 75 251 -22 78 -195 -53 18 109 -27 -44 -95 36 346 -299 86 -76 -346 30 -92
8095i2p6r1L62j06J87l46J46j06j8L17m2j07K6j41P6k21o7L18L12l36j58K48j30
8118d5j11L29l64K22o1j55L68k67K87k17J65J36J15m05j28N4J83P2j77m4j75L71
8140A53j88K44j70Jl58M81p8L16p7k25K0P2j02k16K05N5K08o33K3N34j75J23l45
8163a32j27K40J34j06o0K79m36J92k6J22j61K55l97J56k4PJ5p3J36N6J53q4q7
8186C2k95M10m26L85k29
$$ plain form
8095 -92 -168 -259 103 -3 184 -162 -16 -122 -140 177 135 28 54 -87 -11 -232 -299 19 331 -5 -163 85 -45
8118 -45 -156 173 -191 31 -30 -185 183 -84 203 -14 151 287 402 -3 -131 -77 106 178 1 -43 -218 153
8140 153 -35 209 39 40 -318 163 85 401 324 99 119 191 89 -127 78 133 341 -292 -269 265 90 213 -132
8163 -132 -259 -19 115 9 -51 228 -208 -16 -42 80 -81 174 -223 -67 -91 -84 -69 -142 -6 50 203 119 32
8186 32 -263 147 -279 106 -123
8191a23
$$ Imaginary data points
##PAGE= N=2
##DATA TABLE= (X++(I..I)), XYDATA
0@%%%%%%qJ6j6J6k4L2l8M6n6O5p7R3j10J33j56J80k09K41k77L17l61M12m69N29
30B79n95O70p51Q41r40J048j167J294j436J592j762J952k161K393k652K942l269
47a722L639m064M559n140N835o687P760r154J1052j3803J8174k6223M5923j80687
61a50538l21891J95183J66180K4911j4939M8591n3936q1583j7139K2652j8229
72b00738L0008Q4120N3837o1954j18294p6615K7931O2728L7054J0005j6669p1415
84b40002n4425J6866J1012m4245N463P9717L6339n3241o9380l5260K2275P6524
96b48357N8120r934k1431j144l923J4165M2398J4207K130N4661M2103l8889k7623
109a23517L2111J0356L785O9664M0605o8584m4818M8282J3944m1038J6585M9086
$$ plain form
0 0 0 0 0 0 0 0 -8 8 -8 8 -16 16 -22 24 -32 33 -44 49 -61 72 -84 96 -113 128 -149 168 -193 219 -250 279
30 279 -316 354 -397 444 -496 552 -615 679 -757 835 -927 1025 -1136 1257 -1395 1547 -1722
47 -1722 1917 -2147 2412 -2728 3107 -3580 4180 -4974 6078 -7725 10449 -15774 30149 -150538
61 -150538 -472429 -277246 -111066 -86155 -101094 -52503 -106439 -188022 -205161 -182509 -200738
72 -200738 -170730 -86610 -32773 -94727 -213021 -289636 -261705 -198977 -161923 -151918 -168587 -240002
84 -240002 -294427 -277561 -266549 -310794 -305331 -225614 -189275 -242516 -311896 -347156 -324881 -248357
96 -248357 -190237 -200171 -221602 -222746 -226669 -212504 -170106 -155899 -153769 -99108 -57005 -95894 -123517
109 -123517 -91406 -81050 -77265 -7601 33004 -35580 -80398 -32116 -18172 -59210 -42625 6461
121F461j8834l8358Q281J733l6881j0615L7659K7163k0235l1679Q080K7082j5265
134e5408k5938L5764M4483k2503j5383N0349J8037m4419N769O0568J0175k1974
146C9520J9039K0915j2309J858J5396k479N26O246j7277j0112J7447q586k9480
159D0704R427P190m5332k3238K9835r722m9189L000K8880k4382l6748P54j845
172g0666j7214M829J6161J170n245r947j3595M008J4053L395J2237K1348k996
185d2462j2072R568j798j6930K4646M1582j3405k8200J7444Q072k9643l272K0022
198b6448q497o297K2053j1245m6455r266K1110K62m988L440j2741j4206K471o492
212i7299o950K2420J2156k0496j28K2915j3404k0319L1851L7048q678j0315Q780
$$ plain form
121 6461 -12373 -50731 -42450 -40717 -77598 -88213 -50554 -23391 -43626 -75305 -67225 -40143 -55408
134 -55408 -81346 -45582 -1099 -23602 -38985 11364 29401 -15018 -9249 51319 61494 39520
146 39520 58559 79474 67165 69023 84419 81940 82466 88712 71435 61323 78770 70184 40704
159 40704 50131 57321 11989 -11249 18586 8864 -40325 -37325 -8445 -32827 -69575 -68821 -70666
172 -70666 -87880 -83051 -66890 -65720 -70965 -80912 -94507 -90499 -76446 -73051 -60814 -39466 -42462
185 -42462 -54534 -44966 -46764 -63694 -39048 2534 -10871 -39071 -21627 -13555 -43198 -46470 -26448
198 -26448 -34945 -41242 -19189 -30434 -76889 -86155 -65045 -64783 -69771 -66331 -79072 -93278 -90807 -97299
212 -97299 -104249 -81829 -69673 -90169 -90297 -67382 -80786 -101105 -69254 -32206 -40884 -51199 -42419
225d2419n34K447K0116J1751j71J0283O565n945o96m262r192K3952L6309j6826
239C1378l6572P014J1766j9183L251K7871q117k4571R841P081k2863p970J4866
252f208N468O574R140j7400k0038J2757J5169k952Q849J0953j1998l514J7245
265B4045l325j3655J7336K0731o661m488J900j5509l602K7432R721j8415m417
278C1093K179j3340k38J4451p960j2483J2213M094k0310q792K740m156Q756J5881
292B4128j3424j9909P695K934j4486J0725K1466j1943j3267J4832Q38k0665L534
305g542J9137K400R75M725j4759j3142J2354P986m899Q275N043j5484k244Q571
319A1396j5536j2685K4814J6367j8309j0243L586j2897p075J6547O172o851N591
$$ plain form
225 -42419 -42953 -40506 -20390 -8639 -8810 1473 8038 2093 1397 -2865 -12057 11895 48204 31378
239 31378 -5194 1820 13586 -5597 -2346 25525 17408 -7163 2678 9759 -13104 -21074 -6208
252 -6208 -740 5834 14974 -2426 -22464 -9707 5462 2510 11359 22312 10314 6800 24045
265 24045 20720 7065 24401 45132 38471 33983 35883 20374 16772 44204 53925 35510 31093
278 31093 33272 19932 19694 34145 26185 13702 25915 30009 9699 907 3647 -509 8247 24128
292 24128 10704 -9205 -1510 1424 -13062 -2337 19129 7186 -6081 8751 9589 -11076 -7542
305 -7542 11595 13995 14970 19695 4936 -8206 4148 12134 7235 15510 20553 5069 2825 11396
319 11396 -4140 -16825 7989 24356 6047 -4196 -610 -13507 -20582 -4035 2137 -4714 877
332H77p33j9456l564J1602l464J677K0672q11k1611j365O318q749M678K1211k04
347G078j0906N939j808j7362K037J4573K335O773R345j6840k0825J1479J1457
360C275j0289M607J7280o000j2462K203n803j0437J4944J6324o830m222K664j1296
374f042p403J4274L421q488J1256J1511j6924j1382R676j922m972J7275R077j5799
388C558o356M619n186J323J3336m402r678J2537N229j8618m501J3040r29j736
402B236J2551m735j9087N080J4397p818n035Q253k448m024P360m985j3962R276
416b941J3701j0003n971R020p263j2134J2574R808j3185l870Q195o255n952Q631
430e645k158j0363Q842P399j2137n661O715m975j540J3494j398j5550M348J0094
$$ plain form
332 877 144 -19312 -22876 -11274 -14738 -13061 7611 6800 -14811 -16176 -9858 -18607 -13929 7282 7078
347 7078 -3828 2111 303 -17059 -15022 -449 1886 8659 18004 1164 -19661 -8182 3275
360 3275 -7014 -2407 14873 8873 -3589 -1386 -7189 -17626 -2682 13642 6812 2590 5254 -6042
374 -6042 -13445 829 4250 -4238 7018 18529 1605 -9777 -101 -2023 -6995 10280 19357 3558
388 3558 -2798 1821 -3365 -2042 11294 6892 -2786 9751 14980 -3638 -8139 4901 3972 2236
402 2236 14787 10052 -9035 -3955 10442 2624 -2411 5842 3394 -630 6730 1745 -12217 -2941
416 -2941 10760 757 -5214 3806 -3457 -15591 -3017 6791 -6394 -10264 -2069 -8324 -14276 -5645
430 -5645 -7803 -18166 -9324 -1925 -14062 -19723 -13008 -17983 -19523 -6029 -7427 -22977 -18629 -8535
444h535r725m019J1757O3o250P833o87j3590M485J2458p178m211J2148k246j3011
459b0708N198N799r525K016J2849n070r492N673j27o365P420N097r965J808J2595
474b797q231r298J1489K809j0671Q003J3745j2095j0165J3255N818p055L179K629
488F15o247N507J0946o203p937O626J229k27J0272j913j7112O790J9628o927j4412
503F35O187M029n810Q538P826j5155p630J3513L358q742J671R85n214Q162Q602
518B0955j2521j0173Q362M767Q52Q122m480j6924M773J7825n783j1711O640L896
532A4600l929Q178R76j9677n180K0371P587j0695m080k352l972O854M523j0278
546B926l099J0302m2m583K672q176j2489J3829J8498j1714j3495P063n37r092
$$ plain form
444 -8535 -18260 -22279 -10522 -10459 -16709 -8876 -9563 -23153 -18668 -6210 -13388 -17599 -5451 -7697 -20708
459 -20708 -15510 -9711 -19236 -17220 -4371 -9441 -18933 -13260 -13387 -19752 -12332 -7235 -17200 -15392 -2797
474 -2797 -11028 -20326 -8837 -6028 -16699 -8696 5049 -7046 -17211 -3956 1862 -5193 -2014 615
488 615 -5632 -125 10821 4618 -3319 3307 4536 4309 14581 12668 -4444 2346 21974 15047 635
503 635 6822 10851 5041 13579 21405 6250 -1380 12133 15491 6749 8420 9405 4191 12353 20955
518 20955 8434 -1739 6623 11390 12242 20364 15884 -1040 3733 21558 15775 4064 10704 14600
532 14600 10671 18849 19825 148 -5032 15339 22926 12231 8151 5799 1827 8681 13204 2926
546 2926 -173 10129 10087 5504 8176 0 -12489 1340 19838 8124 -5371 1692 1155 -7937
560g937J0046Q433j4605n260J5982L251j4601n372J466M062J1832K023j5637n935
574a2252R125r71k887P920k280j0680R404J0924j6067j2110J3792P306n782M973
588D15L028j3320m268J1749L209l528K608K26k073O639j658j2235L383J4337p19
603G793l957N656p650j2899J1798J4188j2467q399J3166O37j2629K856L950j0092
617h049L48J3740j420j1794j408O55q41N498Q71p552L909O500p941l687J0487
632f84k368r184J1367J1072j2709o915J3115K056q592O316O382q283n27R919o88
647A0277m952P97j785M98Q062k997j0409O850Q194j1583n522J1346l419j3250
661g893R454J1809j2200q048R170l490j0260Q868R570o785l362M832k511l509
$$ plain form
560 -7937 2109 10542 -4063 -9323 6659 9910 -4691 -10063 -8597 -4535 7297 9320 -6317 -12252
574 -12252 -3127 -4098 -6985 935 -1345 -12025 -2621 8303 -7764 -19874 -6082 1224 -4558 415
588 415 3443 -9877 -14145 -2396 813 -2715 -107 119 -1954 4685 3027 -9208 -5825 8512 7793
603 7793 3836 9492 1842 -11057 741 14929 2462 -5937 7229 7866 -4763 -1907 2043 -8049
617 -8049 -7701 6039 4619 -7175 -8583 -7928 -8769 -3271 -2400 -9952 -6043 457 -7484 -11171 -684
632 -684 -3052 -12236 -869 10203 -2506 -9421 3694 5750 -2842 3474 9856 1573 1046 10965 10277
647 10277 5325 6122 4337 4835 12897 9900 -509 6341 14535 2952 -2570 8776 5357 -7893
661 -7893 1561 13370 1170 -6878 2292 -1198 -11458 -2590 6980 195 -3167 1665 -846 -4355
675d355J817j126K814J2166J395j1279q53L826n784K761J4514j891j0366P573
689A1212M141j5112n182J2195K006k709P331l83j5371n939M536J567M036N445
703G773p072n390N552n134j2783M290J1067k737K949P947j4863j9580J0562J6002
717a417o804l596J0564j378j2026j238p37n441O318J1059l54n299p430j1502j017
732c0298J2075J346p370M916K928j3493n705O376p209n624J5471J0901j3649j0900
746d0235K356k525M02J1408J852n484M801M326q264k298N114n97N905J5240l092
761a1091j5293K574R095m608J062J1225l368p706Q655L756j3730l052J1475J760
775i246l594K822l330p494L648N609j848M11Q29n603K978J0783m187r094Q986
$$ plain form
675 -4355 -2538 -3664 -850 11316 12711 1432 579 4405 -1379 1382 15896 14005 3639 11212
689 11212 15353 241 -4941 7254 9260 6551 13882 13499 -1872 -7811 -3275 -1708 2328 7773
703 7773 701 -4689 863 -4271 -17054 -12764 -1697 -4434 -1485 6462 -8401 -27981 -17419 -1417
717 -1417 -8221 -11817 -1253 -2631 -14657 -15895 -16632 -22073 -15755 -4696 -5050 -10349 -17779 -29281 -30298
732 -30298 -18223 -16877 -24247 -19331 -16403 -29896 -35601 -29225 -36434 -42058 -26587 -15686 -29335 -40235
746 -40235 -37879 -40404 -40002 -28594 -26742 -32226 -27425 -23099 -31363 -33661 -28547 -29144 -23239 -7999 -11091
761 -11091 -26384 -23810 -14715 -19323 -18261 -7036 -10404 -18110 -9455 -5699 -19429 -22481 -11006 -9246
775 -9246 -12840 -10018 -13348 -20842 -17194 -11585 -13433 -13022 -12193 -17796 -14818 -4035 -8222 -17316 -8330
790h330Q660n685J675Q078n698k610J6658O090j2383J14J2148L63k425O154N79
805B3388k138O349J745p842J327N153n159L74Q977n595j3161L914N952p665j134
820A4485O135p126q053O870J450j1267o38P495n36k461P60o464k434Q979K903
835A0098o409L410M830p269j409P577k341m747R625M067j0744j293N953o467l764
850A117J0032J405j0544J29L394q161l858N218l037m432N756k19j0939j960L125
865a2974l950M89P436m105p464N337J420q244L143J0185l277l376P635n81o552
880a4878N425O563l780J627O923l378l535N886L60m100O814M040q843j176Q667
895F615l898n658P094K275q141J517N989o975l483R191J218n913L324K209o359
$$ plain form
790 -8330 330 -5355 -3680 4398 -1300 -3910 12748 18838 6455 6569 18717 19080 16655 22809 23388
805 23388 21250 27599 29344 21502 22829 27982 22823 23197 32174 26579 13418 17332 23284 15619 14485
820 14485 20620 13494 5441 12311 13761 2494 1856 9351 8815 6354 7114 650 -1784 7195 10098
835 10098 3689 7099 11929 4660 3251 10828 8487 3740 13365 17432 6688 5395 11348 4881 1117
850 1117 11149 12554 2010 2139 5533 -2628 -6486 -1268 -4305 -8737 -2981 -3200 -14139 -16099 -12974
865 -12974 -16924 -16435 -8999 -13104 -20568 -15231 -13811 -22055 -18912 -8727 -12004 -15380 -7745 -8326 -14878
880 -14878 -9453 -2890 -6670 -5043 1880 -1498 -5033 853 1213 -2887 3927 7967 -876 -2052 6615
895 6615 2717 -2941 4153 6428 -1713 -196 5793 -1182 -4665 4526 5744 -169 3155 5364 -995
910i95L144Q272l458k823P465K45n292N476M516o957R99J1104p88n303K831l71
926A8065l847O840O243q528l650P578j054o221L210R59o163M231N354j0057p234
941E726P057K339m870L055j66r066r1P401l443m290N142k44n602M557L181j0578
957A08k073J1640K448n141M89k994o489O258P953p424l782O708k15o280J191j724
973F73p040N988J0377o527r817K180r58m518N761L704o801j017O857m933p137
988a3208K878Q40j455R161N139j2183p291P113J685r42O209Q26p434L093O665
1003A096p359o425P165N377K47M444k956j1998Q67J1191r43l704N492l11n420
1018c237L730J259r259O92J2042K050n099K3l706o717O611R577m821m023O007
$$ plain form
910 -995 2149 10421 6963 4140 11605 11850 6558 12034 16550 9593 10592 21696 20908 15605 18436 18065
926 18065 14218 21058 27301 18773 15123 22701 21647 15426 18636 19595 13432 17663 23017 12960 5726
941 5726 12783 15122 10252 13307 13141 4075 3984 11385 7942 3652 8794 8550 2948 7505 10686 108
957 108 -1965 9675 12123 6982 7471 4477 -2012 4246 12199 4775 993 7701 7486 1206 2397 673
973 673 -6367 -379 9998 3471 -6346 -4166 -5124 -9642 -3881 -177 -6978 -7995 -1138 -6071 -13208
988 -13208 -10330 -9490 -10945 -1784 3355 -8828 -16119 -9006 -7321 -8263 -2054 -1228 -8662 -5569 1096
1003 1096 -6263 -12688 -5523 -146 101 4545 1589 -10409 -9542 1649 706 -2998 2494 2183 -3237
1018 -3237 493 1752 -7507 -6815 5227 7277 2178 2201 -1505 -8222 -1611 7966 3145 -878 5129
1033E129p33n099K577j51n700N820J1257m368q968N3k57m82Q244K667r406q10
1049b27Q129l703o481L695J376k079O505L643j1979m547Q123J927l229M178L31
1064E662p039J925N169o003l524O580K25l558M704r13j1358L39R806p63n297L143
1080i02k832o551M593L706p564j517P967j083n941J762j307n164N812O459o121
1095h683l224N549k594n575O205L595n381J768N025n070l169N580p76m812O496
1110e066M743p358j883M564l187k765O894P29o604K705L811o748k160O212j543
1125g656l660O119J673p368O58M908m645k46R053L58p075L091M671l700J387M683
1141B251k328q9P883n24o872L093M231k431K406N048n118l509P419R07p945J747
$$ plain form
1033 5129 4396 -703 1874 1723 -3977 1843 13100 8732 -236 -183 -440 -922 7322 9989 583 -227
1049 -227 7902 4199 -2282 1413 2789 710 7215 10858 -1121 -5668 2455 4382 1153 5331 5662
1064 5662 -1377 548 5717 -286 -3810 2770 2995 -563 4141 3228 -8130 -7791 2015 1252 -4045 -902
1080 -902 -3734 -10285 -5692 -1986 -9550 -11067 -3100 -4183 -10124 -8362 -9669 -14833 -9021 -2562 -8683
1095 -8683 -11907 -6358 -8952 -14527 -8322 -4727 -10108 -8340 -3315 -8385 -11554 -5974 -6750 -11562 -5066
1110 -5066 -323 -7681 -9564 -5000 -8187 -10952 -4058 -3329 -9933 -7228 -3417 -10165 -12325 -6113 -7656
1125 -7656 -11316 -5197 -3524 -10892 -10234 -5326 -9971 -10217 -1164 -806 -7881 -4790 -119 -3819 -2432 2251
1141 2251 -77 -166 7717 7193 321 3414 7645 5214 7620 12668 7550 4041 11460 12367 4422 6169
1157F169N994m243j664O432l406p419L859L459m743J735L834n819j809P212j554
1172H037p677L900N528l909J491M948o117m467Q042L661o461Q27N094k293q33
1187I771L405m128l905O115L022n191K83Q00n396m06N309m341o240N318K632p377
1203c29j385K387o661j602Q470q16r509J647M022n129j176N533l611l928P809
1218d278K853q542j471M387j301K025N766m774o821O335M146o231j233M436j923
1233f626n52N317l924r379L377O419k380j577J369m863j562N320j471n504L712
1248a2324L839m083J741L542q216m135J1710N875p030K40M676m901L00Q484j182
1263a464o226O694Q374m552l897J722j295J667Q594r6p597J213M050m006o18M186
$$ plain form
1157 6169 12163 7920 6256 12688 9282 1863 5722 9181 4438 6173 10007 4188 2379 9591 8037
1172 8037 360 4260 9788 5879 7370 12318 6201 1734 9776 13437 6976 7803 12897 10604 9771
1187 9771 13176 9048 5143 11258 14280 9089 9372 10172 4776 4370 9679 5338 -902 4416 7048 -329
1203 -329 -1714 673 -5988 -7590 880 64 -9445 -7798 -3776 -8905 -10081 -4548 -8159 -12087 -4278
1218 -4278 -1425 -9967 -11438 -7051 -8352 -6327 -561 -5335 -12156 -5821 -1675 -7906 -9139 -4703 -6626
1233 -6626 -7178 -1861 -5785 -15164 -11787 -5368 -7748 -9325 -7956 -12819 -14381 -9061 -10532 -16036 -12324
1248 -12324 -8485 -12568 -10827 -7285 -15501 -19636 -7926 -2051 -9081 -8841 -4165 -9066 -8766 -282 -1464
1263 -1464 -7690 -996 7378 2826 -1071 651 -644 1023 9617 9521 1924 3137 7187 3181 2563 6749
1279F749l083k274P259L90q973j072M043j337Q30N630l614o324M175K940l750
1294A589J104L063k491J895O517m417p487N930N283l110J527L669o602k191R393
1309A3672r3r376K748P654m238l977L759k880n966N242K890n730j918K063l517
1324C33j661L730l573m918L709J479n414P64K238o311j235P826r32q017K726M805
1340d451l660r49L327l346k455O283R12n391J867L294m252L16M103m352l263P045
1356d972K044q385R11M828n348l268P777k7p239K458M069n269k165M582j400k583
1372a3987M655J318m677Q14K252k803J256N535l089j891O004k1n921K878N348
1387b329m152Q0O879j745n724N007L131n816J022O430j831k974L975q32m448M035
$$ plain form
1279 6749 3666 1392 8651 9041 68 -1004 3039 1702 2532 8162 4548 -1776 2399 5339 1589
1294 1589 2693 5756 3265 5160 11677 7260 -227 5703 10986 7876 9403 13072 6470 4279 13672
1309 13672 13579 4203 6951 14605 10367 6390 10149 7269 1303 6545 9435 3705 1787 3850 333
1324 333 -1328 2402 -1171 -6089 -2380 -901 -6315 -5551 -3313 -9624 -10859 -3033 -3965 -11982 -9256 -4451
1340 -4451 -8111 -9060 -5733 -9079 -11534 -5251 -4339 -9730 -7863 -4569 -8821 -8505 -4402 -8754 -12017 -4972
1356 -4972 -2928 -11313 -10402 -5574 -10922 -14190 -6413 -6440 -13679 -11221 -7152 -12421 -14586 -10004 -11404 -13987
1372 -13987 -9332 -8014 -12691 -11877 -9625 -12428 -11172 -5637 -8726 -10617 -4613 -4634 -10555 -7677 -2329
1387 -2329 -6481 -6401 478 -1267 -6991 -1984 1147 -4669 -3647 2783 952 -2022 1953 1121 -3327 708
1403G08K515m522J270O123m138l878N013L12n097M484M920n902k153O922j159
1418E418n198L928L499l799R74M435l064k227L003k21k143M537J427o138O93N051
1434A0175l547k857M750j721m057N096L492q845k293P049p78m435K500Q58m728
1449F59K756L775n808l174N191N63k730K843m19n603J926N104l251l112M229q28
1465B121l262M809K215q680j381P220N52l315J373j594m443M501L838o414k801
1480e261N252Q41k387J272k910n587M545O702n352l788M156p55l645M375Q95o812
1496h459J332Q126r80n775J615q51k210N919M018o689k291M855J38k230K736j755
1512b501l994N899N405o175m465M011M80j143M831k15p165J661O638k770m276
$$ plain form
1403 708 3223 -1299 -29 6094 1956 -1922 3091 3403 -1694 2790 7710 1808 -345 6577 5418
1418 5418 220 4148 7647 3848 4822 9257 6193 3966 6969 6748 4605 9142 10569 4431 5124 10175
1434 10175 6628 3771 8521 6800 2743 7839 11331 2486 193 7242 6464 2029 4529 5387 659
1449 659 3415 7190 1382 -1792 3399 3962 1232 4075 3656 -1947 -21 5083 1832 -1280 2949 2121
1465 2121 -1141 3668 5883 -2797 -4178 3042 3594 279 1652 58 -4385 116 3954 -2460 -5261
1480 -5261 -9 832 -1555 -283 -3193 -8780 -4235 2467 -2885 -6673 -2517 -3272 -6917 -2542 -1647 -8459
1496 -8459 -7127 999 19 -5756 -4141 -4992 -7202 -1283 2735 -3954 -6245 -1390 -1252 -3482 -746 -2501
1512 -2501 -6495 -596 4809 -1366 -5831 -1820 -1340 -2483 2348 2133 -5032 -3371 3267 497 -3779
1527c779K938Q74j497M392R77p385j095O724l06j929K965j647m403M409L909n136
1543A1j895M954L7k567L886m16o531K788O774k326l417K664r63k273M697O65n484
1560F04M73N633j834k947K416p96l243M893K500o348o61N058j608l938M113R52
1576E267n081K055L990l758k120L817j784k837M626R97n759j62M546k182k225
1591f10L670j766m067M084K568o159k26N013k436l441L640Q32m818K406K666m442
1607c086l40M730k379m151L672J711m420N08L163l604p77M048j705m627M115K564
1623e78m910m63L953k687k133N107m99n304K315L188m186K18M075j824l437L764
1639c401R46m301J344K730l186M64N590k572n619M082K421l417J622L251l262
$$ plain form
1527 -3779 -841 33 -1464 2928 3905 -3480 -4575 2149 1843 -86 2879 1232 -3171 1238 5147 11
1543 11 -1884 3070 3107 540 4426 4010 -2521 267 7041 4715 1298 3962 2999 726 5423 6088 604
1560 604 1077 6710 4876 1929 4345 3549 306 5199 7699 1351 690 5748 4140 202 4315 5267
1576 5267 186 2241 6231 2473 353 4170 2386 -451 4175 5172 -587 -749 3797 1615 -610
1591 -610 3060 1294 -2773 1311 3879 -2280 -2506 2507 71 -3370 270 1102 -3716 -1310 1356 -3086
1607 -3086 -3426 1304 -1075 -5226 -1554 157 -4263 -3755 -592 -4196 -4973 -925 -2630 -7257 -3142 -578
1623 -578 -5488 -5951 -1998 -4685 -6818 -1711 -2210 -7514 -5199 -2011 -6197 -5979 -1904 -3728 -7165 -3401
1639 -3401 -2455 -6756 -5412 -2682 -5868 -5404 186 -2386 -8005 -3923 -1502 -4919 -3297 -46 -3308
1654c308j400N002j118n009K663M311k546O19K400l978k109N648R00m369J847
1669d47L322l160j07L940l624l302N797K970m545M1K781l600m04N271p32m534
1685c33K791K578l015N83J878l680k61N747K64n559N29L097k634R71L202l825
1701B333k529N200J244n554J39L127k178K82L642l403m276L731K893l809K1J936
1717B799l240j097N286k024m621K366K340k655N15K848n129k528O021J499n497
1732c117K5K496k690Q05L217l423l743N022K043m066r34J706k527O09M766k791
1748b602m756L202K243l713R09K978l380j834N383K0n129Q38K852j969J192K908
1764h58l190l581M265J480l346J374J780k726J029M570l468m767M473L413l459
$$ plain form
1654 -3308 -4708 294 -824 -5833 -3170 1141 -1405 -786 1614 -2364 -4473 1175 2075 -2294 -447
1669 -447 2875 -285 -392 3548 -76 -3378 2419 5389 844 885 3666 66 -338 4933 4201 -333
1685 -333 2458 5036 2021 2604 4482 802 541 6288 6552 993 1522 4619 1985 2956 6158 2333
1701 2333 -196 5004 6248 694 833 3960 1782 2064 5706 2303 -1973 1758 4651 842 863 2799
1717 2799 -441 -1538 3748 1724 -2897 -531 1809 -846 -331 2517 -2612 -5140 881 2380 -3117
1732 -3117 -3092 -596 -3286 -2481 736 -2687 -6430 -1408 635 -3431 -4365 -2659 -5186 -4577 189 -2602
1748 -2602 -7358 -4156 -1913 -5626 -4717 -1739 -5119 -6953 -1570 -1550 -6679 -5841 -2989 -4958 -3766 -858
1764 -858 -4048 -7629 -3364 -1884 -5230 -3856 -2076 -4802 -3773 797 -2671 -7438 -2965 448 -3011
1779c011P43K223l010r04M841o76l898K487L395k572l30K422l040r48M793Q07
1795C322l693J909J424l238O50M706k587l348N008J556m037P74K636l350k68N608
1811G072j087m801K367K557k812k41K517k327m48L947j111l944K372J758l423
1826B396P34L641l221k143M317r9m575J881L718l732j082M100j242l798J966J894
1842D755k942O55K288l303m96L477k124l126L070Q07l777J514L016m201k419M333
$$ plain form
1779 -3011 -2268 -45 -3055 -3959 882 206 -3692 -1205 2190 -382 -712 1710 -1330 -2278 2515 3322
1795 3322 -371 1538 2962 -276 374 5080 2493 -855 4153 5709 1672 2446 5082 1732 1464 7072
1811 7072 5985 1184 3551 6108 3296 3055 5572 3245 2797 6744 5633 1689 4061 5819 2396
1826 2396 3130 6771 3550 1407 5724 5625 1050 2931 6649 2917 1835 5935 4693 895 2861 4755
1842 4755 1813 2468 4756 1453 957 4434 2310 -816 2254 3061 -716 798 3814 -387 -2806 1527
$$ [...]
8191C75
##END NTUPLES=NMR FID
##END=
