##TITLE=1H_EC-3191f
 CDCl3, 8 sc, 
 10.4.2019
##JCAMPDX= 6.0         $$ Bruker NMR JCAMP-DX V2.0
##DATA TYPE= NMR FID
##DATA CLASS= NTUPLES
##ORIGIN= UXNMR, Bruker Analytische Messtechnik GmbH
##OWNER= root
$$ XWIN-NMR		Version 3.5
$$ Wed Apr 10 14:02:31 2019 Russian Standard Time (UT+4h)  she@DPX200
##.OBSERVE FREQUENCY= 200.1315
##.OBSERVE NUCLEUS= ^1H
##.DELAY= (6, 6)
##.ACQUISITION MODE= SIMULTANEOUS
##.ACQUISITION SCHEME= undefined
##.AVERAGES= 8
##.DIGITISER RES= 18
##SPECTROMETER/DATA SYSTEM= spect
##.PULSE SEQUENCE= zg30
##.SOLVENT NAME= CDCl3
##.SHIFT REFERENCE= (INTERNAL, CDCl3, 0, 15.7039)
##AUDIT TRAIL= $$ (NUMBER, WHEN, WHO, WHERE, WHAT)
$$ ##TITLE= Audit trail, XWIN-NMR		Version 3.5
$$ ##JCAMPDX= 5.01
$$ ##ORIGIN= Bruker BioSpin GmbH
$$ ##OWNER= she
$$ F:/spectra/data/she/nmr/H-F/1/audita.txt
$$ ##AUDIT TRAIL=  $$ (NUMBER, WHEN, WHO, WHERE, WHAT)
(   1,<2019-04-10 14:01:20.14 +0400>,<she>,<DPX200>,
      <created by zg, POWCHK disabled, PULCHK disabled
       configuration hash MD5:
       00 E9 B6 7A A2 85 ED C7 34 08 36 98 17 FE 4E 26
       data hash MD5: 16K
       FF 79 00 69 5F 42 37 4D 36 CD 8B 94 FC E3 C0 34>)
$$ ##END=
$$ 
$$ hash MD5
$$ E4 FF D6 45 7F C6 14 E7 D8 B1 FF 23 8F 27 94 E6
##$RELAX= 
##$RELAX= 
##$RELAX= 
##$RELAX= 
##$RELAX= 
##$RELAX= 
$$ Bruker specific parameters
$$ --------------------------
##$DU= <F:/spectra>
##$EXPNO= 1
##$NAME= <H-F>
##$PROCNO= 1
##$TYPE= <nmr>
##$USER= <she>
##$AMP= (0..31)
100 100 100 100 100 100 100 100 100 100 100 100 100 100 100 100 100 100 
100 100 100 100 100 100 100 100 100 100 100 100 100 100 
##$AQSEQ= 0
##$AQ_mod= 1
##$AUNM= <au_zg>
##$AUTOPOS= <>
##$BF1= 200.13
##$BF2= 200.13
##$BF3= 200.13
##$BF4= 200.13
##$BF5= 200.13
##$BF6= 200.13
##$BF7= 200.13
##$BF8= 200.13
##$BYTORDA= 1
##$CFDGTYP= 0
##$CFRGTYP= 5
##$CHEMSTR= <none>
##$CNST= (0..31)
1 1 145 1 1 1 1 1 1 1 1 1 1 1 1 1 1 1 1 1 1 1 1 1 1 1 1 1 1 1 1 1 
##$CPDPRG= <>
##$CPDPRG1= <>
##$CPDPRG2= <>
##$CPDPRG3= <>
##$CPDPRG4= <mlev>
##$CPDPRG5= <mlev>
##$CPDPRG6= <mlev>
##$CPDPRG7= <mlev>
##$CPDPRG8= <mlev>
##$CPDPRGB= <>
##$CPDPRGT= <>
##$D= (0..31)
0 1.2 0 0 0 0 0 0 0 0 0 0.03 0 0 0 0 0 0 0 0 0 0 0 0 0 0 0 0 0 0 0 0 
##$DATE= 1554890479
##$DBL= (0..7)
120 120 120 120 120 120 120 120 
##$DBP= (0..7)
150 150 150 150 150 150 150 150 
##$DBP07= 0
##$DBPNAM0= <>
##$DBPNAM1= <>
##$DBPNAM2= <>
##$DBPNAM3= <>
##$DBPNAM4= <>
##$DBPNAM5= <>
##$DBPNAM6= <>
##$DBPNAM7= <>
##$DBPOAL= (0..7)
0.5 0.5 0.5 0.5 0.5 0.5 0.5 0.5 
##$DBPOFFS= (0..7)
0 0 0 0 0 0 0 0 
##$DE= 6
##$DECBNUC= <off>
##$DECIM= 24
##$DECNUC= <off>
##$DECSTAT= 4
##$DIGMOD= 1
##$DIGTYP= 9
##$DL= (0..7)
0 120 120 120 120 120 120 120 
##$DP= (0..7)
150 150 150 150 150 150 150 150 
##$DP07= 0
##$DPNAME0= <>
##$DPNAME1= <>
##$DPNAME2= <>
##$DPNAME3= <>
##$DPNAME4= <>
##$DPNAME5= <>
##$DPNAME6= <>
##$DPNAME7= <>
##$DPOAL= (0..7)
0.5 0.5 0.5 0.5 0.5 0.5 0.5 0.5 
##$DPOFFS= (0..7)
0 0 0 0 0 0 0 0 
##$DQDMODE= 0
##$DR= 18
##$DS= 0
##$DSLIST= <SSSSSSSSSSSSSSS>
##$DSPFIRM= 0
$$ [...]
##$SUBNAM2= <"">
##$SUBNAM3= <"">
##$SUBNAM4= <"">
##$SUBNAM5= <"">
##$SUBNAM6= <"">
##$SUBNAM7= <"">
##$SUBNAM8= <"">
##$SUBNAM9= <"">
##$SW= 24.9337058887773
##$SWIBOX= (0..15)
0 0 2 0 0 0 0 0 0 0 0 0 0 0 0 0 
##$SW_h= 4990.01996007984
##$TD= 16384
##$TD0= 1
##$TE= 0
##$TE2= 300
##$TE3= 300
##$TEG= 300
##$TL= (0..7)
0 120 120 120 120 120 120 120 
##$TP= (0..7)
150 150 150 150 150 150 150 150 
##$TP07= 0
##$TPNAME0= <>
##$TPNAME1= <>
##$TPNAME2= <>
##$TPNAME3= <>
##$TPNAME4= <>
##$TPNAME5= <>
##$TPNAME6= <>
##$TPNAME7= <>
##$TPOAL= (0..7)
0.5 0.5 0.5 0.5 0.5 0.5 0.5 0.5 
##$TPOFFS= (0..7)
0 0 0 0 0 0 0 0 
##$TUNHIN= 0
##$TUNHOUT= 0
##$TUNXOUT= 0
##$USERA1= <user>
##$USERA2= <user>
##$USERA3= <user>
##$USERA4= <user>
##$USERA5= <user>
##$V9= 5
##$VALIST= <valist>
##$VCLIST= <CCCCCCCCCCCCCCC>
##$VD= 0
##$VDLIST= <DDDDDDDDDDDDDDD>
##$VPLIST= <PPPPPPPPPPPPPPP>
##$VTLIST= <TTTTTTTTTTTTTTT>
##$WBST= 1024
##$WBSW= 4
##$XGAIN= (0..3)
0 0 0 0 
##$XL= 0
##$YL= 0
##$YMAX_a= 139524
##$YMIN_a= -162081
##$ZGOPTNS= <>
##$ZL1= 120
##$ZL2= 120
##$ZL3= 120
##$ZL4= 120
##$ABSF1= 10
##$ABSF2= 0
##$ABSG= 5
##$ABSL= 3
##$ALPHA= 0
##$AQORDER= 0
##$ASSFAC= 0
##$ASSFACI= 0
##$ASSFACX= 0
##$ASSWID= 0
##$AUNMP= <proc_1d>
##$AZFE= 0.1
##$AZFW= 0.1
##$BCFW= 1
##$BC_mod= 2
##$BYTORDP= 1
##$COROFFS= 0
##$CY= 11.3945322036743
##$DATMOD= 1
##$DC= 2
##$DFILT= <>
##$DTYPP= 0
##$F1P= 18.9103706918063
##$F2P= -1.10871071338519
##$FCOR= 0.5
##$FTSIZE= 0
##$FT_mod= 4
##$GAMMA= 1
##$GB= 0.15
##$INTBC= 1
##$INTSCL= 1
##$ISEN= 128
##$LB= 0.24
##$LEV0= 0
##$LPBIN= 0
##$MAXI= 10000
##$MC2= 0
##$MEAN= 0
##$ME_mod= 0
##$MI= 1.114404
##$NCOEF= 0
##$NC_proc= 0
##$NLEV= 6
##$NOISF1= 3.799351
##$NOISF2= 2.8
##$NSP= 1
##$NTH_PI= 0
##$NZP= 0
##$OFFSET= 15.70392
##$PC= 1
##$PHC0= -8854.283
##$PHC1= 16.40026
##$PH_mod= 1
##$PKNL= yes
##$PPARMOD= 0
##$PSCAL= 0
##$PSIGN= 0
##$REVERSE= no
##$SF= 200.130013532006
##$SI= 16384
##$SIGF1= 3
##$SIGF2= 2
##$SINO= 400
##$SIOLD= 16384
##$SREGLST= <1H.CDCl3>
##$SSB= 0
##$STSI= 0
##$STSR= 0
##$SW_p= 3612.71676300578
##$SYMM= 0
##$S_DEV= 0
##$TDeff= 0
##$TDoff= 0
##$TI= <>
##$TILT= no
##$TM1= 0
##$TM2= 0
##$TOPLEV= 0
##$USERP1= <user>
##$USERP2= <user>
##$USERP3= <user>
##$USERP4= <user>
##$USERP5= <user>
##$WDW= 1
##$XDIM= 8192
##$YMAX_p= 0
##$YMIN_p= 0
$$ End of Bruker specific parameters
$$ ---------------------------------
##NTUPLES= NMR FID
##VAR_NAME=  TIME,          FID/REAL,        FID/IMAG
##SYMBOL=    X,             R,               I
##VAR_TYPE=  INDEPENDENT,   DEPENDENT,       DEPENDENT
##VAR_FORM=  AFFN,          ASDF,            ASDF
##VAR_DIM=   8192,          8192,            8192
##UNITS=     SECONDS,       ARBITRARY UNITS, ARBITRARY UNITS
##FACTOR=    0.0002004,     1,               1
##FIRST=     0,             0,               0
##LAST=      1.6414764,     0,               0
##MIN=       0,             -162081,         0
##MAX=       1.6414764,     139524,          0
$$ Real data points
##PAGE= N=1
##DATA TABLE= (X++(R..R)), XYDATA
0 0 0 0 0 0 0 0 0 -8 8 -8 8 -10 16 -16 24 -25 32 -40 48 -56 65 -73 88 -98 114 -130 150 -171 194 -219 245
31 245 -276 309 -345 385 -430 479 -532 589 -654 722 -802 887 -982 1089 -1207 1342 -1494
48 -1494 1670 -1871 2113 -2401 2753 -3199 3780 -4577 5735 -7598 11080 -19912 92704 139524
62 139524 6635 20854 48937 76056 52779 41948 39834 67980 73231 70268 69105 75173 56027
75 56027 54859 81356 89132 32387 -28017 -33257 25009 85801 85118 20448 -16111 16898 53594
88 53594 37845 9654 6220 18109 26878 23644 2713 -14925 -16883 -10385 12821 55211 59794
101 59794 -2958 -57956 -33538 27885 48097 15404 -23033 -19213 17859 26537 -9837 -28433
113 -28433 -1985 23818 26996 25281 13075 -17875 -36404 -17070 24019 53243 36810 -20191
125 -20191 -46112 -4290 38197 21051 -14456 -12941 15853 32028 14201 -24855 -37891 -9457
137 -9457 18522 20856 17617 6568 -27559 -48947 -21752 21302 27740 -3218 -37590 -35242 1045
150 1045 11738 -28819 -54796 -21473 17482 11210 -21183 -45075 -50004 -33693 -10727 -671 -1198
163 -1198 -15723 -47109 -60008 -27140 5582 -9157 -40544 -38595 -11367 2669 -16931 -53144
175 -53144 -57140 -13474 21210 6805 -23084 -34619 -36699 -29406 -5692 12625 6736 -11582 -26514
188 -26514 -22795 2310 14351 -11760 -31039 -1877 35357 27175 -12365 -36647 -23902 15251
200 15251 38736 23204 -1595 -7185 -7432 -7324 9975 27117 14471 -6385 -3285 15840 22847
213 22847 5549 -23053 -22207 21038 50506 21619 -23741 -29915 -7717 12967 21483 12894 -4249
226 -4249 -10561 -7553 -4855 2120 5497 -10022 -20153 1646 24252 8111 -27979 -41631 -19694
239 -19694 18893 32582 -1102 -36968 -30311 -4847 1745 -1592 -4242 -11260 -14527 -5825 285 -5634
253 -5634 -16410 -25125 -16992 14455 29296 -3221 -43183 -36795 652 23630 16150 -9248 -25145
266 -25145 -12361 7074 4307 -7085 -7648 -5270 -1697 11567 16073 -5033 -26005 -20498 5654
279 5654 30064 28099 -8016 -35828 -15999 20323 23628 1590 -10855 -7250 5826 14514 5005
292 5005 -11772 -12279 -431 9116 19171 16605 -10704 -32294 -14134 19625 28710 8725 -17807
305 -17807 -23879 -406 21354 7839 -16437 -14087 3547 11920 9975 -1175 -18303 -20492 -1119
318 -1119 16433 17884 4424 -19337 -29333 -4723 23909 16362 -11524 -20800 -7203 10872 14056
331 14056 -5632 -24312 -13419 11250 16713 5082 -7901 -21090 -20550 1768 20664 12083 -9629
344 -9629 -22214 -16733 5562 18632 -378 -24350 -16941 8896 16226 1499 -17478 -25255 -9929
357 -9929 13585 16528 -1687 -16201 -20156 -13543 5525 17407 1035 -20854 -18559 23 11816
370 11816 5684 -14887 -27061 -7539 19194 14804 -10183 -23133 -17905 -3085 12701 12797 -6226
383 -6226 -20034 -14630 -1795 8516 8018 -9498 -23226 -8187 14965 12296 -8679 -22621 -18297
396 -18297 3813 21342 10040 -16284 -22660 -7720 5148 11036 5986 -9854 -18535 -4728 10877
409 10877 8820 -4095 -16006 -15498 4706 22280 8259 -19061 -23182 -4859 12834 16405 1723
422 1723 -17998 -17837 1595 11537 5348 -4207 -12567 -12412 3373 15382 2948 -16628 -19057 -5057
436 -5057 11015 16038 -2220 -25079 -20069 3806 13246 3550 -9688 -17504 -12291 3769 9145 -4308
450 -4308 -16313 -15615 -6357 6240 9470 -7837 -26242 -19170 2315 10533 2022 -14480 -24940 -14759
464 -14759 5936 7812 -9568 -19600 -15937 -6837 3353 3200 -13572 -24765 -14768 734 6412
477 6412 -300 -16240 -26880 -13911 7730 8148 -8820 -20167 -17737 -5408 7544 3297 -14945
490 -14945 -21155 -8239 3655 6023 -349 -14728 -21486 -6279 12175 9376 -6128 -16270 -14734
503 -14734 -831 13894 7938 -11596 -16706 -3377 8342 10305 2032 -12720 -14175 2567 15354
516 15354 9030 -3771 -11555 -10584 4914 18289 10002 -9251 -12491 -806 11705 15377 4902
529 4902 -11639 -9730 9377 18446 10156 -1614 -8054 -3734 12664 23073 11035 -5790 -6333 5419
543 5419 17934 22601 9819 -6513 -1355 17437 24605 17281 5382 -1825 5951 25199 30608 14922
557 14922 937 3999 15840 28435 29997 15268 919 8669 26242 31824 24666 12046 4696
570 4696 14384 33585 34619 17284 5616 9799 22389 33822 31373 12967 2263 12957 27807
583 27807 30114 22883 9375 2267 13809 30614 27468 9748 686 4749 16811 27075 20229
596 20229 329 -6439 5800 18173 19048 9704 -4873 -9698 4281 17790 11454 -3720 -10722
609 -10722 -7361 4627 13829 4362 -14131 -17071 -3786 7148 7421 -3250 -18430 -18338 -850 9320
623 9320 228 -12353 -16494 -12120 707 8327 -2203 -17709 -17003 -3782 6090 6331 -5212 -18863
637 -18863 -13936 4091 11195 1806 -9346 -12989 -7430 6950 12043 -616 -12475 -9234 1913
650 1913 9495 9619 -3277 -14168 -6981 9480 12601 3398 -6400 -11197 -4831 10522 13007 -1558
664 -1558 -12565 -7773 2045 8740 6479 -6409 -14564 -6116 6285 6722 -961 -10387 -15415 -6667 8512
679 8512 7765 -8121 -16587 -11454 -1436 5819 2437 -11427 -17038 -6673 3897 3435 -3407 -12248
693 -12248 -15473 -4168 9542 6204 -8021 -13705 -8812 1497 10633 6285 -8330 -12120 -416
706 -416 9983 10718 3144 -6994 -6896 7457 18468 10790 -1551 -4132 1046 11575 20211 13813 -1192
721 -1192 -3835 7834 17849 18772 9735 -2003 -711 14913 22032 12538 1826 -676 4272 15590
735 15590 21071 9952 -4182 -3693 6704 14678 14652 4231 -8299 -5760 8741 13979 4382 -6510
749 -6510 -10211 -3951 8287 10384 -4655 -16960 -12192 -1088 5559 2540 -9125 -19484 -13853 -177
763 -177 3274 -4838 -14794 -19647 -11361 2730 2785 -13253 -22869 -15520 -2625 3053 -1935 -15667 -22616
778 -22616 -11686 1684 2471 -5644 -14182 -17608 -7928 5388 3598 -10620 -16909 -9605 1713 8015
792 8015 1530 -13674 -17153 -2874 9606 7810 -2401 -11592 -11887 853 11341 5224 -7070 -10008
806 -10008 -4122 4003 9766 3361 -10836 -12804 1094 11165 7777 -3870 -14018 -11509 4191
819 4191 12302 1894 -10666 -11598 -5454 2439 5855 -2068 -13901 -12554 -942 5212 2265 -8049
833 -8049 -17851 -13559 2982 8798 -3264 -15289 -16136 -8053 2434 4444 -6897 -17116 -11790 -1020
847 -1020 2369 -1602 -9422 -15835 -9506 4291 6935 -3681 -13152 -14698 -5748 7059 8596 -5707
861 -5707 -15325 -8403 3052 6300 1814 -6639 -10766 -2218 8216 6526 -2341 -8113 -8392 -677 11005
876 11005 10700 -3780 -12410 -5626 4829 9574 5306 -6044 -10194 285 9565 6085 -2757 -7552
890 -7552 -5916 2395 10773 5631 -7121 -10971 -4460 3542 9196 4972 -8058 -12927 -1729 8033
904 8033 5194 -3398 -10078 -7349 3197 9238 498 -10264 -10087 -2643 4406 7741 1588 -10634 -12014
919 -12014 -1261 7374 6160 -1245 -9880 -8040 4020 10511 907 -9109 -7367 496 7935 9164
933 9164 -666 -10595 -6880 4766 9904 7171 201 -7549 -5545 6520 11825 4314 -4804 -4763 2064
948 2064 10868 10905 -899 -8943 -1992 9470 12176 6827 -1271 -7060 -1860 9732 12180 4484 -2627
963 -2627 -4052 652 9960 10460 -461 -8161 -865 9362 11490 5549 -5000 -9391 568 11784
977 11784 10500 863 -4683 -5583 921 9237 8384 -2102 -7055 -1603 5812 8412 3674 -6849 -10288
992 -10288 1270 11890 7773 -3164 -9074 -7212 2454 10074 5703 -5275 -7865 -2066 3091 6328
1006 6328 2083 -7289 -9101 1055 9289 5002 -4305 -10678 -8073 3903 11138 2927 -8807 -9718
1020 -9718 -2448 3775 6194 756 -8555 -7722 2198 6597 2676 -3823 -9416 -7029 5197 11135 1667
1035 1667 -9672 -9648 -1413 7255 8996 30 -9801 -5966 3916 6721 2830 -2769 -7066 -2936 7500
1050 7500 9927 718 -7213 -6718 484 10158 11343 -520 -10366 -4342 7071 10345 5126 -2369 -5960
1065 -5960 427 10482 9435 -248 -4672 -2142 4578 12099 11154 -1209 -7916 -1337 8914 13044
1079 13044 8040 -2400 -6720 2613 13243 9940 95 -3811 -403 7080 12941 7893 -3272 -6006
1093 -6006 2032 10243 11809 6466 -3626 -7137 3267 12970 9992 203 -4893 -1963 6996 12199
1107 12199 4708 -5924 -4978 4092 9497 9057 2347 -7124 -6541 4411 11340 6614 -1327 -6805 -4931
1122 -4931 5637 11167 2320 -8304 -6514 2590 8296 6463 -2529 -10459 -5742 5842 8644 1846
1136 1846 -5217 -8764 -5112 4962 8449 -342 -8774 -6964 115 6103 5215 -4635 -11821 -4835 6798
1151 6798 7400 -675 -7603 -9091 -2580 6973 6400 -2872 -8283 -5228 -5 5474 5211 -4210 -9614 -2752
1167 -2752 6372 6772 349 -6434 -8334 504 10038 6286 -4022 -7381 -3086 2773 7504 5003 -4150
1182 -4150 -7038 44 6075 5827 1514 -4944 -6789 2023 10271 5877 -3752 -6795 -2467 4852 9378
1197 9378 4022 -5871 -6274 1306 5988 5258 1448 -4777 -5498 2968 9003 4116 -3699 -6180 -2523 5461
1213 5461 10005 2674 -6833 -5682 2416 7281 6429 780 -5201 -3878 5033 8577 3464 -2086 -3457
1228 -3457 -930 6493 10132 2852 -5344 -3563 3613 8424 8845 1231 -6393 -2500 7917 9752 3773
1243 3773 -1481 -2389 747 8114 9371 1714 -3942 -1872 3488 8079 8162 -129 -7178 -2381 7218 8283
1259 8283 2427 -3579 -5962 -393 7720 6309 -2555 -7171 -3845 1450 4977 3503 -5533 -10396 -3978
1274 -3978 4054 3594 -1347 -8014 -10638 -3889 4903 2492 -7684 -11495 -7420 -859 2823 -1144 -10621
1289 -10621 -12237 -4587 1175 499 -4237 -10444 -12062 -3780 3979 515 -8784 -11680 -7376 -351 4420
1304 4420 -1372 -11075 -11064 -1791 3545 1893 -3732 -9385 -8350 1024 6466 814 -6124 -7577 -4108
1319 -4108 3148 7382 494 -8617 -7200 1346 6269 5136 -1782 -8362 -4707 5513 8312 663 -5385
1334 -5385 -5374 -1532 5379 7212 -882 -7844 -5255 1991 6166 4439 -3164 -10032 -4553 5296 6123 -1301
1350 -1301 -7227 -7554 -2033 5114 4514 -4738 -9935 -5658 896 3793 1636 -6529 -11067 -4420 4221
1365 4221 3547 -3167 -7844 -8937 -2748 5435 3213 -6617 -10259 -4832 1970 4103 636 -7083 -8973
1380 -8973 -1560 4744 3373 -1769 -6150 -6629 -12 7393 4221 -4976 -7614 -2014 4338 6917 1810
1395 1810 -6361 -6238 2276 6837 4179 -725 -4876 -4654 3059 8209 3355 -4126 -5236 -1232 4498
1410 4498 7527 1619 -6639 -5775 2578 6710 3471 -2156 -6935 -4451 4274 7265 77 -6167 -5630
1425 -5630 -1935 3289 5536 -856 -8218 -6409 1167 4843 2724 -3335 -9089 -4761 4823 5820 -1592
1440 -1592 -6885 -5780 -1056 4313 4635 -2737 -7734 -3847 2173 4653 2999 -2710 -7384 -2832 6812
1455 6812 6469 157 -4733 -3994 949 7660 6581 -2051 -5395 167 6158 7025 4273 -1139 -3962 1622
1471 1622 8652 7531 1980 -1829 -2292 3363 10420 7873 -1088 -4221 1740 7600 8824 4461 -2969
1486 -2969 -2903 4302 9173 5564 926 -2129 -1769 3885 8935 5852 -2225 -4541 223 5828 7566 2778
1502 2778 -5134 -4719 3765 7909 3303 -2018 -4960 -2613 4280 7504 1165 -4942 -4209 -533 3438
1517 3438 5664 969 -6570 -5637 2013 5887 2585 -3092 -6852 -3354 5225 6820 -1499 -6250 -4034
1532 -4034 845 3958 4493 -1050 -6154 -3509 2353 4537 2888 -2158 -6390 -2804 5643 6339 -1408
1547 -1408 -5836 -4224 1359 6317 4629 -3026 -6731 -1571 4238 4315 1706 -2263 -5070 -1350 4691
1562 4691 4822 -670 -4807 -4133 912 7115 4783 -4517 -8000 -909 5612 5315 801 -4580 -5265 841
1578 841 5247 3007 -1236 -3227 -3022 950 6189 3819 -4241 -6276 -644 5060 6274 941 -5918
1593 -5918 -6116 2644 7209 3338 -2143 -3694 -2081 2927 5665 1991 -3525 -3311 450 4133 5719
1608 5719 1737 -5923 -5522 3228 8235 3708 -2275 -5529 -2345 5160 7136 378 -4585 -2151 1926
1623 1926 3781 3992 -332 -5283 -3109 3352 6565 3399 -2257 -6688 -3118 5758 7707 -546 -6296
1638 -6296 -3712 1819 4739 3315 -2906 -5724 -1247 4178 3575 440 -3163 -5765 -2454 5094 5914
1653 5914 -807 -6137 -5140 281 5776 3946 -4132 -7251 -1042 4817 2813 -1511 -4918 -4678 482
1668 482 5017 2727 -2693 -5148 -4397 78 5296 4298 -4139 -7510 -1859 3696 4203 -573 -5572 -5017
1684 -5017 2323 5890 622 -4578 -4592 -1796 2205 5153 2023 -4380 -5935 -1417 2944 4910 1566
1699 1566 -5393 -5353 2503 6671 1734 -4664 -4838 -430 4941 5816 -654 -5703 -3437 1415 3932 4398
1715 4398 1266 -4180 -4448 2139 5637 2882 -1851 -4336 -963 6041 6828 -832 -6322 -2005 3814
1730 3814 5643 3699 -1074 -4602 -1305 3859 4676 2998 -57 -2885 -1468 4682 6502 -216 -4754
1745 -4754 -2105 3405 6833 4370 -3279 -6301 92 5805 5123 1057 -1961 -3269 -197 4286 4252 -645
1761 -645 -3030 -1991 1554 5618 3919 -3819 -6850 -213 6439 5142 -315 -5070 -5157 1126 5501 2601
1777 2601 -2454 -3215 -1879 432 3268 1821 -3965 -5489 -240 4324 4369 -614 -7022 -6554 1878 7096
1793 7096 2210 -4716 -5548 -2063 1711 3508 -402 -4930 -3625 311 2266 1420 -1266 -5620 -5195 1749
1809 1749 5928 1849 -4992 -7147 -3386 3289 5286 -1312 -6847 -3664 1437 2349 697 -2431 -5039
1824 -5039 -2784 2898 4145 185 -3877 -6015 -2591 4617 6577 -786 -6800 -4288 1735 4425 2513
1839 2513 -2868 -5431 -390 4825 3085 -1524 -3439 -3311 -206 5449 5037 -1503 -5553 -3415 1428
1854 1428 5698 4266 -2690 -6107 -733 5572 3656 -1555 -3743 -2223 2372 5654 2071 -3312 -4116
1869 -4116 -1144 2253 5178 3414 -2846 -5848 -614 4552 3670 -363 -4474 -3573 2421 5879 948
1884 948 -5066 -3871 87 3466 4222 519 -4940 -4600 163 3173 3042 225 -4096 -4584 978 5060
1900 5060 989 -4352 -4169 -42 4182 3484 -1942 -6334 -3031 2326 3805 1420 -1592 -4170 -3639 1498
1916 1498 3612 677 -2737 -3588 -1652 3374 4102 -1919 -6429 -2609 3108 4121 1477 -3354 -5064
1931 -5064 -2057 3379 3993 -307 -2567 -3064 -1425 2141 3180 -1209 -4741 -2271 2348 3630 1604
1946 1604 -3662 -5772 -739 5124 3656 -1416 -4014 -3445 -21 3083 2600 -1747 -3233 -1029 1205
1961 1205 2903 1919 -2896 -4934 12 5250 3493 -815 -4105 -3452 1501 5379 2855 -2710 -3227 -410
1977 -410 2271 3229 1719 -2370 -2731 1201 4285 2702 -173 -3309 -3071 2401 6558 2899 -3116 -3724
1993 -3724 -215 3684 4768 786 -3331 -2218 2160 3814 2236 -468 -2893 -1926 2898 5772 1665
2008 1665 -3627 -3975 -674 3927 5228 338 -4761 -2785 2020 3846 1669 -1122 -3675 -1512 3587
2023 3587 3863 -371 -3628 -2923 -377 3818 4187 -862 -5480 -3220 1772 3637 2274 -2442 -4623 -1843
2039 -1843 3780 2910 -1433 -3941 -2866 285 3491 2578 -2754 -5367 -2013 2110 3493 1746 -3368
2054 -3368 -5820 -1406 3947 3013 -1732 -3909 -2743 886 3860 1689 -3913 -4465 -745 2608 3388 556
2070 556 -4013 -4727 -93 4005 2675 -1358 -3550 -2975 1349 4589 1616 -3885 -3980 252 3479 3633
2086 3633 7 -4095 -3428 2207 4634 2334 -1242 -3012 -2127 2197 5245 1315 -2898 -2942 934 3666
2102 3666 4185 -29 -4168 -2311 3308 5082 2029 -1297 -3231 -1449 3561 5398 935 -3154 -2063
2117 -2063 999 4074 3774 -73 -3672 -1221 3904 4406 1905 -1943 -3394 -593 4583 4972 -88 -3379
2133 -3379 -2067 1269 3653 3324 -1323 -4035 -1182 3033 3412 797 -2328 -4017 -110 4589 3536
2148 3536 -1886 -3963 -2264 1067 3742 2233 -2683 -4376 -1172 2413 2392 136 -3383 -4242 367 4238
2164 4238 2079 -2694 -4051 -2616 1365 3651 1628 -3724 -4760 -709 2428 2706 -496 -3852 -4010
2179 -4010 970 3412 773 -2698 -3810 -2455 1295 3537 263 -4271 -4156 -468 2545 2495 -716 -4639
2195 -4639 -3496 1401 3222 573 -2579 -3350 -1920 2084 3568 -237 -4598 -3295 543 3009 2703
2210 2703 -1068 -4666 -2619 2526 3321 650 -1931 -3245 -1217 3132 3644 -1260 -4038 -1906 1378
2225 1378 3109 2440 -1303 -4157 -1519 3223 3213 1124 -2189 -2897 -401 3757 3542 -943 -2916 -1044
2241 -1044 1718 3744 2366 -1771 -3790 -54 3478 3651 1112 -2024 -3257 538 4590 3181 -830
2256 -830 -2375 -868 1790 3920 2177 -2095 -3118 431 3360 2960 244 -2384 -2659 1125 4357 2418
2272 2418 -1415 -2372 -1393 1506 3688 1595 -2741 -3151 666 2930 2349 -261 -3284 -2395 1695 4104
2288 4104 1117 -2055 -2853 -1555 1606 3291 606 -3315 -3094 250 2411 1946 -610 -3790 -2435 1928
2304 1928 3538 406 -2623 -3358 -1642 2319 3269 -147 -3545 -2897 -201 1982 2058 -753 -3655 -2166
2320 -2166 1858 2910 -17 -2397 -3260 -1016 2922 3518 -1091 -3772 -2195 896 2589 2155 -1210 -3593
2336 -3593 -1374 2361 2818 212 -2461 -2960 -106 4132 3062 -1781 -3639 -1599 1641 3959 2280
2351 2280 -1826 -3194 -106 3268 2989 588 -1692 -1959 882 4580 2741 -1186 -2856 -856 2448
2366 2448 4456 2522 -2547 -3165 931 4148 3267 560 -1641 -1845 1812 4487 1913 -1505 -1738 -140
2382 -140 2815 4415 1600 -2580 -2642 1684 4404 3094 198 -2983 -2219 2643 4183 1260 -1652 -1832
2398 -1832 116 2586 3740 429 -3224 -2107 1567 3374 2549 -846 -3714 -2245 2548 4096 922
2413 922 -2292 -2739 -719 2734 2743 -947 -3726 -1488 1455 2600 1217 -1918 -4279 -1727 2280 3258
2429 3258 -155 -2786 -3621 -1059 2776 2441 -1752 -3752 -1381 1171 1763 653 -2985 -4237 -713 2763
2445 2763 1700 -1108 -3235 -3281 -717 2727 2073 -2220 -3988 -1857 757 2070 703 -3261 -3959 -40
2461 -40 2809 1240 -1537 -3041 -2534 759 3065 1564 -2644 -3836 -1322 838 2511 813 -2783 -3126
2477 -3126 446 2453 1523 -1643 -3215 -2039 1821 3682 795 -2971 -2864 -904 1963 3053 369
2492 369 -3214 -2753 641 2327 1617 -1070 -2907 -1648 2438 3516 -65 -3313 -2680 40 2408 2868
2508 2868 -219 -3633 -2422 1158 2105 1114 -732 -2916 -1578 1831 2620 -519 -2827 -2528 76 3159
2524 3159 2767 -1627 -4463 -1876 1522 2112 1339 -1774 -3193 -1255 2230 2041 -727 -2294 -2146 -231
2540 -231 2430 1901 -1992 -3893 -1019 2107 2791 1079 -2645 -3638 -156 3073 2376 -479 -1985 -1878
2556 -1878 242 2784 1585 -2266 -2657 -543 2208 2571 786 -3177 -3710 406 3285 1985 -952 -2597
2572 -2597 -1907 1379 3311 811 -2114 -1955 -91 1688 1730 28 -3246 -2957 975 3438 1534 -1126
2588 -1126 -3454 -2198 1644 3382 610 -2829 -2304 -31 1900 1761 -552 -3049 -1505 1539 2694
2603 2694 984 -1273 -2932 -1564 2369 3544 542 -2329 -2104 -223 2557 2886 -658 -2751 -271
2618 -271 2882 2709 1059 -665 -1921 51 3592 3650 687 -1539 -1663 1046 3798 3472 -141 -2198
2634 -2198 -116 3334 3316 1429 -1190 -1850 937 3935 2897 -571 -1889 -1116 1559 3536 3015 -932
2650 -932 -2873 -404 1865 2775 1005 -2014 -2965 622 3287 1378 -1787 -2707 -1374 617 2557 562
2666 562 -2904 -3743 -1284 649 1465 -434 -3354 -4031 -508 1721 40 -2657 -3642 -2521 343 1761
2682 1761 -904 -4364 -3629 -915 756 973 -1017 -4227 -3623 -344 1203 -5 -1819 -3256 -2609 337
2698 337 2640 -989 -4055 -3063 225 2268 1635 -1523 -3954 -2140 1742 2351 375 -1026 -2380 -1024
2714 -1024 1669 2842 -170 -2340 -1651 615 2246 2312 -1126 -3465 -969 2611 2792 539 -1499 -2338
2730 -2338 -235 3038 2484 -659 -2203 -1207 646 2301 2000 -1165 -3019 -476 2492 2750 658 -1929
2746 -1929 -2839 192 3455 2209 -724 -1960 -794 1027 2671 1775 -1300 -1729 478 2475 2473 1259
2762 1259 -1440 -2252 1553 4481 2345 -557 -1315 -509 2509 3889 1626 -1185 -786 1708 3222 2564
2778 2564 1230 -1124 -748 2326 4195 2742 77 -1071 -85 3256 4697 1702 -1128 -1177 1903 3433
2794 3433 2979 680 -1792 -400 3048 3425 970 -433 -1065 -660 2679 3382 137 -2196 -1948 1171
2810 1171 2464 2628 -740 -3104 -1173 2318 2065 -99 -1508 -2492 -704 1829 1876 -1361 -3078 -2103
2826 -2103 256 1600 1492 -1509 -3619 -1644 1431 1524 -644 -2483 -3161 -487 2246 1288 -2075 -3262
2842 -3262 -1444 286 1757 688 -2066 -3287 -805 1376 1495 -119 -2233 -2811 355 3041 1456
2857 1456 -1913 -2627 -744 1582 2531 996 -2536 -2315 455 1949 1664 -398 -1941 -2153 789 3159
2873 3159 1402 -1479 -2482 -674 1774 3103 885 -2876 -1877 1248 2294 1608 -268 -2338 -1412 1836
2889 1836 2971 993 -1587 -1839 -730 1916 2771 297 -2691 -1793 1226 2372 1710 -940 -3038 -1415
2905 -1415 2100 2818 284 -1554 -1505 -453 2116 2301 -345 -2405 -1286 772 2325 1482 -1130 -3240
2921 -3240 -884 2597 2090 -136 -1827 -2175 -329 2441 1807 -1413 -2786 -883 831 1690 760 -1974
2937 -1974 -3038 -633 1853 1568 -448 -2019 -2713 -251 2585 1157 -2193 -2865 -840 927 1502 -131
2953 -131 -2340 -2639 -208 1705 889 -655 -2268 -2644 85 2345 787 -2293 -2612 -1099 951 2015
2969 2015 327 -2545 -2416 698 2027 920 -735 -2277 -1905 1008 2401 367 -1624 -1630 -1155 1431
2985 1431 2273 309 -2709 -1839 1084 2479 1288 -906 -2279 -1150 1737 2151 32 -1559 -1161 -336
3001 -336 1430 2383 241 -2332 -1152 1251 2124 1558 -864 -2462 -951 2325 2423 6 -1466 -1332 -94
3018 -94 2093 2207 -682 -1895 -458 1173 2079 1514 -777 -2150 -628 2239 2555 546 -1348 -1575 604
3035 604 2944 2210 -1044 -1733 -357 1663 2230 1067 -1021 -1893 272 2159 2045 208 -1181 -1554 195
3052 195 3194 2152 -1327 -2138 -157 1461 2223 669 -1915 -2182 360 2167 1206 -661 -2020 -1771
3068 -1771 729 2373 1104 -1582 -2447 -960 1069 2097 64 -2902 -2274 775 2098 721 -1306
3083 -1306 -2513 -1661 1070 1865 -197 -2159 -2326 -800 549 1469 -471 -3195 -2229 446 1556 487
3099 487 -1825 -3057 -1524 1491 1872 -1112 -2392 -2018 -424 1192 1227 -1241 -3064 -1408 791 1341
3115 1341 695 -1324 -2791 -976 1782 1791 -1003 -2560 -1968 185 2064 1152 -1525 -2939 -389 1431
3131 1431 1431 334 -1371 -2149 -326 2271 1640 -28 -1745 -1670 652 2712 1681 -1560 -2421 -180 1743
3148 1743 2147 247 -1611 -1727 649 2213 869 -703 -1178 -909 590 2648 1241 -1770 -1950 -161
3164 -161 1635 2133 298 -1987 -2038 1004 2692 586 -1330 -2072 -1001 874 2042 -24 -2055 -1717
3180 -1717 -481 1033 1623 -121 -2906 -2461 781 1482 352 -1692 -2710 -1254 1052 1585 -1005 -2432
3196 -2432 -1705 -356 568 708 -1151 -2957 -1882 448 994 119 -1348 -2642 -1357 1464 1708 -999
3212 -999 -2491 -1489 470 1598 1271 -1382 -2447 -515 1349 1384 118 -1147 -1835 -310 2389 2277
3228 2277 -340 -1388 -905 941 2646 1827 -1112 -1794 700 2374 1859 592 -937 -1320 1116 2668
3244 2668 1742 111 -684 -452 1367 2973 2114 -617 -1297 922 2404 2403 649 -984 -944 2103 3217
3261 3217 1295 -450 -943 42 1613 2876 1261 -711 -773 498 1850 2278 781 -1399 -955 2012
3277 2012 3020 1145 -458 -846 174 1911 3050 796 -1501 -284 1226 2122 1906 985 -734 -140
3293 -140 1905 2940 1806 137 -626 420 3107 3176 473 -912 195 1611 2693 2329 726 -877
3309 -877 505 2545 2084 1202 -32 -727 65 2608 2453 -40 -1553 -740 1010 2509 1685 -1038 -2535
3326 -2535 -345 1517 749 3 -1407 -1715 -731 1247 777 -1739 -2241 -1704 -291 889 100 -2492 -3648
3343 -3648 -1503 782 579 -1385 -2659 -2896 -830 204 -868 -2537 -2894 -1912 -886 73 -923 -3444
3359 -3444 -3442 -1368 294 334 -867 -3258 -2830 -509 1097 -443 -2185 -2175 -1238 376 833 -911 -2277
3376 -2277 -1812 113 901 668 -520 -2526 -1701 969 1874 657 -1260 -1684 -561 1556 1942 -189 -2090
3393 -2090 -701 997 1559 901 -305 -1568 -490 1669 2002 700 -992 -1390 -365 1811 2305 -195
3409 -195 -1995 -851 823 1690 1052 -912 -2124 206 1838 1224 -277 -1205 -1576 10 1565 1318 -615
3426 -615 -1693 -872 550 1596 1160 -1318 -1916 104 2194 1051 -498 -1598 -1291 440 2202 1230
3442 1230 -900 -1543 -545 840 2033 1037 -1012 -1469 107 2014 1429 126 -1221 -1134 1351 3007 865
3459 865 -917 -1478 172 1302 2162 952 -853 -1000 874 1534 1315 554 -1004 -1243 1493 2574 528
3476 528 -1493 -1429 -222 1867 1965 -170 -2291 -1212 568 1424 933 -387 -1686 -1103 763 1348 43
3493 43 -1242 -1363 -698 1212 1762 -571 -2246 -1031 852 1324 643 -1101 -2209 -507 1240 887 -400
3510 -400 -1221 -1168 -382 910 1634 -667 -1920 -762 1089 1866 1196 -1256 -2183 -198 2030 1572 119
3527 119 -884 -1019 442 1388 1229 -764 -1087 -192 1121 1856 1157 -1148 -1708 151 2298 1855 50
3544 50 -1256 -994 388 2086 1012 -985 -1075 153 1030 1064 381 -885 -1369 657 1510 1039 -476 -1608
3562 -1608 -1365 603 2216 815 -1495 -1580 -210 830 1168 -318 -1523 -881 595 1096 613 -584 -1524
3579 -1524 -1631 895 2185 -56 -1673 -1893 -923 1007 1309 -544 -2518 -1521 279 966 -244 -1571
3595 -1571 -2240 -1405 836 860 -994 -2001 -1890 -1239 692 853 -843 -2352 -1746 -28 648 268 -1727
3612 -1727 -2493 -875 1167 374 -1326 -1697 -1735 -574 786 479 -1588 -2166 -1199 208 821 466 -1328
3629 -1328 -1979 -184 1321 809 -927 -1306 -1077 277 1604 345 -1389 -1522 -27 1059 1295 193
3645 193 -919 -1683 518 1786 1115 -315 -1105 -809 1001 2378 1112 -786 -789 401 1796 1587 552
3662 552 -1022 -785 828 1850 1181 92 -956 -420 1580 2106 702 -915 -1039 307 1839 1974 531
3679 531 -1661 -842 1154 1765 879 -313 -726 -744 1512 1619 498 -910 -809 234 1646 1506 -703
3696 -703 -1663 -894 1324 1521 557 -879 -1396 -207 1652 1590 -477 -1204 -810 384 1318 1022 -592 -1458
3714 -1458 36 1012 1117 367 -824 -1533 -214 1577 1035 -363 -1036 -782 394 1295 685 -945 -1803
3731 -1803 -159 1053 819 217 -1539 -1465 179 1461 788 -851 -1136 -803 496 1389 664 -1252 -1398
3748 -1398 -229 781 819 93 -1333 -1512 463 1531 358 -768 -991 -808 775 1533 441 -1430 -1139
3765 -1139 -84 821 1028 216 -1190 -1171 494 1373 569 -469 -1101 -386 1255 1842 208 -890 -847 349
3783 349 1325 1162 361 -1594 -303 1381 1551 524 -336 -931 -145 1480 1798 221 -861 -604 516
3800 516 1453 1430 14 -1283 -151 1582 1927 943 -436 -634 354 1863 1616 119 -877 -38 964 1625
3818 1625 1386 -577 -1041 271 1523 1468 423 -612 -966 225 1649 1122 -106 -1061 -564 564 1752
3835 1752 746 -1169 -1258 23 694 775 153 -1318 -1371 -1 1170 397 -911 -1382 -901 250 959 44
3853 44 -1562 -1968 -164 696 173 -459 -1866 -1909 39 812 36 -1395 -2021 -1334 13 777 -438 -1956
3871 -1956 -1728 -744 488 148 -699 -2306 -1759 333 691 -192 -1535 -1921 -877 368 836 -625 -1975
3888 -1975 -912 -161 495 413 -550 -2068 -615 897 1150 -26 -1025 -1019 -226 1040 1197 -220 -1080 -723
3906 -723 787 1252 1182 -463 -1055 -286 1465 1369 498 -618 -896 258 1851 1812 16 -573 4 1042
3924 1042 1747 971 -525 -807 663 1159 1026 391 -439 -793 367 2095 1001 -362 -878 -442 741
3941 741 1708 876 -823 -1202 351 1439 884 28 -834 -920 589 1553 682 -833 -985 -482 662 1596
3959 1596 784 -1369 -862 423 1110 1107 -17 -1022 -728 640 1286 225 -815 -812 -208 1371 1485 296
3977 296 -1233 -917 676 1443 1121 277 -978 -540 1008 1431 232 -604 -797 210 963 1400 -171 -1423
3995 -1423 -224 659 1023 879 -444 -1459 -698 994 961 -166 -1134 -1490 -629 986 339 -995 -1652 -911
4013 -911 292 823 -363 -1334 -2023 -893 440 266 -582 -1140 -1966 -793 817 457 -1096 -1656 -869 -4
4031 -4 668 -259 -1962 -1880 -179 642 571 -430 -1260 -1449 -220 1046 381 -657 -1004 -161 138 1103 426
4050 426 -880 -1150 663 1416 857 -482 -804 -793 964 1664 613 -409 -699 209 1000 1551 944 -677
4068 -677 -444 763 1688 978 125 -808 -625 1249 1555 238 -664 -1060 262 1004 1325 99 -1177 -298
4086 -298 259 678 463 -100 -997 -556 919 1224 -294 -1282 -1446 -188 1049 845 -1005 -1349 -1114 249
4104 249 388 45 -1098 -1221 -466 591 583 -422 -966 -1271 -178 903 990 -755 -1393 -1003 729 1123 614
4123 614 -942 -1549 -200 1032 387 -558 -1097 -734 258 1433 821 -902 -1207 -285 1087 1283 573 -810
4141 -810 -1356 -93 1307 597 -435 -952 -524 904 1555 265 -798 -823 -45 721 1297 463 -1093 -1089 272
4160 272 1394 676 -21 -770 -764 460 1393 164 -583 -611 301 1272 760 0 -1191 -454 895 1493 983
4179 983 -192 -943 -904 1023 1642 500 -737 -587 357 775 1138 -362 -1067 -73 1155 1439 454 -349
4197 -349 -838 -291 1395 1601 483 -548 -259 -147 1196 1351 -78 -1073 270 1160 883 482 -952 -1272
4215 -1272 204 1459 946 -455 -1184 -538 -203 495 951 -674 -1103 -339 446 765 59 -1023 -1117 203
4233 203 1525 763 -756 -1090 -981 224 1058 184 -906 -1236 -482 70 632 -56 -1056 -1153 203 946
4251 946 356 -1266 -1469 -939 516 1250 101 -1257 -1511 -142 -12 499 -62 -1146 -1477 -89 110 125
4269 125 -385 -1521 -1055 542 1385 -705 -1496 -1491 -520 872 718 -499 -1264 -1016 75 306 -154 -595 -1230
4288 -1230 -1015 378 912 -352 -1158 -1014 158 972 1109 -544 -1778 -809 639 778 501 -340 -639 -155
4306 -155 976 788 -341 -586 38 660 1033 1162 -176 -1076 -74 1299 1639 1154 -266 -778 539 1512
4324 1512 957 308 -124 689 741 1555 1154 -34 -269 621 1589 1457 833 -592 -1031 751 1779 1379 80
4343 80 -201 -301 708 1503 619 -545 -574 574 902 1118 68 -863 -858 153 1075 611 -340 -1252 -1206 433
4363 433 912 -355 -1454 -790 93 584 298 -449 -1466 -962 612 567 -63 -387 -1258 -1038 70 1327
4381 1327 2 -1091 -986 -234 366 587 -473 -1468 -472 901 549 -497 -824 -875 -734 614 991 -535
4399 -535 -1116 -737 -271 374 832 -405 -1145 -510 696 857 -218 -879 -1176 -102 1052 657 -489 -894
4417 -894 -666 7 651 629 -438 -1380 -565 720 570 -120 -928 -1341 -96 1282 504 -977 -1517 -654 234
4436 234 1165 714 -993 -1048 -87 603 545 126 -724 -887 316 864 316 -528 -995 -493 891 1412 589 -1297
4456 -1297 -963 350 741 1197 409 -566 -617 682 1011 264 -229 -462 -148 883 1570 382 -912 -442
4474 -442 539 1129 864 178 -1176 -516 925 1118 17 -645 -519 47 750 976 -37 -1036 -247 479 1185
4493 1185 1134 -106 -1208 -324 776 902 250 -670 -881 -230 772 670 -478 -1034 -142 396 704 842
4511 842 -480 -1265 -281 1011 1030 -99 -729 -1259 -193 924 607 -609 -1271 -589 -85 353 288 -612 -1163
4530 -1163 -100 526 340 -268 -1008 -1030 -282 1068 -30 -718 -1111 -506 506 696 -198 -890 -789 115 460
4549 460 94 -92 -855 -1190 493 1015 363 -827 -990 -363 231 638 183 -870 -662 72 621 684 -258
4568 -258 -819 -459 803 1258 87 -394 -440 90 1491 987 432 -680 -310 573 1032 936 166 -764 -213
4587 -213 1372 1508 278 -671 -356 141 1189 1086 -492 -830 -223 550 851 869 20 -739 -110 836 891
4606 891 75 -773 -487 -167 872 837 -455 -692 -332 -142 576 368 -801 -1065 -33 472 128 -185 -1237
4625 -1237 -889 -191 1121 555 -598 -1294 -391 564 589 -31 -962 -986 139 615 359 -339 -796 -1018 131
4644 131 861 83 -744 -936 -350 447 859 161 -1217 -1010 185 1097 408 -358 -682 -1043 724 1181 106
4663 106 -616 -719 -299 559 1162 -231 -1126 -355 512 808 436 -328 -1022 -313 860 861 -78 -758 -530 4
4683 4 342 381 -610 -1103 -384 439 412 403 -528 -1157 -516 791 992 -95 -623 -707 -244 706 601 -424 -983
4704 -983 -148 509 245 305 -736 -768 -139 545 989 195 -762 -915 1 937 748 -560 -671 125 558 863
4724 863 356 -853 -742 221 1123 506 -251 -185 -77 381 1016 706 -681 -737 96 867 672 533 -631 -518
4744 -518 467 1113 218 -340 -551 -417 346 1089 118 -600 -528 -181 696 562 -236 -1211 -874 182 535 265
4764 265 -180 -942 -819 697 858 -169 -1018 -632 -154 344 724 -47 -1256 -872 259 291 -198 -389 -1291
4783 -1291 -697 585 599 -273 -1089 -922 -115 330 405 -779 -1273 -563 302 276 336 -98 -916 -177 643 589 -117
4804 -117 -598 -805 194 645 630 -373 -740 -134 580 832 639 -617 -999 150 1017 604 -143 -388 -618
4823 -618 599 1247 448 -443 -599 168 797 1028 206 -487 -886 497 905 595 14 -252 -255 538 1092 620
4843 620 -437 -409 198 536 945 466 -715 -432 422 1063 507 149 -524 -242 810 745 395 -547 -217 382
4863 382 765 853 100 -646 -173 783 845 179 -413 -578 -52 580 816 -51 -1126 -433 71 866 596 -92
4883 -92 -892 -399 261 373 -66 -368 -1133 -511 628 770 -616 -783 -570 23 484 419 -517 -1223 -304 366
4903 366 96 1 -791 -976 -403 533 341 -527 -978 -408 -39 269 364 -606 -1041 13 221 297 -287 -751 -715
4924 -715 -62 713 241 -511 -801 -705 25 616 412 -814 -610 -246 388 206 -349 -777 -881 181 993 282
4944 282 -237 -436 -146 226 882 329 -605 -754 -16 471 473 -5 -613 -439 420 922 230 -216 -721 -196 546
4965 546 1019 -127 -740 -398 296 480 307 5 -787 -55 926 1001 246 -363 -617 -265 881 1042 -180
4984 -180 -487 -485 321 739 985 -107 -627 -193 745 1023 395 17 -457 400 1141 900 -205 -507 -327 422
5004 422 868 705 -458 -555 576 934 810 210 -503 -299 327 919 169 -378 -288 -200 212 762 372 -568
5024 -568 -715 47 352 297 44 -535 -895 -17 979 137 -717 -566 -263 14 458 126 -907 -872 84 332
5044 332 159 -439 -769 -787 194 706 208 -713 -797 -42 368 560 -251 -1098 -850 117 236 468 -186 -967 -488
5065 -488 260 598 -342 -469 -763 -195 309 738 126 -787 -207 237 461 841 -12 -554 -461 718 663 35
5085 35 -468 -723 -67 907 697 100 -657 -432 397 629 450 -183 -788 -332 639 697 -37 -248 -157 229 616
5106 616 482 -388 -589 -419 116 866 220 -391 -886 -18 597 342 -90 -326 -573 -72 817 404 -481 -393
5126 -393 107 263 722 222 -397 -552 226 934 558 369 -524 -959 -65 1036 480 -373 -643 -200 308 681
5146 681 252 -642 -589 512 357 117 -37 -595 -646 176 463 57 -331 -826 -83 359 691 -321 -628 -721
5166 -721 83 548 191 -420 -876 -337 471 492 -289 -386 -679 -79 166 525 -137 -641 -621 128 221 168 -473 -742
5188 -742 8 599 88 -130 -539 -583 -229 285 201 -373 -603 -483 244 524 460 -187 -611 -307 587 747 -227
5209 -227 -550 -421 -96 717 613 -465 -651 -335 440 481 191 -255 -659 176 488 170 -238 -475 -331 268
5229 268 884 396 -216 -482 219 475 818 413 -525 -290 281 795 299 52 -234 -14 525 708 270 -452
5249 -452 -311 191 397 853 80 -391 -257 421 573 354 107 -656 -49 543 774 -75 -664 -329 -79 727
5269 727 694 -27 -908 -285 169 671 412 -265 -723 -241 300 400 -346 -694 -282 -127 287 230 -422 -787 -244
5290 -244 74 530 102 -157 -652 -110 497 237 -456 -462 -704 23 598 244 -536 -611 35 146 -151 221 -467
5311 -467 -960 -472 427 -60 -180 -716 -589 -60 508 164 -693 -428 40 663 265 125 -158 -843 180 636
5331 636 206 -178 -350 -705 352 855 415 -405 -552 295 634 725 227 -754 -550 122 454 439 -356 -311 -278
5352 -278 402 873 219 -819 -324 110 495 861 -95 -742 -116 236 273 137 -267 -606 -290 793 738 190
5372 190 -230 -399 270 952 839 247 -678 -64 99 648 24 -282 -799 -90 846 435 -306 -511 -113 -26
5392 -26 805 509 -330 -816 -80 312 210 203 -380 -461 -166 643 573 -242 -360 -722 372 347 398 -582 -450 -287
5414 -287 249 151 262 -331 -512 252 651 417 -355 -447 -572 170 599 221 -815 -968 93 477 479 -7 -788
5435 -788 -813 202 251 189 -365 -459 -370 340 570 -94 -628 -568 76 547 623 -193 -541 -497 237 419 66 -672
5457 -672 -427 -168 430 606 38 -212 -271 222 545 846 -152 -536 -45 570 470 163 -23 -503 -411 716
5477 716 594 17 -520 -77 198 474 617 -140 -555 56 775 552 237 -348 -224 347 819 866 46 -329
5497 -329 -223 405 625 478 -293 -887 175 608 662 -68 -233 -526 189 777 454 -49 -458 -323 500 423
5517 423 456 -266 -438 370 460 206 175 -337 -811 247 612 228 -308 -332 -177 427 700 224 -381 -243 -142
5538 -142 519 211 270 -457 -565 495 643 101 -585 -632 -467 563 862 -47 -604 -660 62 159 517 -357 -719
5559 -719 -827 257 575 12 -344 -552 -139 549 555 -321 -848 -617 -166 294 516 -15 -675 -340 516 502 -242
5580 -242 -63 -325 -372 723 410 -184 -752 -468 82 402 375 -305 -701 253 191 598 6 -308 -565 243 741
5601 741 363 -183 -429 -109 330 370 304 -334 -472 -8 416 571 243 -195 -568 -52 854 665 -264 -399 -186
5622 -186 353 630 578 -617 -450 254 331 431 408 -343 -718 359 735 229 -533 -472 73 395 1063 341 -550
5643 -550 -237 90 593 312 -15 -571 -310 140 572 375 -607 -178 -176 226 492 -220 -780 -132 43 345 172
5664 172 13 -594 -527 513 278 -111 -532 -322 86 390 306 -191 -467 -190 8 224 346 -287 -563 -492 385
5685 385 267 -10 -523 -576 -39 527 216 -366 -585 -32 11 407 507 -549 -857 -262 319 81 -136 -702
5705 -702 -634 -104 408 487 -606 -789 -592 54 417 171 -520 -738 5 284 313 -1 -525 -559 26 421 51
5726 51 -481 -362 -394 217 621 255 -671 -359 101 554 509 -180 -406 -420 279 816 93 -250 -183 144 448 641
5748 641 183 -482 -95 391 438 608 -361 -504 21 670 657 10 -100 12 73 327 532 -7 -525 -86 288
5769 288 554 118 -188 -697 -34 557 615 25 -178 -4 -210 591 403 -65 -647 -74 390 271 102 -359
5789 -359 -750 -255 705 156 -139 -156 -368 -237 550 256 -453 -592 -464 82 219 303 -455 -428 63 467 319
5810 319 -100 -515 -403 -119 103 206 -359 -352 -122 183 219 -73 -572 -741 20 305 227 -86 -807 -259 116
5831 116 801 178 -517 -781 -283 476 294 112 -616 -682 239 593 217 -261 -398 -126 379 259 -152 -477
5851 -477 -418 -13 287 284 -221 -271 -115 291 248 176 -168 -580 -109 368 557 -40 -396 -637 51 508 588 -270
5873 -270 -663 -304 258 401 253 -118 -78 -166 527 448 -96 -467 -178 192 652 552 -65 -568 -107 428 3
5894 3 101 -268 -91 247 550 291 -364 -347 -374 320 683 456 -238 -522 -54 117 473 195 -114 -380 197 491
5916 491 126 -339 -384 -455 29 363 223 -524 -450 -118 655 211 312 -285 -808 -73 295 65 -470 -648 -56
5937 -56 355 693 -137 -490 -566 127 100 38 -169 -119 -194 54 350 80 -165 -773 -297 332 659 -30 -563 -229
5959 -229 -156 6 329 -227 -455 -484 134 763 145 -598 -556 -92 672 346 -193 -169 -523 -112 381 479 -434 -292
5981 -292 -372 222 482 123 -318 -490 107 392 289 -289 -347 74 207 583 268 -362 -255 182 549 477 130
6002 130 -172 -462 268 795 373 -155 -220 -423 394 545 132 -213 -391 298 178 268 -154 -451 -397 333 286
6023 286 171 -305 -440 -77 222 638 379 -597 -322 220 588 242 0 -150 10 385 520 271 -179 -393
6043 -393 -236 -62 580 143 -423 -451 11 381 357 126 -718 -240 425 522 184 -279 -392 -105 515 80 -152
6064 -152 -484 -418 164 242 456 -246 -392 -47 293 288 121 -439 -519 -99 181 464 -518 -335 -395 348 429 228
6086 228 -100 -654 66 529 417 -36 -623 -483 -100 471 327 -516 -520 74 310 376 404 -389 -727 12 -45 -48
6108 -48 -189 -88 -605 -32 199 67 -37 -259 -172 284 580 186 -305 -521 69 479 252 207 -271 -463 -22
6129 -22 579 258 -32 -317 -253 127 595 333 -600 -505 66 431 330 149 -402 -158 323 283 23 116 -313 -85
6151 -85 622 486 -5 -283 -156 197 265 236 -31 -685 -398 274 514 -147 -202 -422 -100 96 532 -123 -346
6172 -346 -606 143 23 524 -341 -861 -254 249 368 -64 -261 -247 92 622 109 -320 -390 -103 281 293 -26
6193 -26 -126 -733 0 264 148 -418 -613 -427 89 649 -15 -541 -611 -228 340 564 -70 -343 -569 203 20
6214 20 613 -174 -584 -536 97 643 -56 -323 -560 -169 -107 575 92 -516 -320 259 316 124 101 -286 -129 356
6236 356 597 252 -304 -152 -140 491 492 336 -202 -129 376 622 514 105 -433 -177 306 359 -23 -91 -174 -94 638
6259 638 534 73 -245 -232 128 529 271 203 -393 -268 565 650 -54 -103 -308 62 719 456 -91 -84 240 275
6281 275 394 589 139 -327 -210 491 304 44 -164 -376 53 150 198 -329 -302 70 269 607 26 -455 -435
6302 -435 -121 348 134 141 -79 -108 264 608 74 -207 -516 -201 -92 173 119 -291 -313 295 313 234 15 -170
6324 -170 -425 375 402 -60 -114 -48 -305 -95 355 79 -403 -480 62 389 -120 -173 -564 -379 180 418 38 -820
6346 -820 47 -117 19 345 143 -499 -350 102 444 220 -197 -738 -164 234 353 -101 -216 -359 252 372
6366 372 461 -113 -287 -72 229 250 243 -168 -339 -5 441 239 2 -346 -414 81 337 604 -172 -87 -190 68
6388 68 288 395 224 -272 91 389 265 -40 -196 -80 31 262 350 -187 -656 -198 137 350 180 -216 -289
6409 -289 139 148 84 43 -96 -110 40 147 67 -339 -352 -131 186 296 159 -417 -616 -2 221 -108 -239 -462
6431 -462 -306 -126 140 66 -538 56 -244 160 355 -312 -579 -497 -13 138 345 -89 -443 -116 52 501 -76
6452 -76 -567 -268 4 316 317 -192 -366 -308 335 405 434 -312 -593 -209 380 100 -328 -496 -192 -176 146 411
6474 411 -242 -526 -200 208 56 -60 -148 -629 19 201 567 -134 -310 -287 8 235 199 -599 -715 -328 185
6495 185 97 212 -369 -378 286 153 199 -334 -231 -42 296 328 -18 -261 -88 -260 427 437 480 -174 -315 356
6517 356 341 397 -257 -233 -41 82 555 161 -177 -58 191 473 542 201 -253 -287 283 280 397 46 -301 -152
6539 -152 514 774 206 -305 -220 -133 602 297 321 -216 -505 555 234 -61 -45 -161 -81 314 378 -17 -100 -387
6561 -387 -49 478 7 -169 -219 -147 536 394 191 -340 -179 9 57 229 -279 -284 -417 142 267 -35 63 -321
6583 -321 -136 416 52 253 -29 -322 -88 301 56 -44 -247 -313 46 45 -336 -200 -495 -52 70 6 27 -606
6605 -606 -424 -336 274 121 -80 -357 -130 333 159 205 -294 -392 -214 74 -78 179 -242 -274 67 164 210 -127
6627 -127 -146 -371 149 -71 270 -130 -615 -14 340 112 -302 -457 -282 274 482 181 -267 -271 255 416 334
6648 334 154 -449 -303 -170 -34 469 -229 -61 -302 175 -165 257 46 -310 -128 384 437 -57 -114 -80 299
6669 299 65 21 184 -206 -122 413 287 -181 -118 -226 -105 289 600 204 -343 -60 -128 136 191 -280 145 24
6691 24 16 415 -92 -194 -363 133 242 429 -244 91 -71 -178 292 -150 -279 -116 104 337 203 -96 -353
6712 -353 -283 384 330 3 -108 -97 -189 191 335 -82 -414 -457 1 218 309 222 -321 -370 317 378 459 -268 -93
6735 -93 -213 265 376 374 -619 -179 226 350 266 -232 -513 -97 486 55 168 126 -241 136 437 243 196 -281
6757 -281 -169 186 195 148 -146 -157 -88 397 89 104 -78 -415 -4 240 336 21 -184 -39 90 325 67 -128
6779 -128 -88 -109 360 132 -173 -138 -201 105 356 157 -103 81 202 97 249 -118 -34 -278 129 488 104 100
6801 100 -266 -96 -73 606 133 -67 108 -141 60 177 148 -337 -173 83 -52 180 64 -111 -239 167 359
6822 359 188 -197 -30 -114 -13 193 501 -374 -172 -186 282 26 -39 -288 -145 118 237 16 -181 -521 -64
6843 -64 218 100 -199 -398 -115 -113 398 96 8 -267 -137 112 40 -54 -361 -100 -45 262 325 -43 -155 -30 312
6866 312 149 59 -172 -341 -122 280 73 -215 -164 -300 96 240 463 -178 -566 -61 223 112 -28 -49 -321
6887 -321 46 126 221 133 -104 -179 207 387 389 -106 -162 -86 -230 -76 144 -199 -242 20 355 175 263 -271 -341 282
6911 282 178 344 -122 -162 102 305 483 292 1 -253 -67 235 244 -53 -204 217 391 271 392 -40 -208
6932 -208 -65 123 232 -115 -216 -264 -53 257 282 -245 -762 -142 -263 375 -372 -324 -246 2 34 191 -113 -548
6954 -548 -200 -197 288 35 -376 -435 -32 303 252 -20 -372 -216 -192 171 33 -79 -656 -263 60 134 101 -141
6976 -141 -300 -361 426 80 -63 -554 -414 -14 213 92 85 -597 -272 31 57 -94 -224 -460 -342 238 -36
6997 -36 -178 -344 -263 268 357 359 -157 -293 -74 338 3 -301 8 11 135 198 116 -203 -47 -399 138 864 101
7020 101 -36 -207 106 78 232 -61 -160 -473 259 538 313 27 -436 -222 88 190 22 66 -208 -99 31
7041 31 210 103 -227 -162 255 537 99 388 -305 89 264 221 217 -202 -132 42 285 456 -97 65 263 413
7063 413 686 12 97 -127 112 559 494 170 -204 162 250 432 299 -35 -138 99 540 276 -38 -71 -155 158
7085 158 683 258 -268 -230 -119 15 55 282 -320 -92 -236 243 -134 260 -245 -426 -9 83 46 -28 -433 -453
7107 -453 -112 -109 186 -271 -338 -22 -49 -23 -37 -258 -291 163 16 -240 -224 -451 -31 -35 277 -155 -554 -137 -172 -159
7131 -159 15 15 -409 -192 11 297 66 -10 -256 -3 144 18 309 -62 -488 85 192 303 -99 -473 45
7152 45 -1 285 -130 -322 -242 -169 235 19 -211 -192 -25 66 161 396 49 -228 -54 -2 11 -21 -115 -175 143 195
7176 195 134 -281 284 -40 119 360 203 -154 -259 202 125 237 266 -498 -369 193 115 58 10 -235 -172 38
7198 38 108 74 -22 -484 -5 639 185 -204 29 -218 174 315 74 87 53 -150 188 378 124 11 -123 62
7220 62 128 276 496 -438 -33 87 199 34 98 216 18 -32 243 47 -33 -102 -119 -12 26 45 -351 74 172
7243 172 297 -49 -434 -91 124 43 278 -216 -266 -155 259 154 90 9 -354 -55 393 300 214 -107 -39 27 240
7266 240 -32 -403 -149 -40 274 243 226 -71 -367 -77 86 336 -354 38 -290 -29 238 401 3 -181 -12
7287 -12 222 129 176 -136 -400 -276 237 295 -242 149 -213 156 -37 -40 -133 -361 -139 81 -5 -155 -224 -170 139
7310 139 278 36 278 -163 -133 170 59 202 198 285 -208 277 214 191 -334 -144 -32 297 543 -141 -336 85
7332 85 146 239 -68 -212 -68 -302 3 493 -174 -304 96 103 273 -200 50 -438 -306 144 191 47 51 -17 -171
7355 -171 497 170 -215 -68 170 156 243 120 -49 -304 48 282 -37 41 -33 -505 -105 251 -87 -399 -229
7376 -229 71 272 216 135 -259 -248 -84 107 14 178 -242 -194 -222 232 46 -255 -32 -200 87 84 185 -304 -344
7399 -344 -11 -176 176 -13 -64 -156 236 243 -84 -361 6 -187 224 106 160 -75 -191 250 89 49 87 -122
7421 -122 -53 791 305 -129 -76 90 15 141 137 -193 -235 -26 181 307 144 -44 -205 -213 110 339 46 -443 -14
7444 -14 153 21 200 163 -303 -132 154 39 243 -183 -759 -86 17 -193 105 -282 -376 -56 107 200 -266
7465 -266 -303 -117 -102 132 59 -440 -219 53 220 378 76 -83 -98 -33 -65 -123 -262 -546 -195 -171 254 89 -399
7488 -399 -310 -106 124 -179 -347 -346 -488 -293 221 -230 -161 -33 -103 165 -191 -179 -221 -56 79 459 14 -19 -410
7511 -410 -340 -141 54 73 -327 -78 45 19 106 12 -344 -223 -63 166 -123 -164 -270 -143 -17 264 4 -159
7533 -159 -33 -23 94 281 8 -19 -96 283 367 275 -225 -35 -10 303 365 -221 -295 -125 3 84 119 185 -93 -276
7557 -276 249 384 57 10 -190 -8 414 647 -62 -34 -186 18 520 87 129 9 25 430 285 432 89
7578 89 147 458 291 158 142 72 -342 32 250 304 190 -162 187 521 401 302 82 116 22 75 12 -90 -183 -22
7602 -22 51 256 -5 -12 -33 19 255 150 17 -355 -127 267 -42 -145 -16 -43 -146 -95 36 -290 -157 -36 -195
7625 -195 37 75 38 -612 -714 -167 216 -119 -464 -276 -91 258 308 -51 -286 102 -203 -111 50 -314 -282 -229
7647 -229 -164 -104 103 57 -569 -35 -44 272 214 -197 -238 -47 321 295 27 -235 151 134 110 139 -76 -112 -1 337
7671 337 -6 -145 -25 327 -250 330 279 129 -81 -155 -78 321 90 -200 -530 80 411 -68 46 -28 -60 155
7693 155 277 183 0 -2 244 110 50 -199 20 -260 121 240 93 -295 -52 -180 -44 385 167 -155 21
7714 21 -82 123 321 177 -187 47 320 362 327 116 -144 85 252 132 75 -72 33 17 49 108 293 -238
7736 -238 90 161 519 -44 -329 -3 81 566 -24 43 -99 74 -19 153 335 -118 -185 -391 -8 -156 -170 93
7758 93 -222 -434 127 523 -99 -176 -80 60 75 193 -128 -190 -167 340 -187 127 -174 -263 -410 -196 182 72
7780 72 -402 -107 -51 23 58 -295 -97 7 90 -256 -185 -142 110 -3 140 -238 219 -64 -300 103 314 239 -568
7803 -568 -14 236 -73 -95 106 -229 83 199 465 180 209 -48 -246 136 243 78 -322 53 59 -29 72 197
7825 197 1 -303 39 328 85 -13 -162 -356 18 19 -84 -331 30 -85 217 -15 285 -233 -279 347 -236
7846 -236 -116 -39 -322 -147 -192 -47 -272 -179 26 284 -14 277 69 -68 -120 299 385 -147 -262 -225 2 310
7868 310 129 296 -321 -67 183 -105 288 -353 -108 95 95 -71 215 168 101 -71 363 239 85 113 -35 -201
7890 -201 7 125 -292 -337 -14 90 512 29 -65 45 70 446 144 -74 -494 -258 180 197 -273 12 -93
7911 -93 236 18 -50 17 -176 -101 123 326 -33 219 -33 -168 -191 224 176 -318 -273 182 107 311 9 -195 -302
7934 -302 84 -40 -101 31 -34 81 340 307 1 -228 87 167 -58 150 123 -354 -67 271 313 -144 -12 51
7956 51 -19 207 38 -27 -23 -94 46 112 -59 67 48 -506 325 111 87 156 -69 -62 -150 261 17 -301 -131 75
7980 75 279 261 -371 -274 93 340 -39 -116 43 -236 -181 236 40 30 -488 -37 -100 289 -213 -37 -88 -296 385
8003 385 -54 -174 -112 -53 149 255 -68 -199 -230 -290 89 306 -158 -447 -136 -167 -6 -74 -163 62 -325 -61
8025 -61 249 -55 -116 -315 -215 -56 143 -44 -301 -104 236 279 -29 83 -266 39 104 -57 58 -445 27
8046 27 -274 61 31 -231 -301 41 29 313 353 -168 -102 -518 52 -87 249 -175 -78 2 -59 168 -6 -129 121
8069 121 52 -45 278 -89 -121 47 325 78 73 27 275 239 223 223 73 133 70 61 104 132 -282 -149 98 -79 214
8094 214 310 -130 -188 214 199 110 -207 -94 -74 245 119 89 -299 -230 153 234 138 323 43 48 25 168 156 99 -230
8119 -230 21 315 217 101 150 -52 172 502 170 -71 18 -282 185 -10 -37 -33 -28 -206 71 -98 71 -186 -109
8142 -109 -149 -60 -27 -45 -295 -213 -36 -152 40 -155 -14 -219 -24 -338 -413 -111 170 -160 3 30 -132 107
8164 107 -222 132 333 -98 61 45 329 -227 -247 -148 -216 -140 -44 65 162 -148 -77 -243 -157 157 219 178 -26 186
8188 186 233 332 -37
8191c7
$$ Imaginary data points
##PAGE= N=2
##DATA TABLE= (X++(I..I)), XYDATA
0 0 0 0 0 0 0 0 0 0 0 0 -5 8 -8 8 -8 8 -15 16 -17 22 -24 29 -33 38 -45 50 -56 64 -73 82 -94 105 -117 130
34 130 -145 162 -180 199 -222 246 -272 302 -332 371 -410 454 -507 564 -630 709 -802 915 -1056
53 -1056 1234 -1471 1800 -2295 3117 -4737 9161 -45785 -162081 -110207 -39160 -13510 -37559
66 -37559 -47648 -37656 -11617 -7784 -21593 -30149 -26547 -39570 -44278 -26114 -26272 -74044 -105446 -70382
80 -70382 2608 43214 14338 -54067 -75663 -25751 15408 -7253 -38637 -32642 -10844 -3306 -9433
93 -9433 -23886 -29048 -12882 8162 26766 45808 31208 -27452 -57528 -7001 59555 61538 13978
106 13978 -17295 469 40760 46393 11411 -600 34643 60356 48497 31776 18678 1818
118 1818 2323 34881 69974 74253 39932 -8912 -14832 37624 75973 47233 7113 15389 45741
131 45741 51155 24623 -5262 -1819 35948 60664 46456 26166 13216 -5801 -8791 27541 63096
144 63096 51805 10227 -13757 2086 38565 43830 6026 -10782 27996 61505 39456 -719
156 -719 -12113 3189 29050 48111 45576 29809 12986 -4020 -1152 35261 61927 37432 4272
169 4272 12634 40897 45665 21206 -3282 6995 51122 72413 40406 2489 1039 15847 29822
182 29822 46364 51846 33742 11141 4746 15992 36943 41563 15121 -976 27356 54108 30673
195 30673 -12043 -21366 7423 42539 48873 17503 -13374 -12309 -98 4893 15250 22709 5048
208 5048 -16830 -10339 8271 7910 -11592 -29342 -18888 18699 31876 -9542 -51679 -41112 -4456
221 -4456 12375 6496 -10834 -27570 -28499 -17798 -11707 -9364 -8913 -19881 -25945 -6694 8617 -13399
235 -13399 -43947 -40545 -7421 22555 17800 -22304 -50179 -29223 5241 8490 -4661 -9934 -12668
248 -12668 -13400 -4377 734 -6888 -14622 -13732 -1670 19541 21780 -13864 -42788 -20644 22916 33868
262 33868 10412 -16730 -23407 -3632 16835 10114 -5826 -4492 3309 5433 11290 9504 -9365
275 -9365 -21668 -5360 21463 31098 14269 -20034 -33877 -3685 31945 24756 -5890 -15816 -3738
288 -3738 10026 12938 977 -12633 -7515 8876 15052 12659 3673 -17258 -26221 193 30799
301 30799 25664 -4392 -24784 -18403 8904 24419 5745 -18215 -10472 11349 14324 3455 -7742
314 -7742 -16232 -10093 10854 22002 10879 -7475 -22326 -18998 8162 29377 12380 -18119 -19661
327 -19661 1410 15833 10497 -8842 -20817 -3872 20226 16619 -3923 -15510 -16254 -7161 13275
340 13275 23347 5450 -17760 -20381 -5221 13697 18124 -3421 -23319 -9368 17252 16110 -5899
353 -5899 -20077 -15684 3766 21221 14773 -9294 -20454 -12945 331 14161 16768 -3211 -21365
366 -21365 -11585 10262 15339 2307 -14608 -16943 4666 25686 12080 -16494 -21393 -4127 12130
379 12130 19366 10371 -9294 -17462 -3788 11721 14553 7409 -7801 -14011 3120 22311 12675
392 12675 -10968 -17029 -2292 17519 24731 6118 -18502 -16312 6789 18758 14323 3429 -8661
405 -8661 -10934 5576 18917 9662 -5696 -10650 -2422 14735 23082 3780 -20327 -14843 9997
418 9997 22200 14752 -3240 -17027 -9672 12287 18502 4240 -7134 -8809 -3195 10180 15966
431 15966 -124 -17385 -11239 7024 17031 11435 -8346 -23680 -10896 14829 17467 -842 -14073
444 -14073 -13866 -4054 9621 9369 -7302 -16939 -9371 2941 8961 4843 -11781 -23610 -10049 11972
458 11972 12379 -4237 -18543 -19695 -5303 12399 7812 -12593 -19628 -8757 1759 5685 50
471 50 -15036 -20892 -6053 9333 6736 -6300 -18725 -20781 -4679 13500 6553 -15167 -22064 -11248
485 -11248 1519 6920 -1960 -19189 -20350 -3152 6507 611 -9916 -19718 -19988 -3052 10828 524
499 524 -18164 -22916 -13620 -47 7169 -3999 -22994 -22759 -4983 3857 -1770 -13204 -23300 -18849
513 -18849 -1000 6689 -6484 -20578 -21851 -13686 -657 6058 -7233 -25137 -22419 -5407 3908
526 3908 -313 -13130 -24268 -16843 2661 7132 -8398 -20137 -18365 -9412 4309 7221 -8468
539 -8468 -22912 -16609 -789 7561 3774 -10613 -21659 -11459 7514 9651 -4291 -15225 -15048
552 -15048 -3578 11229 10096 -9458 -20106 -9473 5046 10693 4849 -10510 -19595 -7012 10369
565 10369 9548 -4220 -14816 -14552 -2307 11972 6518 -13420 -20901 -9554 4041 8234 -357 -17618
579 -17618 -22303 -6539 7373 3455 -9456 -18321 -18840 -4669 7967 -19 -18553 -22110 -10313
592 -10313 1657 4969 -5588 -21860 -21864 -3690 7397 1238 -10695 -18849 -15121 696 10955 608
606 608 -14589 -14480 -3665 7460 11214 -68 -14349 -10196 7947 16878 10261 -1372 -8888 -2440
620 -2440 16662 23120 9097 -2846 -49 10521 20669 22718 10630 -1932 5091 21307 26796
633 26796 20060 7891 1118 10708 28354 30036 14869 4589 7535 16900 27609 26741 11998 2201
647 2201 10848 23356 25772 18975 7365 1115 11951 26363 23860 9603 1680 3814 13133 23686
661 23686 20741 3903 -3782 6173 16951 18189 10656 -427 -3435 8040 18961 14148 3545
674 3545 -2923 -1707 8681 19782 13992 -2670 -7226 4185 14463 16202 8710 -3099 -4131 9252
688 9252 18473 12593 2659 -2159 5 11853 21259 12720 -2731 -3943 6228 15942 18399 9952
702 9952 -3290 -3306 11325 19002 12920 2496 -3595 358 13441 18980 6440 -6341 -4752 5017
716 5017 12062 13264 3162 -10440 -9251 5014 11523 4951 -6090 -13613 -8265 5398 8039 -5862
730 -5862 -16950 -13554 -5001 2112 1475 -11287 -22556 -17024 -3241 770 -5682 -16303 -23418 -16367
744 -16367 -1586 -364 -13552 -22256 -19034 -9553 -916 -3185 -17706 -25579 -14197 -621 1025 -6625
758 -6625 -16883 -20484 -9953 3459 3106 -8238 -15141 -12559 -2172 8651 5144 -10774 -15314 -1754
772 -1754 11102 10885 1544 -9114 -9064 5258 17285 12118 297 -4561 -1153 9366 18650 12723
786 12723 -2196 -3899 7664 17641 17152 7389 -4579 -2669 13710 22499 13801 783 -3895 1927
800 1927 13927 19855 9571 -3843 -2417 7376 13630 13092 4760 -6532 -3808 11107 17703 7393
814 7393 -4764 -8780 -1149 13121 16067 1733 -9715 -5278 4720 9640 8566 -362 -9133 -3636
828 -3636 8613 11455 3073 -6125 -9777 -1121 12990 14294 -1106 -11619 -5737 5451 12191 9390
842 9390 -2810 -9425 -734 10855 9985 1844 -4411 -5706 2822 13457 11279 -2334 -9009 -4462
856 -4462 5945 13904 10181 -5232 -12008 -524 10696 8909 528 -6394 -6300 2725 10312 4600 -6829
871 -6829 -9188 -4400 3234 9506 4335 -10968 -15410 -4135 6359 5364 -3240 -12668 -12883 -1217 6070
886 6070 -1142 -11852 -12500 -6831 331 3694 -4026 -16136 -15191 -4903 2275 2128 -5472 -15928 -15754
901 -15754 -2672 5228 -2122 -12117 -13800 -8113 1511 3784 -7038 -16352 -11089 -357 3777 1232
915 1232 -6389 -14824 -11656 1540 7316 725 -8450 -12092 -6820 4554 7021 -4431 -12749 -6589
929 -6589 3426 6357 2451 -7194 -13116 -5152 6971 8301 244 -7144 -9758 -4470 6410 8417
943 8417 -2441 -9861 -6195 2472 7270 3464 -7511 -12062 -1644 9309 7084 -2619 -9190 -10014
957 -10014 -1914 8353 6367 -4604 -9751 -6544 -178 5904 3399 -7484 -12007 -1716 7778 4802
971 4802 -4451 -11288 -10062 1305 10081 3617 -8326 -10808 -5957 1093 6064 2344 -8164 -10570
985 -10570 -1857 4638 3432 -3532 -10678 -9511 3166 10465 1831 -10522 -11386 -4536 4354 7999 531
1000 531 -10167 -9325 -387 4644 2878 -2269 -8673 -7202 3569 8455 414 -9469 -10408 -3297 7175
1015 7175 9668 -1453 -12443 -8620 2122 6563 3945 -2582 -8965 -5174 4916 6773 -313 -6467
1029 -6467 -7170 -1276 8060 9260 -2740 -12322 -6615 4382 9357 6102 -4129 -10414 -3203 7769
1043 7769 7558 -187 -5075 -4989 873 8805 7504 -3433 -9548 -3463 5344 10440 6518 -5545 -11548
1058 -11548 -2094 9869 9021 -265 -6101 -5659 2073 9412 5162 -5560 -7292 -789 5816 8339 3544
1073 3544 -7223 -10343 55 9891 8218 -46 -8402 -8094 2436 10951 4133 -7061 -7754 -540
1087 -540 5983 7134 155 -9594 -7901 2857 8889 5249 -2481 -9688 -8193 3248 10743 3317 -7468
1102 -7468 -8494 -1859 6088 7274 -1923 -10966 -6002 4948 7964 2460 -5029 -9807 -5272 5984
1116 5984 9563 952 -7676 -8220 -2039 6332 8267 -1825 -10469 -5083 5946 8414 2302 -5876 -9038
1131 -9038 -1347 9876 8992 -1352 -6833 -5406 1141 8563 8623 -1515 -8079 -2178 6399 8946 4684
1146 4684 -3872 -7154 2184 12681 8772 -1898 -5886 -2107 5418 11681 7849 -2568 -5403 1236
1160 1236 7601 8983 5465 -2347 -5150 3910 11892 7996 -674 -4401 -1591 7104 13117 5791 -4826
1175 -4826 -5267 2773 8192 8223 3627 -3993 -4326 4359 9387 5229 -715 -4445 -2720 5498 10875 3326
1191 3326 -6826 -5844 1941 7707 7434 379 -7729 -4890 4614 7606 2870 -2202 -5207 -2787 5018
1206 5018 8067 1017 -6420 -5160 1064 6633 7485 -1102 -8980 -4575 5505 7639 2519 -3021 -6069
1221 -6069 -2152 6242 7245 -429 -5414 -3344 901 6017 6324 -1933 -8122 -3557 4763 6882 2939
1236 2939 -4164 -8514 -2026 7426 6011 -2705 -6408 -4217 272 5060 3688 -4546 -8873 -2935 3414
1251 3414 4365 925 -6560 -10204 -2969 6044 4264 -4784 -8767 -6630 -374 5427 2008 -7761 -9818
1266 -9818 -2662 2775 3024 -689 -7826 -9080 -452 6312 2988 -3936 -7400 -5534 1763 8404 3325
1281 3325 -6777 -7433 672 6769 6943 1471 -5512 -4406 5446 10176 5338 -245 -2794 -775 7516
1296 7516 13122 6132 -2688 -1786 5325 11409 11966 4234 -3210 293 10473 13563 8334 2015 -489
1311 -489 3150 12061 14095 5637 -1160 781 7101 11910 11709 3665 -3689 815 10224 12125 6310
1326 6310 -34 -3309 2160 11497 10572 723 -4400 -1203 4739 8425 6601 -1642 -7176 -1410 6745
1341 6745 7249 1932 -4889 -7387 -592 8553 5846 -3948 -7878 -3796 2424 6562 2885 -6383 -8697
1356 -8697 -1231 5107 4324 -827 -6899 -8143 -41 6854 3205 -5073 -7800 -4249 1790 6540 1554
1371 1554 -7750 -8861 -366 5271 3657 -1953 -7794 -6474 1188 6418 1248 -5271 -7223 -4598 1629
1386 1629 5977 193 -8626 -8664 -974 4134 2251 -3785 -10092 -7539 1501 4071 -2242 -7778 -8974
1401 -8974 -5890 739 3191 -3966 -10981 -9568 -2984 1052 55 -6410 -12543 -8868 -65 1689 -4096
1416 -4096 -10170 -10958 -6360 1363 1154 -7042 -11881 -7889 -2583 275 -552 -6782 -11905 -7318 993 1812
1432 1812 -3017 -8219 -9881 -3834 4539 3169 -6218 -9370 -4594 1436 3843 1353 -5172 -8083 -2081
1447 -2081 4444 4245 -243 -4819 -5987 83 7385 5420 -3045 -5951 -2369 3721 7415 3802 -5107
1462 -5107 -6094 1920 7055 4846 -100 -4241 -4211 2769 7872 3989 -2859 -4919 -1595 3374 7574 2867
1478 2867 -6044 -6575 1952 6947 3955 -1569 -6170 -4268 3800 6864 436 -5277 -4935 -2008 3014
1493 3014 6120 710 -7028 -5906 1168 4900 3707 -2135 -7467 -4415 4772 6724 -241 -6025 -4940
1508 -4940 -631 5075 5299 -1954 -6619 -3031 2435 4832 3368 -1122 -6066 -3086 5553 7042 1075
1523 1075 -3928 -4633 997 7693 6539 -2338 -6154 -334 4844 6106 3294 -1368 -4429 -208 6368
1538 6368 6022 1888 -2529 -3606 1140 7783 6277 -2543 -5392 -258 5516 7142 2791 -4422 -5390
1553 -5390 2202 7065 4594 -430 -2954 -3041 1764 6315 4261 -2523 -4586 -983 4120 7058 2818
1568 2818 -5865 -5970 2740 7680 4222 -1740 -5229 -3034 3596 6462 1819 -3242 -2985 -678 2783
1583 2783 5762 1973 -4946 -4936 2525 6861 4182 -1602 -6434 -3618 5013 7903 606 -4798 -3597
1598 -3597 455 3701 4185 -322 -4949 -2795 2094 4015 2689 -1774 -6714 -3759 5234 7138 37
1613 37 -6306 -5532 -486 5283 4813 -2980 -7080 -1836 3023 2764 438 -2762 -5335 -2464 4212 4339
1629 4339 -1243 -5586 -6051 -1162 6195 5024 -4190 -8525 -2782 2958 4059 131 -5315 -5875 165
1644 165 4585 1760 -2793 -4655 -4054 -102 5543 4004 -3995 -7669 -3171 2999 5616 1691 -5930
1659 -5930 -6459 1536 6242 1739 -3459 -4544 -2308 2786 5531 1360 -4280 -4885 -1104 2807 5767
1674 5767 2547 -5380 -6645 1374 6484 3529 -2342 -5022 -2189 5066 6463 -619 -5276 -2622 1986
1689 1986 4395 4696 846 -4709 -3603 2310 5232 3976 -208 -4640 -3101 4883 7059 352 -5111
1704 -5111 -2692 2933 6301 4546 -1975 -5683 -632 4950 4817 2543 -838 -3842 -2121 4145 6379
1719 6379 1335 -3446 -2889 1364 6233 4808 -3165 -6630 13 6107 5195 628 -3608 -4407 16 5057
1735 5057 4035 -323 -2832 -2815 -627 4637 4170 -2589 -6165 -809 4701 5229 41 -5644 -6018 1359
1751 1359 6949 3071 -2700 -4100 -2778 427 3848 2609 -2646 -4395 -1180 2102 3681 617 -5508
1766 -5508 -6242 2056 7185 2765 -4391 -6427 -3232 2892 5451 597 -4499 -3411 33 1868 2539
1781 2539 382 -4125 -4123 1927 5467 2330 -2870 -6137 -3181 5027 7718 566 -6055 -4211 1211 4263
1797 4263 3491 -754 -4245 -1636 3491 3627 896 -1324 -4085 -1443 4934 7093 513 -5462 -3865
1812 -3865 1641 6536 5798 -1346 -5730 -574 5309 4350 520 -1475 -2268 1079 5462 4491 -652 -3751
1828 -3751 -2334 1835 6819 6172 -2107 -6385 -1176 5481 6098 1643 -3200 -3240 1938 6026 2915 -2691
1844 -2691 -3018 266 2997 5381 3449 -3215 -5525 -527 4586 5379 1924 -4351 -5416 1091 6506
1859 6506 2386 -3592 -3972 -106 3381 4094 -496 -5639 -3891 974 3361 3183 -64 -5009 -5495 606
1875 606 4824 2249 -3061 -5130 -2405 2774 4331 -1318 -6615 -3293 2122 3529 1353 -2609 -5807
1890 -5807 -3374 1971 4020 1064 -2637 -4734 -3518 2621 4557 -707 -5968 -3151 1658 3884 1383
1905 1383 -3956 -6774 -1292 4373 3475 -752 -3477 -4285 -1900 2764 3900 -1003 -4134 -2887 415
1920 415 3227 2506 -3264 -5716 -615 5077 3420 -1359 -4730 -4181 478 4791 3147 -2272 -3873 -1794
1936 -1794 632 3025 2543 -2066 -4116 -512 3558 3138 -180 -3937 -4156 1822 6180 2572 -3226 -3779
1952 -3779 -1207 2078 4207 1895 -2297 -2927 176 2784 2303 709 -2878 -3152 1988 5763 2239 -3053
1968 -3053 -4112 -903 3408 5130 1255 -4066 -3137 1203 3099 2172 332 -2843 -2114 2228 4397 1231
1984 1231 -2799 -3356 -1437 3312 5298 192 -5372 -4178 1439 3847 2708 -1357 -4317 -2267 2488
1999 2488 3406 -476 -3114 -2876 -1041 2923 3697 -1437 -5637 -3566 950 3727 2495 -2783 -6305 -2560
2015 -2560 3134 2992 -994 -3566 -3415 -972 3040 2242 -2820 -4802 -2257 1713 3535 1920 -3169 -6065
2031 -6065 -1884 3664 3084 -856 -3972 -4274 -243 4081 1698 -3191 -4443 -866 1975 3015 974
2046 974 -3627 -4773 21 3865 2781 -293 -4047 -4226 1040 5332 2464 -2793 -3652 -549 2910 3767
2062 3767 994 -3916 -3301 2042 4477 2835 -719 -3520 -2626 2627 5600 2045 -2422 -2977 -227 3385
2078 3385 4635 901 -3928 -2505 3325 4806 2699 -1050 -3714 -1344 4349 5260 1308 -2462 -2644
2093 -2644 67 3783 4995 640 -3762 -1888 2888 4471 1815 -1365 -3790 -608 4858 4966 0
2108 0 -2999 -2550 518 4451 4254 -978 -4373 -1342 2498 3699 1647 -1998 -4187 -70 4198 3191
2124 3191 -1351 -3534 -3087 476 4432 3034 -2622 -4938 -1096 2135 2602 996 -3318 -4552 -347
2139 -347 3197 2052 -2106 -4173 -3120 1066 4073 1405 -4086 -4969 -777 2094 2995 330 -4316 -4427
2155 -4427 274 3350 1533 -1911 -3992 -2787 1485 4159 547 -4440 -4057 -631 2568 2931 -152
2170 -152 -4539 -3678 1187 3541 1469 -1743 -3841 -2366 2437 3828 28 -3495 -2755 -70 3145 3129
2186 3129 -650 -4934 -2575 1926 3940 1455 -1810 -3890 -1486 3188 3852 -469 -2772 -2034 531
2201 531 3390 3221 -1268 -4412 -1330 3299 3750 1414 -2083 -3948 -489 4074 3663 -759 -3025 -1932
2217 -1932 832 3984 2980 -2188 -3658 -163 3257 3241 1211 -2475 -3643 300 4430 2972 -837
2232 -837 -2766 -1890 1379 4023 2084 -2374 -3113 51 2866 2698 778 -2748 -3143 1010 4091 2227
2248 2227 -1289 -2763 -2188 1378 4038 1208 -2904 -3201 137 2462 2411 -1 -3045 -2979 1431 3209
2264 3209 1007 -2199 -3283 -2217 1537 3986 668 -3854 -3259 -481 2075 2344 -575 -3914 -2962 1576
2280 1576 3031 -127 -2266 -3369 -1624 2314 3226 -750 -3685 -3013 -197 2375 2449 -814 -3990 -2380
2296 -2380 1694 2632 409 -2190 -3294 -996 3141 3258 -1168 -3808 -2358 465 2726 2805 -1381 -4040
2312 -4040 -1789 2324 2853 1058 -1882 -3105 -901 3160 2987 -1363 -3269 -1656 1048 3459 2521 -2040
2328 -2040 -4061 -780 2927 3075 990 -2125 -3076 278 3533 2792 -875 -2614 -1511 1735 4486 2156
2344 2156 -2629 -3241 606 3506 3529 583 -2539 -2824 1209 4373 2377 -1097 -2521 -1197 1709 4101
2360 4101 1359 -2957 -2533 842 3259 3378 19 -3752 -2788 2167 4115 1754 -1544 -2910 -1519 2318
2376 2318 3561 226 -3214 -2132 816 2649 2166 -672 -3931 -2034 2995 3822 895 -2151 -3393
2391 -3393 -1089 2817 3514 -500 -3408 -1826 776 2454 1893 -1709 -3932 -1245 2866 3049 260 -2528
2407 -2528 -3855 -990 3314 3562 -1052 -3818 -2045 970 3008 1641 -2123 -3341 101 3136 2301
2422 2301 -285 -2479 -3068 24 3786 2789 -1306 -3102 -1512 1376 3444 1954 -2064 -3002 339 3365
2438 3365 2227 -394 -2470 -1977 1603 4332 1691 -1904 -2441 -817 2389 3862 2156 -2000 -2816 711
2454 711 3065 2508 522 -2165 -1838 2348 4184 1100 -2183 -1947 75 2732 4202 1174 -2623 -2138
2470 -2138 1224 2769 3128 421 -2541 -2165 2497 3471 830 -2041 -2154 -67 3091 3743 -630 -3607
2486 -3607 -1713 1493 2754 2211 -679 -3223 -2004 2100 2869 378 -1914 -2661 -521 2884 2489 -1660
2502 -1660 -4116 -1650 1254 2475 1189 -2344 -4190 -1574 1962 1976 -239 -2073 -2703 -1134 2087 1807
2518 1807 -2047 -3630 -1446 944 2468 703 -3050 -4383 -820 2682 1731 -1033 -2629 -3193 -486
2533 -486 2711 1586 -2002 -2932 -1192 781 2169 547 -3198 -3378 290 3064 1848 -684 -3333 -3118
2549 -3118 1130 3743 1090 -2114 -2558 -814 1111 2367 270 -2967 -2298 1032 2740 1570 -688
2564 -688 -3212 -2498 1994 3821 834 -2254 -2586 -487 2109 2730 -379 -2896 -1673 1772 2034 1217
2580 1217 -640 -2669 -1325 2830 3743 450 -2216 -2430 -30 3149 3836 51 -3088 -838 2046 2653
2596 2653 1673 -743 -2119 557 3568 3372 396 -1620 -1237 727 4223 3826 161 -2301 -614 2225
2612 2225 3550 2602 -794 -2246 780 3831 2555 -179 -1496 -932 1269 3881 2494 -989 -2283
2627 -2283 -621 1914 3185 2093 -2112 -3206 285 3231 1729 -820 -2590 -1970 763 2757 38
2642 38 -3088 -3056 -1059 916 1850 44 -3649 -4179 -846 1530 417 -1611 -3432 -3505 -195 1807 -1130
2659 -1130 -4227 -3817 -1446 384 879 -1710 -4508 -3548 -465 940 13 -1694 -4030 -3368 450 1901
2675 1901 -682 -3435 -3417 -1124 1359 1565 -1728 -4348 -2245 923 1695 708 -1587 -3303 -1597 1799
2691 1799 2427 -442 -1965 -1975 -619 2116 2586 -759 -3575 -1124 2076 2384 1173 -1814 -3110 -358
2707 -358 3077 2178 -498 -2054 -1885 26 2286 2124 -967 -2964 -915 1742 2542 774 -2168 -3237
2723 -3237 70 3470 2173 -1107 -2466 -1894 366 2900 1452 -2025 -2402 -295 1199 1830 668 -2335
2739 -2335 -2595 642 3080 1993 -856 -2366 -1979 1240 3937 1219 -1994 -2157 360 1884 2612 919
2755 919 -2023 -1363 1539 3143 2028 -134 -1628 -1289 2653 4223 1155 -2033 -1706 1154 2974 3374
2771 3374 395 -2079 -1239 2223 2856 1417 -323 -1659 -593 2684 3479 241 -2450 -1919 246 2428
2787 2428 2408 -615 -3443 -1635 1803 2120 443 -1949 -2999 -656 2222 1617 -1181 -2887 -1780 -237
2803 -237 1899 1809 -1883 -3790 -1596 1545 1550 205 -2368 -3559 -870 2137 1684 -1525 -2806 -1969 161
2820 161 1923 1065 -1938 -3124 -703 1321 2251 855 -1987 -3023 -126 3244 1850 -1102 -2093 -1065
2836 -1065 1255 3519 973 -1994 -2428 630 2376 2060 693 -1545 -1936 1379 3249 1955 -576 -1702
2852 -1702 -1216 1668 3818 906 -2180 -1578 1202 2887 2353 -1 -2366 -1363 1825 3030 904 -566
2868 -566 -1503 -802 1708 3123 598 -2379 -1531 438 2319 2357 -320 -3021 -1282 2005 2850 567 -1489
2885 -1489 -2310 -674 2516 2090 -601 -2302 -1366 134 1663 2330 -947 -3001 -1530 1646 2368 154
2901 154 -1951 -2820 -506 2794 1940 -1392 -2445 -1265 654 1638 1247 -1419 -3081 -814 1781 1705 206
2918 206 -2023 -2638 346 2684 1590 -1644 -2736 -1366 1103 2466 567 -2260 -2520 172 2042 1160
2934 1160 -296 -1726 -2099 332 2777 1356 -1679 -1867 -873 1505 3080 726 -2386 -2183 1077 2218
2950 2218 1729 11 -1884 -1533 1507 2984 856 -605 -1311 -431 1508 3171 903 -2210 -1542 1223
2966 1223 2516 2306 30 -2263 -788 2122 2774 807 -1016 -1210 -70 2233 2943 387 -1564 -748
2982 -748 1234 2322 2550 56 -2273 -819 2266 2543 535 -1133 -1533 88 2492 2395 -538 -1859
2998 -1859 -498 973 1958 1638 -730 -2393 -318 1975 2310 312 -1422 -2114 -43 2960 2288 -1020
3014 -1020 -1889 -883 1077 2006 1186 -1448 -2015 -83 1837 1262 5 -1433 -2111 172 2796 1617
3030 1617 -1179 -2133 -1279 687 2064 872 -2376 -2488 148 2054 881 -362 -2200 -1993 -61 2060
3046 2060 381 -1772 -2122 -1548 465 2380 715 -2678 -3085 160 1540 549 -867 -2806 -2031 968
3062 968 1988 -60 -2030 -2228 -1480 1005 1543 -534 -2658 -2116 266 1236 1226 -658 -2928 -1943 1320
3079 1320 2221 -241 -2107 -1818 -777 1636 2016 -734 -2489 -1031 960 1610 1353 -765 -2307 -1045
3095 -1045 2210 2052 301 -1566 -2016 10 2789 2224 -732 -1947 -484 1488 2413 1439 -947 -1822
3111 -1822 304 2442 2039 495 -1085 -1145 686 3521 2338 -940 -1857 -22 2026 2883 1489 -1315
3127 -1315 -1500 1119 2824 1718 -69 -986 -1217 877 3259 1704 -1194 -1705 -250 1525 2486 662
3143 662 -2142 -2341 878 2384 1091 -1173 -2033 -1108 886 2161 35 -2090 -1741 -550 861 1424
3159 1424 -325 -2914 -2245 27 1372 561 -1401 -3004 -1917 1095 1644 -832 -2988 -2403 -662 750
3175 750 760 -1578 -3643 -2110 -2 653 50 -1631 -3682 -2181 950 1240 -1225 -2854 -2510 -735 1159
3192 1159 699 -2243 -3061 -1147 743 803 -216 -1698 -2951 -1168 1477 1370 -666 -2357 -2250 -173
3208 -173 2066 1341 -1289 -2586 -638 1240 1517 498 -1533 -1953 613 2147 1234 -739 -1362 -1250 708
3225 708 2325 1430 -1162 -1805 -244 1132 2257 551 -1973 -2086 1176 2408 1025 -808 -1236 -834
3241 -834 1253 2379 716 -1358 -1585 -481 1210 1941 684 -1967 -1673 831 2089 907 -938 -1626
3257 -1626 -1009 1821 2221 18 -1967 -1103 218 1514 1652 86 -1607 -1236 881 1710 1471 25 -1463
3274 -1463 -598 1979 2873 100 -1445 -803 1235 2455 1850 -423 -1726 -165 1969 1931 1470 169 -1408
3291 -1408 -292 2108 2225 230 -1256 -799 671 2467 2192 -839 -2150 -3 1887 1635 552 -1321
3307 -1321 -1784 -31 1696 930 -998 -1231 -1317 -357 1435 811 -1872 -2639 -608 1323 1242 -88 -2620
3324 -2620 -2570 -68 1613 582 -1532 -1744 -1622 -324 1138 -157 -2145 -2113 -866 510 983 -81 -2902
3341 -2902 -2662 764 2039 558 -932 -2111 -1156 1063 1835 38 -1759 -814 556 1421 1471 591 -1365
3358 -1365 -835 1668 2573 1385 -192 -1125 -569 2674 3217 642 -1350 -73 1420 1997 1968 103 -981
3375 -981 321 2323 2113 1362 146 -750 427 2431 3170 582 -1210 -912 938 2478 1939 -456 -1701
3392 -1701 238 2018 1623 131 -644 -1307 75 2108 1503 -501 -1382 -1333 -238 1685 1305 -1462 -2285
3409 -2285 -434 967 1323 -237 -1832 -2282 391 1846 762 -1596 -1629 -789 287 1717 958 -1450
3425 -1450 -2090 -356 999 1245 593 -1835 -1931 804 2534 524 -1311 -1479 -170 1301 1804 176 -1567
3442 -1567 -943 254 1067 1513 437 -1634 -1615 522 2002 1017 -1020 -1449 -552 1285 2240 -167 -2619
3459 -2619 -1212 665 1263 933 -598 -2007 -1229 632 1250 450 -556 -1726 -914 1328 1683 -491 -2352
3476 -2352 -1339 831 1238 764 -1166 -2602 -826 1082 1030 -127 -916 -1597 -607 1210 1242 -309 -1352
3493 -1352 -819 323 1632 1133 -1455 -1887 -409 1948 1811 23 -1039 -1342 261 2275 1405 -300
3509 -300 -827 -100 481 1621 1464 -1166 -1589 377 2002 1980 660 -1359 -1519 919 2797 1180 -872
3526 -872 -1523 40 1078 1683 463 -1266 -941 780 1263 1004 392 -1601 -1467 968 2022 736 -1071
3543 -1071 -1411 -851 1324 1671 187 -1817 -1447 277 891 539 -452 -1485 -948 1039 1557 127 -1397
3560 -1397 -1580 -961 586 1325 -156 -2185 -1621 99 1121 355 -1060 -1819 -1097 1199 1085 -547 -1487
3577 -1487 -1348 -687 1079 1386 -1060 -2322 -1403 298 1231 521 -1267 -2044 -363 1270 947 -398 -1304
3594 -1304 -1420 -65 1381 1028 -940 -1755 -597 541 1443 1154 -722 -1702 -140 1647 1524 -112 -1032
3611 -1032 -938 716 2365 1014 -988 -1318 56 818 1775 1205 -890 -1249 373 1968 1742 816 -760
3628 -760 -692 1424 2945 1342 -340 -383 503 1379 2261 994 -741 -578 1361 2114 1420 586 -629 -510
3646 -510 1246 1956 1175 -371 -648 109 1539 2111 114 -1505 -873 942 1323 1178 -397 -1222 -927 1149
3664 1149 1433 55 -1215 -1199 -355 991 1492 -724 -1846 -1014 218 936 291 -1346 -2348 -974 1192
3681 1192 725 -752 -1684 -1755 -522 676 868 -1138 -2023 -1046 319 963 387 -1090 -2307 -807 860
3698 860 643 -967 -1657 -1369 -285 1262 767 -1495 -1766 -615 238 490 -25 -1744 -2199 -247 833
3715 833 375 -796 -1667 -1603 -339 1191 290 -1667 -1774 -876 450 660 -221 -1932 -1619 -175 801 499
3733 499 -1005 -1806 -1657 135 1569 59 -1804 -1398 -389 672 1264 -358 -1873 -1554 651 984 214
3750 214 -839 -1316 -960 712 1217 434 -1090 -1485 136 1042 1579 -94 -1531 -622 1146 1698 826 -125
3768 -125 -1148 -438 1416 1677 218 -796 -695 129 1730 1709 238 -1019 43 1232 2009 1044 93
3785 93 -985 194 2143 1670 312 -723 -372 513 2001 1550 -251 -1002 328 1550 1675 953 -425
3802 -425 -988 113 1844 1239 -169 -451 -866 401 1797 1045 -862 -1227 -30 1156 1046 491 -934
3819 -934 -1455 249 1578 1073 -367 -1197 -1182 358 1818 239 -1117 -1616 -252 982 1100 -137 -1667
3836 -1667 -1554 627 851 197 -753 -1482 -843 550 1424 -282 -1423 -1631 -230 534 722 -432 -1945
3853 -1945 -1411 788 1105 52 -894 -1605 -1056 953 1259 -262 -1405 -1000 -251 1232 1422 -194 -1560
3870 -1560 -530 947 1254 569 -536 -1167 45 1693 1550 8 -713 -159 663 1669 1429 -195 -1018
3887 -1018 55 1455 1654 854 -362 -1345 320 2012 1805 135 -704 -1 915 2040 1449 -124 -1023
3904 -1023 457 1608 1607 750 -511 -1612 350 1678 1040 -286 -1041 -751 358 1324 295 -928 -1535
3921 -1535 91 698 1127 181 -1264 -1546 301 1154 230 -596 -1167 -722 320 1064 -179 -1820 -1497 -165
3939 -165 305 911 -499 -1678 -1117 479 860 37 -1028 -1276 -543 655 1025 -148 -1360 -1121 10
3956 10 824 915 -213 -1690 -1164 602 1330 193 -379 -1150 -613 717 930 -523 -1402 -706 331 1100
3974 1100 492 -740 -1704 -475 811 944 8 -556 -1339 -547 976 965 -639 -1687 -970 172 652 246
3992 246 -1064 -1687 -529 770 386 -432 -1439 -1781 -516 910 321 -633 -1631 -967 35 528 246 -1343
4010 -1343 -1401 -396 599 263 -480 -1043 -1158 192 1278 735 -511 -1102 -440 339 1203 613 -636 -698 288
4029 288 996 743 473 -756 -600 943 2071 1075 -300 -331 77 1243 2140 1067 -403 -219 736 1100
4047 1100 1382 886 -755 -199 1664 1834 715 -476 -655 -118 1369 1624 73 -798 -564 387 1035 1083
4065 1083 66 -1278 -551 848 1047 -57 -522 -958 -35 1411 1027 -456 -1497 -946 25 947 446
4082 446 -911 -1267 -761 600 372 -94 -1068 -876 -345 917 834 -932 -1471 -779 294 991 715 -1045
4100 -1045 -1869 -374 828 631 -162 -737 -1062 174 946 787 -728 -930 -125 736 1351 490 -1048 -1397
4118 -1397 48 1382 1022 203 -786 -993 535 1671 442 -607 -421 261 985 1048 462 -1116 -1002 348
4136 348 1145 1111 231 -1210 -1169 631 1617 278 -589 -759 -96 799 899 -229 -1054 -268 694 1143 586
4155 586 -98 -1586 -944 776 1536 502 -863 -1135 -328 1286 1329 -634 -1204 -54 746 1083 403 -501
4173 -501 -955 -25 1067 1068 217 -658 -1166 -634 1156 1406 -61 -1107 -573 241 602 435 -1004 -1333 -235
4192 -235 1048 526 -633 -1017 -1125 -22 1528 681 -744 -1386 -820 -83 766 437 -1060 -1323 148 881
4210 881 299 -574 -1243 -1270 416 1026 64 -1382 -1660 -1077 189 960 232 -1270 -1758 -390 139 197 -456
4229 -456 -1508 -1073 519 1272 -103 -1295 -1437 -403 531 1146 -326 -1301 -1223 51 568 560 -136 -1352
4247 -1352 -1007 571 893 -288 -1153 -1351 -61 898 981 -486 -1757 -895 505 909 354 32 -823 -295
4265 -295 497 891 98 -661 -465 -82 858 1015 -510 -1441 -318 1109 1500 705 -575 -1242 103 1069
4283 1069 979 -39 8 33 265 1162 1154 114 -873 -15 1053 1884 1256 -414 -729 652 1673 1424 254
4302 254 -190 67 837 1745 1212 -56 -196 662 1083 1374 1082 -250 -835 669 1687 1553 82 -748
4320 -748 -699 714 1803 568 -321 -229 191 891 762 142 -1198 -564 761 1140 524 -412 -1060 -1021 344
4339 344 1479 162 -1227 -1337 -479 476 751 -402 -1756 -716 346 624 -265 -1003 -1443 -845 321
4356 321 924 -453 -1413 -1161 -923 429 682 -564 -1379 -907 216 304 -316 -1021 -1403 -298 1038 782
4374 782 -523 -1414 -1038 -503 691 1095 -228 -1243 -609 553 738 333 -445 -1102 1 1105 729 -703
4392 -703 -948 -662 176 931 674 -740 -874 -411 332 631 692 -527 -1270 247 1290 662 -274 -838 -690
4411 -690 678 1137 535 -854 -546 163 380 653 458 -507 -855 201 1205 491 -184 -788 -549 531
4429 531 1481 417 -949 -666 112 1023 955 -140 -1288 -823 638 758 284 -295 -481 -430 187 1212 126
4448 126 -710 -557 366 1079 853 104 -1362 -424 1013 932 259 -539 -691 6 670 1037 28 -661 -477
4467 -477 25 615 770 -564 -1213 -295 732 1071 319 -468 -978 -275 880 825 -383 -824 -593 46 647
4486 647 169 -548 -1346 -156 427 598 -95 -1060 -1503 -311 1038 521 -372 -1277 -679 -67 681 252 -826
4505 -826 -845 -228 697 144 -246 -947 -977 -40 1030 498 -425 -1095 -999 353 776 2 -1037 -1058 -99 636
4525 636 407 -264 -718 -680 265 593 398 -596 -747 -724 167 1026 280 -1182 -930 199 561 809 318 -627
4545 -627 -577 897 780 65 -253 -388 2 1071 1318 222 -693 -434 668 1027 1312 308 -836 -434
4563 -434 1144 1283 672 -498 -344 361 1401 1286 -220 -420 54 305 1443 565 -98 -521 -142 931
4581 931 914 409 -282 -737 -90 1069 910 -494 -974 -557 240 895 629 -709 -1189 187 505 580 -5
4600 -5 -756 -890 -249 630 440 -734 -1224 -687 107 814 24 -1562 -1156 -99 516 466 -466 -1118 -992 -16
4620 -16 546 -17 -784 -948 -565 204 661 51 -1141 -803 -194 724 661 -53 -601 -645 528 847 300 -369
4640 -369 -647 -165 644 1108 58 -867 -268 -117 779 470 -29 -1081 -441 818 1060 326 -435 -666 -262
4659 -262 854 827 -356 -859 -69 428 779 584 -148 -1043 -652 779 797 -120 -337 -813 -321 894 736
4678 736 -511 -940 -411 386 731 307 -647 -1015 -173 549 413 -12 -926 -651 270 1033 613 -673 -902
4697 -902 -199 194 835 542 -573 -971 120 967 898 31 -445 -558 1 860 868 -349 -475 -109 628 1221
4717 1221 369 -1122 -740 440 967 649 -98 -508 -600 586 935 559 -432 -550 -102 259 802 80 -1097
4736 -1097 -562 260 766 173 -385 -1006 -650 304 841 -394 -437 -302 -418 534 480 -385 -1290 -814 56 309
4756 309 133 -325 -1165 -745 445 919 90 -810 -755 -313 715 560 -622 -969 -247 268 703 476 -472
4775 -472 -779 -226 771 705 -311 -468 -811 188 1000 824 -329 -722 -151 976 623 509 -234 -600 -92
4794 -92 973 703 67 -334 -471 255 1090 948 -281 -890 88 674 1477 684 -629 -457 303 1084 371
4813 371 152 -494 -273 533 1074 561 -525 -382 131 592 973 504 -543 -416 450 641 386 -72 -472
4832 -472 -256 554 1060 38 -805 -459 254 288 698 -10 -756 -261 427 352 358 -248 -853 -534 304 873 -114
4853 -114 -1052 -323 -268 170 497 -631 -1088 -377 213 363 5 -885 -1226 -320 492 415 -333 -910 -823 -345 705
4874 705 374 -589 -986 -675 92 -18 54 -660 -1130 -252 392 168 -484 -862 -790 -338 599 366 -971 -998 -438
4895 -438 371 393 194 -345 -893 -19 680 13 -359 -635 -399 -140 684 109 -778 -677 52 844 865 94 -556
4916 -556 -719 503 1004 666 -117 -477 -473 539 1021 193 -432 -598 307 860 607 288 -827 -485 423 721
4936 721 423 -83 -420 -368 443 984 453 -552 -218 291 664 696 -338 -640 -483 484 1037 395 -51 -788
4956 -788 -91 1053 777 -89 -487 -699 370 610 620 -323 -927 -31 787 538 386 -33 -789 -8 602 578
4976 578 6 -64 -510 311 635 505 -117 -644 67 596 850 262 -384 -717 31 946 528 -313 -754 -339
4996 -339 226 933 370 -130 -832 -31 182 646 3 -1227 -1045 307 639 186 -457 -578 -482 -23 417 -19
5016 -19 -883 -755 -416 103 222 -367 -1041 -772 23 169 22 -789 -1084 -639 376 688 -248 -1156 -596 -13
5036 -13 126 -66 124 -989 -327 478 430 249 -279 -401 -390 674 692 1 -749 -448 72 391 619 -29 -843
5057 -843 -341 777 523 209 -175 -589 -34 823 1198 -35 -297 125 206 762 855 163 -657 43 942 625
5077 625 132 -142 -443 -13 838 409 -138 -619 -247 326 902 940 -102 -741 -345 543 479 297 -388 -454 -248
5098 -248 621 354 -187 -423 -208 386 668 244 -325 -643 207 360 320 132 -474 -700 -117 811 537 -186
5118 -186 -545 -332 444 1027 45 -669 -445 -59 806 424 -365 -809 -461 -9 1000 477 -392 -512 -358 392
5138 392 903 105 -645 -445 119 475 453 -45 -768 -326 373 454 -20 -361 -875 -466 557 526 -273 -736 -785
5159 -785 -214 563 633 -112 -848 -158 649 517 -190 -341 -836 -69 915 621 -165 -717 -244 191 483 170
5179 170 -327 -977 -119 760 638 425 -615 -353 -25 879 437 -461 -545 -147 298 985 567 -611 -617 -80
5199 -80 506 631 -56 -267 -551 447 893 665 -599 -658 -309 313 807 664 -556 -560 263 430 361 8 -333
5220 -333 -687 447 783 14 -457 -493 -114 553 876 32 -738 -657 344 724 522 -103 -714 -423 372 379 -118
5241 -118 -506 -338 -68 801 835 131 -628 -630 495 485 247 -99 -542 -335 600 530 -302 -713 -712 -48 323 622
5263 622 -322 -908 -451 17 654 27 -580 -1008 -378 662 276 39 -415 -612 -201 275 125 -635 -628 -223
5283 -223 65 491 352 -804 -680 -82 346 442 -91 -512 -981 1 829 409 -572 -495 -303 166 676 82
5303 82 -475 -621 314 817 500 98 -588 -558 431 606 643 -405 -541 -78 285 825 89 -360 -302 774 753
5324 753 385 -34 -299 95 474 920 26 -127 -144 -17 459 754 248 -651 -243 209 717 315 -220 -385
5344 -385 -223 620 802 62 -536 -323 190 721 727 -46 -608 -152 202 565 57 -303 -895 -463 529 243 -53
5365 -53 -289 -426 -83 946 648 -404 -728 -48 413 223 626 -354 -731 -57 232 258 36 -405 -722 -117
5385 -117 628 499 -415 -771 -221 64 582 248 -477 -862 -386 492 -37 -78 -687 -568 138 538 383 -313
5405 -313 -591 -148 248 574 190 -847 -587 260 675 301 -266 -644 -329 268 672 246 -333 -472 -191 251
5425 251 485 105 -1140 -515 355 614 294 -233 -645 -398 214 716 20 -496 -413 132 363 546 106 -532
5445 -532 -177 320 562 255 -335 -335 -259 665 538 181 -374 -137 71 599 395 -90 -383 -116 563 415 98
5466 98 -243 -469 -94 666 473 79 -290 -433 136 665 678 -36 -639 -181 594 271 45 -359 -172 472 839
5487 839 476 -140 -422 -219 64 878 472 -352 -452 147 307 470 -185 -697 -576 272 660 290 -130 -567
5507 -567 -431 205 673 45 -327 -729 -224 145 515 187 -623 -723 284 527 102 -235 -499 -685 199 465
5527 465 -212 -457 -464 -81 331 519 -293 -686 -505 256 606 46 -374 -495 -413 300 601 -179 -563 -349 21
5548 21 401 809 -151 -762 -287 81 272 165 -534 -841 -502 510 329 -227 -986 -314 127 558 301 -308
5568 -308 -677 316 242 345 46 -656 -394 -13 749 492 -369 -573 -132 332 288 470 -189 -483 -33 505 291
5589 291 324 31 -467 305 670 794 -243 -534 -123 11 850 405 -195 -321 77 235 339 157 -462 -641
5609 -641 180 829 157 -466 -341 -466 306 725 371 -393 -534 -77 373 647 70 -267 -351 403 123 -29
5629 -29 -610 -645 -316 286 508 -26 -698 -487 27 141 416 -160 -628 -474 485 544 43 -311 -548 -102 320
5650 320 515 -139 -661 -410 71 252 502 -180 -747 -563 535 532 -48 -169 -526 -104 655 108 -479 -569 -25
5671 -25 -50 473 603 -369 -847 -179 523 329 85 -236 -220 119 626 560 -204 -367 -394 275 494 504 -432 -676
5693 -676 -68 331 387 -49 -423 -1030 91 692 333 -358 -407 -77 296 720 -18 -479 -328 47 393 463 51
5714 51 -228 -177 255 810 356 -178 -312 -137 452 603 -88 -419 -41 270 650 420 251 -519 -144 517 516
5735 516 206 -245 -346 38 494 717 -58 -409 -195 378 543 398 -8 -558 -256 376 92 -65 -316 -620
5755 -620 -370 218 543 -310 -973 -294 -34 280 81 -550 -681 -83 596 428 74 -553 -663 244 196 -168
5775 -168 -643 -357 83 15 7 277 -368 -651 118 284 373 -309 -291 -542 281 366 231 -417 -328 -388 333 627 -119
5798 -119 -325 -559 -203 35 -37 -265 -580 -404 207 852 230 -428 -407 -429 316 562 -34 -599 -289 166 118
5819 118 241 -128 -361 -299 335 802 275 -217 -647 -248 464 365 -188 -724 -162 446 318 255 -131 -262 -427
5840 -427 399 522 -23 -71 -404 -33 666 596 219 -474 -21 112 623 761 -13 -311 -127 388 114 213 -94
5861 -94 -403 -1 406 618 -485 -269 -31 -28 652 359 -272 -419 -353 573 465 25 -181 -215 194 515 93
5882 93 -569 -588 223 -40 283 43 -321 -718 106 317 197 -269 -385 -308 199 743 -108 -319 -578 -123 41
5903 41 220 216 -584 -432 228 272 263 -23 -753 -541 78 591 -103 -620 -582 -73 256 394 43 -577 -579 585 389
5926 389 188 -408 -716 -419 118 596 14 -510 -468 -58 190 458 35 -846 -313 262 321 218 -431 -287 -332
5947 -332 128 -36 16 -532 -278 -152 256 628 -24 -651 -81 94 96 408 -424 -285 -198 549 804 23 -400
5968 -400 -230 45 423 394 -242 -311 215 373 523 272 -274 -727 -3 763 401 29 -760 -341 224 784 338
5989 338 -385 -277 182 105 406 237 -178 -341 39 613 69 1 -434 -311 508 737 196 -536 -683 -88 290
6010 290 558 183 -509 -88 29 319 134 -236 -351 0 511 362 134 -522 -533 -123 315 395 -31 -632 -113
6031 -113 353 562 -543 -149 -601 -185 778 563 -557 -381 -372 44 246 235 -373 -662 -34 129 155 68 -352
6052 -352 -231 -181 165 266 -85 -566 -379 -109 158 313 -226 -546 -167 175 117 148 -176 -414 -242 472 569
6073 569 -69 -435 -229 55 528 -229 -460 -316 -135 338 340 145 -141 -299 313 535 330 -26 -305 -562 -12
6094 -12 632 331 -270 -507 134 295 399 191 -292 -267 295 429 -64 166 -205 -84 285 647 412 -508 -288
6115 -288 418 500 482 128 -234 -312 261 834 80 173 -271 -225 524 267 -88 -330 -45 54 175 339 -309 -508
6137 -508 -534 350 209 -64 -392 -456 -404 284 229 -112 -603 -471 -191 234 283 -137 -233 -228 332 479 -118 -358 -340
6160 -340 -27 252 122 -70 -593 -160 -47 305 387 -252 -264 -213 168 504 158 -291 -327 -410 381 375 42 -107
6182 -107 -144 -49 305 438 -416 -476 -177 318 99 -55 -308 -740 114 463 221 -270 -157 -355 60 574 12
6203 12 -364 -497 106 289 523 143 -98 -250 242 602 302 191 -169 -84 232 437 306 -294 -379 261 622
6224 622 430 384 -414 -498 316 552 120 -30 3 0 279 635 99 -137 212 -8 197 374 105 -534 -136 318
6246 318 531 158 -329 -404 -165 654 603 -195 -451 -42 156 246 566 -108 -274 49 317 48 -144 233 -594
6267 -594 -375 676 312 -11 -552 -235 118 439 225 -74 -717 -283 167 -3 -113 -292 -240 -89 348 -129
6287 -129 -419 -579 -559 51 286 -161 -135 -472 -282 -14 39 127 -519 -379 -49 138 -110 -154 -424 -22 270 598
6309 598 -176 -239 -459 174 85 240 11 -296 -445 300 205 -140 -542 -321 -211 110 433 33 -481 -112 -23
6330 -23 91 112 -190 -384 -315 523 344 -189 -492 -85 -208 318 183 -200 -264 -304 383 503 406 103 -458 -5
6352 -5 305 685 -27 -78 -300 80 531 357 32 -77 73 -3 303 331 -4 -266 59 807 443 210 -309 -56
6374 -56 -18 597 547 31 -12 252 518 366 422 -11 -136 183 513 415 36 -195 18 71 733 124 -99 -8 3
6397 3 77 226 248 -215 -359 184 381 289 335 -556 -137 95 415 -81 -18 -223 -136 196 178 102 -445 -316 -142
6420 -142 215 21 109 -348 -449 58 156 149 -185 -294 -225 118 313 -327 -394 -117 110 263 51 -346 -271 -219 283
6443 283 256 70 -188 -355 -284 143 514 -473 -337 -566 46 125 -72 -78 -367 -430 206 280 -263 -194 -215 -15 24
6466 24 -49 -17 -462 -67 22 113 366 -345 -194 -194 167 372 -25 -490 -255 128 412 10 -389 -378 -182 422 26
6489 26 67 -375 -656 111 160 122 -327 -632 -370 436 288 34 -309 -314 16 -50 203 -33 -476 -261 335 350 15
6512 15 -154 -329 -14 338 386 25 60 -87 34 290 435 102 -285 -441 174 65 332 1 -277 -479 462
6533 462 416 -21 39 -344 -424 450 333 -60 -329 -326 17 -24 197 90 -476 -22 464 378 136 -164 -34 -49 376
6556 376 74 -156 -573 47 -44 -15 -89 -399 -446 -205 435 -13 -184 -140 -114 217 150 215 -57 -454 -28 92 180
6579 180 -45 -314 -404 111 448 278 -208 -521 -494 202 364 242 -301 -148 104 548 648 -51 -304 -248 110
6600 110 338 -141 103 -223 -148 38 455 200 -110 78 378 329 456 146 -287 -35 192 326 347 -8 -460
6621 -460 94 278 372 76 -209 -299 -10 307 144 227 -406 -293 286 280 53 -56 -76 -4 162 532 -127 -284
6643 -284 -245 86 290 404 126 -289 -49 20 69 119 -86 -458 -385 54 378 -131 7 100 105 510 299 -554 -175
6666 -175 -153 152 103 123 -29 -225 -85 35 88 159 -85 -427 143 344 9 -111 -537 -210 84 171 114 -278
6688 -278 -497 -65 480 55 -165 -184 -243 87 336 -151 -412 -532 106 202 -190 -17 -372 -185 8 93 121 -159
6710 -159 -151 -75 366 420 -203 -442 -194 -19 660 455 91 -388 -201 225 310 175 141 -400 -154 218 453 -374
6732 -374 -332 -186 -4 424 419 105 -337 143 582 293 273 -13 -99 35 49 183 -23 -413 -241 16 206 148
6754 148 -81 -414 -182 284 122 5 -444 -436 -63 578 291 -71 -296 -63 -202 479 179 -75 -226 91 391
6775 391 24 101 -246 -176 252 279 44 -313 -203 208 -152 334 19 -234 -335 -394 -48 305 -140 -392 -348 121
6797 121 395 276 -151 62 -4 484 410 357 -530 -552 294 144 396 77 -52 -338 134 276 -70 -55 -166 -226
6819 -226 128 628 135 -197 -55 70 238 160 -144 -115 -11 146 508 -57 -376 -511 -17 69 311 -10 -756
6840 -756 -126 79 116 542 -119 -251 -163 592 421 141 -215 -132 54 209 205 37 -119 215 481 134 343 -2
6862 -2 -101 211 291 408 336 -141 25 191 242 162 114 -95 272 364 507 -78 -32 -191 100 443 525 178 -263 12
6886 12 106 519 385 217 170 -43 348 270 205 79 111 322 157 223 130 -171 4 529 387 29 -68 103 107 631
6910 631 563 319 45 -344 66 239 293 104 -213 -345 170 171 -182 -374 -418 102 315 189 52 -250 -343 -323
6932 -323 -195 260 -143 -678 -367 117 19 -259 -517 -610 25 -5 233 -432 -837 -73 -57 -75 79 -99 -462 -228
6954 -228 143 224 -384 -358 -573 -288 64 -67 -274 -474 -124 112 66 83 -434 -305 -382 -204 47 -3 -260 -274
6976 -274 -235 80 310 -428 -91 238 -164 -132 60 -493 -347 -191 19 -201 -104 -493 -422 103 275 -240 -148 -550
6998 -550 -96 313 -53 126 -446 -343 194 115 240 126 -180 -365 174 177 267 -224 -131 -76 25 266 -128 -512
7020 -512 -380 147 177 228 -16 -503 -214 -5 190 380 -295 -15 -103 40 472 -34 -570 -179 224 239 374
7041 374 -212 79 -138 425 513 -171 74 -270 -65 736 433 -331 -284 -202 23 65 365 27 -362 159 392
7062 392 89 -144 -70 -203 218 280 41 -260 -302 -289 153 257 -4 2 -504 53 101 231 62 -95 -277 -65
7084 -65 98 290 110 -235 -191 -223 293 202 -398 -349 -107 321 158 -66 -568 -381 289 420 35 -212 -275 -217
7106 -217 162 109 -236 -290 -60 49 110 -271 -217 -283 170 253 189 -264 -51 31 42 64 431 234 88 -119 90
7129 90 501 366 0 -314 -163 133 477 52 -124 162 -35 354 71 -213 -355 -185 75 465 58 -125
7149 -125 -365 -97 255 -48 1 -343 -182 21 134 198 -121 -346 189 262 -27 -66 -264 -47 -317 -110 432
7170 432 -110 -73 -229 -269 36 -129 -280 -390 -101 -236 251 88 71 -330 -69 196 0 -246 -426 -266 180
7191 180 99 121 -266 -306 39 111 241 140 -319 -280 -188 127 -116 -111 -498 -332 3 -5 -11 -414 -278 -147 299 -111
7215 -111 -266 -515 -299 -73 467 49 -60 -234 -65 74 -24 -22 -444 -58 74 -75 53 -93 -324 192 -139
7236 -139 84 13 -175 -20 -157 339 36 59 -455 -113 -18 -1 329 -73 -387 -90 104 256 124 -67 -57 89
7258 89 -55 -94 92 -23 -195 4 379 313 -290 40 224 8 204 71 -447 -213 176 442 104 -162 221
7279 221 -562 401 710 325 -114 -11 -158 -6 256 371 -125 -136 62 255 -59 14 -169 -12 103 469 -84
7300 -84 -448 -346 -18 -35 227 44 -240 104 -41 117 169 58 -126 -2 67 253 -50 -135 -3 145 93 180
7322 180 -265 -366 -184 273 244 151 -264 -206 -61 370 250 -107 -291 32 162 200 124 -97 -131 -68 161 456
7344 456 -172 -377 -567 143 620 311 -15 -88 -91 330 -52 233 -41 -275 47 -109 -144 166 -355 -344 -77 338
7366 338 561 -229 -211 -91 127 25 16 -192 2 -26 143 296 30 39 -204 295 279 73 76 -50 185 -244 438
7389 438 122 -193 -47 -94 256 120 38 42 89 303 295 364 -68 -30 -86 169 212 87 -88 -46 -404 257 103 44
7413 44 -49 183 451 -41 18 -307 -79 -247 36 266 -123 -264 -134 318 300 177 -182 -264 -179 447 487 -13
7435 -13 -334 -52 -343 415 406 -44 -323 -11 -186 253 247 -133 -210 -117 144 -201 -21 -179 -262 -354 384 14 -143
7458 -143 -505 -410 -108 486 -77 -354 -424 -512 102 196 -53 -223 40 52 46 -249 -62 -481 -101 -125 110 -196 -353
7481 -353 -140 -76 163 -93 276 -82 -312 -157 367 -77 -576 -357 -269 -45 326 205 -138 -71 -75 1 30 221
7503 221 -493 -226 513 309 271 -663 -275 -118 -144 503 112 -211 -342 -39 62 -75 14 -150 -48 -113 202
7524 202 -63 -20 14 -78 247 72 33 46 140 275 375 48 41 -293 -62 264 156 240 -157 -78 78 53 -81 -115
7548 -115 34 180 545 91 71 90 -122 -21 187 43 -28 -28 205 -69 131 74 -135 -121 -41 561 355 73 -155
7571 -155 -374 248 308 157 37 43 -95 159 379 -99 -280 14 203 137 128 -212 -107 -187 134 -10 -40 -53 -320
7594 -320 -603 -103 201 2 4 -4 -191 73 -4 -126 -315 76 84 77 -260 -49 -144 -189 -57 296 -251 -342 -593 -345
7618 -345 93 45 18 -315 -85 226 209 -169 60 -160 -256 -118 205 7 -200 -121 236 109 -51 285 -120 -231
7640 -231 118 -90 125 10 -114 254 235 417 -58 172 -115 -38 -79 186 463 67 76 6 182 -39 65 -264
7662 -264 -126 448 -46 124 31 -180 -163 431 123 -322 32 118 205 370 37 -72 -231 112 74 0 13 -214
7684 -214 -104 135 253 79 -172 -366 -196 347 265 243 -132 -359 233 261 -16 -140 -73 68 83 168 108 -347
7706 -347 -13 -104 221 240 -21 -170 -48 -180 -130 59 92 -296 33 107 207 9 25 -54 -144 128 71 -128 82
7729 82 3 26 53 178 -406 11 -37 -10 -6 -56 -50 67 83 101 -42 -135 -93 -7 -26 -93 198 -276 -173 129 80 194
7755 194 167 -77 -27 -146 3 205 -411 -231 -189 293 450 35 -137 -321 -41 277 347 -196 -102 128 51 -78
7777 -78 -104 -286 -173 60 90 27 -51 141 -226 21 335 120 332 45 25 317 317 133 -163 -125 -193 103 350
7800 350 -21 86 17 212 329 257 152 -154 -3 -4 120 -103 7 -77 117 547 105 89 -112 -50 36 64 34
7823 34 191 -141 -119 127 536 -322 52 -20 -66 101 48 -308 -513 -162 130 -199 100 -320 -146 -153 -226 -9 53
7846 53 100 -196 246 128 180 -144 -147 -14 220 -271 -140 -478 -398 -36 302 -38 -319 -92 -11 -172 294 459
7868 459 -83 -461 91 -24 113 287 -53 -294 155 -99 25 81 348 79 46 -76 -221 -471 -252 -39 121
7889 121 229 -168 -144 -279 116 -68 -14 70 -77 -20 -110 28 98 58 -176 182 363 -22 -115 -266 -174 324 -51
7912 -51 105 252 -64 -393 251 167 -43 -107 -57 -20 28 211 -152 -385 -99 54 -42 202 -282 -223 -33 225 179
7935 179 -141 106 16 -56 24 293 -120 -115 -70 231 91 -99 -186 -120 111 349 235 -240 -11 116 -57 -238 292
7958 292 176 -46 -8 304 283 -25 -235 -40 380 254 -40 -238 102 8 -26 309 519 -182 -75 -65 -41 -20
7980 -20 -14 235 -148 -93 485 -50 3 -343 -180 181 74 17 -240 -164 0 64 177 180 -460 -282 -56 206 -3
8003 -3 -8 -307 -199 4 69 -13 -275 -38 -3 43 117 -34 -284 130 326 65 69 -154 -280 126 21 91 273 -252
8027 -252 -334 162 42 55 -245 -209 174 -21 198 -1 -261 -70 -48 117 92 119 -97 -116 234 280 -19 -38 -126
8050 -126 85 -84 -116 -58 -196 -142 47 154 6 -30 -3 -66 73 273 118 52 -8 -139 487 106 109 -99 207
8073 207 168 205 100 25 -156 -82 172 301 -63 -270 -366 86 338 298 -22 -312 -77 305 117 -84 47 -168
8095 -168 220 -131 -26 -103 -264 -80 -259 -125 156 -265 204 -278 433 -80 -207 -11 214 174 27 -93 -126
8116 -126 -211 -189 -22 -64 254 -101 -203 -64 167 -103 123 -32 166 -255 12 -96 -421 -410 -82 -280 76
8137 76 -69 -70 -6 -70 12 131 148 -215 -406 2 194 6 -74 -540 82 22 -16 -162 -221 -326 -22 439 48 167
8161 167 -206 -84 287 113 133 135 135 35 -38 128 3 128 61 139 165 289 -54 158 57 171 -45 71 42
8184 42 -229 224 114 105 -31 -415 -54
8191e4
##END NTUPLES=NMR FID
##END=
