##TITLE=1H_EC-3191
 DMSO, 8 sc, 
 9.4.2019
##JCAMPDX= 6.0         $$ Bruker NMR JCAMP-DX V2.0
##DATA TYPE= NMR FID
##DATA CLASS= NTUPLES
##ORIGIN= UXNMR, Bruker Analytische Messtechnik GmbH
##OWNER= root
$$ XWIN-NMR		Version 3.5
$$ Tue Apr  9 14:12:13 2019 Russian Standard Time (UT+4h)  she@DPX200
##.OBSERVE FREQUENCY= 200.1315
##.OBSERVE NUCLEUS= ^1H
##.DELAY= (6, 6)
##.ACQUISITION MODE= SIMULTANEOUS
##.ACQUISITION SCHEME= undefined
##.AVERAGES= 8
##.DIGITISER RES= 18
##SPECTROMETER/DATA SYSTEM= spect
##.PULSE SEQUENCE= zg30
##.SOLVENT NAME= DMSO
##.SHIFT REFERENCE= (INTERNAL, DMSO, 0, 15.7039)
##AUDIT TRAIL= $$ (NUMBER, WHEN, WHO, WHERE, WHAT)
$$ ##TITLE= Audit trail, XWIN-NMR		Version 3.5
$$ ##JCAMPDX= 5.01
$$ ##ORIGIN= Bruker BioSpin GmbH
$$ ##OWNER= she
$$ F:/spectra/data/she/nmr/H-F/1/audita.txt
$$ ##AUDIT TRAIL=  $$ (NUMBER, WHEN, WHO, WHERE, WHAT)
(   1,<2019-04-09 14:10:56.73 +0400>,<she>,<DPX200>,
      <created by zg, POWCHK disabled, PULCHK disabled
       configuration hash MD5:
       00 E9 B6 7A A2 85 ED C7 34 08 36 98 17 FE 4E 26
       data hash MD5: 16K
       1E CF 70 11 84 60 6C C4 D2 01 CA FD 3B 7D AB AE>)
$$ ##END=
$$ 
$$ hash MD5
$$ 8D 13 4C 97 60 A9 DB 09 36 43 DB 98 12 62 CC 55
##$RELAX= 
##$RELAX= 
##$RELAX= 
##$RELAX= 
##$RELAX= 
##$RELAX= 
$$ Bruker specific parameters
$$ --------------------------
##$DU= <F:/spectra>
##$EXPNO= 1
##$NAME= <H-F>
##$PROCNO= 1
##$TYPE= <nmr>
##$USER= <she>
##$AMP= (0..31)
100 100 100 100 100 100 100 100 100 100 100 100 100 100 100 100 100 100 
100 100 100 100 100 100 100 100 100 100 100 100 100 100 
##$AQSEQ= 0
##$AQ_mod= 1
##$AUNM= <au_zg>
##$AUTOPOS= <>
##$BF1= 200.13
##$BF2= 200.13
##$BF3= 200.13
##$BF4= 200.13
##$BF5= 200.13
##$BF6= 200.13
##$BF7= 200.13
##$BF8= 200.13
##$BYTORDA= 1
##$CFDGTYP= 0
##$CFRGTYP= 5
##$CHEMSTR= <none>
##$CNST= (0..31)
1 1 145 1 1 1 1 1 1 1 1 1 1 1 1 1 1 1 1 1 1 1 1 1 1 1 1 1 1 1 1 1 
##$CPDPRG= <>
##$CPDPRG1= <>
##$CPDPRG2= <>
##$CPDPRG3= <>
##$CPDPRG4= <mlev>
##$CPDPRG5= <mlev>
##$CPDPRG6= <mlev>
##$CPDPRG7= <mlev>
##$CPDPRG8= <mlev>
##$CPDPRGB= <>
##$CPDPRGT= <>
##$D= (0..31)
0 1.2 0 0 0 0 0 0 0 0 0 0.03 0 0 0 0 0 0 0 0 0 0 0 0 0 0 0 0 0 0 0 0 
##$DATE= 1554804655
##$DBL= (0..7)
120 120 120 120 120 120 120 120 
##$DBP= (0..7)
150 150 150 150 150 150 150 150 
##$DBP07= 0
##$DBPNAM0= <>
##$DBPNAM1= <>
##$DBPNAM2= <>
##$DBPNAM3= <>
##$DBPNAM4= <>
##$DBPNAM5= <>
##$DBPNAM6= <>
##$DBPNAM7= <>
##$DBPOAL= (0..7)
0.5 0.5 0.5 0.5 0.5 0.5 0.5 0.5 
##$DBPOFFS= (0..7)
0 0 0 0 0 0 0 0 
##$DE= 6
##$DECBNUC= <off>
##$DECIM= 24
##$DECNUC= <off>
##$DECSTAT= 4
##$DIGMOD= 1
##$DIGTYP= 9
##$DL= (0..7)
0 120 120 120 120 120 120 120 
##$DP= (0..7)
150 150 150 150 150 150 150 150 
##$DP07= 0
##$DPNAME0= <>
##$DPNAME1= <>
##$DPNAME2= <>
##$DPNAME3= <>
##$DPNAME4= <>
##$DPNAME5= <>
##$DPNAME6= <>
##$DPNAME7= <>
##$DPOAL= (0..7)
0.5 0.5 0.5 0.5 0.5 0.5 0.5 0.5 
##$DPOFFS= (0..7)
0 0 0 0 0 0 0 0 
##$DQDMODE= 0
##$DR= 18
##$DS= 0
##$DSLIST= <SSSSSSSSSSSSSSS>
##$DSPFIRM= 0
$$ [...]
##$SUBNAM2= <"">
##$SUBNAM3= <"">
##$SUBNAM4= <"">
##$SUBNAM5= <"">
##$SUBNAM6= <"">
##$SUBNAM7= <"">
##$SUBNAM8= <"">
##$SUBNAM9= <"">
##$SW= 24.9337058887773
##$SWIBOX= (0..15)
0 0 2 0 0 0 0 0 0 0 0 0 0 0 0 0 
##$SW_h= 4990.01996007984
##$TD= 16384
##$TD0= 1
##$TE= 0
##$TE2= 300
##$TE3= 300
##$TEG= 300
##$TL= (0..7)
0 120 120 120 120 120 120 120 
##$TP= (0..7)
150 150 150 150 150 150 150 150 
##$TP07= 0
##$TPNAME0= <>
##$TPNAME1= <>
##$TPNAME2= <>
##$TPNAME3= <>
##$TPNAME4= <>
##$TPNAME5= <>
##$TPNAME6= <>
##$TPNAME7= <>
##$TPOAL= (0..7)
0.5 0.5 0.5 0.5 0.5 0.5 0.5 0.5 
##$TPOFFS= (0..7)
0 0 0 0 0 0 0 0 
##$TUNHIN= 0
##$TUNHOUT= 0
##$TUNXOUT= 0
##$USERA1= <user>
##$USERA2= <user>
##$USERA3= <user>
##$USERA4= <user>
##$USERA5= <user>
##$V9= 5
##$VALIST= <valist>
##$VCLIST= <CCCCCCCCCCCCCCC>
##$VD= 0
##$VDLIST= <DDDDDDDDDDDDDDD>
##$VPLIST= <PPPPPPPPPPPPPPP>
##$VTLIST= <TTTTTTTTTTTTTTT>
##$WBST= 1024
##$WBSW= 4
##$XGAIN= (0..3)
0 0 0 0 
##$XL= 0
##$YL= 0
##$YMAX_a= 419376
##$YMIN_a= -591692
##$ZGOPTNS= <>
##$ZL1= 120
##$ZL2= 120
##$ZL3= 120
##$ZL4= 120
##$ABSF1= 10
##$ABSF2= 0
##$ABSG= 5
##$ABSL= 3
##$ALPHA= 0
##$AQORDER= 0
##$ASSFAC= 0
##$ASSFACI= 0
##$ASSFACX= 0
##$ASSWID= 0
##$AUNMP= <proc_1d>
##$AZFE= 0.1
##$AZFW= 0.1
##$BCFW= 1
##$BC_mod= 2
##$BYTORDP= 1
##$COROFFS= 0
##$CY= 11.3945322036743
##$DATMOD= 1
##$DC= 2
##$DFILT= <>
##$DTYPP= 0
##$F1P= 18.9103706918063
##$F2P= -1.10871071338519
##$FCOR= 0.5
##$FTSIZE= 0
##$FT_mod= 4
##$GAMMA= 1
##$GB= 0.15
##$INTBC= 1
##$INTSCL= 1
##$ISEN= 128
##$LB= 0.24
##$LEV0= 0
##$LPBIN= 0
##$MAXI= 10000
##$MC2= 0
##$MEAN= 0
##$ME_mod= 0
##$MI= 1.114404
##$NCOEF= 0
##$NC_proc= 0
##$NLEV= 6
##$NOISF1= 3.799351
##$NOISF2= 2.8
##$NSP= 1
##$NTH_PI= 0
##$NZP= 0
##$OFFSET= 15.70392
##$PC= 1
##$PHC0= -8859.975
##$PHC1= 19.80026
##$PH_mod= 1
##$PKNL= yes
##$PPARMOD= 0
##$PSCAL= 0
##$PSIGN= 0
##$REVERSE= no
##$SF= 200.130013532006
##$SI= 16384
##$SIGF1= 3
##$SIGF2= 2
##$SINO= 400
##$SIOLD= 16384
##$SREGLST= <1H.CDCl3>
##$SSB= 0
##$STSI= 0
##$STSR= 0
##$SW_p= 3612.71676300578
##$SYMM= 0
##$S_DEV= 0
##$TDeff= 0
##$TDoff= 0
##$TI= <>
##$TILT= no
##$TM1= 0
##$TM2= 0
##$TOPLEV= 0
##$USERP1= <user>
##$USERP2= <user>
##$USERP3= <user>
##$USERP4= <user>
##$USERP5= <user>
##$WDW= 1
##$XDIM= 8192
##$YMAX_p= 0
##$YMIN_p= 0
$$ End of Bruker specific parameters
$$ ---------------------------------
##NTUPLES= NMR FID
##VAR_NAME=  TIME,          FID/REAL,        FID/IMAG
##SYMBOL=    X,             R,               I
##VAR_TYPE=  INDEPENDENT,   DEPENDENT,       DEPENDENT
##VAR_FORM=  AFFN,          ASDF,            ASDF
##VAR_DIM=   8192,          8192,            8192
##UNITS=     SECONDS,       ARBITRARY UNITS, ARBITRARY UNITS
##FACTOR=    0.0002004,     1,               1
##FIRST=     0,             0,               0
##LAST=      1.6414764,     0,               0
##MIN=       0,             -591692,         0
##MAX=       1.6414764,     419376,          0
$$ Real data points
##PAGE= N=1
##DATA TABLE= (X++(R..R)), XYDATA
0 0 0 0 0 0 8 -8 8 -16 16 -16 24 -32 40 -48 56 -72 88 -103 120 -144 167 -192 227 -262 296 -344 392 -444
28 -444 506 -572 645 -725 810 -907 1015 -1127 1253 -1397 1549 -1715 1898 -2104 2329 -2576
44 -2576 2860 -3168 3518 -3921 4377 -4911 5538 -6289 7211 -8369 9871 -11926 14902 -19626
58 -19626 28322 -49636 210596 105923 -484628 -369340 13848 265101 146395 36357 -9148
69 -9148 -42630 -122300 -45131 92765 73785 -129786 -135330 148196 340102 71479 -348323
80 -348323 -386457 7915 332916 289354 45506 -124081 -211562 -224732 -59043 248916 342144
91 342144 40700 -301676 -228996 124919 229868 -44841 -245606 -51086 252981 233462
101 233462 -57822 -241863 -179023 -35950 89372 217367 242051 7238 -323268 -343293
111 -343293 25533 342781 235121 -90778 -191151 -29743 69344 -17291 -78139 5664 78401
122 78401 38827 15119 68024 24033 -183499 -269351 7449 372259 333743 -101256 -397376
133 -397376 -230559 116577 227554 99028 -14325 -36061 -62953 -85268 -11768 82745 33662
144 33662 -90359 -44670 157281 190057 -78294 -315427 -183233 162959 302605 127168
154 127168 -95967 -162414 -131087 -73190 57386 210107 175941 -78505 -247353 -95869 157995
165 157995 147473 -91653 -179301 27210 224239 129725 -123247 -223431 -107295 58334
175 58334 161234 185383 79846 -150067 -293850 -135935 191207 301385 67154 -195231
185 -195231 -168368 39548 113867 4638 -74008 -21452 44515 45532 39899 37588 -50108 -181210
197 -181210 -140278 127882 323993 156405 -212355 -341210 -95951 200780 233244 55074
207 55074 -94634 -118759 -69366 12826 92123 80687 -45279 -126171 -10673 170249 136757
218 136757 -115146 -259967 -89027 189089 244941 55133 -136986 -171856 -94919 16417
228 16417 135356 180412 51987 -161776 -206197 -4932 186425 119475 -93423 -148480 14520
239 14520 152576 83206 -85166 -148145 -68164 54752 140200 139086 11733 -175159 -221225
250 -221225 -24755 218740 220566 -19071 -201007 -128042 57041 111086 21918 -45860 -25700
261 -25700 9702 19488 30261 24557 -46093 -118637 -54422 127456 203554 37388 -194393 -210762
273 -210762 -335 180623 153062 792 -104132 -103398 -35310 49668 94452 41607 -68999
284 -68999 -96295 20818 131266 59787 -122390 -166924 2453 175209 144508 -31220 -145505
295 -145505 -111652 -7341 75959 110872 73544 -41295 -138591 -91818 65729 140137 33955
306 33955 -105712 -90282 48663 116462 28909 -92595 -106984 -16601 83276 117558 60271
317 60271 -67297 -164385 -106747 82564 200521 98196 -112584 -180920 -40930 117445 109578
328 109578 -15232 -86303 -45251 29195 61553 41246 -18313 -84563 -83014 24979 143945
339 143945 119304 -56178 -188338 -115993 81101 178363 87256 -69106 -134347 -74356 36516
350 36516 105804 76881 -31660 -114548 -67214 74380 137224 23134 -137010 -135634 34887
361 34887 168126 110171 -58417 -151417 -93280 35998 119566 102862 2328 -107308 -123045
372 -123045 -11219 118493 115413 -20957 -125251 -74433 60234 112471 29975 -79675 -98262
383 -98262 -17819 79170 108026 37039 -85214 -142099 -52928 109615 164955 38545 -130020
394 -130020 -148190 -4567 124865 102079 -21649 -97148 -61096 26087 75982 50586 -27115
405 -27115 -88003 -60576 43514 117313 64024 -70845 -136714 -53550 86955 129209 39477
416 39477 -77048 -107627 -39170 57902 97692 43427 -56726 -99932 -31187 80901 101274
427 101274 -4694 -112854 -85445 46496 124583 60149 -66368 -116056 -47870 59505 103352
438 103352 51518 -45921 -100194 -59073 44044 103098 49395 -58811 -96401 -22353 72833
449 72833 79524 -2592 -77723 -66490 12952 80381 70511 -10920 -91099 -86441 13280 111099 93924
462 93924 -29629 -123507 -80918 48607 117596 54286 -60721 -99646 -30256 62462 84849
473 84849 19816 -66644 -86109 -13955 80931 94761 4189 -97791 -97522 8653 106830 90698
485 90698 -17558 -101318 -80131 16093 92244 75871 -16039 -93084 -74265 25395 101748 67009
497 67009 -48538 -114330 -50751 72938 115485 30257 -86680 -109725 -19088 88684 104528
508 104528 16155 -86532 -101513 -13895 88239 98842 4190 -93195 -87268 12282 93915 71220
520 71220 -26078 -92276 -60201 33405 92347 57099 -37582 -99067 -60815 44789 109693 59195
532 59195 -57747 -114938 -49001 68144 109836 33357 -75012 -97963 -17215 76701 86405 5776
544 5776 -79998 -81514 5072 88428 77261 -18907 -96636 -72194 29333 99035 63261 -37174
556 -37174 -95594 -56292 36172 89374 51553 -38104 -88801 -47136 44992 89732 37180 -58490
568 -58490 -90885 -21894 72852 87361 5606 -82140 -81101 5238 85377 76178 -12069 -87010
580 -87010 -71485 17332 87492 65510 -26079 -87939 -53571 37049 83555 39251 -45589 -78556
592 -78556 -27482 51625 76250 21309 -56856 -77605 -18133 64512 82647 12830 -73542 -82804
604 -82804 -3154 79402 76910 -7193 -81726 -67252 18203 81135 56670 -27665 -82267 -49595
616 -49595 38407 86847 41077 -51613 -90427 -31841 62234 90751 22925 -68154 -85906 -14679
628 -14679 68799 80648 10689 -68234 -76507 -5481 71778 73523 -3641 -78677 -68896 17238 86302
641 86302 61221 -31232 -91055 -54319 39985 92718 49360 -46297 -94753 -45383 50997 94439
653 94439 38908 -57854 -92555 -27600 65235 84627 13051 -69727 -75229 -1346 71975 68356
665 68356 -6638 -75037 -67426 10677 80649 68824 -16971 -88454 -67619 25443 90727 59992
677 59992 -33094 -88552 -49463 38915 83372 39935 -43732 -80509 -31460 52971 82768 22283
689 22283 -65061 -82465 -9633 75779 80450 -214 -79520 -73248 7351 77207 66820 -9291
701 -9291 -73673 -63043 12048 74227 57437 -21290 -77076 -49120 34361 79861 36432 -47244
713 -47244 -79193 -25549 54247 77538 21063 -57753 -78407 -19227 60745 79064 15486 -65358
725 -65358 -76106 -4217 69591 65075 -10145 -69967 -50825 20919 67004 40779 -28292 -68629
737 -68629 -38361 33694 74444 38576 -41385 -81917 -34894 50597 81825 26114 -54653 -74100
749 -74100 -15623 54300 63789 8259 -52971 -58101 -2400 58710 58591 -8791 -71954 -56960 23815
762 23815 81729 50922 -36851 -84920 -43017 41340 78964 37110 -38699 -73696 -35236 37644
774 37644 72406 30663 -44917 -71849 -17860 57743 68739 1339 -68176 -61723 11753 72383
786 72383 57680 -14803 -73256 -59972 13696 76370 63469 -15754 -80744 -60797 24687 81637
798 81637 46537 -36958 -74065 -28499 44675 65932 17043 -48306 -63797 -13284 54051 70515
810 70515 13026 -64094 -78559 -7921 73905 77162 -1567 -74311 -66561 7550 67129 53857
822 53857 -10922 -60082 -46678 14530 62258 43663 -26960 -72850 -37835 44820 81400 27526
834 27526 -58051 -81144 -18400 60506 74676 16821 -52858 -69515 -19060 49022 68463 15832
846 15832 -54133 -64630 -1528 63021 54329 -18238 -69086 -40757 32290 69012 33585 -35063
858 -35063 -69307 -37053 33331 74419 42628 -34717 -78168 -40045 41521 75962 25854 -47828
870 -47828 -62233 -8109 49022 48718 -2805 -49423 -44278 8005 55868 48877 -12256 -68533 -55709
883 -55709 20836 78545 52263 -29398 -76452 -41686 31139 64773 31312 -28080 -54107 -24456
895 -24456 28771 52712 19619 -39765 -58049 -7767 57647 61660 -5536 -70034 -58948 14972
907 14972 71691 53938 -14628 -64439 -51842 8340 59639 51174 -10316 -61577 -45007 22605
919 22605 63798 29814 -39796 -62665 -12798 51579 59191 4224 -54145 -60023 -7341 55400
931 55400 66641 11611 -58202 -71283 -9650 62828 66209 -1542 -63106 -50748 14916 57172
943 57172 34425 -23119 -53591 -27487 28501 58364 28742 -35864 -69537 -30625 46723 78536
955 78536 26681 -53748 -75209 -18506 52238 64088 13079 -44463 -53535 -8955 42217 48918
967 48918 2402 -50135 -48379 11296 63251 44385 -27992 -72702 -38615 36829 72705 34356
979 34356 -35539 -67524 -35299 28867 64524 37142 -28360 -63720 -29988 36796 60562 13972
991 13972 -47417 -52358 3765 55483 44892 -13629 -57605 -43934 13337 60146 49962 -11861
1003 -11861 -65236 -54035 13671 67774 49118 -21435 -63516 -33814 27771 53128 19923 -31092
1015 -31092 -45775 -11646 35859 47976 8888 -44408 -55799 -5762 56601 61468 -1340 -63140
1027 -63140 -57039 7379 59155 47486 -8941 -50348 -38904 8282 44525 33916 -13272 -48664
1039 -48664 -29610 27143 56370 20663 -42942 -59815 -10738 51363 58907 6313 -50270 -55731
1051 -55731 -8433 44985 54825 10890 -44517 -53817 -5527 48561 47010 -8517 -53522 -35371
1063 -35371 23370 54674 23835 -32133 -54203 -21368 33420 57601 25661 -34096 -63708 -28411
1075 -28411 38879 66540 23448 -43460 -60079 -11075 45220 47874 161 -42756 -38263 6151
1087 6151 44204 37020 -10675 -51810 -41051 16873 62071 42052 -26091 -67371 -36685 31288
1099 31288 63148 29292 -29785 -54508 -24378 27240 49164 20930 -29122 -49548 -14625 39962
1111 39962 51439 2766 -51952 -49138 8900 57880 44787 -14059 -56844 -42418 12141 52967
1123 52967 42917 -9625 -53494 -43275 13841 55867 35619 -24405 -54678 -22244 34920 51380
1135 51380 10728 -39996 -46950 -6064 41325 48295 7167 -44627 -53260 -6803 49427 54567 1215
1148 1215 -52706 -48513 7309 50893 36561 -14140 -45376 -28314 16743 43871 25075 -21384
1160 -21384 -48246 -24326 29537 54944 21124 -38504 -57296 -13830 42839 52362 7947 -41040
1172 -41040 -45260 -5185 37544 40670 3252 -37861 -39864 2110 43839 37234 -13702 -50713 -31302
1185 -31302 23440 52417 24488 -28685 -50866 -21176 28301 49078 21208 -27772 -49771 -20724
1197 -20724 31662 50504 13284 -38554 -46823 -2723 43601 40371 -6894 -44386 -34169 11620
1209 11620 44956 33283 -12824 -47936 -35257 15478 52456 34165 -21767 -54387 -27694 27557
1221 27557 51548 19049 -31005 -45256 -12366 31742 42621 9279 -34277 -43385 -6004 40367
1233 40367 45294 139 -47296 -43926 7158 50324 38509 -12785 -48524 -33501 13914 45902
1245 45902 30060 -15757 -45369 -27654 20353 48100 23715 -28353 -49301 -15900 35320 47592
1257 47592 9391 -38124 -44193 -4806 38898 42713 3524 -39509 -42789 -1364 42898 41953 -4827
1270 -4827 -46657 -37361 12502 48068 30465 -19376 -47005 -24027 22623 45555 21496 -24844
1282 -24844 -46353 -19611 28896 48146 16045 -33864 -47594 -10100 37656 43978 3395 -38930
1294 -38930 -38631 852 38196 35296 -3669 -39765 -34785 7423 42409 32893 -13558 -46357 -28846
1307 -28846 20356 46941 22812 -24743 -44174 -17665 26300 42112 15044 -27390 -41308 -12069
1319 -12069 30496 41635 7282 -35776 -39727 -395 39679 35663 -6152 -40489 -31494 9919
1331 9919 40284 28328 -12142 -40473 -27629 15067 42997 25411 -20607 -44932 -19768 26383
1343 26383 43570 13337 -30458 -40276 -7767 31982 37850 4814 -33097 -37490 -2567 36565
1355 36565 37559 -2254 -41451 -35477 8738 43240 30381 -14836 -42429 -24769 17433 39915
1367 39915 21235 -18624 -40048 -20096 22145 41911 17019 -26944 -43185 -11688 33125 41762
1379 41762 5400 -35220 -37581 -384 35180 34371 -1153 -35478 -33658 3612 38147 32736 -8389
1392 -8389 -42104 -29674 16128 43733 23321 -21564 -41728 -17538 23566 39082 15089 -23739
1404 -23739 -38742 -14432 26176 41224 12434 -31449 -41337 -5546 36291 37980 -1776 -37796
1416 -37796 -32645 6820 37053 28366 -8390 -36764 -28586 10256 40375 28202 -15570 -43531
1428 -43531 -24274 22127 43890 17577 -26246 -39859 -11243 26307 35133 8950 -25520 -34202
1440 -34202 -7990 28272 36238 4445 -34442 -36886 2321 39480 32548 -9796 -39305 -26521
1452 -26521 12062 35623 23246 -11413 -34575 -23106 12507 36539 22034 -17929 -39761 -16336
1464 -16336 26562 39169 7590 -30950 -34555 -1864 30512 30873 1205 -29464 -31242 -2115 30806
1477 30806 33531 -356 -36239 -32281 8139 38584 24715 -15869 -37015 -17200 19339 33233
1489 33233 13079 -18892 -32675 -14438 20132 37163 14921 -26680 -40879 -9829 33067 38832
1501 38832 1770 -34858 -31591 3923 30849 24383 -4812 -28213 -24016 4870 31074 25919 -9972
1514 -9972 -37985 -24716 18538 41969 18417 -25356 -39029 -11779 24847 33395 10700 -20621
1526 -20621 -31779 -12081 20800 33931 10757 -26413 -35397 -2207 34823 30897 -8729 -37687
1538 -37687 -23773 13847 34626 19795 -12408 -32503 -22463 9582 34944 26365 -12186 -39646
1550 -39646 -23415 20063 39569 13656 -25807 -33236 -3696 26801 26973 502 -25239 -26789 -2204
1563 -2204 27339 32226 2079 -35096 -36217 3991 40818 31996 -11301 -39001 -22794 14471 31278
1576 31278 15852 -12312 -26566 -15443 11575 29675 16325 -18636 -36186 -12348 29215 38639
1588 38639 4327 -34788 -33927 1775 31472 27854 -340 -25352 -26696 -3873 23904 28578 2004
1601 2004 -29529 -28141 7518 35195 20545 -19256 -35240 -10471 23727 30711 7618 -20870
1613 -20870 -29725 -11603 18453 33656 16016 -21150 -37609 -12054 27905 34622 1199 -30487
1625 -30487 -24893 7426 27140 16289 -9644 -24134 -16070 7651 27711 21848 -10088 -36795
1637 -36795 -24063 17718 41911 19396 -23612 -37218 -10125 23156 28107 5630 -17657 -22016
1649 -22016 -6472 16524 24377 5589 -24215 -28802 1986 34470 28220 -11441 -38741 -22484
1661 -22484 16120 34099 17527 -11887 -27675 -18991 6690 27176 21754 -8146 -31169 -18425
1673 -18425 17655 33272 7699 -27447 -28970 3063 29919 23395 -4990 -26957 -23439 323
1685 323 25535 28778 3014 -29718 -33158 729 34283 27887 -9863 -32905 -16585 16041 26627
1698 26627 8224 -16396 -22683 -7190 15887 26789 11376 -19730 -35265 -11509 28989 38295
1710 38295 5218 -32814 -33044 1221 28615 23195 -2797 -21273 -18450 384 19763 20262 -2921
1723 -2921 -26547 -21233 11923 34922 17283 -22355 -36943 -10258 25496 31963 7546 -19832
1735 -19832 -27291 -10873 14722 27613 13793 -16140 -29925 -9318 23103 28305 -1771 -29446
1747 -29446 -20767 12128 29416 14523 -13472 -26576 -14955 9841 27775 20766 -7916 -32329
1759 -32329 -23806 12093 35743 18004 -18986 -30608 -7121 20911 22026 97 -19040 -17442
1771 -17442 527 18730 20623 869 -25069 -27333 1932 33222 28706 -8402 -35919 -22859
1783 -22859 12498 30343 15872 -11273 -22385 -12413 7486 20377 13171 -10246 -25219 -10977
1795 -10977 19405 29842 4347 -28068 -29078 2878 30705 24546 -4401 -25182 -22091 25
1807 25 20902 23512 2873 -22643 -24996 1580 27193 20447 -11279 -29204 -10889 19353 26084
1820 26084 4385 -20131 -23577 -5057 17956 26022 9919 -17824 -31175 -11323 22323 32344
1832 32344 5723 -26035 -26364 2089 24452 17457 -6911 -21075 -13207 7389 20856 14549 -8376
1845 -8376 -26845 -18186 13200 33448 16854 -19595 -34553 -11785 21339 29212 7178 -17806
1857 -17806 -22717 -6221 14075 20307 6391 -16266 -23051 -2431 24166 23792 -5231 -30100 -20628
1870 -20628 12271 30794 16573 -13687 -27087 -15392 8888 24491 17607 -6992 -25535 -17796
1882 -17796 10488 27509 12279 -17276 -25667 -3439 22495 21296 -2290 -22257 -19025 2698
1894 2698 21554 20915 -300 -23896 -25359 -62 27326 25504 -4776 -28866 -19433 10055 25196
1907 25196 11878 -12103 -20487 -7641 12156 19864 7740 -14124 -23904 -7865 19941 28485 5182
1920 5182 -25087 -28066 -470 25639 23226 -1990 -22418 -18515 1800 18411 16916 -1783 -20126
1933 -20126 -17539 6089 24433 15239 -13343 -27620 -10077 18942 27296 6840 -19045 -24260 -6052
1946 -6052 16719 23300 8137 -15651 -24532 -7651 18359 24157 2614 -21756 -20641 4798 23550
1959 23550 15239 -9495 -22933 -12344 10031 22943 13634 -9564 -25028 -15739 11348 27973
1971 27973 15030 -14803 -27930 -9812 17311 23567 4435 -17555 -19296 -1535 16942 17591 -254
1984 -254 -18942 -19499 1574 23680 21056 -5892 -27518 -19468 9305 27334 16066 -10813 -24384
1997 -24384 -13022 10051 21426 11754 -9741 -21633 -10438 13357 23605 7028 -18729 -23734
2009 -23734 -1781 22527 22109 -1954 -22985 -19986 2132 21441 19880 -1560 -21247 -19934 2084
2022 2084 22066 18169 -6040 -23396 -14055 10937 23214 9323 -14068 -21329 -6567 14947 21590
2035 21590 6638 -15694 -23132 -6638 17817 24401 4743 -20406 -23661 -1697 21383 19245 -2525
2048 -2525 -20268 -15688 4393 19402 13241 -6699 -20578 -13411 9148 23233 12783 -12727 -25398
2061 -25398 -10247 16009 24687 7918 -16542 -22270 -5688 15446 20166 4420 -15481 -19257 -2566
2074 -2566 17411 18834 -1642 -21106 -17502 5684 23250 15299 -9218 -23277 -13362 9799 22481
2087 22481 13031 -9828 -22275 -12451 10926 22931 10349 -12799 -21717 -6327 16110 20019 1870
2100 1870 -17782 -17504 1336 17979 16719 -2033 -19517 -17943 2355 21186 18233 -4173 -22550
2113 -22550 -17075 7154 22562 13363 -9217 -20727 -10115 10640 19612 7645 -12546 -19763 -5610
2126 -5610 14897 21101 4096 -18504 -21789 -960 20763 20232 -1341 -20889 -18016 2313 19204
2139 19204 15668 -3173 -18500 -14874 4476 19720 13756 -8122 -21118 -10813 12300 22232 7684
2152 7684 -14845 -21765 -5759 15684 21043 5300 -15465 -21013 -5153 16464 20605 2618 -18106
2165 -18106 -18766 696 19235 15485 -4538 -19299 -12506 7385 19115 11170 -8240 -19864 -11692
2178 -11692 9640 21931 11675 -11150 -22999 -9903 13678 21913 6541 -14657 -19111 -3525
2190 -3525 14336 16885 1462 -15413 -16096 470 17841 16636 -3605 -20627 -15636 6633 22646
2203 22646 13944 -8725 -21501 -11592 9341 19784 10339 -8865 -18378 -8894 9616 18489 6847
2216 6847 -13032 -18452 -3212 16307 17964 -87 -18188 -17267 1829 18625 16358 -2465 -18638
2229 -18638 -16447 2537 19566 16120 -4297 -20098 -13728 7627 19756 9640 -10459 -18312 -5531
2242 -5531 12551 17225 4079 -13060 -17458 -3575 14849 18975 3469 -16489 -19660 -2154 17980
2255 17980 17846 -605 -17591 -14905 2617 16243 12555 -3971 -16426 -11320 6198 18591 10796
2268 10796 -9735 -20620 -8709 13584 21797 5931 -15296 -20220 -4327 14471 18251 3074
2280 3074 -13936 -16669 -2537 13776 15365 515 -15728 -14683 3245 18227 12594 -7131 -18957
2293 -18957 -10720 8457 19221 10146 -8758 -19321 -10844 8459 20392 10889 -10126 -19941 -7797
2306 -7797 12603 18601 3802 -14558 -16054 228 15485 13202 -2076 -15796 -13628 2733 17649
2319 17649 14580 -3729 -19341 -14844 5475 19702 13467 -6826 -18358 -9848 7536 16132 7745
2332 7745 -7948 -15143 -6180 9752 16187 4599 -13378 -18058 -1765 17027 17878 -929 -18673
2345 -18673 -16760 2248 17674 14722 -2485 -16119 -12849 3115 15804 11856 -4854 -16370 -9330
2358 -9330 8449 17014 6154 -11696 -16483 -3698 12920 16566 3506 -13091 -16572 -4348 12786
2371 12786 17770 4662 -14199 -17733 -2124 15236 15426 -1891 -16170 -11965 5602 15979 8672
2384 8672 -7449 -15977 -7886 8505 17525 8275 -10171 -18667 -7640 11789 18917 6126 -12185
2397 -12185 -16583 -3887 11635 14313 2293 -10944 -12260 -1482 12178 13043 -1299 -15386 -13210
2410 -13210 4373 18375 12515 -7199 -19643 -10786 9130 18733 9551 -8640 -17075 -8226 8493
2423 8493 15964 6791 -10006 -15633 -3772 12423 14343 -16 -14484 -12736 2575 15268 12590
2436 12590 -3014 -15626 -12755 2576 15939 13672 -2434 -16461 -13500 4491 17069 10878 -6588
2449 -6588 -16212 -7401 8996 15057 4383 -10937 -14506 -2670 12588 15489 2102 -14464 -16306
2462 -16306 -932 15718 16046 -911 -15795 -13520 1984 14209 11022 -2510 -12412 -9564 3486
2475 3486 12939 8897 -5615 -14703 -7840 8962 17042 6520 -11806 -17580 -4680 12958 16725
2488 16725 3691 -12535 -15771 -3046 12062 14389 1879 -12810 -13638 978 14427 10863 -5081
2501 -5081 -15007 -8209 7570 15125 6979 -8194 -14712 -7075 7691 15428 8359 -7712 -16279 -7865
2515 -7865 8952 16148 6121 -10567 -14378 -2573 11856 12584 -117 -12716 -11388 2160 13802
2528 13802 11648 -3446 -15742 -11943 5319 17514 10789 -7062 -16539 -8811 7800 14787 6579
2541 6579 -7401 -12516 -5399 7409 11915 3955 -8853 -12770 -2457 11618 13657 144 -14380
2554 -14380 -13592 1593 14697 12545 -2346 -14582 -11896 2652 14109 11490 -3421 -14490 -9951
2567 -9951 6056 14903 6589 -9148 -14580 -3548 11230 13412 1429 -11663 -12847 -1340 11679
2580 11679 13005 1932 -11683 -14231 -1888 12376 13726 130 -12845 -11446 2409 13051 9187
2593 9187 -4171 -12830 -7669 5759 13807 7703 -7418 -15391 -6654 10120 16565 5574 -11705
2606 -11705 -16035 -2881 11884 13924 1617 -10894 -11321 -757 10071 9797 -259 -10592 -10098
2619 -10098 2160 12650 9690 -4420 -14425 -8660 6508 15084 7944 -6878 -14439 -7864 6681
2632 6681 14516 7245 -7354 -14402 -5816 9054 14042 2806 -12092 -12539 850 13307 10439 -3235
2646 -3235 -13287 -9120 3466 13147 9569 -3327 -13442 -9978 3645 13723 9359 -5006 -13254
2659 -13254 -7318 6075 12259 5153 -7418 -11512 -3503 8083 11818 2931 -9898 -13402 -1913
2672 -1913 12380 14110 13 -14365 -12858 2020 14201 10787 -3678 -12215 -8134 3665 11193
2685 11193 7169 -4132 -11262 -6223 5775 12722 5132 -8489 -12902 -3517 10115 12727 2289
2698 2289 -9891 -12371 -2478 9677 12196 2291 -10236 -12340 -1544 11521 11555 -1649 -12984 -9585
2712 -9585 5098 13690 6789 -6855 -13166 -5448 7712 12671 5099 -8023 -13070 -5320 8687 13604
2726 13604 4449 -9126 -12564 -2476 9329 10680 546 -9556 -9274 799 9765 9002 -1087
2739 -1087 -11001 -10058 2644 13512 10354 -4663 -14941 -8976 6621 14606 6998 -7355 -12685 -4941
2753 -4941 7440 11359 3814 -8079 -10999 -2639 9271 11334 676 -10771 -10481 1303 11582
2766 11582 9784 -2447 -11573 -9036 2147 11049 9094 -1857 -11697 -9501 2794 12361 8170 -5592
2780 -5592 -13131 -5740 8256 12422 3070 -9386 -11628 -1623 9748 11304 940 -10696 -11526 -337
2794 -337 10884 11158 -760 -11950 -9812 2431 11554 7790 -3079 -10403 -6376 4107 10260 5736
2808 5736 -4496 -10699 -5852 5925 12276 5526 -7964 -13299 -4010 9727 12501 2226 -9955
2821 -9955 -11626 -807 10053 9982 24 -10122 -9632 1331 10604 8450 -3532 -11810 -7333 5345
2835 5345 12064 5251 -6337 -11336 -4790 5997 10727 5206 -6067 -11000 -5242 6688 11844 3935
2849 3935 -8306 -11717 -1554 9896 10387 -398 -10792 -8825 2510 11274 8499 -2978 -11478
2862 -11478 -8165 3790 12360 7888 -5064 -12314 -6383 6565 12060 4128 -6818 -10180 -2613 7216
2876 7216 9495 2396 -7162 -9812 -2037 8632 10367 994 -10647 -11083 795 11297 9931 -2300
2890 -2300 -11272 -8760 2864 10897 7363 -3475 -10813 -6686 4821 11368 5613 -6806 -11300 -3370
2904 -3370 8175 11192 1471 -9303 -10116 -828 8859 9266 701 -8773 -9514 -938 9003 9334 -275
2919 -275 -10172 -8643 2148 11006 7135 -4036 -10714 -5692 5405 10770 5401 -6049 -10746 -4706
2933 -4706 6857 11831 3899 -8261 -11495 -2226 9501 10466 329 -9594 -8346 480 8833 7408
2947 7408 -1289 -8692 -6873 1858 9469 7426 -2979 -10724 -7204 4551 11596 5999 -5572 -10920
2961 -10920 -4455 6118 10339 4171 -5980 -10210 -3746 7083 10245 2284 -8989 -9856 31 10247
2975 10247 8975 -2129 -10665 -7210 2949 9847 6277 -3021 -9487 -6833 2986 10116 6773 -3965
2989 -3965 -10373 -5214 5565 10667 3547 -7117 -9205 -1824 7359 8815 1386 -8110 -9393 -1143
3003 -1143 9042 9825 263 -10171 -9704 1579 11060 7913 -3603 -10268 -5934 4426 9312 4747
3017 4747 -4258 -8540 -3970 4785 9374 4099 -6219 -10173 -3045 7933 10069 1737 -8494 -9435
3031 -9435 -795 8204 8544 770 -7868 -8647 -361 8661 8511 -1107 -9728 -7521 3456 10687 5809
3046 5809 -5228 -10486 -4063 6544 9478 3359 -5697 -9257 -3662 5998 9773 3126 -6896 -9546
3060 -9546 -2261 7966 8815 -277 -8740 -7342 1949 8311 6361 -1967 -8824 -6976 2470 9479 7029
3075 7029 -3446 -10970 -6837 4801 11225 4881 -6331 -10050 -2989 6272 8127 1805 -6197 -7833
3089 -7833 -1422 6947 8006 830 -8553 -8716 711 9436 7517 -2235 -9835 -6800 2716 8951 6180
3104 6180 -2515 -8101 -6033 2364 8665 6261 -4104 -9623 -4289 6097 9796 1762 -7834 -9035
3118 -9035 -386 8764 8182 -142 -7823 -8019 -301 8051 8295 -295 -8575 -7843 1436 8917 6115 -3219
3134 -3219 -8836 -4301 4669 7915 2962 -4576 -7875 -3562 4924 9181 3656 -6417 -10317 -2933 8406
3149 8406 10200 1233 -8516 -8625 381 7544 6798 -1409 -7173 -6051 1367 7612 6025 -2729 -8788
3164 -8788 -5862 4360 10015 4685 -6039 -9792 -3422 5915 8953 3181 -5106 -8014 -3075 4655
3178 4655 7739 2909 -5922 -8429 -1008 7949 7626 -1556 -9032 -6450 2935 8985 5313 -2982 -8347
3193 -8347 -5874 2737 9059 6778 -2851 -9565 -5763 4597 9200 3676 -5758 -7930 -1291 6366 6546
3208 6546 174 -6526 -6417 -414 6550 7356 36 -8041 -8345 814 9146 8037 -2166 -9445 -5990
3223 -5990 2909 8240 4643 -3135 -7126 -3948 3509 7327 3856 -4824 -8611 -2643 6777 9289 840
3238 840 -8444 -8702 251 7847 7099 -384 -6425 -6449 -447 6063 6972 259 -7096 -6767 1460 8235 5442
3255 5442 -3763 -8432 -3498 5488 8080 2363 -5622 -7872 -3084 4904 8568 3288 -5714 -8968 -2619
3270 -2619 6549 8414 688 -7211 -6324 1469 7006 4609 -2288 -6505 -4108 2329 7251 5072 -2662
3285 -2662 -8795 -5704 3921 9574 4835 -5071 -9371 -3211 5400 7919 2240 -5007 -6278 -1756 4918
3300 4918 6225 686 -6006 -6792 436 8000 6986 -2103 -9174 -5868 3558 8397 4946 -3124 -7622
3315 -7622 -4794 2045 6790 4938 -2435 -7522 -3901 4083 7891 2298 -6172 -7300 -419 6928 6697
3330 6697 -475 -6732 -6465 197 6651 7010 417 -7396 -7709 562 8128 6914 -2048 -7721 -4740 3613
3346 3613 7041 2564 -3964 -6481 -1881 4095 6486 2176 -5224 -7976 -2427 6227 8558 1291 -6944
3361 -6944 -8225 -183 6933 6353 -264 -5740 -5323 576 5239 4991 -965 -6650 -4711 2772 8138 4179
3377 4179 -5002 -8583 -2770 5859 7959 2057 -5197 -7276 -2362 4540 6794 2815 -4467 -7184 -2078
3392 -2078 5653 7101 -256 -6644 -5321 1881 7252 4599 -2920 -6755 -4128 2655 6981 4706 -2795
3407 -2795 -7786 -5129 3204 8406 3942 -4273 -7683 -2403 4981 6285 615 -5217 -5048 117 5258
3422 5258 5219 -192 -6239 -6302 561 7666 6467 -1435 -8031 -5505 3147 7685 4413 -2545 -6069 -3502
3438 -3502 2432 5730 3187 -3179 -6094 -2356 4594 7148 1571 -6482 -7068 -99 6923 6411 -502
3453 -502 -6626 -5914 532 6072 5876 -324 -6070 -5746 921 6428 4783 -2653 -7028 -3484 3862 6658
3469 6658 2011 -4282 -6352 -1441 4645 6523 2274 -4693 -7390 -2436 5538 7554 1135 -5734 -6341
3484 -6341 353 6154 4997 -1387 -5781 -3985 1816 5759 3864 -2001 -6671 -3937 3280 7360 3520
3499 3520 -3939 -7560 -2861 4755 6968 1988 -4476 -6027 -1346 4401 5565 878 -4609 -5629 -288
3514 -288 5571 5712 -802 -6913 -5135 2420 7211 4332 -2521 -6767 -3777 2384 6582 3824 -2440
3529 -2440 -6431 -3608 3023 6557 2691 -4301 -6389 -1850 5136 5765 95 -5547 -5548 616 5872 5540
3545 5540 -259 -6028 -5343 675 6440 5729 -1408 -6762 -4765 2250 6439 3431 -2862 -5785 -2361
3560 -2361 3255 5903 2041 -4022 -5856 -1652 4539 6445 1066 -5968 -6265 161 6315 5600 -388
3575 -388 -5821 -4703 918 5351 4579 -1008 -5406 -4097 1917 6348 3552 -2883 -6592 -2612 4207
3590 4207 6522 2112 -4190 -6470 -1550 4607 5960 1525 -4538 -5927 -1356 4909 5697 348 -5384
3605 -5384 -5009 838 5577 4193 -1870 -5836 -3812 2322 6000 3726 -2441 -6248 -3823 2696 6501
3620 6501 3456 -3434 -6811 -2480 4269 6075 1650 -4253 -5473 -625 4684 4983 182 -4970 -4495
3635 -4495 510 5556 4788 -1183 -6092 -4864 1993 6315 4065 -2739 -6200 -3200 2758 5522 2924
3650 2924 -2848 -5438 -2079 3606 5584 1737 -4119 -5766 -423 5343 5314 -185 -5491 -5029 349 5452
3666 5452 4718 -511 -5540 -4644 1044 5399 4189 -1303 -5859 -3700 2404 5687 2732 -3263 -5767
3681 -5767 -1997 3623 5627 1310 -4142 -5740 -1691 4457 5773 743 -5018 -5579 -165 5055 4995 -542
3697 -542 -4989 -4053 1333 5195 3514 -1741 -5522 -3460 2380 5668 3115 -2996 -6123 -2623 3762
3712 3762 6046 1858 -4182 -5990 -1488 3680 5035 1070 -4232 -4754 -393 4301 4636 -616 -5032
3727 -5032 -4371 1355 5543 3870 -1962 -5633 -3222 2347 5771 3209 -2613 -5764 -3010 2725 5543
3742 5543 2374 -3242 -5711 -1717 4015 4794 699 -4230 -4566 -283 4624 4554 -298 -4846 -4513 510
3758 510 5161 4224 -1431 -5333 -4060 1868 5734 3736 -2410 -5388 -2809 2461 4961 1865 -3166
3773 -3166 -4774 -1606 3706 5022 1122 -4499 -5210 -213 4984 4982 -139 -5006 -4499 813 5001 4254
3789 4254 -853 -4766 -3692 1304 4718 3358 -2072 -5048 -2534 2968 5422 1982 -3610 -5496 -1215
3804 -1215 3572 5166 1100 -4064 -5068 -1108 4056 5236 674 -4267 -4648 -18 4661 3913 -873
3819 -873 -5071 -3428 1590 4535 3032 -2358 -5317 -2728 2576 5431 2686 -3005 -5511 -2503 3536
3834 3536 5311 1798 -3758 -5075 -1169 3693 4466 151 -4035 -3840 516 4395 4185 -890 -4947 -3775
3850 -3775 1765 5333 3428 -2341 -5566 -3102 2653 4994 2382 -2406 -4676 -2127 2726 4979 1629
3865 1629 -3283 -4695 -777 4022 4670 -127 -4394 -4077 798 4713 4107 -695 -4978 -4066 1026 4919
3881 4919 3799 -1293 -4927 -3167 1805 4982 2476 -2341 -4683 -1757 3229 4127 927 -3583 -4269
3896 -4269 -772 4173 4995 872 -4092 -5156 -307 4944 4691 -245 -4306 -3920 834 4336 3403 -1302
3912 -1302 -3836 -2609 1766 4548 2528 -2531 -5029 -1919 3498 5420 1598 -4132 -5249 -1183 3797
3927 3797 4702 911 -3318 -4158 -757 3477 4260 227 -4406 -3657 760 4881 2825 -1951 -5034 -2787
3943 -2787 2346 4719 2463 -2467 -4624 -2417 2277 4740 2408 -2950 -4820 -1933 2943 4423 937
3958 937 -3678 -3831 -152 3601 3578 -709 -3952 -3024 1017 4495 3562 -1278 -5069 -3578 1270 5132
3974 5132 3207 -2025 -4937 -2615 2137 4156 1917 -2330 -3824 -1341 2505 3920 1235 -4042 -4443
3989 -4443 -410 4329 4637 -281 -4910 -4133 599 4575 3881 -781 -3835 -3323 653 4040 2834 -1347
4005 -1347 -4072 -2164 2035 4315 1895 -2990 -4504 -535 3971 3885 473 -3270 -4248 -597 3654 4611
4021 4611 813 -3886 -4406 -427 3988 3501 -560 -3996 -2823 1551 3589 2208 -2125 -3766 -1844
4036 -1844 2460 4355 1869 -2537 -4842 -2357 2936 5217 1263 -3754 -4736 -1021 3154 3722 425
4051 425 -2916 -3013 99 3140 2906 -562 -3815 -2960 1139 4779 2864 -2073 -5079 -2104 2331 4400
4067 4400 2575 -2343 -4095 -1949 1839 4118 1627 -2273 -4146 -1196 3410 3693 -15 -3901 -3544
4082 -3544 708 4047 3237 -1130 -4063 -2902 776 4177 3316 -635 -4436 -3341 1233 4322 2698
4097 2698 -1970 -4153 -1538 2390 3543 645 -2891 -3242 -463 3104 3505 291 -3945 -4198 -279 4227
4113 4227 4328 -193 -4642 -3784 931 4333 2897 -1099 -3155 -2534 1075 3738 1868 -1628 -3767 -1901
4129 -1901 2676 4628 1011 -3657 -4644 -723 3559 4275 611 -3441 -3660 -701 3022 3614 658 -2990
4145 -2990 -3102 137 3611 2635 -1439 -3639 -2279 2257 4016 1284 -2455 -3798 -1519 2403 4050
4160 4050 2134 -1883 -4360 -1857 2449 4277 929 -2856 -3481 364 3157 2689 -666 -3291 -2115
4175 -2115 798 3369 2249 -1183 -3819 -2767 1275 4518 2942 -1628 -4371 -2242 2420 3829 1423
4190 1423 -1886 -3279 -1160 2127 3099 469 -2461 -3341 -88 3205 3500 -391 -4138 -3413 953 4045
4206 4045 3218 -641 -3727 -2526 732 3191 2580 -747 -3528 -2493 1244 3554 2093 -2154 -3809
4221 -3809 -510 2984 3685 145 -3203 -3211 128 3006 3351 304 -3373 -3693 -121 3641 3201 13 -3427
4238 -3427 -2903 774 3567 2038 -1541 -3218 -1341 1788 3353 1460 -2268 -3320 -1614 2638 4159
4253 4159 1603 -3452 -4217 -897 3080 3566 367 -2738 -2930 -317 2484 2171 -477 -2785 -2617 899
4269 899 3621 2365 -1998 -4067 -1871 2492 3783 1498 -2285 -3892 -1624 2129 3597 1347 -1653
4284 -1653 -3767 -1469 2051 3221 631 -3132 -3059 539 3440 2456 -1043 -3294 -2401 1124 3632 2489
4300 2489 -803 -3565 -2440 1129 3972 2066 -1499 -3439 -1583 2014 3105 954 -2224 -2792 -503
4315 -503 2262 2548 561 -2790 -2816 25 2838 2884 -522 -3688 -2850 787 3613 2680 -1284 -3005 -2076
4332 -2076 916 3255 1927 -1282 -2847 -1755 1517 3311 1210 -2406 -3361 -670 3183 3463 231
4347 231 -3266 -3073 -104 2906 3070 312 -2452 -2894 -199 2791 2445 -401 -3179 -2097 1123 3112
4363 3112 1244 -1930 -3288 -1206 1857 2844 1124 -2158 -3225 -1212 2350 3188 962 -2783 -3582 -760
4379 -760 2708 2801 -314 -2783 -2154 456 2434 1920 -1006 -2800 -2166 1102 3371 2501 -1329 -3873 -1984
4396 -1984 2198 3882 1176 -2140 -2826 -1182 2188 2781 829 -1695 -2896 -409 2644 2869 225 -2764
4412 -2764 -2725 870 3137 2336 -1156 -3263 -2220 1190 2935 1863 -860 -2908 -2149 1036 2859 1759
4428 1759 -1514 -3117 -1159 2288 2841 670 -2383 -2957 -221 2761 2287 -21 -2515 -2821 -111 2887
4444 2887 2887 -311 -3204 -2595 684 2853 2089 -1252 -2755 -1493 1188 2768 1043 -1487 -2727 -863
4460 -863 1921 2987 1082 -2311 -3296 -725 2365 2809 91 -2468 -2579 -210 2284 2436 -129 -2397
4476 -2397 -2406 562 2626 1953 -794 -3060 -1750 2014 3323 1544 -2011 -2944 -1019 1867 2968 1045
4492 1045 -1596 -2865 -814 1966 3004 680 -2129 -2721 227 2420 2173 -634 -2886 -1941 663 2719
4508 2719 1540 -1100 -2733 -1704 845 2998 1524 -1382 -2676 -1566 1569 2937 880 -2224 -2810
4523 -2810 -494 2011 2331 165 -2085 -2511 -68 2560 2247 -334 -2784 -2481 255 3117 2199 -948
4539 -948 -2783 -1884 899 2689 1687 -1046 -2569 -1321 1550 2604 965 -2045 -2854 -630 1898 2716
4555 2716 -36 -2319 -2405 -225 2535 2155 -129 -2544 -2527 321 2854 2302 -598 -2490 -1898 820 2811
4572 2811 1542 -1277 -2631 -879 1749 2416 686 -1850 -2565 -969 1629 2930 557 -2321 -2850 -567
4588 -567 2223 2586 381 -2372 -2212 112 2539 1577 -554 -2302 -1612 940 2569 1438 -874 -2821
4604 -2821 -1708 1761 3048 1170 -1666 -2775 -733 1843 2390 466 -2030 -2288 -607 2059 2584 295
4620 295 -2485 -2209 225 2440 2090 -438 -2432 -1688 871 2734 1573 -955 -2463 -1661 851 2801
4636 2801 1305 -1107 -2408 -987 1466 2546 876 -1997 -2497 -337 2024 2042 56 -1995 -2295 219
4652 219 2565 1984 -631 -2636 -1987 719 2764 1628 -901 -2495 -1562 1468 2598 786 -1362 -1948
4668 -1948 -1370 1105 2391 716 -1973 -2183 -491 2161 2621 376 -2228 -2211 257 2275 2025 -147
4684 -147 -2377 -2083 341 2225 1765 -730 -2151 -1671 1279 2537 1568 -1671 -2668 -862 1799 2605 510
4701 510 -1894 -2408 -1058 1742 2358 520 -1645 -2274 223 2192 1939 -341 -2261 -1935 542 2401
4717 2401 1327 -898 -2341 -1480 1088 2657 1704 -970 -2577 -1183 1657 2885 1156 -1503 -2488 -548
4733 -548 1769 2240 535 -1747 -1962 -431 1647 2141 167 -2168 -1947 532 2570 1724 -722 -2515
4749 -2515 -1132 953 2580 1263 -1116 -2230 -1470 1073 1934 1068 -1552 -2682 -990 1607 2377 214
4765 214 -1756 -2324 110 2043 1616 -129 -2321 -1564 198 2295 1808 -183 -2133 -1801 662 2405
4781 2405 1533 -1041 -2042 -1205 1141 2028 851 -1510 -2305 -821 1884 2194 493 -1576 -2405 -342
4797 -342 1937 2097 -206 -1908 -1848 -108 2001 1665 -416 -1944 -1294 500 2167 1245 -804 -1906 -1473
4814 -1473 1351 2278 926 -1683 -2353 -1015 1672 2224 291 -1593 -2244 -381 1768 1874 52 -1671
4830 -1671 -1580 -83 1761 1893 -652 -2260 -1614 712 2120 1229 -844 -2256 -1185 763 2289 1052
4846 1052 -904 -2505 -1113 1630 2272 760 -1650 -1952 -340 1429 1645 60 -1534 -1625 449 2125
4862 2125 1751 -200 -2299 -1832 410 1833 1348 -709 -2142 -1207 851 2137 839 -948 -1956 -762
4878 -762 1098 1932 390 -1323 -2204 -464 1743 2139 189 -2079 -1933 208 2102 1569 -252 -1642
4894 -1642 -1616 401 1973 1545 -310 -1790 -1204 726 2201 802 -1213 -2017 -637 1366 2109 264
4910 264 -1549 -1821 -536 1481 2025 433 -1399 -2275 -249 1676 1966 130 -2091 -1399 725 1934
4926 1934 1214 -849 -1819 -1027 653 1978 946 -898 -2099 -1083 1417 2081 845 -1541 -2094 -621
4942 -621 1322 1960 446 -1230 -1525 -269 1264 1469 -118 -1605 -1937 225 2106 1520 -636 -2314
4958 -2314 -1419 814 2399 1329 -930 -1891 -967 1187 1717 1174 -1202 -1996 -918 1023 1817 303 -1638
4975 -1638 -1374 189 1724 1500 -315 -1789 -1622 384 1787 1655 -377 -1853 -1537 383 1810 1413
4991 1413 -854 -2045 -859 1079 1815 448 -1238 -1797 -285 1261 1772 385 -1318 -1878 -260 1527
5007 1527 1995 5 -1777 -1663 228 1592 1412 -268 -1467 -1297 485 1539 1196 -264 -1701 -1046
5023 -1046 944 1915 556 -1094 -2222 -597 1362 1804 117 -1516 -1844 -571 1540 1802 442 -1081
5039 -1081 -1662 -42 1643 1279 -246 -1813 -1191 827 1992 812 -880 -1855 -919 998 1677 749 -1033
5056 -1033 -1865 -723 985 1826 966 -1243 -1774 -159 1611 1414 -41 -1308 -1302 461 1402 1301 -149
5073 -149 -1800 -1412 634 1808 1614 -597 -2053 -900 962 1857 831 -893 -1585 -570 961 1373
5089 1373 750 -836 -1667 -475 1169 1316 393 -1396 -1695 53 1850 1232 -301 -1868 -1343 209 1427
5106 1427 1161 -775 -1467 -1020 440 1603 655 -725 -1619 -485 1133 1546 246 -1517 -1478 -207 1092
5123 1092 1331 504 -1166 -1744 83 1413 1614 423 -1420 -1460 355 1644 1192 -456 -1419 -1017 752
5140 752 1623 936 -750 -2004 -627 899 1735 787 -1193 -1951 -514 1507 1242 5 -1382 -1746 -80
5157 -80 1041 1585 140 -1161 -992 263 1388 816 -776 -1422 -1232 528 1582 799 -813 -1617 -728
5174 -728 991 1649 822 -782 -1277 -661 589 1660 338 -1294 -1656 -303 1214 1194 -365 -1428 -1062
5191 -1062 373 1589 1012 -300 -1572 -1577 408 1622 1155 -359 -1724 -1045 896 1548 743 -1148 -1270
5208 -1270 -506 992 1494 196 -1357 -1345 -133 1344 1289 41 -1518 -1428 367 1583 1235 -559 -1379
5225 -1379 -768 615 1609 995 -551 -1204 -1130 702 1458 472 -1049 -1126 -525 1073 1350 229 -1146 -1570
5243 -1570 -102 1297 1545 355 -1376 -1504 57 1140 1520 -319 -1419 -1125 629 1307 958 -415
5259 -415 -1509 -735 672 1644 656 -1098 -1489 -794 881 1713 494 -1285 -1718 -602 1062 1278 168
5276 168 -1353 -1193 87 1330 948 -339 -1300 -1001 358 1446 1284 -536 -1756 -895 726 1702 704
5293 704 -947 -1329 -389 819 1401 732 -697 -1246 -357 885 1145 531 -1421 -1457 389 1315 1452 -121
5311 -121 -1408 -1127 384 1368 1070 -151 -1459 -891 519 1401 916 -599 -1532 -927 645 1084 270 -699
5329 -699 -969 -237 1042 1284 332 -1138 -940 -205 1259 1270 66 -1126 -1207 246 1217 990 -326 -1288
5347 -1288 -861 301 1132 643 -300 -1074 -756 641 1186 436 -724 -1349 -550 1268 1422 297 -1257 -1318
5365 -1318 -8 1026 1064 60 -1050 -833 65 1090 544 102 -1461 -604 459 1106 965 -484 -1641
5382 -1641 -279 740 1484 453 -777 -1057 -405 1105 1073 507 -1026 -1092 -106 1067 1284 -81 -1101
5399 -1101 -929 43 1349 921 -68 -1500 -913 696 1350 905 -441 -1401 -647 380 1205 708 -681 -970
5417 -970 -367 613 1106 135 -547 -774 -197 931 1238 54 -1117 -891 -239 1288 1157 -125 -1127 -1053
5435 -1053 433 1383 847 -281 -1143 -770 98 1251 425 -848 -1408 -583 963 1309 143 -1027 -1169
5452 -1169 53 1026 1066 133 -1060 -896 40 1144 939 108 -1275 -1234 53 1091 821 -253 -1208 -953
5470 -953 499 1026 420 -579 -1270 -614 838 924 229 -615 -1332 -247 827 1213 303 -1080 -1015 157 1350
5489 1350 616 -251 -805 -803 330 1120 755 9 -833 -706 523 1074 770 -753 -1390 -707 679 1432 303
5508 303 -574 -1274 -403 849 605 407 -854 -885 165 1072 795 -102 -1162 -732 103 1033 961 -357 -1230
5527 -1230 -735 667 1114 823 -485 -1220 -684 565 1283 359 -757 -887 -475 773 689 145 -541 -1072
5545 -1072 120 936 832 -144 -1409 -1056 -128 1053 856 -228 -1296 -753 303 1046 304 -768 -907
5562 -907 -425 451 1020 263 -1049 -979 -40 846 927 470 -1141 -751 -150 1134 836 -25 -940 -914 -171 937
5582 937 1017 -51 -892 -900 492 1276 612 -723 -1048 -561 509 1111 417 -527 -1103 -290 692 939 453 -1130
5602 -1130 -1222 -164 797 1029 35 -1082 -810 253 1068 589 -421 -893 -799 321 1263 823 -443 -976
5620 -976 -705 643 1116 685 -687 -1104 -221 756 1033 283 -520 -652 -246 820 712 91 -395 -567 221
5639 221 959 974 -369 -776 -789 68 1062 797 -454 -928 -726 337 1084 648 -311 -797 -339 722 1232
5658 1232 304 -456 -776 -212 733 985 -278 -1026 -846 -80 768 816 -279 -803 -797 313 1089 679 -614
5677 -614 -869 -311 352 1260 417 -545 -943 -675 363 832 260 -806 -1328 76 547 812 121 -947 -861
5696 -861 -146 842 655 68 -893 -640 246 1270 791 -294 -938 -475 253 784 411 -292 -1034 -449 835
5715 835 995 421 -769 -936 -159 681 959 432 -524 -903 -115 521 638 -23 -523 -669 223 969 536 -360
5735 -360 -907 -649 -106 1097 831 -129 -1080 -598 579 951 420 -696 -438 -478 494 849 16 -884 -733
5754 -733 28 581 1048 155 -813 -618 59 794 775 -266 -927 -723 241 1029 490 -644 -758 -645 412
5773 412 746 598 -142 -773 -87 623 1016 149 -732 -756 -151 551 1108 50 -613 -1095 -84 788 523 -130
5793 -130 -660 -711 451 1124 700 -364 -1103 -383 367 788 369 -448 -727 -314 311 633 241 -561 -790 -299
5813 -299 796 987 361 -1097 -724 -5 586 707 -162 -700 -709 186 811 652 -158 -456 -706 80 851 295
5833 295 -722 -942 -408 320 1085 661 -538 -782 -429 606 602 144 -500 -1048 -35 473 936 -196 -736
5852 -736 -528 20 682 784 -365 -753 -580 449 754 222 -624 -841 -239 650 604 342 -444 -964 -304 536
5872 536 719 -37 -642 -693 -155 526 799 -38 -664 -718 -179 712 832 -31 -995 -638 406 806 155 -200
5892 -200 -728 -478 567 661 360 -411 -847 -561 337 817 166 -388 -837 -135 814 963 390 -586 -816 81
5912 81 551 410 -195 -628 -494 322 833 620 -279 -696 -509 182 769 198 -698 -940 -521 694 608 102
5932 102 -625 -684 -364 664 747 277 -226 -541 -87 941 640 14 -743 -490 439 517 527 -218 -849 -276 471
5953 471 473 307 -3 -983 -312 279 830 236 -750 -836 -105 359 654 -65 -665 -757 5 443 557 -84 -978
5974 -978 -902 130 797 719 -297 -668 -441 359 772 159 -438 -277 -270 188 804 77 -692 -539 -317 696
5994 696 739 207 -555 -582 -293 508 745 -103 -770 -438 54 619 370 -245 -543 -154 355 651 343 -520 -524
6015 -524 -357 787 782 396 -388 -841 36 673 411 -103 -361 -634 -259 470 618 -159 -787 -739 159 521 187
6036 187 -218 -721 -589 61 597 264 -442 -841 -400 156 674 403 -566 -582 51 578 450 227 -499 -689
6056 -689 -256 508 542 -9 -430 -541 220 640 539 -129 -507 -609 190 572 644 -323 -570 -320 201 471 166
6077 166 -96 -591 -119 497 588 116 -570 -710 -93 655 557 -6 -403 -411 92 741 383 -181 -824 -495 81
6098 81 741 455 -143 -744 -240 428 622 262 -357 -550 -247 514 570 71 -662 -773 -118 436 415 330 -652
6119 -652 -676 -152 237 681 -73 -291 -382 -21 749 341 -400 -567 -476 554 593 357 -463 -900 -164 419 609
6140 609 47 -259 -406 -371 352 677 -69 -651 -662 81 839 680 -13 -722 -425 291 566 711 -365 -543
6160 -543 -141 363 687 120 -537 -671 -262 216 785 358 -560 -605 -86 717 390 -23 -285 -736 388 492
6180 492 636 -12 -286 -490 206 751 478 -231 -493 -177 178 492 244 -364 -444 -142 218 486 328 -330
6200 -330 -437 -348 505 365 102 -456 -524 70 411 549 -142 -352 -267 220 510 385 -73 -274 -456 -41 560
6221 560 232 -50 -252 -138 378 722 146 -554 -322 -107 382 656 331 -522 -466 147 223 519 58 -379 -540
6242 -540 -238 257 271 -67 -532 -163 314 476 779 -92 -569 -275 479 655 300 -190 -431 -148 318 572
6262 572 265 -517 -480 35 482 270 1 -619 -653 -38 423 431 85 -326 -462 85 517 572 -269 -375 -372 -101
6284 -101 883 490 -312 -639 -307 -51 483 320 -498 -416 -96 301 348 -164 -375 -291 -112 660 304 -5 -166
6305 -166 -579 156 262 358 -196 -439 -352 161 286 99 -71 -281 -123 63 609 47 -400 -219 -499 350 456
6326 456 195 -463 -429 -67 553 513 -23 -539 -387 239 363 281 -205 -567 -474 420 626 174 -99 -467 -54
6347 -54 270 594 501 -383 -502 -171 149 74 274 -452 -492 47 464 321 -17 -514 -277 226 357 194 -268
6368 -268 -181 -361 223 415 290 -188 -428 -106 388 247 101 -322 -480 -279 479 290 60 -373 -454 -2 261
6389 261 398 250 -432 -506 188 369 314 186 -364 -599 103 523 351 -116 -424 -129 -15 727 321 -365 -198
6410 -198 -493 276 695 -5 -542 -83 -403 467 387 6 -396 -243 -75 497 435 116 -424 -190 218 404 22
6431 22 -286 -592 -282 256 270 337 -376 -419 -571 273 906 245 -422 -602 -63 597 447 -104 -459 -415 -38 665
6453 665 79 177 -382 -254 55 638 571 138 -536 -335 248 338 129 -416 -626 -118 194 481 124 -605 -533
6474 -533 -105 114 451 43 -336 -358 100 338 276 -125 -247 -532 184 230 -14 -271 -625 -398 -72 304 324
6495 324 -457 -453 -495 272 636 136 -451 -661 -314 85 511 -45 -303 -179 154 593 322 -12 -622 -315 124
6516 124 257 424 -136 -438 -325 227 662 256 -233 -198 -384 79 457 36 -130 -405 7 519 493 13 -349
6537 -349 -492 -69 410 260 354 -380 -15 -339 483 349 -15 -238 -408 37 404 383 -34 -430 -411 74 410
6558 410 -26 -224 -370 -95 225 256 219 -156 -250 -184 265 569 10 -264 -251 141 244 559 -435 -395 -188 379
6580 379 377 307 -183 -362 -313 16 250 40 -150 -153 103 162 308 -17 -194 -210 -165 -154 417 -74 -144 -192 168 -31
6604 -31 296 8 -645 -287 183 464 43 133 -336 -211 94 217 463 143 -349 -277 69 358 227 -60 -328
6625 -328 -15 339 371 109 -168 -375 -117 429 426 -78 -333 -161 -94 575 464 -64 -283 -184 -62 318 172 -93
6647 -93 -300 -98 249 641 103 -122 -385 -49 318 53 19 -192 -534 -257 200 317 -231 -560 -174 177 408
6668 408 148 -193 -311 -369 -103 471 182 -349 -226 163 212 607 -32 -202 -382 -487 377 697 388 -300 -404
6689 -404 -95 318 81 207 -32 -106 197 400 164 -236 -68 -262 -50 164 465 -424 -111 -330 72 383
6709 383 176 -243 -507 -456 288 759 309 -342 -133 -138 224 396 6 -240 -152 -64 306 233 -263 -486 -187 -140
6731 -140 162 256 -184 -277 -200 123 178 -18 15 -196 -134 267 309 475 -333 -123 9 249 15 274 -137 -159 62
6754 62 171 173 -255 -431 -433 7 255 351 11 -398 -79 7 270 129 -149 -47 -107 238 384 160 -174 -211 -115
6777 -115 -7 2 88 -390 -113 132 575 411 -38 -141 -356 318 252 101 -253 -524 -44 26 218 83 -87 -644
6799 -644 -588 134 290 250 -328 -475 187 327 31 227 -249 -289 -316 143 316 -42 -367 -97 -128 317 330 153
6821 153 -355 -196 -142 108 260 136 -58 -200 -69 128 6 -64 -221 -232 331 217 -42 -339 105 101 309 200
6843 200 -219 -268 -163 287 699 296 -202 -231 -192 115 573 171 -179 -144 -106 1 644 120 -355 -193 -402 196
6865 196 253 33 -433 -202 -105 180 272 -35 -53 -174 -13 118 319 244 -119 216 -17 427 375 50 1 -216
6887 -216 -4 191 82 -71 -226 -291 246 338 100 -418 -152 -109 280 242 -177 37 -426 203 154 255 32 -286
6909 -286 -141 171 195 189 127 -200 -148 98 103 344 -320 181 -125 16 213 33 -200 -232 -138 105 321 -9 -29
6932 -29 -176 78 281 139 -128 -354 -377 167 320 224 68 -300 -513 237 329 320 -141 -317 -122 130 459 73
6954 73 -360 -315 -90 275 407 -322 155 -326 -85 106 78 53 26 -131 -74 361 304 -412 -207 -201 24 336 -69
6977 -69 -156 -218 -74 94 55 361 -14 -308 -10 45 34 59 -172 -306 -160 226 106 346 -244 -62 -83 216 570
7000 570 29 181 11 29 47 111 3 -259 -136 93 306 -1 -27 -430 -102 83 308 133 187 -331 84 175
7022 175 110 75 60 -123 -42 165 173 82 -46 -105 6 178 84 79 -259 -91 201 34 423 -164 -518 -152 -10 -52
7046 -52 -42 -355 -526 28 53 186 208 47 -165 -84 11 38 145 -243 -288 -279 350 103 -374 -151 -200 -48 134 -214
7070 -214 -194 -484 -268 51 370 -188 -94 7 -141 95 69 125 -328 -18 -54 165 84 -99 -77 -180 -109 341 263
7093 263 24 -335 124 145 290 -97 -45 -266 -341 360 373 62 -157 -206 -263 55 20 -2 -91 -48 -205 42 127 59
7117 59 -164 -168 -258 149 236 -184 -60 -254 58 -1 354 -74 -451 -174 461 219 108 100 -199 -324 311 -77 128
7140 128 -123 -119 -241 303 459 88 18 -220 335 8 157 124 -151 -357 43 -130 286 -90 -90 64 -55 364
7162 364 275 -79 -94 -356 -10 221 92 -317 -400 -239 25 122 -2 -328 25 -138 51 377 65 -30 -205 191
7184 191 126 153 -144 0 199 225 472 61 -247 -60 84 60 -11 17 -229 -133 -253 65 247 202 -55 -70 -108
7207 -108 147 -50 80 -105 -28 16 140 248 -72 199 -343 225 247 -70 265 -294 1 -1 329 234 -204 -77
7229 -77 -127 303 107 229 -500 -163 75 299 -7 54 -83 -45 -52 -225 -62 36 -43 -242 -125 383 -36 2 -201
7252 -201 -101 -81 -17 69 -131 -111 88 22 -75 -67 87 -62 56 186 -259 95 -90 -140 67 491 121 -55 -281
7275 -281 -236 246 429 153 56 -119 -96 357 522 -5 -33 73 -89 172 25 150 -346 135 30 -82 -25 -24
7297 -24 -52 -434 -46 421 311 89 -327 28 67 62 173 -27 -143 130 23 -65 237 -63 -209 -351 242 34
7319 34 -83 293 -231 48 -7 169 114 227 -223 22 19 180 -24 -144 125 -250 -22 72 -176 -36 -279 394
7341 394 248 227 33 174 50 -122 123 201 -269 -176 67 252 -23 108 -78 -184 -249 175 -36 0 -23 17
7363 17 2 317 -17 -20 177 -369 195 101 276 161 -71 -130 39 -134 60 -138 -303 -69 38 138 -198 -146
7385 -146 239 156 121 258 313 -202 221 380 31 -108 -72 -37 62 127 24 -177 18 -165 0 5 -32 221 -43
7408 -43 -351 -145 218 -122 3 34 -143 78 75 129 -279 258 -260 258 146 106 193 11 -72 -218 151 38 -246
7431 -246 5 2 260 192 35 18 19 -220 -10 146 43 -39 116 283 54 86 56 168 23 58 -65 15 188 -444
7455 -444 21 -235 162 244 -160 -169 -241 221 -187 23 130 -322 -9 131 31 182 -19 203 192 79 37 -54
7477 -54 43 -410 -191 -49 104 305 -57 -400 -172 -79 59 212 -119 -18 124 -192 361 -152 -343 -248 103
7498 103 194 211 -110 -53 -175 -104 208 -183 40 -230 136 314 367 157 23 73 93 390 -124 158 -68 116
7520 116 341 -123 74 -84 -33 97 121 -29 199 -478 -182 -28 40 121 208 -69 83 6 62 181 -248 -2
7542 -2 -139 142 89 107 -43 117 37 -56 247 243 -21 44 -28 39 188 -102 -157 -10 -52 180 52 11 -33 -169 -211
7567 -211 -201 111 102 -23 109 42 53 351 -114 -319 -48 -151 -27 204 111 53 61 146 43 -204 -82 106 170 356
7591 356 47 141 -7 -85 -69 -201 330 -29 -216 -29 175 36 85 72 32 -335 40 -58 13 -97 -158 -138 112
7614 112 -2 12 -110 -206 2 108 -54 -207 -152 11 -111 461 398 210 83 -164 117 -185 -130 46 -118 75
7636 75 112 28 -203 7 101 -113 -119 311 -328 -122 35 185 382 -70 13 -113 404 -88 -127 -55 -74 -313 -56
7659 -56 -12 -174 156 -424 -12 -116 20 308 129 55 35 -104 -317 136 177 65 -80 -105 228 -111 -115 -170 -191
7682 -191 -29 173 28 -207 26 -237 -142 19 59 154 -249 65 125 67 -91 -207 -199 -11 291 11 161 -21
7704 -21 -190 -43 -142 -240 -59 -4 -231 -2 112 -267 283 -99 -137 329 74 -254 60 2 52 -23 -285 186 94
7727 94 -251 -54 284 -21 -117 81 -323 24 24 197 153 -297 -192 6 -202 11 85 -184 17 -131 72 28
7749 28 -207 257 360 -227 190 153 -127 -135 34 35 58 -151 -223 -17 -40 345 97 -97 -32 -29 118 101 171 -127 -169
7774 -169 347 -205 -92 -32 -119 -239 -295 45 -95 88 -171 -58 225 4 56 276 -78 -27 245 370 -163 -120
7796 -120 -143 226 -7 58 -89 -384 45 -4 210 -100 77 89 43 -70 52 29 174 -206 257 113 257 80
7818 80 226 -163 -193 -240 12 186 -187 -130 -209 -53 60 -198 64 165 79 13 -196 77 -96 -107 -292 119 -117
7841 -117 120 42 29 -194 -207 149 156 163 -65 -29 -75 291 145 -21 -349 56 20 167 -212 -183 92 -181 78 48
7865 48 -211 212 -237 67 -77 -203 -74 -219 51 279 246 -19 -382 -49 64 -38 -239 -49 208 -182 121
7886 121 -102 -34 -139 -20 -166 236 -10 -170 -257 -66 490 159 10 -179 -65 -84 -51 -420 -48 26 144 -410
7908 -410 -13 2 -155 223 -33 82 -111 150 142 26 -43 142 8 -258 101 92 129 177 225 -101 -250 21 -158
7931 -158 20 11 -152 178 -22 -166 245 -420 37 -118 -43 163 24 2 57 -115 -124 -160 -123 100 -243 -369 -31
7954 -31 -260 14 21 23 -126 -113 -49 69 275 -56 71 20 -171 88 82 -24 114 230 300 266 -1 35 81 49 -202
7979 -202 150 -170 -333 -73 32 -16 -247 185 19 252 -261 232 1 -332 -33 270 62 277 126 156 -21
8000 -21 -237 -148 -32 15 123 -288 183 -19 125 173 -198 -101 -252 191 3 -11 -37 22 -188 40 344 -105 61
8023 61 16 126 403 298 -70 -6 32 -155 -95 -146 16 34 -1 66 3 52 -50 9 -49 130 168 -106 11 45 75
8048 75 185 93 105 -93 -38 20 -56 187 67 295 -215 -50 -123 93 -207 -85 -24 183 104 -314 -197 -35 63
8071 63 -91 -53 -121 -108 -54 69 -9 39 -13 -98 -146 24 177 18 -48 -237 -445 16 -105 -89 -53 102 151 170 -148
8096 -148 67 189 -126 36 -122 -185 -271 3 71 -95 254 143 -95 52 -153 -168 -140 -55 59 -20 135 15
8118 15 266 144 449 -139 115 34 -56 -176 -134 54 -184 -63 18 0 -23 -139 -136 62 96 270 -180 144 -26
8141 -26 114 154 145 -41 -165 171 106 208 58 -364 183 28 217 36 -49 -314 45 147 218 149 -105 -29 -183
8164 -183 191 111 122 166 -212 -137 326 -10 -127 -39 141 114 148 -88 48 -224 -276 72 1 -2 -24 -185 -26 139
8188 139 -66 -100 34
8191C4
$$ Imaginary data points
##PAGE= N=2
##DATA TABLE= (X++(I..I)), XYDATA
0 0 0 0 0 0 0 0 -8 8 -8 8 -14 16 -16 24 -28 32 -40 48 -56 66 -74 90 -106 117 -137 157 -176 201 -228 255
30 255 -289 325 -360 407 -452 501 -559 621 -685 761 -844 933 -1031 1146 -1268 1407 -1568
47 -1568 1749 -1958 2206 -2494 2851 -3294 3857 -4611 5676 -7276 9975 -15383 30425 -158151
61 -158151 -591692 -267343 236765 377715 112317 -91656 -104097 -71223 -83276 -2880 110514
72 110514 69858 -100508 -82792 155897 235670 -75200 -390741 -250462 208811 419376 183910
83 183910 -155998 -264202 -188530 -65780 112147 293112 231173 -117282 -361409 -165237
93 -165237 207687 240567 -73564 -227679 11534 266174 143185 -181307 -277390 -81653
103 -81653 123706 186001 170048 76086 -151113 -338858 -196729 202736 394228 138129 -222637
114 -222637 -245669 -676 118015 11651 -60380 25775 91981 26830 -33409 -5703 -27373
125 -27373 -147239 -135445 138399 365354 171125 -274884 -419635 -89432 279230 276394 25135
136 25135 -122668 -95057 -53107 -37090 30050 95195 34108 -74724 -28042 125893 101254
147 101254 -148753 -276222 -45154 277048 283655 -8579 -230265 -191618 -42935 58532
157 58532 134352 176387 63080 -169168 -241140 -21488 209699 134218 -117015 -157724 68292
168 68292 208031 42068 -200724 -203277 7312 171736 173999 77985 -65891 -214367 -217796
179 -217796 16299 281948 253843 -58473 -273581 -146627 105986 148293 -5337 -86770
189 -86770 -9233 65242 38885 -5855 -21636 -67663 -117016 -24848 191696 255568 610 -310800
201 -310800 -285176 59048 307165 203106 -63532 -187252 -118534 -1170 74267 97133 42748
212 42748 -69720 -104797 21697 151630 63999 -162999 -210942 25392 256110 192095 -72521
223 -72521 -224677 -147583 15023 120141 150985 97918 -56913 -202389 -149454 82111 214455
234 214455 75301 -140364 -140194 52940 153704 30521 -132865 -128568 12343 124806 128875
245 128875 44988 -89514 -190697 -128995 94896 255101 143037 -129136 -238664 -74993
255 -74993 130117 135392 -4037 -76455 -28520 24798 22509 7844 -6562 -48830 -71802 11291
267 11291 144146 135671 -62268 -228493 -139808 109462 225519 97717 -94352 -152454 -73016
278 -73016 32461 90873 79420 -750 -86920 -73186 46837 115219 12935 -138472 -116458
289 -116458 75076 190670 79120 -117665 -170867 -55358 77316 117800 78365 -2883 -95312
300 -95312 -126004 -29415 114297 130107 -12030 -128403 -66937 78905 106703 -12933 -114386
311 -114386 -73765 46655 113506 78428 -19856 -115953 -130602 -16085 146591 175383 8562
322 8562 -176592 -160430 31985 161669 89211 -63480 -106026 -21469 59602 58846 5094 -49186
334 -49186 -71084 -28495 70771 127730 44974 -119881 -173855 -31228 154948 170295 8841
345 8841 -140041 -132923 -10422 96386 107429 26264 -77555 -107517 -19604 102509 107779 -31812
357 -31812 -149002 -83068 97935 168282 41060 -128503 -151610 -23771 108352 129100 43278
368 43278 -69926 -125778 -73809 55460 137483 73168 -75063 -132757 -31984 98562 100979
379 100979 -15938 -105649 -71513 36135 102104 70920 -29471 -114972 -101152 23811 146298
390 146298 122617 -41899 -167346 -108034 66604 153062 65059 -76400 -111428 -27040 66240
401 66240 77168 14855 -58706 -77401 -15455 76482 98378 6683 -109146 -113132 11378 127642
413 127642 105234 -25527 -118494 -88139 18690 95352 80682 -7004 -87715 -81051 14424 99570
425 99570 71550 -47618 -115895 -42323 88791 115808 6815 -107749 -100388 9754 100923
436 100923 89404 -3468 -87309 -90150 -8524 82635 92821 3686 -90472 -82030 18437 92459
448 92459 57146 -41134 -87240 -35660 52334 84131 31225 -54335 -92699 -40249 62950 113433
460 113433 44151 -80669 -122916 -29423 96000 112320 5702 -98270 -87378 14036 89471
471 89471 65118 -23932 -85611 -59120 31373 94617 59368 -45839 -109145 -56414 61961 116471
483 116471 46898 -70172 -110139 -37386 66957 100198 35549 -60991 -96168 -33346 67264
494 67264 99068 22273 -84279 -99815 -280 104191 91836 -24916 -114071 -79826 38054
505 38054 113462 71329 -41317 -110326 -68177 41198 108706 64541 -46873 -108008 -52581
516 -52581 58005 102141 34282 -66767 -92209 -19706 71230 86510 12479 -75370 -89060 -12055
528 -12055 82785 96432 6013 -96147 -99085 4531 103342 90060 -19181 -104279 -75465 30930
540 30930 98105 59497 -39476 -93991 -49409 48078 95760 39840 -61281 -98213 -29878 71645
552 71645 96899 18949 -77488 -91120 -11873 75071 83825 9418 -72725 -80501 -5602 75397
564 75397 77201 -5051 -83298 -71696 20552 91801 60676 -38019 -95128 -48607 49445 94792
576 94792 40663 -55262 -92977 -33840 59643 90594 27700 -63574 -86413 -16167 69598 77254
588 77254 2151 -72289 -66312 9588 73254 58349 -17718 -75795 -55904 23136 81318 56335
600 56335 -29939 -88655 -53766 40555 92256 45860 -48379 -89320 -33830 55995 83927 22328
612 22328 -60751 -77992 -11718 68304 76678 707 -78163 -73433 11774 86689 69363 -22682
624 -22682 -90226 -62023 30257 88413 55379 -31931 -84590 -50159 35374 84255 44846 -42512
636 -42512 -85218 -36103 54115 87036 24701 -66295 -85982 -12171 74657 83602 4946 -79426
648 -79426 -82348 360 82985 79614 -6691 -86258 -74510 16355 88726 63991 -28375 -86669
660 -86669 -50236 38151 83060 39746 -44657 -81253 -33698 49978 84868 33087 -56468 -89520
672 -89520 -28070 64827 90003 19829 -70274 -84629 -10520 71213 75590 1008 -71559 -68460
684 -68460 6347 74805 63862 -18194 -83644 -58430 31645 89340 50608 -43235 -91211 -41734
696 -41734 49043 86420 34677 -48896 -80969 -31697 48216 77931 25679 -53571 -76005 -16052
708 -16052 61803 71343 341 -71747 -65378 12262 75620 58052 -19597 -77833 -56633 22304
720 22304 79831 56299 -26041 -81918 -51756 33777 81873 39745 -43407 -75377 -23595 50212
732 50212 66251 11369 -54103 -61645 -4663 58538 63663 1869 -67084 -68483 4391 75525 66599
745 66599 -13704 -77256 -57339 20662 72440 46393 -24492 -65415 -37699 29161 66065 33151
757 33151 -38547 -72188 -25054 55151 78086 14432 -67381 -76884 -3531 71979 70721 -1225
769 -1225 -67554 -64062 959 63619 62093 -3462 -65523 -56895 15177 72026 48183 -31416 -76163
782 -76163 -34333 46077 76168 25920 -50052 -74984 -25439 51036 79216 28718 -52741 -82253
794 -82253 -25772 59148 80407 13327 -65553 -68234 2910 65158 53074 -14914 -64337 -45428
806 -45428 20887 67275 46500 -24951 -77589 -51094 33313 87356 48316 -42297 -86441 -38622
818 -38622 45588 76696 28230 -43034 -65019 -20849 41675 61048 15710 -50424 -64766 -4651
830 -4651 66449 65755 -11108 -79530 -61511 22492 80872 54316 -24270 -74111 -50718 18873 68824
843 68824 51223 -18316 -68505 -45256 28672 70320 30777 -44974 -67596 -12165 56871 61478
855 61478 -296 -60451 -59577 -624 60202 64245 3997 -63683 -69646 -3485 67807 66200 -7404
868 -7404 -68587 -50506 20551 61479 32299 -28388 -54404 -22418 33581 56792 21550 -40371
880 -40371 -66804 -22700 52291 76243 17418 -61206 -73706 -8604 59859 61558 2433 -51529
892 -51529 -49374 387 46216 43633 -5304 -51418 -41858 19337 64417 37293 -36719 -73987 -29143
905 -29143 48704 74918 23343 -49067 -68661 -22582 41792 65027 25444 -39511 -63810 -19971
917 -19971 46063 59806 4096 -56568 -50895 15652 63668 39736 -27598 -65211 -36202 28611
929 28611 67426 42349 -25963 -72585 -47576 28241 76574 44127 -34959 -72579 -28801 41857
941 41857 60257 12166 -43818 -48830 -2108 46599 48137 -1866 -54821 -55424 4786 67283 62006
954 62006 -12391 -75723 -58926 19029 72628 48629 -20372 -61923 -39088 19213 53711 33337
966 33337 -21847 -54491 -27438 35289 61628 16795 -52145 -65372 -5502 62135 63828 -1258
978 -1258 -62342 -59661 -1091 56098 58683 5297 -53039 -57700 -1931 55659 50559 -11913 -58916
991 -58916 -36358 28406 59746 22532 -39448 -57885 -16603 41792 60721 20406 -42640 -66558
1003 -66558 -24295 45595 69951 20650 -50027 -64246 -9584 49813 49462 -3451 -46370 -36572
1015 -36572 10838 45790 32736 -16487 -52389 -35080 24097 64484 37225 -33713 -71110 -32370
1027 -32370 39729 66911 24513 -37303 -56314 -19348 32213 47817 14719 -32238 -45729 -8316
1039 -8316 41791 46394 -5370 -55511 -44149 19127 63188 39753 -26133 -63099 -36240 23977
1051 23977 58615 37500 -19068 -56630 -37406 21369 57634 30100 -30600 -55284 -15088 42094
1063 42094 49180 152 -49347 -44090 7261 50799 44927 -5687 -54263 -51269 4321 58721 54113
1076 54113 -8241 -62110 -48007 16952 58778 34382 -23561 -50491 -21714 27457 46028 16847
1088 16847 -31635 -49609 -15357 40230 58237 13035 -50641 -62439 -6014 56084 57551 258
1100 258 -52838 -48954 1411 45998 42285 -2657 -43963 -39374 8243 49819 36288 -21339 -57392
1113 -57392 -27981 34884 60686 20233 -41261 -58154 -16331 39764 55709 18287 -35972 -55698
1125 -55698 -19772 37969 55531 12210 -44551 -50522 150 49718 40692 -13452 -50876 -32344
1137 -32344 19570 50860 30841 -20426 -53626 -34227 22459 59145 34907 -27349 -60671 -28338
1149 -28338 33185 56007 17934 -35465 -46418 -8724 34642 40533 4382 -37133 -41536 -737
1161 -737 43921 44122 -5296 -53497 -44174 14127 56985 38396 -19344 -52897 -31121 19696 47118
1174 47118 27054 -18743 -44087 -24012 22360 46459 19241 -31867 -48727 -9599 41734 46309
1186 46309 22 -46407 -43452 4145 45514 40588 -4057 -44134 -40943 4205 46597 39712 -9998
1199 -9998 -49469 -33772 19885 50405 24136 -27975 -47299 -15102 31991 45405 12117 -33527
1211 -33527 -46447 -12689 37011 49776 10224 -42286 -50247 -4119 45938 44865 -4437 -45981
1223 -45981 -36690 10088 43372 31177 -12670 -43757 -29479 16892 47566 28477 -22900 -52101
1235 -52101 -24747 31222 53386 18264 -35109 -49824 -12492 35426 45453 9575 -35072 -43207
1247 -43207 -6935 37198 42721 1436 -43037 -40792 6998 47432 35447 -14938 -48678 -30214
1259 -30214 18986 47721 27521 -20019 -46877 -26240 21906 48697 24689 -27074 -49939 -18207
1271 -18207 32944 47684 10184 -37613 -43711 -2981 39252 39362 -815 -40289 -38774 3087 43166
1284 43166 38582 -7608 -46597 -35921 13147 48145 30796 -19098 -46793 -23947 22242 43800
1296 43800 20014 -23684 -42608 -17573 26755 43593 14104 -31985 -44559 -8639 37378 42909
1308 42909 1538 -40563 -38258 3552 40050 34069 -6132 -39697 -31963 8702 40629 30120
1320 30120 -13055 -43515 -26516 19973 44772 20307 -25524 -43000 -14552 28682 40798 10628
1332 10628 -29729 -39784 -8868 31492 40127 5752 -36032 -39641 279 40012 35595 -7032
1344 -7032 -41464 -30486 12411 41157 25860 -15113 -39962 -24034 17810 42286 22535 -22660
1356 -22660 -44324 -18365 28239 44541 12393 -32550 -41522 -5959 33603 36685 2307 -33446
1368 -33446 -35104 -730 35076 34894 -3287 -39252 -34025 8814 43093 30344 -15551 -43392 -24203
1381 -24203 19401 41671 20520 -20655 -40018 -18284 22569 40921 16664 -26647 -42179 -11499
1393 -11499 32808 40904 3885 -36572 -36882 1880 36902 32608 -4782 -36219 -30901 5534 37404
1406 37404 31506 -8208 -40987 -29966 14849 43738 24426 -21062 -42571 -17470 25278 39543
1418 39543 12598 -25842 -37340 -11393 26900 39027 9965 -31839 -40615 -5368 37005 38726
1430 38726 -2397 -39183 -32801 8044 37227 26302 -9489 -34548 -24932 10253 36037 25288
1442 25288 -14033 -39791 -22935 20958 42980 16882 -27386 -40639 -9957 29109 35603 6986
1454 6986 -26918 -33477 -6357 27034 33949 4982 -31054 -34510 1166 36846 30891 -10516 -39045
1467 -39045 -23874 16211 37079 19247 -16903 -34613 -18541 15792 35813 19881 -17970 -39242
1479 -39242 -17638 24539 39668 9369 -30348 -34867 -1118 31321 28503 -3117 -29568 -26177
1491 -26177 2711 30750 29289 -4084 -36651 -31457 9906 41978 27660 -17059 -41274 -19136
1503 -19136 21213 35376 12359 -19887 -29877 -11211 19072 31310 11336 -23367 -35496 -7348
1515 -7348 31974 36879 -478 -37722 -32808 7071 36387 26322 -7599 -31642 -24696 4845 30029
1528 30029 26390 -5743 -33863 -25285 13621 38957 18568 -24018 -38158 -8742 28866 33395
1540 33395 3614 -27162 -30853 -5692 24662 33213 9166 -27367 -37125 -6454 33333 35233 -3234
1553 -3234 -36152 -26480 11846 33624 17406 -14672 -29702 -15396 13988 31144 19273 -15245
1565 -15245 -38361 -20865 22703 43505 15908 -28869 -39938 -7741 29610 31203 1841 -24258
1577 -24258 -24215 -2251 21797 25224 2109 -27353 -28864 4423 36669 27839 -13992 -41371 -21677
1590 -21677 20550 37936 15919 -17612 -30943 -16087 12063 29750 18860 -12603 -32498 -16674
1602 -16674 20396 34474 6637 -30026 -30557 4820 32927 23332 -8947 -29989 -22129 5546 28177
1615 28177 26187 -1622 -31724 -30376 4999 36721 26366 -14157 -35670 -15112 20167 28648
1627 28648 5524 -20927 -23201 -3680 19156 24920 6751 -22982 -33234 -7143 31347 36926
1639 36926 762 -36857 -32230 6645 33445 22498 -8650 -25661 -16240 6127 22242 16917
1651 16917 -6694 -27167 -18067 15667 35265 13887 -26382 -37482 -6426 31013 32513 1686
1663 1686 -26616 -27295 -4883 20031 26638 8530 -19972 -29293 -5642 26759 28401 -5374 -33110
1676 -33110 -19755 17023 32858 11645 -19721 -29306 -10614 15983 29166 16191 -13651 -33806
1688 -33806 -20740 17386 37944 15310 -24481 -33732 -4553 26430 24136 -3821 -23978 -17435
1700 -17435 5317 22278 18855 -3884 -27375 -25675 6268 36624 27681 -13177 -40043 -21697
1712 -21697 18152 34852 14110 -16840 -25766 -10125 12120 22074 10849 -13227 -25962 -9490
1724 -9490 22017 30792 2010 -32092 -30189 6919 35156 24829 -9358 -30457 -20673 5186 24504
1737 24504 22817 -366 -24664 -24433 3650 28975 20957 -13361 -31371 -10316 22901 27761 1391
1750 1391 -24384 -23850 -972 21515 25036 5736 -21326 -30846 -8707 25402 33442 3379 -29928
1763 -29928 -27498 5426 28050 16757 -10806 -22930 -10132 11423 20971 10812 -11538 -26104
1775 -26104 -14904 16176 34247 14504 -23796 -36169 -8817 26704 30897 3170 -23060 -22334
1787 -22334 -1750 17054 19198 2953 -17563 -20923 262 25205 21901 -9457 -32254 -18382
1799 -18382 17901 34045 12881 -19610 -29021 -11010 14536 25521 14256 -10911 -26637 -15768
1811 -15768 13475 28306 10700 -20912 -26949 371 26884 20329 -8611 -26284 -15900 8723
1823 8723 24655 18155 -5184 -25966 -23171 4419 30477 25085 -8947 -32649 -18498 15316 28290
1836 28290 9232 -16583 -21545 -3773 16273 19217 3453 -17657 -22997 -4940 23431 29100 1393
1849 1393 -30261 -29407 4001 31776 23751 -7078 -26745 -17711 6171 21097 15662 -4393 -20595
1862 -20595 -16164 8021 26022 13968 -16716 -29843 -8075 24151 29304 2880 -25299 -25726 -1632
1875 -1632 21221 23607 5376 -18464 -25211 -6329 20569 25315 1184 -24498 -20883 7502 26546
1888 26546 13765 -13556 -24501 -9436 14247 23707 11000 -13178 -25975 -14041 14006 30029
1900 30029 14138 -18414 -30400 -8799 20974 24919 1439 -20495 -18051 2022 18550 15392
1912 15392 -3011 -19545 -17546 4336 25029 19971 -8943 -30428 -18849 14005 30657 14524
1924 14524 -15320 -26392 -9924 13164 21781 9046 -11645 -20754 -8479 14844 22936 4027
1936 4027 -21547 -23194 1896 26070 20755 -6997 -26552 -17778 7800 23939 17475 -4851 -22638
1949 -22638 -18661 4378 24224 17674 -8490 -25098 -12813 14631 24792 5957 -18510 -20893
1961 -20893 -1701 18846 20218 1548 -19136 -22552 -3303 20968 24706 2313 -23922 -24313 2047
1974 2047 25293 19141 -6358 -23131 -13877 8810 20625 10832 -9809 -21129 -10751 12391 24562
1987 24562 10510 -17188 -27793 -7860 20534 26385 3974 -21312 -23299 -2024 19383 19739 1338
2000 1338 -17480 -19090 -65 19387 18610 -3763 -23440 -16758 9622 26017 13609 -13549 -25699
2013 -25699 -10814 14099 24161 9742 -13324 -23693 -10777 13374 24189 9005 -15581 -23516
2025 -23516 -4786 18745 20898 -872 -20618 -17277 4178 20832 15675 -4991 -21210 -16943 5528
2038 5528 23419 18172 -7291 -25343 -16245 10326 25457 12266 -13185 -22438 -7574 13897 19570
2051 19570 5056 -14813 -19303 -3468 16769 20492 1488 -20666 -21470 1441 23504 20005 -4420
2064 -4420 -23074 -17252 6023 21276 14930 -5888 -19800 -13406 7111 20673 12104 -10752 -22261
2077 -22261 -8809 15189 22726 4820 -18200 -21843 -2601 19033 20802 1698 -18206 -20047 -1869
2090 -1869 18900 19909 157 -19994 -18007 3665 21286 14905 -7911 -21118 -10742 10570 20386
2103 20386 9175 -11535 -20578 -9262 13078 22120 8855 -14886 -23585 -7425 17032 22769 3724
2116 3724 -18391 -19471 -894 17396 16346 -1630 -17925 -15570 3752 19970 15072 -6525 -22657
2129 -22657 -14244 10288 24190 12059 -12387 -23110 -9612 13115 21359 8342 -12536 -19612
2141 -19612 -6775 12746 18953 4910 -15625 -19822 -1172 19029 18283 -2711 -20972 -16565 5428
2154 5428 21352 15523 -5825 -21097 -14946 5700 21609 14791 -7730 -21855 -12479 10465 21219
2167 21219 8231 -13309 -19848 -4229 14836 17599 1998 -15545 -17821 -1480 17070 18760 947
2180 947 -19161 -19508 599 20328 18251 -3600 -20188 -14545 5498 18669 11947 -6843 -18146
2193 -18146 -10006 9277 19291 8307 -12344 -21012 -6943 15527 21834 4055 -17644 -20241 -2002
2206 -2002 17496 17948 669 -16602 -16333 -436 15827 15306 -1469 -17202 -13997 5282 19290
2219 19290 11615 -9049 -20236 -9605 11544 20599 8506 -12261 -20168 -8073 11824 20603 7968
2232 7968 -13172 -20799 -5683 15414 18615 1542 -16746 -15584 2726 17372 12693 -5118 -17336
2245 -17336 -12291 5730 18378 13053 -6504 -20542 -12976 8462 21378 11565 -10245 -20329 -8458
2258 -8458 11080 17150 5521 -11470 -16378 -3901 12618 16608 1751 -15774 -17260 695 19265
2271 19265 17158 -4482 -21060 -15049 6128 20285 13241 -6181 -17880 -11337 6232 17140 10496
2284 10496 -7161 -17531 -8112 10272 18372 4806 -14043 -17421 -2112 15667 17513 1003 -16506
2297 -16506 -17096 -1560 16140 17740 1228 -17055 -17524 1065 18120 15039 -4806 -18110 -10999
2310 -10999 8150 17362 7385 -10041 -16462 -6060 10767 17474 6086 -12694 -19406 -6115 13927
2323 13927 20044 4478 -15113 -18010 -2376 14412 15109 403 -13475 -13358 1189 14443 12370
2336 12370 -3190 -16877 -12097 6701 19740 11342 -10262 -20912 -8779 11981 19724 7280
2348 7280 -11438 -17633 -6566 10895 16229 5109 -11232 -15245 -2592 13358 14566 -1324 -15894
2361 -15894 -12631 4642 16879 11588 -5598 -17022 -11526 5123 17583 12868 -5204 -18399 -12424
2374 -12424 6748 18593 9914 -9282 -17351 -5425 11732 15155 1732 -13006 -13766 -60 14148
2387 14148 14288 -696 -16104 -15042 1863 17373 15246 -2924 -17605 -13217 4256 15774 10742
2400 10742 -4484 -14253 -8615 5407 14108 7698 -8000 -15640 -6249 11198 17701 4091 -14907
2413 -14907 -18070 -1687 16150 16766 510 -15504 -15600 -74 14523 13838 -678 -14299 -12255 3304
2427 3304 15247 10288 -6626 -16031 -7174 9763 15982 5631 -10884 -16102 -5434 10744 16295
2440 16295 6262 -10166 -17294 -6423 11802 17251 3826 -13306 -15096 -821 13976 12606 -2340
2453 -2340 -14528 -10195 5036 15159 10154 -5983 -17095 -10147 8265 18463 9556 -9443 -17910
2466 -17910 -7585 10164 15819 5566 -9407 -13434 -4211 8909 12578 2793 -10401 -12965 -958
2479 -958 13425 13774 -1538 -16199 -13570 4157 17750 12463 -4988 -16940 -11519 5214 15696
2492 15696 10294 -5809 -15331 -8300 7526 15203 5368 -10472 -14386 -1486 12677 13295 -492
2505 -492 -13652 -12435 994 13289 12922 29 -13293 -14093 -239 14140 13509 -1837 -14606 -11403
2519 -11403 4142 14367 8739 -6657 -14201 -6063 8444 14285 5018 -10276 -15799 -4441 12310
2532 12310 16469 2765 -13891 -16042 -1642 13726 13621 -549 -12335 -10886 896 11019 9681
2545 9681 -1610 -11502 -8986 3868 13562 8725 -6439 -16055 -7975 8940 16279 6340 -10032 -15837
2559 -15837 -5832 9380 15163 5212 -10242 -14603 -3684 11036 13898 712 -13106 -11956 3175
2572 3175 14251 9395 -5758 -14315 -8021 6205 14218 8445 -5968 -14436 -9000 5726 15168 8564
2586 8564 -6911 -15219 -6476 8125 13679 3918 -9398 -12628 -1743 10353 11751 791 -12312
2599 -12312 -12960 785 14611 13440 -2433 -16446 -12611 4598 15766 9707 -5424 -13902 -7132
2612 -7132 5802 11909 6165 -5622 -11857 -5419 7409 12534 3845 -10052 -13768 -2319 12124
2625 12124 13233 1178 -12345 -13023 -537 11919 12697 416 -12309 -12484 979 13355 11220
2638 11220 -3602 -14195 -7931 7374 14041 5398 -9499 -13436 -3563 9814 12620 3058 -9458
2651 -9458 -13178 -3892 9648 13979 3394 -10613 -13269 -1543 10867 11183 -499 -11000 -9427
2664 -9427 2243 11137 8267 -3013 -12552 -8881 4895 14616 8765 -7329 -16030 -7332 9072 15356
2678 15356 5357 -9814 -13575 -3181 8905 11207 2165 -8710 -10682 -1260 10051 10433 -703
2691 -703 -11813 -9894 2931 13354 9429 -4367 -13443 -8497 4240 12945 8464 -4179 -12808 -8588
2705 -8588 4723 13522 7436 -7333 -14056 -4610 9979 12804 1012 -11563 -10967 763 12077
2718 12077 10378 -1737 -12062 -10575 1334 12328 10683 -2177 -13336 -9724 3536 12498 7613
2731 7613 -4874 -11674 -5754 5700 10952 4697 -6393 -11559 -4803 8158 13139 3810 -10469 -14401
2745 -14401 -2554 12138 12999 211 -12369 -11220 1399 11615 9301 -1743 -11004 -8440 3094
2758 3094 11457 7374 -4594 -12065 -6164 7051 12530 4591 -8127 -12221 -3972 7997 11722 4093
2772 4093 -7927 -12011 -4096 8306 12130 3226 -9889 -11931 -237 11735 10210 -2835 -12403
2785 -12403 -8375 4689 12246 6856 -4989 -12408 -6781 5606 12885 6412 -6671 -13067 -5445 8317
2799 8317 12070 3130 -8368 -10401 -2068 8459 9221 1114 -8649 -9406 -727 9633 10308 -242 -11915
2814 -11915 -10701 2521 13310 9596 -3749 -12866 -7664 5256 12203 6473 -5154 -11052 -5388
2827 -5388 6297 11425 4172 -8018 -11419 -2114 9660 10925 195 -10438 -9691 905 10148 8859
2841 8859 -635 -9877 -9012 643 10004 9518 -1782 -11002 -8522 3324 12467 6826 -5958 -11801 -4666
2856 -4666 7241 11115 3514 -7923 -11352 -3030 9061 11634 2434 -9806 -11515 -568 10536
2869 10536 10358 -1142 -10785 -8175 2439 9862 6779 -2754 -9402 -6545 3112 10080 7210 -4212
2883 -4212 -11955 -6413 6495 12414 5387 -7467 -11785 -3779 7835 11098 2530 -8008 -10292 -1828
2897 -1828 8627 10238 -13 -10046 -9278 2316 11211 8029 -3578 -11403 -6380 4687 10493 5800
2911 5800 -4510 -10325 -6046 4465 10751 5855 -5434 -11054 -5039 6826 11082 3062 -8578 -9972
2925 -9972 -930 8888 9165 -131 -9570 -9487 521 10215 9523 -1571 -11561 -9169 3620 12126 7767
2940 7767 -4996 -10898 -5262 5632 9686 3930 -5826 -9298 -3500 6201 9455 3138 -7025 -10456
2954 -10456 -2333 8874 10598 885 -9674 -9289 444 9576 8569 -1267 -9051 -8054 1492 9350 7488
2969 7488 -2993 -10613 -6577 5261 11433 4801 -7047 -10877 -2820 7679 9953 1768 -7418 -9417
2983 -9417 -1899 7324 9325 1948 -7663 -9651 -754 8943 8747 -870 -9524 -7489 2783 9696 6357
2998 6357 -3274 -9720 -6191 3941 10545 5781 -5094 -11670 -5346 6709 11390 3656 -8109 -10532
3012 -10532 -1328 7964 8843 232 -7720 -7602 259 8012 7671 -635 -8570 -8202 1848 10042 7509
3027 7509 -3496 -10504 -6528 4399 9935 5437 -4211 -9128 -5341 4132 9787 4700 -5799 -10492
3041 -10492 -3062 7801 10035 900 -9055 -9210 680 9761 7880 -1478 -8720 -7315 1317 9179 7852
3056 7852 -1721 -9452 -7271 2830 9919 6201 -4385 -9457 -3805 5704 8613 2957 -6137 -8604
3070 -8604 -2520 6441 9106 2664 -7359 -10311 -1615 8998 9924 -72 -9782 -8538 1514 9243
3084 9243 6650 -2645 -8427 -5438 2796 8528 5359 -3460 -9387 -4859 5186 10506 4010 -6854
3098 -6854 -10037 -2518 7057 9244 2108 -6510 -8256 -2031 5846 8302 1906 -7113 -8499 69 9023
3113 9023 7862 -2301 -9663 -6315 4235 9684 4944 -4793 -9378 -4478 4321 9124 4969 -4691
3127 -4691 -9682 -4596 5307 9611 2808 -6997 -8439 -795 7228 7151 -689 -7108 -6361 732 7421 7459
3143 7459 -947 -8881 -7757 2078 10111 7439 -3721 -10358 -5575 5119 9130 3784 -4953 -7944
3157 -7944 -2439 4712 7506 2508 -5910 -8278 -1601 7900 8921 -122 -8997 -8195 1190 9029 7110
3172 7110 -1202 -7626 -6565 1084 7211 6191 -824 -8015 -6474 2984 9008 4904 -5260 -9309 -2595
3187 -2595 6410 8642 1367 -6938 -8288 -1678 6525 8425 1938 -6991 -8959 -1453 7795 8498 -410
3202 -410 -8228 -6541 2249 7759 4420 -3415 -7383 -3531 3429 7480 4275 -3927 -9225 -4876 5030
3217 5030 10128 4408 -6222 -10004 -2590 6766 8181 883 -6166 -6523 -341 6036 6162 -308 -6714
3232 -6714 -6876 1173 8875 6516 -3475 -9555 -4912 4895 9093 4254 -4542 -8109 -3993 3556 7426
3247 7426 4155 -3515 -7858 -3984 4724 8004 1537 -6836 -7435 719 8077 6427 -1865 -7750 -6049
3262 -6049 1409 7771 6480 -1175 -8173 -7207 1749 8628 6343 -2980 -8933 -3878 4376 7326 1645
3277 1645 -5379 -6379 -1176 5311 6512 1218 -6259 -7988 -1593 7347 8627 355 -8223 -8049 883
3292 883 8257 6234 -1747 -7054 -5152 1658 6186 4492 -2309 -6857 -4325 3767 8316 3360 -5777
3307 -5777 -9152 -2043 7193 8483 908 -6613 -7516 -838 5659 6564 1687 -5227 -6818 -1157 6490
3322 6490 6860 -976 -7291 -5214 3288 8066 3768 -3921 -7455 -3286 4209 7574 4032 -3768 -8435
3337 -8435 -4689 4604 8747 3651 -5315 -7980 -1799 6438 6345 -632 -6166 -4767 1217 6031 4597
3352 4597 -1135 -6607 -5913 1649 8332 6647 -2939 -9186 -5387 4065 8598 3726 -4072 -7238 -3031
3367 -3031 3475 6101 2591 -3986 -6738 -2013 5567 7061 449 -7306 -7665 1115 8397 6391 -1989
3382 -1989 -7797 -5503 1806 6689 5243 -762 -6176 -5467 1337 7335 4768 -3333 -7631 -3043 4949
3397 4949 7124 1139 -5766 -6171 -749 5693 6467 1075 -5748 -7507 -1639 6662 7495 682 -6938 -6863
3413 -6863 1093 7270 4833 -2295 -6554 -3391 2691 6005 3353 -3083 -6870 -3398 4097 7764 3349
3428 3349 -5265 -8418 -2261 6493 7646 762 -5834 -6212 -529 4794 5565 125 -5235 -5268 497 6040
3444 6040 5281 -1732 -7841 -4620 3732 7843 3816 -4288 -7186 -3144 4193 6870 3104 -3391 -6650
3459 -6650 -3208 3593 6941 2268 -5131 -6499 -451 6173 5672 -993 -6429 -4849 1201 6260 5099
3474 5099 -1522 -6628 -5319 1574 7077 5675 -2395 -7804 -4227 3590 6880 2651 -4129 -6191 -1267
3489 -1267 4247 5336 1062 -4374 -6005 -909 5598 6470 441 -6778 -6318 813 6996 5951 -1292
3504 -1292 -6745 -4606 1903 6039 4336 -1703 -6217 -3645 2566 6474 3121 -3932 -6873 -2103 5206
3519 5206 6689 1090 -5616 -6282 -551 5582 5911 822 -5111 -6309 -707 5213 5733 -303 -5915 -4980
3535 -4980 1669 6420 3769 -2523 -6348 -2937 3266 6095 2700 -3648 -6259 -3303 3457 6780 2812
3550 2812 -4541 -6798 -1929 4682 6296 688 -5476 -5150 372 5288 4413 -901 -5532 -4365 1421
3565 1421 6225 4730 -2294 -6836 -4154 3202 6977 3644 -3780 -6735 -2662 3900 5819 2002 -3616
3580 -3616 -5687 -1556 4014 5285 880 -4903 -5695 311 5746 5446 -1442 -6403 -4789 1462 6292
3595 6292 4586 -1694 -6119 -4131 1757 5966 4062 -2697 -6222 -3230 3410 6004 2052 -4169 -5902
3610 -5902 -1254 4641 5471 752 -4844 -5400 -671 5268 5691 158 -5889 -5971 531 6083 4750 -1222
3626 -1222 -6047 -3709 2021 5637 3253 -2913 -5723 -2531 3165 5680 2152 -3963 -6437 -2035 5015
3641 5015 6363 1296 -4941 -5538 -380 4761 5510 229 -4880 -4604 433 5192 4453 -998 -5434 -4440
3657 -4440 2342 5808 3831 -2847 -6134 -2848 3294 6014 2666 -3493 -6144 -2328 3410 5734 1938
3672 1938 -4390 -5840 -1305 4676 5369 -47 -4760 -4587 630 5258 4221 -1092 -5460 -4054 1457
3687 1457 5668 3963 -1970 -6385 -3752 2618 5950 2884 -3252 -5819 -2276 3544 5108 1287 -3671
3702 -3671 -5307 -1009 4597 5216 423 -5274 -5389 521 5535 4820 -788 -5786 -4343 1627 5787 3386
3718 3386 -1791 -5393 -3065 1928 5085 2722 -2852 -5356 -2147 3561 5203 1332 -4372 -5604 -744
3733 -744 4754 5075 500 -4687 -4854 -257 5010 4952 89 -4660 -4521 853 5253 3921 -1880 -5240
3749 -5240 -2914 2468 4958 2526 -3001 -5314 -2047 3180 5462 1784 -3939 -6111 -1804 4444 5264
3764 5264 878 -4139 -5013 -145 4557 4407 -344 -4486 -3634 938 5052 3464 -1531 -5419 -3584 2431
3780 2431 5770 3128 -3080 -6021 -2298 3007 5349 2229 -3093 -5107 -1763 3366 4690 1108 -3982
3795 -3982 -4477 -101 4371 4243 -242 -5375 -4081 1364 5200 3795 -1802 -5210 -3855 1775 5567
3810 5567 3725 -1937 -5362 -2957 2466 5539 2070 -3484 -5072 -1175 3598 4650 723 -4123 -4373
3825 -4373 22 4421 5005 27 -4951 -4440 319 4960 4503 -926 -5348 -3762 1449 4806 2643 -1990
3841 -1990 -4688 -2429 2340 4531 2015 -3130 -4961 -1686 3990 5584 1172 -4243 -5209 -471 4652
3856 4652 4491 27 -4069 -4322 221 4322 3773 -606 -4380 -3384 1191 4791 2968 -2639 -5328 -2141
3872 -2141 3022 5031 2094 -3306 -5089 -1965 3211 5117 1701 -3366 -4770 -1217 3536 4897 332
3887 332 -4174 -4026 452 4192 3602 -997 -4436 -3213 1404 4805 3438 -1935 -5327 -3420 2382 5792
3903 5792 2813 -2679 -5184 -1995 2875 4646 1184 -3238 -3890 -879 3243 3768 256 -3813 -4534 369
3919 369 4894 4415 -840 -5397 -3851 1300 4927 3436 -1503 -4679 -3030 1564 4491 2616 -1845
3934 -1845 -4474 -2238 2688 4372 1521 -3850 -4475 -449 4093 4295 -302 -4612 -3821 7 4315 4338
3950 4338 174 -4210 -4384 276 4363 3577 -1334 -4525 -2624 1846 4292 1922 -2505 -3999 -1252
3965 -1252 2643 4491 1482 -3358 -4871 -1718 3869 4984 960 -4045 -4471 -300 3859 3868 65 -3475
3981 -3475 -3112 517 3598 2727 -1255 -4020 -2828 1766 4712 2304 -2792 -5559 -2189 3332 5305
3996 5305 2069 -3060 -4434 -1688 2437 3960 1310 -2802 -3986 -738 3312 3727 -535 -4093 -3251
4011 -3251 1345 4442 2567 -1937 -4522 -2528 1770 4461 2896 -1548 -4889 -2726 1627 4568 2450
4026 2450 -2390 -4240 -1190 3074 3610 161 -3412 -3334 61 3539 3712 -30 -3916 -3749 469 4763
4042 4763 4073 -847 -4903 -3643 1556 4507 2472 -1317 -3863 -1528 1412 3565 1604 -2120 -3684
4057 -3684 -1137 3247 4671 919 -4110 -4422 -204 4036 3984 -142 -3989 -3445 -168 3490 3699 -35
4073 -35 -3292 -3342 437 3830 2532 -1741 -4083 -1745 2600 3900 1303 -3240 -4334 -997 3026 4263
4089 4263 1501 -3106 -4614 -1324 3007 4167 1013 -3097 -3594 46 3172 2610 -952 -3543 -2200
4104 -2200 1604 3635 2468 -1665 -4324 -2579 1860 4882 2670 -2253 -4761 -1956 2545 4165 1387
4119 1387 -2639 -3599 -787 2572 2875 394 -2950 -3099 214 3561 2985 -612 -4412 -3137 1801 4461
4135 4461 2955 -1731 -4508 -2276 1503 3676 2495 -1337 -3913 -2428 1638 3724 1162 -2561 -3730
4150 -3730 -351 3492 3349 -287 -3506 -3405 494 3721 3695 -256 -3462 -3392 104 3891 3171 -795 -4009
4167 -4009 -3045 1531 3653 1322 -1988 -3361 -1096 2209 3192 820 -2507 -3911 -1255 2948 4300
4182 4300 823 -3826 -4180 -164 3871 3628 -118 -3268 -2779 311 3188 2416 -634 -2818 -2458 1203
4198 1203 3522 1925 -2565 -4341 -1610 2994 4422 1058 -3123 -4015 -1180 2782 3426 1404 -2727
4213 -2727 -3432 -944 2791 3084 287 -3261 -3075 815 3323 2319 -1615 -3837 -1935 2007 3818 1984
4229 1984 -1777 -4066 -2565 1680 3912 2173 -1909 -3880 -1202 2134 3379 560 -2768 -3011 243
4244 243 2773 2625 67 -2993 -2727 622 3512 3062 -533 -4406 -3069 1513 4330 2820 -1587 -3312
4260 -3312 -1824 1206 3268 1535 -1253 -2867 -1224 1803 3203 909 -2693 -3470 62 3572 3373
4275 3373 -484 -3595 -3299 281 3345 2652 -268 -2763 -2920 135 3286 2839 -960 -3254 -1906 2014
4291 2014 3343 989 -2441 -3274 -819 2262 2983 842 -2490 -3415 -870 2515 3499 622 -2978 -3228
4307 -3228 -333 3302 2937 -550 -2558 -2024 1335 2850 1606 -1215 -2952 -1922 1635 3616 1493
4322 1493 -2168 -4205 -1750 2472 3852 1189 -2401 -3343 -644 2452 2684 596 -2408 -2649 -227 2582
4338 2582 2689 -667 -3270 -2291 1214 3716 2170 -1802 -3410 -1901 1666 3300 1554 -1514 -3149
4353 -3149 -2075 1448 3321 1301 -2182 -3449 -680 2539 2797 -306 -2723 -2725 682 2890 2635 -664
4369 -664 -2956 -2795 153 3407 2894 -699 -3772 -2583 948 3361 1696 -2024 -2915 -837 1901 3045
4385 3045 853 -2361 -2809 -825 2091 3239 352 -2903 -3203 -65 3069 3105 -262 -3125 -2583 615
4401 615 2879 1988 -732 -2465 -2000 611 3164 1707 -1382 -2984 -1435 2058 3214 708 -2375 -3193
4417 -3193 -717 2592 3335 546 -2087 -2698 -467 2419 2937 770 -2562 -2804 569 2850 2112 -1121
4433 -1121 -2619 -2063 1336 3032 1352 -1370 -3250 -1462 1803 3350 1620 -1763 -3326 -1617 2290
4448 2290 3248 795 -2569 -2373 -189 2330 2076 -196 -2435 -2213 358 2555 2255 -580 -2990 -2238
4464 -2238 916 3397 2097 -1660 -3148 -1760 1403 2784 1464 -1368 -2540 -901 1727 2722 798
4479 798 -2260 -2876 -567 2583 2851 -300 -2840 -2219 493 2626 2320 -629 -2802 -2044 603 3062
4495 3062 2008 -696 -2986 -2033 1152 2925 1336 -1814 -2845 -960 2009 2533 391 -2408 -2765 -496
4511 -496 2296 2815 307 -2209 -3167 -218 2726 2637 -225 -2645 -2162 677 2377 1666 -854 -2686 -1334
4528 -1334 1207 2662 1505 -1640 -3160 -1390 2068 3120 674 -2157 -2841 -466 2147 2565 427
4543 427 -2320 -2427 -336 2335 2334 -131 -2438 -2188 640 2767 1941 -1236 -2742 -1568 1343 2953 1274
4560 1274 -1424 -2579 -1188 1546 2689 968 -1627 -2819 -646 1934 2628 430 -2145 -2231 103 2469
4576 2469 2040 -683 -2476 -1837 532 2939 2182 -472 -2708 -1847 976 2722 1534 -1320 -2992 -1223
4592 -1223 1571 2723 712 -1395 -2250 -1025 1892 2538 339 -2387 -2211 -63 2497 2355 -225 -2902
4608 -2902 -2134 429 2548 1957 -437 -2366 -1733 711 2369 1873 -939 -2366 -1263 1466 2890 1034
4624 1034 -1745 -2560 -640 2299 2643 334 -1837 -2277 -398 2385 2070 324 -2001 -2178 -4 2416
4640 2416 2332 -600 -2280 -1833 803 2434 1528 -1475 -2540 -1049 1160 2523 1183 -1498 -2648 -1217
4656 -1217 1856 2582 656 -2192 -2385 -116 1788 2036 97 -2134 -1977 560 2171 1884 -227 -2378
4672 -2378 -1790 859 2486 1770 -1214 -2556 -1523 1343 2403 1078 -1248 -2566 -1084 1150 2320
4687 2320 1300 -1660 -2495 -509 1782 2454 107 -2172 -2072 259 2279 2022 -374 -2243 -1788 569
4703 569 2155 1969 -619 -2516 -1779 920 2418 1331 -1339 -2894 -823 1795 1997 744 -1751 -2184
4719 -2184 -426 1791 2405 213 -1590 -2477 -142 2513 2491 -258 -2317 -1907 514 2420 1524 -1035
4735 -1035 -1792 -1241 1185 2118 1163 -1455 -2426 -806 1465 2351 664 -1515 -2674 -561 2136 2032 224
4752 224 -1899 -2112 22 1820 1999 26 -2186 -1890 221 1897 1827 -783 -2422 -1509 1133 2505 757
4769 757 -1264 -2443 -928 1570 2537 946 -1506 -2097 -907 1701 2232 333 -1672 -2000 -68 1764
4785 1764 1871 -315 -2017 -1465 704 1974 1712 -642 -2270 -1542 839 2525 1440 -1147 -2514 -1019
4801 -1019 1131 2071 906 -1308 -1760 -555 1342 2223 296 -1700 -2359 -234 1971 1980 -148 -2407 -1812
4818 -1812 727 2185 1473 -504 -2352 -1458 745 1885 1138 -585 -1795 -1429 1180 2199 1209 -1842
4834 -1842 -2095 -848 1740 2079 572 -1645 -2125 -113 1974 2213 23 -1945 -2048 -226 2023 1980 -302
4851 -302 -2122 -1555 845 2152 1063 -733 -1847 -921 1054 2374 1014 -1338 -2055 -380 1413 1954
4867 1954 819 -1613 -2004 -414 1937 2080 -64 -1731 -1596 -205 1603 1205 -214 -1990 -1636 539
4883 539 2371 1586 -613 -2354 -992 1063 2107 796 -1622 -1895 -458 1014 1868 641 -1217 -1788
4899 -1788 -491 1244 1953 333 -1788 -1790 128 1865 1374 -335 -2033 -1257 623 2330 1124 -772
4915 -772 -2150 -1642 931 1993 1520 -978 -2075 -888 1280 1968 623 -1334 -1280 -276 1493 1582 50
4932 50 -1614 -1510 203 1739 1811 -40 -2073 -1477 238 1932 1660 -582 -1723 -1112 699 1669 1008
4949 1008 -851 -1936 -746 866 2055 505 -1659 -2327 -378 1892 2074 301 -1897 -1720 -132 1542
4965 1542 1266 51 -1669 -1551 298 1680 1325 -296 -1914 -733 1169 2091 809 -1018 -1955 -937
4981 -937 1449 2023 880 -1302 -2007 -828 1319 2067 639 -1546 -1911 -272 1411 1332 -166 -1758 -1185
4998 -1185 648 1530 1367 -508 -1653 -1246 528 2036 1259 -940 -2089 -977 1265 2169 655 -1306
5014 -1306 -1903 -722 904 1606 346 -1020 -1633 43 1584 1654 -66 -1719 -1522 437 1979 1233 -619
5031 -619 -1880 -1202 424 1919 1081 -828 -2045 -1205 786 1718 713 -846 -1598 -227 1256 1547 213
5048 213 -1587 -1444 1 1458 1519 -260 -1630 -1616 18 1712 1551 -87 -1624 -1717 652 1877 1014
5065 1014 -669 -1671 -728 610 1405 645 -1044 -1489 -388 1350 1890 758 -1741 -2260 -272 1616
5081 1616 1738 48 -1685 -1195 5 1379 1276 -110 -1496 -1063 59 1695 1186 -551 -1770 -1268
5097 -1268 1272 1933 442 -1444 -1822 -575 908 1859 625 -905 -1571 -569 1423 1712 566 -1131
5113 -1131 -1590 369 1388 1069 -325 -1881 -963 715 1680 1103 -860 -1710 -1157 518 1712 984 -992
5130 -992 -1385 -593 892 1642 292 -1175 -1501 -243 1320 1323 198 -1474 -1433 33 1592 1445 10 -1602
5148 -1602 -1333 198 1831 1546 -836 -1629 -985 441 1286 867 -491 -1408 -710 849 1653 725 -1004
5165 -1004 -1485 -387 1267 1610 357 -1586 -1428 328 1290 1429 -210 -1445 -1150 115 1229 1507 -349
5182 -349 -1922 -1198 774 1677 776 -1172 -1388 -626 1039 1378 508 -1210 -1161 -508 1217 1655 305 -1084
5200 -1084 -1469 -100 1099 1377 20 -1738 -1283 28 1299 831 -470 -1578 -1000 757 1441 1018 -1089
5217 -1089 -1482 -709 1002 1681 567 -1255 -1765 -269 1054 1544 271 -1023 -1378 -320 1101 1173 167
5234 167 -1191 -1405 -4 1283 967 -245 -1537 -956 859 1488 1052 -526 -1252 -845 698 1590 879
5251 879 -468 -1305 -200 1115 1295 174 -1111 -1089 283 1287 1203 -382 -1199 -1326 -73 1628 1032
5268 1032 -242 -1796 -1263 240 1657 1139 -496 -1293 -814 535 1485 594 -600 -1354 -657 985 1350
5285 1350 437 -1322 -1691 -352 1146 1340 -210 -1297 -1325 61 1367 1424 -162 -1007 -584 52 1092
5302 1092 581 -613 -1566 -633 1000 1333 849 -913 -1426 -620 982 1413 538 -804 -1548 -256 817
5319 817 1506 47 -1304 -1451 -174 1270 1154 -194 -1402 -1356 327 1208 447 -518 -1291 -677 638 1368
5337 1368 928 -381 -1250 -427 768 1279 223 -814 -1442 -291 995 1365 335 -1146 -1094 64 1276
5354 1276 1027 62 -1248 -892 186 1420 1307 -337 -1722 -695 490 1277 789 -969 -1237 -488 718
5371 718 1377 520 -685 -1016 -254 973 1402 -41 -1214 -928 211 1154 1147 43 -1059 -1225 133 1350
5389 1350 992 -93 -1037 -785 335 1209 779 -813 -1164 -731 816 1319 580 -1051 -1305 -280 949
5406 949 1271 102 -995 -1254 92 1264 1115 -333 -1205 -1129 -125 1142 977 -284 -1087 -894 273
5423 273 1023 546 -355 -1403 -752 588 1315 615 -1043 -1436 -596 778 1168 252 -697 -989 -35 1006
5441 1006 1272 -12 -1024 -978 246 1121 918 -171 -923 -768 362 1141 984 -536 -1457 -473 566 1243
5459 1243 523 -437 -1053 -463 717 922 433 -655 -986 -155 847 1359 -55 -1207 -866 273 1243 920
5477 920 -321 -1174 -1098 71 1111 1045 -223 -1056 -702 316 1135 705 -709 -1212 -382 537 755 434 -1004
5496 -1004 -1170 -193 750 1044 142 -1122 -1134 22 997 1149 -2 -1153 -514 259 1333 665 -333 -1340
5514 -1340 -630 702 676 432 -501 -1168 -489 785 1215 191 -987 -1054 -473 886 1099 210 -869 -1149
5532 -1149 -122 1238 859 189 -841 -597 204 1122 550 -91 -1030 -232 402 1370 233 -594 -1271 -605
5550 -605 634 913 338 -669 -1065 -615 1092 1007 26 -968 -678 -57 812 545 54 -1003 -851 166 1055
5569 1055 624 -338 -1177 -759 441 1123 749 -677 -1260 -573 541 1208 349 -574 -1033 -315 789 1095
5587 1095 295 -857 -838 -296 951 763 38 -982 -847 138 955 674 -43 -900 -878 270 1160 582 -381
5606 -381 -1426 -505 533 1317 580 -689 -872 -219 643 1100 411 -779 -1011 -187 828 991 53 -1075
5624 -1075 -725 227 851 1035 217 -778 -832 472 783 602 -399 -1079 -193 524 942 271 -519 -1029 -377
5643 -377 653 1013 281 -520 -1117 -112 807 979 567 -850 -1213 346 960 862 -210 -773 -485 -15 906
5662 906 591 -2 -1071 -392 490 835 314 -447 -896 -343 662 1202 378 -492 -783 -427 661 797 -43
5681 -43 -840 -996 -34 888 875 -555 -1130 -829 65 1070 722 -266 -865 -610 476 1030 579 -323 -708 -298
5701 -298 501 1000 430 -670 -1256 -118 924 895 201 -918 -572 118 668 780 -172 -957 -748 -95 878
5720 878 701 -153 -755 -481 258 1100 594 -619 -693 -172 643 1018 330 -614 -917 -195 598 979 1 -813
5740 -813 -519 -173 860 1019 11 -794 -615 -18 830 708 -192 -535 -957 151 856 603 -366 -734 -561
5759 -561 600 953 350 -458 -859 -500 802 692 140 -653 -1024 -248 587 684 75 -658 -676 263 704 530
5779 530 -53 -689 -378 519 562 287 -590 -1053 -407 569 720 279 -480 -1092 -369 545 794 253 -610 -985
5799 -985 -49 784 856 96 -803 -786 15 901 537 -104 -1002 -630 71 768 737 -734 -752 -479 354 813 87
5820 87 -700 -934 -22 670 734 263 -726 -842 -274 713 727 64 -1148 -640 150 952 610 199 -622 -745 343
5841 343 732 776 -132 -876 -375 355 774 428 -521 -833 -344 943 992 439 -625 -814 -307 462 703 66
5861 66 -582 -663 -266 624 681 48 -575 -698 -73 790 503 -350 -783 -380 319 826 239 -577 -1078 -213 206
5882 206 982 145 -549 -745 -353 612 909 28 -456 -618 32 892 421 -93 -697 -643 272 439 285 -130
5902 -130 -708 -375 263 832 611 -177 -948 -235 384 604 405 -300 -594 -556 342 752 150 -768 -671 -39 910
5923 910 575 113 -698 -620 28 892 400 -66 -700 -549 176 976 634 -318 -379 -488 434 472 349 -397 -668
5944 -668 -52 580 818 158 -664 -808 -44 750 801 153 -616 -760 244 655 491 -141 -478 -150 321 878
5964 878 541 -605 -547 -258 421 814 545 -204 -917 -305 384 990 -113 -324 -564 -69 538 883 -70 -357
5984 -357 -423 -47 782 619 -594 -692 -361 30 882 542 -58 -530 -273 192 713 456 -190 -1005 -359 644
6004 644 805 97 -405 -684 -235 489 553 -126 -592 -816 -78 498 398 -165 -309 -560 126 752 586 -97
6024 -97 -684 -527 563 709 260 -359 -565 -345 294 698 522 -581 -439 -59 269 437 228 -583 -675 24
6044 24 821 680 357 -412 -514 66 877 653 -34 -728 -795 510 590 324 -384 -759 -315 720 792 386 -611
6065 -611 -430 -211 369 718 -37 -764 -624 -283 707 775 -67 -668 -564 175 627 650 125 -247 -341 294 758
6086 758 355 -434 -748 -388 759 871 442 -211 -823 -428 622 450 185 -530 -787 100 527 489 187 -598
6106 -598 -599 189 623 655 6 -690 -466 323 743 821 -152 -522 -198 644 773 532 -244 -662 -161 337 319 167
6128 167 -318 -307 -185 825 771 -77 -436 -692 48 654 771 -203 -570 -408 -100 609 367 -531 -656 -581 219
6149 219 567 361 -224 -419 -304 456 526 33 -319 -475 -27 454 515 304 -413 -505 -26 578 483 -171 -468
6170 -468 -300 434 720 387 -270 -691 -245 111 768 -115 -633 -465 -115 417 675 211 -400 -725 -284 369
6190 369 666 126 -1047 -342 -6 434 241 -61 -728 -671 -55 588 599 -314 -387 -255 292 598 521 -361 -652
6211 -652 -147 451 484 351 -517 -535 -342 561 511 134 -52 -429 113 587 333 132 -555 -751 -254 739 539
6232 539 -220 -756 -158 250 559 534 -590 -808 -262 174 398 283 -336 -671 87 203 613 -47 -210 -571
6252 -571 -91 539 659 1 -507 -644 -62 590 386 -70 -521 -413 258 664 385 70 -346 -391 223 687
6272 687 250 -423 -622 -390 449 550 512 -159 -438 -43 297 415 283 -527 -466 3 444 361 -114 -335 -299
6293 -299 83 572 227 -516 -635 -74 364 447 384 -438 -844 -417 307 627 102 -173 -367 228 119 592 87
6314 87 -451 -449 117 794 134 -97 -251 -528 355 559 78 -341 -791 50 75 453 373 -116 -361 -280 279 396
6336 396 168 -252 -239 -185 223 549 377 -531 -447 -79 527 708 -94 -504 -328 438 431 128 -17 -380 -272 279
6358 279 434 621 -395 -509 -351 474 617 66 -433 -286 156 286 288 -69 -656 -409 260 78 260 -85
6378 -85 -438 -169 -77 462 460 -33 -471 -284 -101 383 286 96 -439 -363 169 645 12 -339 -283 29 327 529
6400 529 266 -276 -300 -53 525 340 -180 -337 -313 162 399 215 -148 -466 -506 -29 609 140 10 -603 -381
6421 -381 428 528 59 -228 -395 -171 139 340 106 -431 -373 226 325 334 102 -194 -373 125 125 696 -84 -303
6443 -303 -112 304 397 51 -287 -395 -222 -58 452 132 -104 -383 208 -167 237 262 -268 -153 -339 295 446
6464 446 220 -262 -611 51 488 356 77 -307 -365 2 285 151 -204 -417 -496 82 603 -38 -261 -424 -69
6485 -69 231 349 253 -182 -302 -458 114 146 -113 -299 -203 -167 315 329 201 -298 -239 -159 176 41 -77 -451 -42
6508 -42 132 321 322 -356 -559 -418 211 460 202 342 -581 -163 171 431 -69 -35 -393 -686 183 251 242 -439
6530 -439 -448 96 389 378 -69 -385 -194 313 456 156 -159 -433 -290 230 218 199 -444 -764 -147 535 193 -165
6552 -165 -184 -302 53 380 231 -284 -427 -412 141 307 203 -23 -702 -73 -231 50 381 -47 -690 -673 204
6573 204 601 254 84 -522 -167 211 132 -25 -386 -482 -150 182 583 213 -310 -78 -158 595 120 358 -111
6594 -111 -456 -9 459 289 -99 -327 -469 28 100 165 -182 -332 -131 265 310 230 -371 -352 -97 463 518 -25
6616 -25 -187 -431 -465 389 318 -118 -56 -317 -168 439 370 -182 -289 -63 1 426 464 -265 -690 92 181 403 86
6639 86 20 -481 -146 292 221 324 -363 -133 214 561 215 27 -168 11 361 401 54 -254 -384 -303 -101 64
6661 64 116 -214 -308 53 457 362 366 -28 -535 -25 214 109 -162 -446 -415 -435 116 359 -118 -263 -655 48 429
6684 429 627 -98 -497 -190 151 369 251 -197 -646 -102 313 473 -122 -354 -612 112 156 223 292 -483 -278
6705 -278 14 348 221 -55 -717 -688 103 83 -27 -322 -488 21 173 76 62 -169 -314 -132 129 240 57
6726 57 -121 -445 46 263 552 181 -425 -269 -135 -11 284 -46 88 -251 77 289 397 121 -263 -322 -231
6747 -231 388 94 -153 -178 -62 18 166 221 -63 -649 -261 115 549 4 -91 -470 46 244 112 67 -342 45
6769 45 -23 221 48 -60 -420 -353 277 348 116 192 -378 -86 -72 235 55 -86 -364 -300 138 481 57 -325
6791 -325 -237 -139 210 576 -36 -200 -36 -215 421 455 121 189 -114 443 92 305 -256 -223 -142 -76 193 300
6813 300 -454 -391 135 112 293 293 -70 -541 -267 70 445 299 -256 -351 -109 267 441 -215 -351 -62 209 176
6835 176 186 -166 -40 -84 154 322 116 -228 -406 -45 14 -124 445 -195 -447 43 175 56 46 -191 -488
6856 -488 70 268 179 -32 -174 -642 -116 715 184 -169 -405 -574 1 523 409 -369 -480 -75 63 219
6876 219 260 92 -175 -294 -100 377 131 -313 -120 -218 362 10 -55 -325 -259 158 54 283 -104 -540 -78
6897 -78 263 620 453 -112 -202 -254 98 184 312 43 -92 -185 600 117 437 -202 -549 -290 124 163 38 -214
6919 -214 -456 143 -60 351 37 -158 -385 222 80 -77 66 -67 -415 -50 432 -81 -179 -387 -120 416
6939 416 532 54 -217 138 53 52 -3 -176 -134 -274 118 80 313 39 -147 -225 240 488 200 50 -175 -162 -267
6962 -267 122 -92 23 92 -492 220 512 128 25 -241 249 130 138 43 -151 -100 -40 189 314 232 -39 -156
6984 -156 -44 202 -20 219 -201 -470 122 16 -24 25 -480 100 277 498 133 -60 62 -93 289 611 -84
7005 -84 -108 -338 -51 110 56 -46 -443 -20 -76 283 40 -206 -320 45 99 460 286 -129 -405 -130 151 292
7027 292 71 -241 -301 -313 237 561 135 -530 -376 85 78 214 -225 -192 -197 21 -159 38 -56 -126 -137 310 56
7050 56 -136 -273 125 36 194 193 498 -149 -535 -400 269 297 -69 82 -385 -103 176 64 289 -337 19 100
7072 100 -49 342 61 -351 -483 48 178 245 100 -187 -183 23 88 -78 -326 -228 105 -19 102 -29 -269 79
7094 79 25 114 368 187 79 -314 173 -36 193 -8 -130 -228 -118 229 314 -291 -198 -376 -277 360 56 107 -239
7117 -239 -288 136 315 193 -491 -313 56 364 52 58 -437 -397 -111 250 128 -15 -125 -238 -50 -32 180 119
7139 119 -77 -44 339 225 317 54 -41 248 122 169 8 -198 -189 -48 83 237 238 -206 -16 -136 287 241 -41
7162 -41 -19 -87 26 -101 224 4 113 -193 97 -136 230 -348 -345 -128 -45 -82 218 -110 -365 -164 -223 300 -98
7185 -98 -202 -412 146 129 215 -144 -100 -335 241 252 -100 -70 -402 -275 -11 97 215 80 -165 -48 -74 33
7207 33 55 12 -215 -9 147 174 141 2 -227 301 181 260 230 -142 32 232 102 179 -48 -8 -156 92 -57
7230 -57 -232 37 -265 -186 185 232 183 57 -249 -95 -48 -167 -41 -17 -342 -361 226 -80 -223 -140 -87 -78 -93 177
7254 177 272 -176 -61 21 242 -164 -94 -193 50 188 386 350 -358 -86 -15 298 141 31 -260 85 -11 -169
7276 -169 317 -21 -296 -178 102 164 68 181 121 -221 139 129 -254 -23 -218 -31 216 49 69 191 -277 -216
7298 -216 20 -151 154 -166 -378 14 -187 150 145 -58 -128 358 369 18 -38 -7 166 -66 152 340 16 -199
7320 -199 -24 142 443 91 -55 -166 4 17 197 175 -266 -264 32 166 -73 54 48 167 -105 44 130 -143
7342 -143 -269 -125 130 206 22 -70 -106 -3 -180 104 140 -401 -254 -46 -12 -21 81 -89 195 59 127 -181 -110
7365 -110 -228 -99 55 -117 -46 -58 70 -38 220 73 97 -11 -137 97 -113 102 157 -278 -199 -102 454 244
7387 244 167 -32 5 -51 514 36 308 -133 -195 -266 -96 52 -4 -101 37 86 98 347 -77 4 -247 -289 316 125
$$ [...]
8191A96
##END NTUPLES=NMR FID
##END=
