##TITLE=1H_EC-3190
 CDCl3, 8 sc, 
 8.4.2019
##JCAMPDX= 6.0         $$ Bruker NMR JCAMP-DX V2.0
##DATA TYPE= NMR FID
##DATA CLASS= NTUPLES
##ORIGIN= UXNMR, Bruker Analytische Messtechnik GmbH
##OWNER= root
$$ XWIN-NMR		Version 3.5
$$ Mon Apr  8 14:20:25 2019 Russian Standard Time (UT+4h)  she@DPX200
##.OBSERVE FREQUENCY= 200.1315
##.OBSERVE NUCLEUS= ^1H
##.DELAY= (6, 6)
##.ACQUISITION MODE= SIMULTANEOUS
##.ACQUISITION SCHEME= undefined
##.AVERAGES= 8
##.DIGITISER RES= 18
##SPECTROMETER/DATA SYSTEM= spect
##.PULSE SEQUENCE= zg30
##.SOLVENT NAME= CDCl3
##.SHIFT REFERENCE= (INTERNAL, CDCl3, 0, 15.7039)
##AUDIT TRAIL= $$ (NUMBER, WHEN, WHO, WHERE, WHAT)
$$ ##TITLE= Audit trail, XWIN-NMR		Version 3.5
$$ ##JCAMPDX= 5.01
$$ ##ORIGIN= Bruker BioSpin GmbH
$$ ##OWNER= she
$$ F:/spectra/data/she/nmr/H-F/1/audita.txt
$$ ##AUDIT TRAIL=  $$ (NUMBER, WHEN, WHO, WHERE, WHAT)
(   1,<2019-04-08 14:19:18.25 +0400>,<she>,<DPX200>,
      <created by zg, POWCHK disabled, PULCHK disabled
       configuration hash MD5:
       00 E9 B6 7A A2 85 ED C7 34 08 36 98 17 FE 4E 26
       data hash MD5: 16K
       FD 9B 7D D3 55 BF 8E 6E A8 E3 FB 59 F8 49 A3 82>)
$$ ##END=
$$ 
$$ hash MD5
$$ 3E E3 D7 33 41 0B FF 75 71 CD 05 B8 55 34 24 01
##$RELAX= 
##$RELAX= 
##$RELAX= 
##$RELAX= 
##$RELAX= 
##$RELAX= 
$$ Bruker specific parameters
$$ --------------------------
##$DU= <F:/spectra>
##$EXPNO= 1
##$NAME= <H-F>
##$PROCNO= 1
##$TYPE= <nmr>
##$USER= <she>
##$AMP= (0..31)
100 100 100 100 100 100 100 100 100 100 100 100 100 100 100 100 100 100 
100 100 100 100 100 100 100 100 100 100 100 100 100 100 
##$AQSEQ= 0
##$AQ_mod= 1
##$AUNM= <au_zg>
##$AUTOPOS= <>
##$BF1= 200.13
##$BF2= 200.13
##$BF3= 200.13
##$BF4= 200.13
##$BF5= 200.13
##$BF6= 200.13
##$BF7= 200.13
##$BF8= 200.13
##$BYTORDA= 1
##$CFDGTYP= 0
##$CFRGTYP= 5
##$CHEMSTR= <none>
##$CNST= (0..31)
1 1 145 1 1 1 1 1 1 1 1 1 1 1 1 1 1 1 1 1 1 1 1 1 1 1 1 1 1 1 1 1 
##$CPDPRG= <>
##$CPDPRG1= <>
##$CPDPRG2= <>
##$CPDPRG3= <>
##$CPDPRG4= <mlev>
##$CPDPRG5= <mlev>
##$CPDPRG6= <mlev>
##$CPDPRG7= <mlev>
##$CPDPRG8= <mlev>
##$CPDPRGB= <>
##$CPDPRGT= <>
##$D= (0..31)
0 1.2 0 0 0 0 0 0 0 0 0 0.03 0 0 0 0 0 0 0 0 0 0 0 0 0 0 0 0 0 0 0 0 
##$DATE= 1554718757
##$DBL= (0..7)
120 120 120 120 120 120 120 120 
##$DBP= (0..7)
150 150 150 150 150 150 150 150 
##$DBP07= 0
##$DBPNAM0= <>
##$DBPNAM1= <>
##$DBPNAM2= <>
##$DBPNAM3= <>
##$DBPNAM4= <>
##$DBPNAM5= <>
##$DBPNAM6= <>
##$DBPNAM7= <>
##$DBPOAL= (0..7)
0.5 0.5 0.5 0.5 0.5 0.5 0.5 0.5 
##$DBPOFFS= (0..7)
0 0 0 0 0 0 0 0 
##$DE= 6
##$DECBNUC= <off>
##$DECIM= 24
##$DECNUC= <off>
##$DECSTAT= 4
##$DIGMOD= 1
##$DIGTYP= 9
##$DL= (0..7)
0 120 120 120 120 120 120 120 
##$DP= (0..7)
150 150 150 150 150 150 150 150 
##$DP07= 0
##$DPNAME0= <>
##$DPNAME1= <>
##$DPNAME2= <>
##$DPNAME3= <>
##$DPNAME4= <>
##$DPNAME5= <>
##$DPNAME6= <>
##$DPNAME7= <>
##$DPOAL= (0..7)
0.5 0.5 0.5 0.5 0.5 0.5 0.5 0.5 
##$DPOFFS= (0..7)
0 0 0 0 0 0 0 0 
##$DQDMODE= 0
##$DR= 18
##$DS= 0
##$DSLIST= <SSSSSSSSSSSSSSS>
##$DSPFIRM= 0
$$ [...]
##$SUBNAM2= <"">
##$SUBNAM3= <"">
##$SUBNAM4= <"">
##$SUBNAM5= <"">
##$SUBNAM6= <"">
##$SUBNAM7= <"">
##$SUBNAM8= <"">
##$SUBNAM9= <"">
##$SW= 24.9337058887773
##$SWIBOX= (0..15)
0 0 2 0 0 0 0 0 0 0 0 0 0 0 0 0 
##$SW_h= 4990.01996007984
##$TD= 16384
##$TD0= 1
##$TE= 0
##$TE2= 300
##$TE3= 300
##$TEG= 300
##$TL= (0..7)
0 120 120 120 120 120 120 120 
##$TP= (0..7)
150 150 150 150 150 150 150 150 
##$TP07= 0
##$TPNAME0= <>
##$TPNAME1= <>
##$TPNAME2= <>
##$TPNAME3= <>
##$TPNAME4= <>
##$TPNAME5= <>
##$TPNAME6= <>
##$TPNAME7= <>
##$TPOAL= (0..7)
0.5 0.5 0.5 0.5 0.5 0.5 0.5 0.5 
##$TPOFFS= (0..7)
0 0 0 0 0 0 0 0 
##$TUNHIN= 0
##$TUNHOUT= 0
##$TUNXOUT= 0
##$USERA1= <user>
##$USERA2= <user>
##$USERA3= <user>
##$USERA4= <user>
##$USERA5= <user>
##$V9= 5
##$VALIST= <valist>
##$VCLIST= <CCCCCCCCCCCCCCC>
##$VD= 0
##$VDLIST= <DDDDDDDDDDDDDDD>
##$VPLIST= <PPPPPPPPPPPPPPP>
##$VTLIST= <TTTTTTTTTTTTTTT>
##$WBST= 1024
##$WBSW= 4
##$XGAIN= (0..3)
0 0 0 0 
##$XL= 0
##$YL= 0
##$YMAX_a= 158884
##$YMIN_a= -291182
##$ZGOPTNS= <>
##$ZL1= 120
##$ZL2= 120
##$ZL3= 120
##$ZL4= 120
##$ABSF1= 10
##$ABSF2= 0
##$ABSG= 5
##$ABSL= 3
##$ALPHA= 0
##$AQORDER= 0
##$ASSFAC= 0
##$ASSFACI= 0
##$ASSFACX= 0
##$ASSWID= 0
##$AUNMP= <proc_1d>
##$AZFE= 0.1
##$AZFW= 0.1
##$BCFW= 1
##$BC_mod= 2
##$BYTORDP= 1
##$COROFFS= 0
##$CY= 11.3945322036743
##$DATMOD= 1
##$DC= 2
##$DFILT= <>
##$DTYPP= 0
##$F1P= 18.9103706918063
##$F2P= -1.10871071338519
##$FCOR= 0.5
##$FTSIZE= 0
##$FT_mod= 4
##$GAMMA= 1
##$GB= 0.15
##$INTBC= 1
##$INTSCL= 1
##$ISEN= 128
##$LB= 0.24
##$LEV0= 0
##$LPBIN= 0
##$MAXI= 10000
##$MC2= 0
##$MEAN= 0
##$ME_mod= 0
##$MI= 1.114404
##$NCOEF= 0
##$NC_proc= 0
##$NLEV= 6
##$NOISF1= 3.799351
##$NOISF2= 2.8
##$NSP= 1
##$NTH_PI= 0
##$NZP= 0
##$OFFSET= 15.70392
##$PC= 1
##$PHC0= -8854.47
##$PHC1= 18.40026
##$PH_mod= 1
##$PKNL= yes
##$PPARMOD= 0
##$PSCAL= 0
##$PSIGN= 0
##$REVERSE= no
##$SF= 200.130013532006
##$SI= 16384
##$SIGF1= 3
##$SIGF2= 2
##$SINO= 400
##$SIOLD= 16384
##$SREGLST= <1H.CDCl3>
##$SSB= 0
##$STSI= 0
##$STSR= 0
##$SW_p= 3612.71676300578
##$SYMM= 0
##$S_DEV= 0
##$TDeff= 0
##$TDoff= 0
##$TI= <>
##$TILT= no
##$TM1= 0
##$TM2= 0
##$TOPLEV= 0
##$USERP1= <user>
##$USERP2= <user>
##$USERP3= <user>
##$USERP4= <user>
##$USERP5= <user>
##$WDW= 1
##$XDIM= 8192
##$YMAX_p= 0
##$YMIN_p= 0
$$ End of Bruker specific parameters
$$ ---------------------------------
##NTUPLES= NMR FID
##VAR_NAME=  TIME,          FID/REAL,        FID/IMAG
##SYMBOL=    X,             R,               I
##VAR_TYPE=  INDEPENDENT,   DEPENDENT,       DEPENDENT
##VAR_FORM=  AFFN,          ASDF,            ASDF
##VAR_DIM=   8192,          8192,            8192
##UNITS=     SECONDS,       ARBITRARY UNITS, ARBITRARY UNITS
##FACTOR=    0.0002004,     1,               1
##FIRST=     0,             0,               0
##LAST=      1.6414764,     0,               0
##MIN=       0,             -291182,         0
##MAX=       1.6414764,     158884,          0
$$ Real data points
##PAGE= N=1
##DATA TABLE= (X++(R..R)), XYDATA
$$ [...]
$$ plain form
2818 1514 732 -1035 -2437 -372 1353 504 330 -1255 -2897 -1004 2403 1707 -1849 -2705 -951 332
2834 332 1073 1000 -1674 -2433 -436 1568 809 -615 -1545 -1512 916 2255 -76 -2414 -1176 133 1080
2851 1080 1883 324 -2857 -1919 1775 2022 50 -708 -972 -495 535 1417 -448 -1507 -702 443 1501
2868 1501 1463 -1199 -2298 678 2793 885 -853 2 -494 -492 1562 1892 -613 -1611 -151 1333 1777
2885 1777 758 -1102 -1034 1513 1614 162 98 587 -604 103 2359 1831 -1138 -1010 1140 1366 1441 829
2903 829 -1271 -874 1090 1493 662 712 -407 -1165 721 2590 850 -1278 -334 621 670 1017 482 -1117
2921 -1117 -404 1263 886 -18 76 -774 -828 1540 2093 -583 -1809 -812 606 894 863 -737 -1723 -722
2939 -722 606 244 272 -141 -1760 -1012 1751 1232 -2264 -2307 -534 672 625 299 -1593 -2550 -707 773
$$ packed form
2818A514p82j767j402K065J725q49j74j585j642J893L407o96l556q56J754J283
2834C32P41p3k674p59J997K004p59j424r30L3K428J339k331k338J238J309R47
2851A080Q03j559l181R38L694K47j972p58k64M77J030Q82j865j059Q05J145J058
2868A501l8k662j099K976K115j908j738Q55m96KK054L30k505r98J460J484M44
2885A777j019j860O8K547J01j452o4M89j191P07K256n28k969J28K150K26P5o12
2903H29k100L97J964M03q31N0j119p58J886J869j740k128R44R55M9L47n35j599
2921a117P13J667l77r04R4q50n4K368N53k676j226R97J418K88l1j600r86J001
2939g22J328l62K8m13j619P48K763n19l496m3J773J206m7l26j892r57J843J480
$$ plain form
2957 773 1204 215 -1970 -3114 293 2430 -382 -3058 -1026 1096 -132 -408 87 -1691 -2407 -110
2973 -110 2065 1313 -1761 -3245 -1081 2414 1873 -1517 -1735 188 -599 -576 1452 550 -2875 -2027 2198
2990 2198 2461 -1179 -2634 -1174 1282 2047 186 -951 -448 -718 -909 1620 2425 -1611 -3534 1322
3006 1322 3674 -128 -2765 -67 1332 730 776 983 -732 -1710 -548 2401 2752 -501 -3159 -395
3022 -395 3601 1115 -1803 354 1464 -819 -244 2720 1076 -2693 -1420 2234 2900 255 -1740 -677
3038 -677 1473 916 -302 574 1073 -1608 -1890 2066 2529 -1982 -2981 1832 2407 -335 -1238 284 -256
3055 -256 -825 293 1883 951 -2056 -2553 818 2981 -920 -3059 638 1425 -1285 -1803 1273 -82
3071 -82 -2441 -647 2759 1070 -2716 -2766 1 1630 -179 -1293 -575 537 -2043 -1770 1747 1272 -3001
$$ packed form
2957G73M31r89k185j144L407K137k812k676K032K122j228k76M95j778p16K297
2973a10K175p52l074j484K164L495n41l390k18J923p87K3K028r02l425Q48M225
2990B198K63l640j455J460K456P65j861j137N03k70j91K529Q05m036j923M856
3006A322K352l802k637K698J399o02M6K07j715r78J162K949L51l253k658K764
3022c95L996k486k918K157J110k283N75K964j644l769J273L654O66k645j995J063
3038f77K150n57j218Q76M99k681k82L956M63m511r99M813N75k742r03J522n40
3055b56n69J118J590r32l007m97L371K163l901k139L697P87k710n18L076j355
3071h2k359J794L406j689l786n0K767J629j809j114P18J112k580K73L517m75m273
$$ plain form
3088 -3001 -2389 2399 2078 -3017 -3039 488 749 -579 -91 756 -1102 -2959 -1462 2131 2538 -1931 -3480
3105 -3480 644 2194 -1760 -2241 1011 660 -1960 -175 2280 -542 -3422 -1368 2701 2622 -991 -2987
3121 -2987 -936 1273 105 -737 1484 1018 -2715 -1519 3177 1549 -3692 -1833 2967 2917 -1050 -1956
3137 -1956 -221 499 95 1326 2436 238 -2728 -1832 3275 3947 -2132 -3040 2133 3018 -455 -1009 1228
3154 1228 157 -1352 1326 3402 535 -3222 -2305 2642 4201 -294 -2862 -61 2356 -192 -552
3169 -552 2398 751 -2807 -284 3886 2140 -3182 -2124 2117 2562 158 -1561 -406 448 -711 -542
3185 -542 2241 1321 -2926 -2531 3325 2962 -2921 -3420 1701 2124 -1085 -672 1067 -468 -2241 -648 2467
3202 2467 1551 -2710 -3582 1463 2662 -1780 -3462 1260 1759 -1643 -1058 2143 -311 -4071 -1183 3302
$$ packed form
3088c001O12M788l21n095k2L527K61j328M88Q47j858j857J497L593M07m469j549
3105c480M124J550l954m81L252l51k620J785K455k822k880K054M069p9l613j996
3121b987K051K209j168q42K221m66l733J196M696j628n241J859M800n0l967r06
3137a956J735P20m04J231J110k198k966Q96N107O72o079r08N173Q85l473n54K237
3154A228j071j509K678K076k867l757R17M947J559m495k568K801K417k548l60
3169e52K950j647l558K523M170j746n322J058M241M45k404j719J155Q54j159J69
3185e42K783r20m247L95N856l63n883m99N121M23l209M13J739j535j773J593L115
3202B467r16m261q72N045J199m442j682M722M99l402N85L201k454l760K888M485
$$ plain form
3218 3302 2061 -2217 -3096 -53 1416 -1005 -1151 1561 1514 -2741 -2480 2730 1626 -3712 -2407 3310
3234 3310 2451 -2818 -2642 760 328 -1411 428 2746 612 -3575 -2662 2980 2867 -1964 -2785 2372
3250 2372 1761 -2975 -2011 2763 836 -2855 -54 3950 498 -4396 -1996 2852 3038 -949 -1908 1305
3266 1305 632 -2102 -1016 4013 1908 -4033 -1708 4104 1962 -4189 -1565 3782 2268 -1373 -558
3281 -558 1728 -205 -2127 828 5434 2278 -4500 -2849 3999 3686 -2347 -1585 3438 1297 -3171 265
3297 265 4208 105 -3911 470 5218 1869 -4192 -2757 3102 3093 -1420 -1276 2186 539 -3593 -37
3313 -37 4958 733 -5585 -1197 4826 1640 -4236 -2105 2530 1292 -1580 -324 1897 -773 -3601
3328 -3601 -557 5032 1191 -5465 -3065 4064 2104 -3442 -1461 2318 -790 -3268 562 3344 -1392
$$ packed form
3218C302j241m278q79L043J469k421j46K712m7m255K61N210j104n338J305N717
3234C310q59n269J76L402m32j739J839K318k134m187R13N642j13m831q21N157
3250B372o11m736R64M774j927l691K801M004l452m894K400M848J86l987r59L213
3266A305o73k734J086N029k105n941K325N812k142o151K624N347j514l641Q15
3281e58K286j933j922K955M606l156o778J651O848l13o033P62N023k141m468L436
3297B65L943m103m016M381M748l349o061J435N859rm513J44L462j647m132L556
3313c7M995m225o318M388O023l186n876K131M635j238k872J256K221k670k828
3328c601L044N589l841o656K400P129j960n546J981L779l108k478L830K782m736
$$ plain form
3343 -1392 -4332 -575 3569 833 -4276 -2849 2304 1291 -2923 -1350 2065 -732 -4148 584 4409
3358 4409 -1099 -4910 -920 3457 465 -2650 -1114 1267 -106 -2178 -138 2499 -774 -3521 240
3373 240 4150 -58 -4536 -806 3205 367 -1780 878 1456 -1900 -2647 1651 3061 -504 -3033 -338
3389 -338 2459 567 -2433 -304 2737 -19 -2236 1130 2639 -2070 -3180 2142 4050 -880 -3095
3404 -3095 229 1610 -215 -474 1387 1658 -1366 -2487 1525 3682 -789 -3738 1038 4034 -586
3419 -586 -2742 861 1738 -1316 -1230 2609 2145 -2758 -2760 1281 3495 744 -2973 -605 2395 -300 -2412
3436 -2412 998 2419 -1681 -2685 2257 2831 -2394 -3671 1516 3578 113 -2260 -672 901 -130
3451 -130 -857 1268 2297 -1823 -3898 1278 4036 -828 -4072 -142 2583 42 -1893 215 589 -1507
$$ packed form
3343a392k940L757M144k736n109J427N153j013m214J573L415k797l416M732L825
3358D409n508l811L990M377k992l115J536K381j373k072K040K637l273k747L761
3373B40L910m208m478L730M011k838k147K658N78l356p47M298J410l565k529K695
3389c38K797j892l000K129L041k756k217L366J509m709j110N322J908m930k215
3404c095L324J381j825k59J861K71l024j121M012K157m471k949M776K996m620
3419e86k156L603Q77l054Q6L839m64m903kM041K214k751l717K368L000k695k112
3436b412L410J421m100j004M942N74n225j277N187K062l465k373J588J573j031
3451a30p27K125J029m120k075N176K758m864l244L930K725k541j935K108L74k096
$$ plain form
3467 -1507 -1228 1445 1993 -1664 -4090 -564 3304 1136 -3229 -2031 1350 -252 -1630 891 833 -2376
3483 -2376 -2828 1485 2193 -1471 -3258 -1170 1735 855 -1684 -1936 437 -230 -1524 578 1508 -2107
3499 -2107 -3773 584 3189 -577 -2893 -782 846 499 -81 -358 -197 -649 -865 347 1733 -559
3515 -559 -2923 -662 2891 1190 -1839 -913 974 -246 -42 1499 773 -1469 -1205 1260 1777 490
3531 490 -1612 -681 1457 1206 -810 113 798 -242 -896 1741 1895 -1626 -1800 1345 2044 358 -297
3548 -297 -192 649 -77 208 960 1172 -711 -1708 1040 2625 -273 -2248 625 1573 -312 -642 1126
3565 1126 17 -1563 -328 2197 924 -1571 -1799 344 1915 215 -1841 -633 1147 -375 -1573
3580 -1573 1237 1302 -2555 -1986 1543 1775 -1378 -1812 344 1124 159 -629 377 19 -1405 -1054 1388
$$ packed form
3467a507K79K673N48l657k426L526L868k168m365J198L381j602j378K521n8l209
3483b376m52M313P08l664j787K088K905q80k539k52K373o67j294K102R30l615
3499b107j666M357K605l766k316K111J628l47n80k77J61m52k16J212J386k292
3515e59k364K261L553j701l029R26J887j220K04J541p26k242K64K465N17j287
3531D90k102R31K138k51k016R23O85j040o54K637J54l521j74L145O99j686o55
3548b97J05Q41p26K85P52K12j883r97K748J585k898j975K873R48j885l30J768
3565A126j109j580J235K525j273k495k28K143J571j700k056J208J780j522j198
3580a573K810O5l857N69L529K32l153m34K156P80r65p88J006l58j424L51K442
$$ plain form
3597 1388 1977 -1651 -3235 682 2333 -625 -1969 191 612 -859 -92 1613 21 -2101 -1208 1049
3613 1049 1690 -876 -3059 -860 1744 257 -1591 -411 264 -1489 -962 1975 792 -2440 -2231 822
3629 822 1576 -515 -1513 -1256 222 358 -269 -274 -45 -1274 -1055 1827 2043 -1688 -2514 800 1678 373
3647 373 -534 -294 -901 2 1175 1030 87 -1090 -701 824 2091 235 -1542 -503 1653 841 126
3664 126 341 -235 -1277 572 1842 669 -942 -829 798 1447 1548 -72 -849 334 1100 679 940
3681 940 551 -671 -170 2069 1303 -710 -675 293 538 753 1089 -435 -1122 141 1032 833 132 -528 -782
3700 -782 -75 1246 62 -1112 -330 -68 -148 710 406 -1032 -1511 350 420 -28 -266 -955 -990 124 851
3719 851 -11 -929 -200 -193 62 720 15 -1326 -731 763 228 102 -235 -765 -839 492 824 -556 -754 -554
$$ packed form
3597A388N89l628j584L917J651k958j344K160M21j471P67J705j592k122Q93K257
3613A049O41k566k183K199K604j487j848J180O75j753N27K937j183l232K09L053
3629H22P54k091r98K57J478J36o27nK29j229K19K882K16l731q26L314Q78j305
3647C73r07K40o07R03J173j45r43j177L89J525J267j856j777J039K156q12p15
3664A26K15n76j042J849J270j173j611J13J627O49J01j620p77J183P66m21K61
3681I40l89j222N01K239p66k013L5R68K45K15L36j524o87J263Q91j99p01o60k54
3700g82P07J321j184j174P82K62q0Q58l04j438m79J861P0m48k38o89l5J114P27
3719H51q62r18P29PK55O58p05j341N95J494n35j26l37n30p4J331L32j380j98K00
$$ plain form
3739 -554 -566 29 677 -112 -1256 -489 416 134 -259 -653 -881 -460 1357 345 -941 -462 -725 -414 797
3758 797 752 -995 -1569 -64 822 98 -413 -673 -854 -58 1291 282 -502 -851 -532 662 1548 723 -1712
3777 -1712 -1425 821 955 306 227 -638 -590 355 1503 438 -852 -790 234 1298 1386 -1016 -1411 172
3795 172 1031 684 560 668 -862 -753 1534 1803 -145 -1178 -98 1080 1101 228 -558 -40 822 752 564
3814 564 673 -400 -1353 215 2265 1115 -1353 -715 923 530 -111 614 56 -311 456 751 845 -287
3832 -287 -1502 -317 1950 1820 -1346 -1467 591 185 -701 166 517 -1143 -1605 565 1231 -417 -1860
3849 -1860 -1184 740 839 -635 -1369 -202 199 -661 412 1560 -247 -2552 -758 1420 467 -1256 -538
3866 -538 579 -49 -462 -109 -228 -209 -963 129 1646 315 -2178 -1367 1385 1225 -1295 -279 504 -640
$$ packed form
3739e54j2N95O48p89j144P67R05k82l93l94k28M21J817j012j286M79k63L11J211
3758G97m5j747n74J505Q86p24n11k60j81P96J349j009p84l49L19J194Q86q25k435
3777a712K87K246J34o49p9q65M8R45J148j065j290O2J024J064Q8k402l95J583
3795A72Q59l47j24J08j530J09K287K69j948j033J080J178K1q73p86N18Q62p0j88
3814E64J09j073r53J568K050j150k468O38J638l93o41P25n58l67P67K95R4j132
3832b87j215J185K267j30l166j21K058m06q86Q67L51j660m62K170O66j648j443
3849a860O76J924R9j474p34J167M01q60J073J148j807k305J794K178r53j723P18
3866e38J117o28m13L53j19J9p54J092J517j331k493Q11K752j60k520J016P83j144
$$ plain form
3884 -640 -1384 327 1043 -564 -1266 -283 1059 423 -1784 -1377 491 1085 -717 -225 789 -594 -2135
3901 -2135 510 2314 -69 -2104 -224 1379 352 -834 -139 602 372 -440 702 1553 -581 -2287
3917 -2287 -78 2896 1112 -1762 -895 1342 305 -791 921 1220 -857 -1448 914 1987 -317 -1866
3933 -1866 -347 2164 1420 -1055 -969 1219 214 -1003 1668 2402 -905 -2435 1467 3024 -7 -1795
3949 -1795 111 1822 1005 -508 456 921 -542 -1067 1574 2675 -879 -3635 160 3265 536 -2098
3965 -2098 93 1467 -913 -1001 1475 1267 -1795 -1689 1308 2595 -844 -3199 -619 2545 419 -1599
3981 -1599 301 1097 -1785 -1932 1725 2309 -2000 -3020 998 2338 -835 -2672 -715 1210 -183 -1326
3997 -1326 156 1385 -1675 -2985 1426 2800 -1518 -3706 676 2472 -896 -2151 450 1483 -1181
$$ packed form
3884f40p44J711P16j607p02R83J342o36k207M07J868N94j802M92J014j383j541
3901b135K645J804k383k035J880J603j027j186O95P41k30q12J142Q51k134j706
3917b287K209K974j784k874Q67K237j037j096J712K99k077n91K362J073k304j549
3933a866J519K511p44k475Q6K188j005j217K671P34l307j530L902J557l031j788
3949a795J906J711q17j513R64M65j463n25K641J101l554k756L795L105k729k634
3965b098K191J374k380q8K476k08l062J06K997J287l439k355K580L164k126k018
3981a599J900P96k882j47L657N84m309j020M018J340l173j837J957J925j393j143
3997a326J482J229l060j310M411J374m318k188M382J796l368j255K601J033k664
$$ plain form
4012 -1181 -1165 1509 859 -1876 -2603 753 3008 0 -3206 -166 1746 -1012 -1881 1288 1475 -1666
4028 -1666 -1907 1973 1768 -1764 -1744 896 2335 107 -1472 -104 918 -81 -984 1647 2156 -1859 -2613
4045 -2613 1501 2870 -507 -1406 1137 1591 -759 -804 1300 878 -798 -495 1879 2030 -1254 -2215 685
4062 685 2615 372 -810 759 1045 -1754 -753 2447 1239 -1643 -856 1612 1172 -1179 -1005 687
4078 687 1699 154 -494 517 482 -1491 -1073 2762 2379 -1824 -2269 1223 1463 -531 -296 1174 306
4095 306 -1235 -294 1499 372 -1683 -1206 1687 2276 -1468 -2755 836 1805 -890 -572 1599 -24
4111 -24 -2565 -484 2356 1121 -2206 -1746 1253 1266 -748 -1515 449 1063 -921 -868 1463 511 -2919
4128 -2919 -1364 2795 1719 -2119 -1966 1005 1127 -620 -522 402 62 -1209 -659 1885 1461 -2185 -2103
$$ packed form
4012a181J6K674o50k735p27L356K255l008l206L040J912k758q69L169J87l141
4028a666k41L880k05l532K0K640J439k228j579J368J022r99r03K631N09m015p54
4045b613M114J369l377q99K543M54k350m5K104m22j676L03K374J51l284r61K900
4062F85J930k243j182J569K86k799J001L200j208k882P87K468m40k351J74J692
4078F87J012j545o48J011l5j973M18L835l83m203m45L492K40j994K35J470q68
4095C06j541R41J793j127k055M77K893N89l744j287L591R69k695L18K171j623
4111b4k541K081K840j235l327M60K999J3k014p67J964O14j984N3K331r52l430
4128b919J555M159j076l838J53K971J22j747R8R24l40j271N50K544m24l646Q2
$$ plain form
4145 -2103 1603 2219 -1518 -2452 956 1371 -886 -463 1364 9 -1944 -903 2132 1707 -1723 -2294
4161 -2294 717 2470 -417 -1533 547 1325 -1537 -943 2086 1298 -1763 -1215 1915 1775 -999 -1854
4177 -1854 790 1890 633 -314 829 1102 -1261 -1204 2184 2731 -1399 -2027 1582 2080 -903 -985 1248
4194 1248 1191 -364 -222 1216 884 -1446 -870 1564 2144 -489 -1827 606 1807 -264 -418 1448 889
4211 889 -1655 -826 2159 1325 -1357 -1036 1155 1399 -403 -1125 424 879 -211 -533 1518 624 -2088
4228 -2088 -1345 2064 1854 -1456 -1266 776 610 -1180 -357 929 -292 -1659 -202 1480 705 -2085
4244 -2085 -1902 1024 1835 -1122 -1713 1000 93 -1654 26 1965 -136 -2556 -947 2081 678 -1770
4260 -1770 -1170 891 1107 -802 -530 439 -70 -2110 -223 2437 623 -2955 -1019 2314 1074 -1627
$$ packed form
4145b103L706O16l737r34L408M15k257M23J827j355j953J041L035m25l430n71
4161b294L011J753k887j116K080P78k862N94L029p88l061N48L130j40k774q55
4177a854K644J100j257r47J143K73k363N7L388N47m130o28L609M98k983q2K233
4194A248n7j555J42J438l32k330N76K434N80k633j338K433J201k071j54J866n59
4211H89k544Q29K985q34k682L21K191K44j802p22J549M55j090l22K051q94k712
4228b088P43L409k10l310J90K042j66j790Q23J286j221j367J457J682p75k790
4244b085J83K926Q11k957n91K713r07j747J680J939k101k420J609L028j403k448
4260a770O00K061K16j909K72R69n09k040J887K660j814l578J936L333j240k701
$$ plain form
4276 -1627 -1094 815 249 -1187 315 1153 -292 -2169 -426 2301 1135 -2310 -1681 1841 1470 -1111
4292 -1111 -570 1155 -95 -1912 528 2572 -399 -2058 -551 2119 1060 -1097 -981 1110 1070 -831
4308 -831 91 1784 502 -2037 105 3097 618 -2548 -630 2145 892 -771 -343 735 265 -796
4324 -796 483 1740 352 -1758 -433 2636 1358 -1841 -926 1436 636 -952 85 1508 -266 -1415
4340 -1415 1004 1775 363 -1715 -500 1644 1158 -896 -829 915 188 -1199 278 1948 -406 -2288
4356 -2288 342 2023 -148 -1774 -291 675 -85 -721 178 378 -694 -1146 93 1133 -3 -1773
4372 -1773 -858 1322 354 -1209 -373 345 -702 -756 510 546 -852 -1278 302 865 144 -934 -925 372
4390 372 133 -797 172 657 -828 -1699 885 1470 -833 -1620 158 966 391 -405 -307 -224 -403 190 398
$$ packed form
4276a627N33J909n66j436J502Q38j445j877J743K727j166l445O29L522l71k581
4292a111N41J725j250j817K440K044k971j659J507K670j059k157J16K091m0j901
4308h31R22J693j282k539K142K992k479l166J918K775j253j663M28J078m70j061
4324g96J279J257j388k110J325L069j278l199R15K362q00j588J037J423j774j149
4340a415K419P71j412k078J215K144m86k054O7J744p27j387J477J670k354j882
4356b288K630J681k171j626J483R66p60o36Q99K00j072m52J239J040j136j770
4372a773R15K180r68j563Q36P18j047n4J266L6j398m26J580N63p21j078RJ297
4390C72k39r30R69M85j485q71K584N85k303p87J778Q08n75p96R8Q3j79N93K08
$$ plain form
4409 398 384 -664 -1627 -57 1577 352 -1798 -375 1041 -46 -145 284 -112 -959 -327 938 1080 -405
4427 -405 -1036 -235 954 894 -482 -664 615 212 170 987 608 -664 -989 1216 1393 -49 -763 -114 624
4446 624 897 928 -232 35 202 10 695 1048 -637 -1391 396 1469 453 -565 84 94 330 575 696
4465 696 -220 -902 116 692 1101 46 -886 -683 1029 1128 -220 -425 -202 -217 -161 1082 416 -787 -820
4484 -820 556 733 439 -558 -704 -19 904 261 -345 -186 -251 -606 437 877 -469 -1079 -21 447 275
4503 275 -302 -404 -770 -251 768 154 -719 -558 -388 -49 934 279 -887 -957 -99 22 -77 -275 -257 -735
4523 -735 -59 734 -94 -649 -580 -194 74 387 89 -1134 -502 564 230 159 -36 -764 -391 610 387 -330
4543 -330 -56 -412 -422 368 1045 -89 -719 -113 771 428 390 -62 -587 -141 514 973 73 -262 -629 -77
$$ packed form
4409C98j4j048r63J570J634j225k150J423J416j087r9M29l96q47O32J265J42j485
4427d05o31Q01J189o0j376j82J279m03m2Q17l79j272l25K205J77j442p14O49P38
4446F24K73L1j160K67J67j92O85L53j685p54J787J073j016j018O49J0K36K45J21
4465F96r16o82J018N76M09j055r32K03J712R9j348k05K23j5N6J243o66j203l3
4484h20J376J77k94r97j46O85R23o43o06J59o5l55J043M40j346o10J058M68j72
4503B75n77j02l66N19J019o14q73J61J70L39R83o55j166p0Q58J21r9j98J8m78
4523g35O76P93q28n55O9L86K68L13k98j223O32J066l34p1j95p28L73J001k23p17
4543c30K74l56j0P90O77j134o30O06Q84l43l8m52n25M46O55M59r00l35l67N52
$$ plain form
4563 -77 582 594 -455 -453 305 429 258 464 -125 -486 87 1492 728 -124 -460 -17 329 773 367 -477 105
4584 105 350 -69 340 610 -450 -526 933 997 53 -741 -401 244 634 852 178 -764 -297 274 671 934
4604 934 95 -850 94 875 394 -737 -343 102 -410 535 1210 -79 -1331 -134 704 609 42 -725 -423
4623 -423 192 315 -61 -104 -104 -652 -229 992 250 -1501 -1120 923 1070 -574 -578 -67 -627 -7 532 151
4643 151 -191 -955 -577 636 954 -842 -1571 62 823 -633 -714 19 -335 -1096 268 1304 -36 -1315
4661 -1315 -696 666 378 -479 -711 -167 288 -443 -713 459 299 -1466 -245 1773 762 -1378 -979
4678 -979 833 684 -270 117 679 318 -544 105 1073 751 -1179 -513 1283 1185 -749 -911 909 487 -484
4697 -484 575 1218 -102 -1176 296 1508 884 -490 -460 760 987 -123 -265 782 670 -469 118
$$ packed form
4563g7O59J2j049KP58J24j71K06n89l61N73J405p64q52l36M43L46M44m06q44N82
4584A05K45m19M09K70j060p6J459O4r44p94L40O45L90K18o74r42M67N71L97K63
4604I34q39r45R44P81m81j131L94M45n12R45O75j289j252J197Q38r5n67p67L02
4623d23O15J23l76m3%n48M23J221p42j751L81K043J47j644mN11n60O20N39l81
4643A51l42p64L78J213L18j796p29J633P61j456q1P33l54p61J364J036j340j279
4661a315O19J362k88q57k32N44M55p31k70J172j60j765J221K018j011k140L99
4678i79J812j49r54L87N62l61q62O49R68l22j930O66J796r8j934j62J820m22r71
4697d84J059O43j320j074J472J212o24j374L0J220K27j110j42J047j12j139N87
$$ plain form
4714 118 1740 659 -1471 -557 1220 806 -375 -512 263 192 -254 214 616 152 -884 -461 870 860
4732 860 -1242 -746 879 1144 -457 -296 402 -250 -685 503 1067 -312 -1213 -491 721 786 -407 -792
4750 -792 180 724 -440 -394 670 -477 -1342 355 1526 255 -1314 -890 580 784 -344 -23 -76 -631
4768 -631 -574 -38 971 -87 -1080 -416 1565 689 -1387 -971 402 274 -105 174 170 -1128 -954 678 826
4787 826 208 -1247 -621 753 914 -739 -1151 602 230 -744 292 861 -550 -1855 25 1536 104
4804 104 -1434 -763 841 414 -445 -567 498 104 -806 105 1369 -5 -1861 -143 1510 948 -1264
4821 -1264 -425 778 146 -599 668 1091 64 -785 202 1540 335 -1384 -723 1545 1107 -1069 -717
4838 -717 1242 233 -1339 763 2067 34 -1609 -329 1441 791 -1074 -657 1040 640 -443 -500
$$ packed form
4714A18J622j081k130R14J777m14j181j37P75p1m46M68M02m64j036M23J331j0
4732H60k102M96J625K65j601J61O98o52m35J188N64j379r01P22J212O5j193l85
4750g92R72N44j164M6J064j147q65J697J171j271j569M24J470K04j128L21n3n55
4768f31N7N36J009j058r93O64J981q76k076M16J373j28l79K79mj298J74J632J48
4787H26o18j455O26J374J61j653m12J753l72r74J036N69j411j305J880J511j432
4804A04j538O71J604m27q59j22J065l94r10R11J264j374j856J718J653n62k212
4821a264Q39J203o32p45J267M23j027q49R87J338j205j719O61K268m38k176L52
4838g17J959j009j572K102J304k033j643J280J770o50j865M17J697m00j083n7
$$ plain form
4854 -500 1349 541 -1321 15 2166 540 -1887 -675 1517 907 -801 -30 601 310 -1042 -3
4870 -3 1343 356 -1418 -611 1551 589 -1867 -974 1266 819 -1166 157 1076 -672 -1776 1 1593
4887 1593 308 -1646 -960 816 544 -783 -488 672 85 -1317 -6 1679 -107 -2115 -87 1895
4903 1895 -252 -1865 -781 336 168 -664 -33 366 -332 -1495 -259 1744 467 -1945 -745 1665
4919 1665 570 -1459 -437 694 -306 -873 545 805 -990 -1684 159 1637 409 -1367 -791 1108
4935 1108 448 -835 360 1199 -810 -1527 984 2117 -738 -1727 620 2021 99 -1195 -133 1064
4951 1064 108 -544 524 1067 -509 -1616 572 2370 -108 -1767 194 1744 -39 -1206 1001 1155
4967 1155 -851 -1284 1174 1379 -767 -1545 487 1987 31 -1529 136 1018 24 -716 724 1405 -1233
$$ packed form
4854e00J849q08j862J336K151j626k427J212K192o10j708P71O31k91j352J039
4870cJ346r87j774Q07K162r62k456Q93K240m47j985J323R19j748j104J777J592
4887A593j285j954O86J776k72j327K95J160n87j402J311J685j786k008K028J982
4903A895k147j613J084J117j68q32O31L99o98j163J236K003j277k412J200K410
4919A665j095k029J022J131j000n67J418K60j795o94J843J478j228j776N76J899
4935A108o60j283J195Q39k009p17K511J133k855r89K347J401j922j294J062J197
4951A064r56o52J068N43j576j107K188J798k478j659J961J550j783j167K207J54
4967A155k006m33K458K05k146p78K032J500j956j560J665Q82r94p40J440O81k638
$$ plain form
4984 -1233 -1711 1536 1943 -692 -1437 372 1422 -191 -885 -31 1044 -419 -859 941 1430 -902 -1752
5001 -1752 748 2094 -344 -1618 455 1089 -822 -864 903 836 -896 -1195 381 1377 -441 -1375 28
5018 28 1441 -133 -1253 8 957 -891 -834 1025 830 -1517 -1592 658 1180 -763 -793 -50 383 -419
5036 -419 -1225 198 524 -1050 -1477 682 1177 -1083 -1484 279 1226 -549 -733 336 454 -821 -462
5053 -462 1224 740 -1038 -1152 207 1214 -390 -876 211 670 -339 -612 647 606 -1046 -547 1643
5070 1643 454 -881 -849 325 895 86 -538 -70 302 -285 -515 711 899 -892 -1057 1236 1522 -460
5088 -460 -1048 474 810 -295 128 358 61 -743 11 1194 792 -737 -1291 415 1605 -106 -987 547
5106 547 614 -379 -151 1179 260 -1059 -308 1078 965 -447 -867 -59 840 200 -629 58 434 -805 -132
$$ packed form
4984a233m78L247M07k635p45J809J050j613o94Q54J075j463m40J800M89k332q50
5001a752K500J346k438j274K073O34j911m2J767o7j732k99J576R96j818r34J403
5018B8J413j574j120J261R49j848N7J859j95k347p5K250N22j943l0P43M33q02
5036d19q06J423L26j574m27K159M95k260m01J763R47j775j84J069J18j275L59
5053d62J686m84j778j14J359J007j604m86J087M59j009k73J259m1j652M99K190
5070A643j189j335L2J174N70q09o24M68L72n87k30J226J88j791j65K293K86j982
5088d60n88J522L36j105M23K30k97q04P54J183m02j529n54J706J190j711q81J534
5106E47O7r93K28J330r19j319P51J386j13j412m20Q08Q99o40q29O87L76j239O73
$$ plain form
5125 -132 1338 476 -1209 -584 702 1106 -371 -537 409 174 -56 -321 280 385 -694 -449 1094 543
5143 543 -609 -1373 666 910 -550 -565 261 -16 -844 -410 741 288 -820 -676 464 826 -294 -1267
5161 -1267 -210 398 17 -496 417 5 -1017 -623 1028 248 -907 -894 317 623 -484 -479 -117 288 -359
5180 -359 -242 411 303 -671 -1093 607 1068 -594 -919 -102 321 -212 -274 282 29 -668 -183 679 416 -420
5200 -420 -799 182 752 461 -629 236 753 -235 -126 864 209 -933 -314 1043 530 -86 -580 -175 915
5219 915 141 235 406 217 -360 -59 519 742 -746 -577 638 572 -67 -83 145 -91 78 359 690 -151
5239 -151 -501 -521 588 867 -351 -1125 -32 517 -75 -548 302 -310 -534 447 1063 3 -957 -629 206
5258 206 500 -72 -383 -404 122 -124 356 610 -8 -675 -259 1324 663 -896 -912 247 321 24 -50 -467
$$ packed form
5125a32J470q62j685O25J286M04j477j66R46k35k30k65O01J05j079K45J543n51
5143E43j152p64K039K44j460j5Q26k77q28M34J151m53j108J44J140L62j120r73
5161a267J057O08l81n13R13m12j022L94J651p80j155J3J211L06j107NL62M05o47
5180c59J17O53j08r74m22J700M61j662l25Q17M23n33o2N56k53o97M85Q62k63q36
5200d20l79R81N70k91j090Q65N17r88J09R90o55j142O19J357n13o16m94M05J090
5219I15p74R4J71j89n77L01N78K23j488J69J215o6o39j6K28k36J69K81L31q41
5239a51l50k0J109K79j218p74J093N49n92m73Q50o12k24R81O16j060r60L28Q35
5258B06K94n72l11k1N26k46M80K54o18o67M16J583o61j559j6J159P4k97p4m17
$$ plain form
5278 -467 -327 -22 385 398 -64 -850 -416 623 700 -635 -1047 332 70 -359 54 324 -386 -921 355
5297 355 551 85 -863 -261 -220 134 124 -533 -250 -80 1 36 477 -264 -944 -158 560 467 -587 -186 71
5318 71 -181 229 239 -390 -406 -227 -89 130 203 -501 -550 326 540 -17 -141 -16 -22 -68 435 150 -62 -523 31
5341 31 170 441 221 -647 -197 482 665 -267 -72 -46 -68 274 599 37 -357 -54 126 449 502 405 -302 -220
5363 -220 464 388 -100 189 40 120 493 353 -109 -272 -63 307 547 255 -252 -478 164 405 1 49 -9
5384 -9 -293 -193 294 444 -702 -353 341 458 444 -116 -250 -349 158 439 -43 78 -426 -541 41 623 -50
5405 -50 -759 -165 399 194 -143 -112 -491 -289 -74 337 -91 -402 -734 -206 737 634 -263 -775 -237 -65 -46
5426 -46 176 -70 -759 -645 479 551 -221 -622 -656 103 333 138 -744 -427 4 86 273 -24 -233 -969 -138
$$ packed form
5278d67J40L05M07J3m62p86M34J039P7j335m12J379k62m29M13K70p10n35J276
5297C55J96m66r48O02M1L54j0o57K83J70Q1L5M41p41o80P86P18r3j054M01K57
5318G1k52M10J0o29j6J79J38K19P3p04m9Q76K14n57j24J25om6N03k85k12m61N54
5341C1J39K71k20q68M50O79J83r32J95K6k2L42L25n62l94L03J80L23N3r7p07Q2
5363b20O84p6m88K89j49Q0L73j40m62j63K09L70K40k92n07k26O42K41m04M8n8
5384ik84J00M87J50j146L49O94J17j4n60j34r9N07K81m82J21n04j15N82N82o73
5405e0p09N94N64k05l37L1l79K02K15M11m28l11l32N28R43j03q97n12N38J72J9
5426d6K22k46o89J14J124P2p72m01l4P59K30j95q82L17M31Q2J87k97k09p36Q31
$$ plain form
5447 -138 676 -7 -692 -118 230 410 380 -359 -191 -311 -154 140 282 206 -677 -48 551 425 -266 128 262
5468 262 -355 18 476 -35 -742 -310 627 609 175 -814 -235 543 493 176 74 381 103 -419 501 804 -774
5489 -774 -577 625 711 102 -160 -26 81 -218 372 278 151 -322 -428 288 967 77 -718 -68 814 -410
5509 -410 -274 383 10 -542 84 597 341 -438 -884 67 871 285 -273 -66 617 -35 -357 331 515 -571
5529 -571 -550 334 694 -429 -909 141 608 -30 -396 -323 35 -353 -428 376 823 -252 -1488 36 818
5548 818 -305 -1074 -72 418 -148 -549 358 342 -882 -719 455 883 -365 -1509 -704 963 160 -599
5566 -599 -74 385 -603 -643 638 445 -1050 -938 538 1308 -249 -893 -507 545 333 -405 137 464 -622
5585 -622 -704 815 1551 -628 -1229 295 1034 -39 -511 -143 308 -135 -83 486 189 -869 -771 429 1408
$$ packed form
5447a38Q14o83o85N74L48J80l0p39J68j20J57K94J42p6q83O29N99j26o91L94J34
5468B62o17L73M58n11p07M32R37j8m34r89N79P78n0l17j02L07k78n22R20L03j578
5489g74J97J202Q6o09k62J34J07k99N90r4j27m73j06P16O79q90p95O50Q82j224
5509d10J36O57l73n52O26N13k56p79m46R51Q04n86n58K07O83o52l22O88J84j086
5529e71K1Q84L60j123m80J050M67o38l66P3L58l88p5Q04M47j075j236J524P82
5548H18j123p69J002M90n66m01R07j6j224J63J174M28j248j144Q05J667q03p59
5566e99N25M59r88m0J281j93j495J12J476P70j557o44L86J052k12p38N42L27j086
5585f22q2J519P36k179o01J524P39j073m72L68M51m43N2N69k97j058R8J200R79
$$ plain form
5604 1408 -186 -1096 253 743 -271 -551 427 537 -609 -439 1026 538 -807 -833 832 952 -85
5621 -85 -577 -11 297 -287 -198 963 780 -930 -853 1258 1072 -879 -776 515 520 -710 -203 538 -107 -618
5641 -618 -233 738 398 -794 -922 198 936 -481 -759 841 648 -798 -86 1174 241 -1088 -402 945
5659 945 706 -973 -744 464 514 -205 -221 280 181 -792 -581 1132 638 -1197 -832 711 425 -728 -1055
5678 -1055 691 224 -782 -130 824 356 -878 -559 703 868 -812 -955 680 761 -1000 -537 461 166
5696 166 -1060 -181 812 292 -1224 -371 512 588 -339 -924 333 -66 -304 -542 677 151 -808 -483 1204
5715 1204 721 -958 -586 718 386 -389 -175 475 250 -238 -139 849 27 -938 -698 807 868 -706 -649
5734 -649 550 360 -578 -31 915 214 -784 417 803 541 -521 -501 707 753 -86 -568 161 727 -711
$$ packed form
5604A408j594r10J349M90j014k80R78J10j146J70J465m88j345k6J665J20j037
5621h5m92N66L08n84Q9J161j83j710P7K111j86j951J03J291Nj230N07P41o45n11
5641f18L85R71l40j192j28J120P38j417k78J600j93j446P12J260r33j329O86J347
5659I45k39j679K29J208N0p19j6N01r9r73K11J713m94j835L65J543k86j153l27
5678a055J746m67j006O52R54m68j234L19J262J65j680j43J635Q1j761M63R98k95
5696A66j226Q79R93n20j516Q53Q83P6r27n85J257l99k38k38J219n26r59L25J687
5715A204m83j679L72J304l32p75K14O50k25m88R9R88q22r65K40J505O1j574N7
5734f49J199j90r38N47R46p01r98J201L86k62j062K0J208M6q39m82P29N66j438
$$ plain form
5753 -711 -14 900 -16 -1206 -280 1316 666 -258 -626 431 502 -233 191 413 88 -398 -258 1082 555
5772 555 -804 -328 1190 839 -537 -423 776 60 -372 301 490 -282 -1014 -334 740 529 -464 -898
5790 -898 419 343 -711 -323 596 97 -800 151 884 -101 -1266 -462 477 516 -524 -466 43 360 -409 -753
5810 -753 375 -227 -988 -586 533 39 -1232 -735 645 292 -710 -377 211 -362 -560 -130 578 -61
5828 -61 -1023 -810 450 635 -685 -676 247 490 -775 -324 980 -353 -1021 277 1206 89 -744 -493 662
5847 662 669 -278 -218 421 219 -416 -85 935 454 -1064 -259 1276 472 -740 -8 535 447 -445 172 610
5867 610 7 -415 58 1049 453 -813 -556 937 464 -359 1 696 312 -544 351 920 -258 -954 57
5886 57 722 529 -630 -407 582 455 -513 -118 606 286 -837 94 1308 290 -1289 -439 920 -70
$$ packed form
5753g11O97R14r16j190R26J596o50r24l68J057P1p35M24K22l25m86J40J340n27
5772E55j359M76J518l51j376J14J199p16m32O73J89p72p32O80J074k11r93m34
5790h98J317p6j054L88R19m99q97R51P33r85j165Q04R39L9j040N8N09L17p69l44
5810g53J128o02p61M02J119m94j271M97J380l53j002L33N88n73j98M30P08o39
5828f1r62K13J260J85j320RR23K43j265M51J304j333o68J298R29j117q33K51J155
5847F62Pr47O0O39k02o35L31J020m81j518Q05J535q04j212P32N43q8q92O17M38
5867F10o03m22M73R91n96j266K57J493m73q23L60O95l84q56Q95N69j178o96J011
5886E7O65j93j159K23R89j27r68L95P24l20j123R31J214j018j579Q50J359r90
$$ plain form
5904 -70 -739 -141 218 -24 -151 51 683 -192 -1054 -93 1124 459 -993 -339 487 154 -555 93 454 -581
5924 -581 -1043 462 857 -473 -980 -411 629 327 -584 -611 223 -52 -609 337 745 -596 -1037 221 965
5943 965 -294 -913 -70 143 139 -570 56 125 -432 -609 427 668 -141 -1184 -15 1018 -362 -902 -370
5962 -370 666 -126 -693 538 352 -579 -760 285 603 -249 -699 -229 424 -111 -557 214 369 -113 -600
5981 -600 343 615 -548 -777 238 558 -30 -505 103 525 -56 -100 110 446 -2 -631 107 866 -210
6000 -210 -749 281 600 198 -337 59 199 -102 -394 538 323 -285 -418 353 734 133 -96 -186 481 21
6020 21 -173 175 493 -236 -490 354 748 -220 -344 -76 450 362 -301 129 64 278 -165 -13 503 -458 -819
6041 -819 56 1010 89 -356 -76 297 -216 27 362 -104 -257 -63 306 65 36 -814 -388 250 244 -46 -233
$$ packed form
5904g0o69N98L59k42j27K02O32q75q62R61J217o65j452O54Q26l33p09O48L61j035
5924e81m62J505L95j330n07N69J040l02r11k7Q34k75n57R46M08j341m41J258P44
5943I65j259o19Q43K13mp09O26O9n57j77J036K41q09j043J169J033j380n40N32
5962c70J036p92n67J231j86r31j81J045L18q52m50M70O53n35m46P71J55m82m87
5981f00R43K72j163k29J015L20n88m75O08M22n81m4K10L36m48o29P38P59j076
6000b10n39J030L19m02n35L96J40l01k92R32k15o08j33P71L81o01k29r0O67m60
6020B1j94L48L18p29k54Q44L94r68j24K68N26q8o63M30o5K14m43J52N16r61l61
6041h19Q75R54r21m45K80L73n13K43L35m66j53J94L69k41k9q50M26O38ok90j87
$$ plain form
6062 -233 9 -283 64 167 32 -325 -205 280 128 -52 -354 -135 -230 -71 -139 -112 -256 -48 -356 493 187
6083 187 -695 -714 -46 258 254 -43 -351 -92 -46 569 224 36 -171 -250 670 448 -221 -208 -173 84 -33 -143
6105 -143 13 -242 -438 223 664 -95 -452 -202 180 527 157 -95 -222 27 211 230 -39 238 -78 -144 344
6126 344 58 -34 -830 166 387 269 198 -235 220 131 103 235 127 -177 -388 331 547 16 -253 216 -140
6147 -140 -27 320 152 -180 -304 270 191 101 61 -12 -8 113 305 220 -361 95 -32 -1 16 284 -249 -82 -85 78
6171 78 -69 -220 -229 -133 285 96 -104 -173 225 94 -117 303 162 -623 6 -148 337 74 -279 -135 -116 433
6193 433 -144 -299 -203 -194 8 -51 277 -110 -532 -68 191 25 -335 -541 -191 213 135 -31 -389 -334 -258 -318 224
6216 224 213 -795 -610 250 93 -157 -183 -64 -226 29 418 110 1 -216 -44 916 370 -7 -413 196
$$ packed form
6062b33K42k92L47J03j35l57J20M85j52j80l02K19r5J59o8K7j44K08l08Q49l06
6083A87q82j9O68L04mk97l08K59M6O15l45j88k07p9R20k22o69J3L5K57j17j10
6105a43J56k55j96O61M41p59l57K50L82L47l70k52j27K49J84J9k69K77l16o6M88
6126C44k86r2p96R96K21j18p1m33M55q9k8J32j08l04k11P19K16n31k69M69l56
6147a40J13L47j68l32j24N74p9r0m0p3MJ21J92q5n81M56j27L1J7K68n33J67lJ63
6171G8j47j51rR6M18j89k00o9L98j31k11M20j41p85O29j54M85k63l53J44J9N49
6193D33n77j55R6RK02n9L28l87m22M64K59j66l60k06L50M04p8j66l58N5P6o0N42
6216B24j1j008J85Q60j57k50k6J19j62K55L89l08j09k17J72R60n46l77m06O09
$$ plain form
6236 196 322 7 -78 82 8 8 367 383 -72 -411 -288 682 484 124 -47 -1 226 372 198 127 11 -243
6258 -243 185 662 539 -92 -74 376 409 274 32 245 -55 200 -154 297 82 -399 -146 377 417 -104 -286
6279 -286 38 304 -169 -44 277 -92 -394 85 584 112 -567 86 107 349 -290 -454 33 174 -208 -276 564
6300 564 -131 -731 -47 373 418 -586 78 202 89 -61 65 300 -350 37 -255 462 227 -748 -432 431
6320 431 173 -316 191 260 -212 -205 25 513 -257 -163 -59 298 75 -470 -393 -186 340 -159 -410 274 -133 -506
6342 -506 222 329 23 -382 18 282 -98 -545 -35 38 102 -188 -178 328 25 -494 -45 635 281 -766 -387
6363 -387 465 182 -202 11 222 -306 -599 77 812 -23 -496 -29 469 673 -381 -298 275 423 -165 281
6383 281 505 -299 -700 444 699 -279 -453 -5 613 543 -170 101 242 59 -63 260 382 17 -922 162
$$ packed form
6236A96J26l15q5J60p4%L59J6m55l39J23R70j98l60j71M6K27J46j74p1j16k54
6258b43M28M77j23o31J8M50L3j35k42K13l00K55l54M51k15m81K53N23M0n21j82
6279b86L24K66m73J25L21l69l02M79M99m72o79O53K1K42o39j64M87J41l82o8Q40
6300E64o95o00O84M20M5j004O64J24j13j50J26K35o50L87k92P17k35r75L16Q63
6320D31k58m89N07O9m72PK30M88p70R4J04L57k23n45P7K07N26m99k51O84m07l73
6342e06P28J07l06m05M00K64l80m47N10P3O4k90J0N06l03n19M49O80l54j047L79
6363c87Q52k83l84K13K11n28k93O76P35q35m73M67M98K04j054Q3N73J48n88M46
6383B81K24q04m01J144K55r78j74M48O18p0p13K71J41j83j22L23J22l65r39J084
$$ plain form
6403 162 725 157 -553 -202 477 107 -29 307 17 169 -388 124 765 -85 -838 -482 691 471 -215 101
6423 101 368 -153 -429 391 845 -238 -316 103 543 74 -653 -131 -47 299 -174 56 222 5 -430 -242
6443 -242 750 -107 -1071 -21 531 -66 -230 -27 150 -60 -195 78 -2 -363 -477 -310 631 -40 -818 -313
6463 -313 392 148 -829 -83 158 -489 -480 -39 136 -251 -621 -250 509 325 -599 -187 513 24 -307 -71 386
6484 386 -309 -771 249 892 3 -736 -61 383 109 -363 257 321 -11 -218 -66 786 103 -911 -85 882
6504 882 262 -738 45 706 153 -37 462 876 99 -792 530 697 149 -662 89 717 469 -381 324
6523 324 590 -177 -618 262 946 -240 -888 102 770 -34 -409 115 413 91 -243 225 482 -287 -632 292
6543 292 942 174 -974 -271 740 57 -677 115 123 -521 -261 867 363 -502 -816 299 777 322 -752
$$ packed form
6403A62N63n68p10L51O79l70j36L36k90J52n57N12O41q50p53L56J173k20o86L16
6423A01K67n21k76Q20M54j083p8M19M40m69p27N22Q4L46m73K30J66k17m35J88
6443b42R92q57r64J050N52n97j64K03J77k10j35K73q0l61j14J67R41o71p78N05
6463c13P05k44r77P46K41o47RM41J75l87l70L71P59j84r24M12P00m89l31K36M57
6484C86o95m62J020O43q89p39O75M44k74m72O20O4l32k07J52Q52o83j014Q26R67
6504H82o20j000P83O61n53j90M99M14p77q91J322J67n48q11P51O28k48q50P05
6523C24K66p67m41Q80O84j186o48R90O68q04l75N24K98l22l34M68K57p69l45R24
6543B92O50p68j148P03J011o83p34P92Qo44K60J128n04q65l14J115M78m55j074
$$ plain form
6562 -752 -343 225 -301 -609 108 605 -392 -789 461 781 -287 -874 325 663 30 -529 -360 419 -256
6581 -256 -375 555 368 -669 -1041 323 840 -480 -968 405 112 -477 -478 588 266 -272 -318 63 647
6600 647 -537 -962 -6 872 -203 -661 -221 429 -517 -458 518 275 -644 -838 711 653 -180 -531 -2 396
6620 396 107 -283 48 199 -263 -437 601 679 -682 -666 315 640 -351 -346 655 150 -563 -367 589 197
6640 197 -78 -249 406 528 -349 -708 393 823 -165 -220 812 92 -439 -264 510 555 -497 -496 265 635
6660 635 -225 -393 335 463 -451 -266 254 345 -629 -204 879 470 -299 -485 269 575 -300 166 360 -13
6680 -13 -432 -229 522 536 -351 -364 412 511 -270 -516 306 -94 -622 -39 505 114 -808 -155 269 328 -455 -446
6702 -446 199 446 -141 -411 -69 148 -429 -367 530 209 -896 -469 435 524 -438 -572 -22 -71 -190 -64 23
$$ packed form
6562g52M09N68n26l08P17M97r97l97J250L20j068n87J199L38o33n59J69P79o75
6581b56j19R30j87j037l72J364N17j320m88J373k93n89jJ066l22n38m6L81N84
6600F47j184m25R56Q78j075m58M40O50r46N9R76k43r19j94J549n8q33l51N29L98
6620C96k89l90L31J51m62j74J038P8j361J6R81L25r91NJ001n05p13J96R56l92
6640A97k75j71O55J22q77l59J101M30r88n5J032p20n31J75P74M5j052JP61L70
6660F35q60j68P28J28r14J85N20R1r74M25J083m09p69j86P54L06q75M66J94l73
6680a3m19K03P51J4q87j3P76R9p81k46Q22m00n28N83N44l91r22O53M24N9p83R
6702d46O45K47n87k70L42K17n77O2Q97l21j105M27R04Q9r62j34N50m9j19J26Q7
$$ plain form
6723 23 138 -307 -241 714 482 -141 -783 95 524 -403 -285 518 126 -204 82 516 167 -467 -292 357 109
6744 109 -14 -526 143 415 -144 -347 396 180 -415 -167 463 222 -748 -404 324 261 -101 -26 142 67 -136
6765 -136 -28 353 67 -175 -205 490 426 -593 -486 245 199 -85 -464 208 50 -213 342 462 -74 -659 -24
6786 -24 323 239 140 -275 145 403 -444 270 373 -56 -430 -77 390 159 6 -352 38 222 57 -155 -119
6807 -119 247 -113 316 284 445 -459 22 486 268 -506 9 217 290 -106 356 334 195 -183 -20 389 178
6828 178 -94 -94 178 133 -285 177 281 -22 -463 61 491 -57 -266 -212 318 -148 -203 -285 -81 -101 109 -184
6850 -184 36 -110 -428 -205 61 203 -758 -207 352 -160 -235 -81 -176 -326 -71 299 582 -132 -477 -192 568
6871 568 314 -169 -265 -8 37 -306 -367 4 -386 -270 38 372 197 -80 -313 33 119 226 61 -76 353
$$ packed form
6723B3J15m45O6R55k32o23o42Q78M29r27J18Q03l92l30K86M34l49o34J75O49k48
6744A09j23n12O69K72n59k03P43k16n95K48O30k41r70L44P28o3l62P5J68p5k03
6765a36J08L81k86k42l0O95o4j019J07P31m6k84l79O72j58k63N55J20n36n85O35
6786b4L47q4r9m15M20K58q47P14J03m29l74L53M67k31j53l58L90J84j65k12L6
6807a19L66l60M29l2J61r04M81M64k18p74N15K08P3l96M62k2j39l78J63M09k11
6828A78k72%K72m5m18M62J04l03m41N24M30n48k09N4N30m66n5q2K04k0K10k93
6850a84K20j46l18K23K66J42r61N51N59n12p5J54r5j50K55L70K83p14l45K85P60
6871E68k54m83r6K57M5l43o1L71l90J16L08L34j75k77k33L46Q6J07j65j37M29
$$ plain form
6892 353 56 465 74 -45 -487 -65 518 -45 -248 -31 307 72 -38 101 124 157 275 275 294 211 -126 -421
6914 -421 217 358 125 -385 -38 -99 234 -51 209 -109 -99 216 336 -109 -81 -143 -134 606 98 33 53 215 -142
6937 -142 304 463 -51 -413 68 17 37 -183 -309 -1 -73 73 202 -357 -102 -414 194 226 116 -234 -114
6958 -114 36 185 -24 -88 -51 -561 228 -85 -13 -362 -42 5 400 250 -97 -380 -275 277 18 -43 77 -268
6980 -268 -169 -202 209 -147 -452 38 -99 -346 389 -245 -302 -278 384 18 -141 -9 -74 -67 402 235 -88 -269
7002 -269 80 -237 354 20 -91 -370 -201 76 -97 131 32 -278 133 263 -5 -241 -107 -263 16 178
7022 178 -76 -264 -362 52 207 -67 175 89 -161 -65 447 -41 -180 -33 184 296 79 108 -344 -177 141
7043 141 276 -227 265 6 7 398 161 59 -79 144 -84 -26 568 -85 -394 4 379 289 1 -47 -270 174
$$ packed form
6892C53k97M09l91j19m42M22N83n63k03K17L38k35j10J39K3L3J18%J9q3l37k95
6914d21O38J41k33n10L47o1L33k85K60l18J0L15J20m45K8o2RP40n08o5K0J62l57
6937a42M46J59n14l62M81n1K0k20j26L08p2J46J29n59K55l12O08L2j10l50J20
6958a14J50J49k09o4L7n10P89l13P2l49L20M7L95j50l47k83J05N52k59o1J20l45
6980b68R9l3M11l56l05M90j37k47P35o34n7K4O62l66j59J32o5PM69j67l23j81
7002b69L49l17N91l34j11k79J69K77j73K28r9l10M11J30k68k36J34j56K79J62
7022A78k54j88r8M14J55k74K42q6k50R6N12m88j39J47K17J12k17K9m52J67L18
7043A41J35n03M92k59JL91k37j02j38K23k28N8N94o53l09L98L75r0k88m8k23M44
$$ plain form
7065 174 516 66 -14 -8 201 -174 228 297 -224 -238 324 501 28 165 -2 -91 -128 50 -9 218 -68 -258 356
7088 356 332 -137 -495 -126 392 63 -266 193 -101 -628 -168 478 48 -300 -159 -113 379 29 -106 -23 183
7109 183 -132 -28 227 179 -264 14 49 111 -418 -477 83 329 -4 -228 -110 101 -171 -171 5 -47 -508 -315
7131 -315 99 473 -333 -501 143 222 -200 181 243 -89 -242 117 74 93 -117 -452 -161 11 61 -359 33 455
7153 455 33 -483 274 57 -594 -46 372 530 -180 94 -72 353 58 -76 277 50 -172 -223 343 519
7173 519 -333 -432 73 58 -27 -250 265 748 107 131 396 123 -619 -35 221 536 104 -305 -71 663 -83
7194 -83 -307 373 -44 -446 -248 576 435 -516 -469 456 478 44 -528 33 287 -129 -74 160 36 -821 -402
7215 -402 444 299 -636 -482 179 468 -111 -418 103 -129 -542 -25 268 34 -321 -622 107 558 -58 -307
$$ packed form
7065A74L42m50q0OK09l75M02O9n21j4N62J77m73J37j67q9l7J78n9K27k86j90O14
7088C56k4m69l58L69N18l29l29M59k94n27M60O46m30l48J41M6M92l50j35Q3K06
7109A83l15J04K55m8m43K78L5O2n29n9N60K46l33k24J18K11k72%J76n2m61J93
7131c15M14L74q06j68O44P9m22L81O2l32j53L59m3J9k10l35K91J72N0m20L92M22
7153D55m22n16P57k17o51N48M18J58p10K74j66M25k95j34L53k27k22n1N66J76
7173E19q52r9N05j5q5k23N15M83o41K4K65k73p42N84K56L15m32m09K34P34p46
7194h3k24O80m17m02J98Q24j41r51M7R25K2m34n72N61K54m16N5K34j24q57M19
7215d02Q46j45r35J54O61K89n79l07N21k32m13N17K93k34l55l01P29M51o16k49
$$ plain form
7235 -307 212 62 -217 6 321 47 -445 -66 376 197 -555 -346 72 204 122 -587 326 149 -157 -139 323
7256 323 357 -469 -414 353 596 -325 -199 333 -11 164 -166 23 64 -538 -64 449 568 -309 -509 383 211
7277 211 -593 -302 427 74 -422 315 702 28 -533 -316 755 -14 -418 -312 326 118 -360 50 254 464
7297 464 -617 -141 556 179 -333 112 297 387 -217 -71 351 337 -190 136 195 66 -172 24 480 326 -232
7318 -232 -600 589 96 -65 -252 273 135 -342 -7 410 295 -411 -82 641 71 -491 -180 -1 188 -443
7338 -443 292 234 80 -791 -153 304 13 -207 -93 432 -59 -156 125 -38 -298 -264 116 562 -109 -387 -365
7359 -365 608 176 -344 -352 -35 -423 -433 -40 295 -26 -360 -335 636 -31 -399 -322 515 339 -166 -439 117 -233
7381 -233 -286 391 226 65 -561 39 193 92 -507 -43 -73 266 54 -28 217 43 -593 -94 505 -140 -715
$$ packed form
7235c07N19j50k79K23L15k74m92L79M42j79p52K09M18J32q2p09R13j77l06J8M62
7256C23L4q26N5P67K43r21J26N32l44J75l30J89M1o02M74N13J19q77k00Q92j72
7277B11q04K91P29l53m96P37L87o74n61K17J071p69m04J06O38k08m78M10K04K10
7297D64j081M76O97l77n12M45J85R0o04J46M22j4n27L26N9j29k38J96M56j54n58
7318b32l68J189m93j61j87N25j38m77L35M17j15p06L29P23n70n62L11J79J89o31
7338d43P35n8j54q71O38M57k91k20J14N25m91r7K81j63k60L4L80M46o71k78K2
7359c65R73m32n20qL17l88j0L93L35l21l34K5R71o67l68P7Q37j76n05k73N56l50
7381b33n3O77j65j61o26O00J54j01n99M64l0L39k12q2K45j74o36M99N99o45n75
$$ plain form
7402 -715 -496 702 -43 -360 -57 365 -187 -338 234 557 -78 -331 -69 673 261 -382 -287 90 69 -72
7422 -72 -147 322 103 -369 398 512 168 -183 -292 389 167 -22 91 65 174 -343 26 198 158 -278 100
7443 100 753 203 -339 -234 408 255 -122 -98 182 180 -160 -149 544 67 -522 -4 609 89 -395 -394 423 42
7465 42 -433 87 174 102 -240 -122 431 -98 -321 -304 221 175 -206 -213 322 44 -332 -153 439 -91 -642 -12
7487 -12 233 -135 -188 78 -203 -201 -241 -144 173 -23 -428 -6 492 13 -702 114 536 17 -126 -290 424 -331
7509 -331 -251 -185 245 -316 -438 -46 255 -139 -156 -167 73 231 -260 37 369 13 -466 257 770 -140 -162 80
7531 80 76 -53 97 99 306 -279 -282 404 343 158 -453 -67 370 179 -417 5 515 24 -18 86 189 -521 -154
7554 -154 227 293 -173 -319 -147 601 157 -160 -191 236 210 36 274 254 -386 -556 290 275 -66 -122 172 101
$$ packed form
7402g15K19J198p45l17L03M22n52j51N72L23o35k53K62P42m12o43R5L77k1j41
7422g2p5M69k19m72P67J14l44l51j09O81k22j89J13k6J09n17L69J72m0m36L78
7443A00O53n50n42J05O42j53l77K4K80kl40J1O93m77n89N18O13n20m84JQ17l81
7465D2m75N20Q7p2l42J18N53n29k23J7N25m6l81pN35k78l76J79N92n30n51O30
7487a2K45l68n3K66k81Km0R7L17j96m05M22M98m79p15Q16M22n19j43j64P14p55
7509c31Q0O6M30n61j22L92L01l94j7j1K40J58m91K97L32l56m79P23N13r10k2K42
7531H0mj29J50KK07n85lO86o1j85o11L86M37j91n96M22N10m91m2J04J03p10L67
7554a54L81O6m66j46J72P48m44l17l1M27k6j74K38k0o40j70Q46j5l41n6K94p1
$$ plain form
7576 101 402 218 -41 3 -65 62 100 473 -151 -536 20 451 76 -581 159 33 -159 176 260 455 -456
7597 -456 -472 -36 468 -115 -276 -8 351 67 -109 55 358 -234 -137 281 256 -379 -83 336 57 -127 87
7618 87 202 -137 -3 -116 105 -114 -354 -367 461 128 -98 -294 141 186 -314 -246 -134 -38 -471 67 376 218
7640 218 -199 -357 -195 400 -138 -442 -18 -130 -336 -247 383 -1 -447 -211 -66 298 -121 -328 -201 116
7660 116 -80 0 69 -9 25 68 248 208 -351 -212 247 525 -169 69 129 101 -250 127 476 -63 -119 -103 60
7683 60 9 -230 -93 -75 270 -23 -57 78 -65 65 -159 373 1 -261 -458 317 238 67 -53 -195 53 60
7705 60 -156 128 167 166 6 479 342 39 -32 -80 155 167 -64 404 -99 -116 -55 25 -116 -504 -165 -75 90 -345
7729 -345 -521 -85 119 -99 443 99 -413 -441 183 -70 -195 -41 -557 -171 179 239 -115 -367 96 91 -201
$$ packed form
7576A01L01j84k59M4o8J27L8L73o24l85N56M31l75o57P40j26j92L35Q4J95r11
7597d56j6M36N04n83j61K68L59k84j76J64L03n92R7M18k5o35K96M19k79j84K14
7618H7J15l39J34j13K21k19k40j3Q28l33k26j96M35M5n00O8J12R6m33N38L09j58
7640B18m17j58J62N95n38l04M24j12k06Q9O30l84m46K36J45L64m19k07J27L17
7660A16j96Q0O9p8L4M3J80m0n59J39M59K78o94K38O0k8l51L77L49n39n6J6J63
7683F0n1k39J37J8L45k93l4J35j43J30k24N32l72k62j97P75p9j71j20j42K48P
7705F0k16K84L9jj60M73j37l03p1m8K35J2k31M68n03j7O1Q0j41l88L39R0J65m35
7729c45j76M36K04k18N42l44n12k8O24k53j25J54n16L86L50O0l54k52M63nk92
$$ plain form
7750 -201 39 -77 -187 -11 356 -86 -3 49 -163 36 146 200 -168 47 135 -284 80 199 -221 -235 14 410
7772 410 -75 -170 -109 -90 25 -27 158 -266 -505 -96 95 204 -25 -41 -171 109 127 -166 -233 65 137 -10 418
7795 418 -221 -11 -88 -216 39 43 -111 -493 266 180 -34 -200 226 1 -80 138 155 -84 -425 -420 401 287 129
7818 129 -79 203 67 118 -43 -309 10 191 -210 90 88 -127 110 268 64 106 200 -26 -196 206 344 302
7840 302 -17 -315 -4 27 523 282 -229 -328 305 265 -92 219 -252 162 203 274 -172 -38 -350 -286 70 278
7862 278 -99 -177 -88 192 47 215 -123 0 221 152 67 -127 -346 -70 -257 171 -8 -538 139 67 -216 -213
7884 -213 -158 -1 -458 26 223 23 -325 -97 -113 37 -124 -122 273 -134 56 -42 -69 -157 -215 -213 94 396 -279
7907 -279 -250 166 290 -349 206 344 -174 -486 163 183 53 -287 -288 286 160 33 218 -68 54 -360 -69
$$ packed form
7750b01K40j16j10J76L67m42Q3N2k12J99J10N4l68K15Q8m19L64J19m20j4K49L96
7772D10m85r5O1J9J15n2J85m24k39M09J91J09k29j6j30K80J8k93o7K98P2j47M28
7795D18o39K10p7j28K55Mj54l82P59q6k14j66M26k25q1K18J7k39l41NQ21j14j58
7818A29k08K82j36N1j61k66L19J81m01L00kk15K37J58k04M2R4k26j70M02J38m2
7840C02l19k98L11L1M96k41n11r9O33m0l57L11m71M14M1P1m46J34l12O4L56K08
7862B78l77p8Q9K80j45J68l38J23K21o9q5j94k19K76j87M28j79n30O77p2k83L
7884b13N5J57m57M84J97k00l48K28j6J50j61KL95m07J90r8k7q8n8KL07L02o75
7907b79K9M16J24o39N55J38n18l12O49K0j30l40jN74j26j27J85k86J22m14K91
$$ plain form
7928 -69 436 -153 -638 91 410 -173 -154 -129 -172 245 306 277 -37 -61 -255 30 121 -33 -253 161 395 -66 -161
7951 -161 -81 19 -72 -44 299 -110 266 178 -9 503 493 -84 -239 276 137 -147 9 111 -49 -456 159 538
7973 538 -102 -55 -229 128 49 -286 36 -38 -76 90 -14 250 -110 -208 142 391 130 -244 -65 223 -281 98
7995 98 59 233 -376 -154 64 301 47 41 270 334 12 87 -218 361 64 -241 3 88 -538 -400 -26 520
8017 520 -41 -61 -212 168 166 -99 99 -41 -112 -236 329 -111 -330 -172 -102 159 15 -141 -15 126 39 4
8039 4 239 -254 69 -418 381 250 -81 -388 -50 191 -28 77 3 67 -187 187 66 95 -130 -91 49 -124
8061 -124 104 38 -314 235 -59 -127 -144 20 -55 -330 287 717 14 -117 -5 285 215 34 62 41 -445 154
8083 154 43 498 -73 -350 407 232 66 -263 31 402 -9 -274 190 195 -269 -188 91 -95 -55 -105 142 212
$$ packed form
7928f9N05n89m85P29L19n83J9K5m3M17O1k9l14k4j94K85R1j54k20M14K34m61r5
7951a61Q0J00r1K8L43m09L76q8j87N12j0n77j55N15j39k84J56J02j60m07O15L79
7973E38o40M7j74L57p9l35L22p4l8J66j04K64l60r8L50K49k61l74J79K88n04L79
7995I8l9J74o09K22K18K37k54oK29O4l22P5l05N79k97l05K44Q5o26J38L74N46
8017E20n61k0j51L80kk65J98j40p1j24N65m40k19J58P0K61j44j56J26J41q7l5
8039DK35m93L23m87P99j31l31l07L38K41k19J05p4O4k54L74j21K9k25L9J40j73
8061a24K28o6l52N49k94o8j7J64p5k75O17M30p03j31J12K90p0j81K8k1m86N99
8083A54j11M55n71k77P57j75j66l29K94L71m11k65M64Nm64Q1K79j86M0n0K47P0
$$ plain form
8105 212 -334 -384 59 398 -77 -204 63 556 -306 -171 294 436 11 -210 120 107 189 -179 10 133 -294
8126 -294 -368 287 92 -130 -353 -15 430 183 -198 45 365 -190 -384 191 48 -190 -156 -27 139 -20 -580
8147 -580 -19 153 -197 -286 -269 70 -59 -215 362 254 -383 -336 52 303 24 -107 -67 -72 -187 -149 51 302
8169 302 -109 -208 -165 205 -165 -249 -133 494 165 -145 326 149 -241 -57 267 18 -170 -301 144 282 -67
$$ packed form
8105B12n46n0M43L39m75j27K67M93q62J35M65J42m25k21L30j3Q2l68J89J23m27
8126b94p4O55j95k22k23L38M45k47l81K43L20n55j94N75j43k38L4J29J66j59n60
8147e80N61J72l50q9J7L39j29j56N77j08o37M7L88K51k79j31M0nj15L8K00K51
8169C02m11r9M3L70l70q4J16O27l29l10M71j77l90J84L24k49j88j31M45J38l49
8190f7n
8191g2
$$ Imaginary data points
##PAGE= N=2
##DATA TABLE= (X++(I..I)), XYDATA
$$ plain form
0 0 0 0 0 0 0 0 0 0 0 7 -8 8 -8 8 -16 16 -20 24 -28 32 -39 44 -52 59 -67 76 -88 99 -113 125 -140 159 -180
33 -180 198 -221 247 -274 303 -337 373 -412 457 -506 562 -621 690 -769 856 -960 1081 -1228
51 -1228 1405 -1624 1909 -2288 2826 -3643 5027 -7816 15612 -80381 -291182 -62083 150725
64 150725 42261 -138698 -72154 47682 -7542 -109156 -42835 59802 7760 -96281 -44913
75 -44913 51546 -13481 -139164 -93522 40897 48729 -35497 -51271 -25369 -29593 -18899 32207
87 32207 36024 -21670 -40603 6806 18152 -44699 -65882 21383 81853 3402 -82023 -21870
99 -21870 66117 26992 -38941 6032 61635 10412 -52625 -18589 36899 15070 -28593 -4150
111 -4150 45812 23837 -39004 -23745 55611 65244 -5610 -32311 10850 31707 12681 4099 2029
$$ packed form
0@%%%%%%%%%Pj5J6j6J6k4L2l6M4n2O0p1Q3r6J11j26J43j64J87k12K38k65K99l39
33a80L78m19M68n21N77o40P10p85Q69r63J068j183J311j459J625j816K041k309
51a228K633l029L533m197N114o469Q670j2843K3428r5993k10801K29099K12808
64A50725j08464j80959O6544J19836n5224j01614O6321J02637n2042j04041N1368
75d4913R6459o5027j25683M5642J34419P832q4226j5774K5902m224J0694N1106
87C2207L817n7694j8933M7409J1346o2851k1183Q7265O0470p8451q5425O0153
99b1870Q7987l9125o5933M4973N5603n1223o3037L4036N5488k1829m3663K4443
111d150M9962k1975o2841J5259P9356R633p0854k6701M3161K0857j9026q582k070
$$ plain form
124 2029 -5959 5737 29119 20704 -7649 -6721 20906 35125 15918 -17113 -24281 2986 24133
137 24133 14395 -9387 -30383 -33429 -1822 30050 8124 -31179 -20440 8228 -4762 -25688
149 -25688 -12328 -2327 -15341 -13032 3510 -9562 -44612 -40172 16943 51964 7078 -54470
161 -54470 -34351 29634 25585 -24274 -15513 28258 16778 -23061 -16141 11510 8142 -733 17610
174 17610 33053 10214 -24263 -19553 21038 34417 6540 -5235 10932 1002 -24185 -5441
186 -5441 29016 17272 -6539 5395 12398 -16926 -24936 15750 38393 601 -38391 -12660 33700
199 33700 15785 -42362 -33125 36559 44900 -16055 -33743 2563 5452 -16332 5931 36703 2657
212 2657 -50179 -33534 30224 42265 -16146 -50221 -5930 40162 13256 -30691 -21890 1930
$$ packed form
124B029p988J1696K3382q415k8353R28K7627J4219j9207l3031p168K7267K1147
137B4133r738k3782k0996l046L1607L1872k1926l9303J0739K8668j2990k0926
149b5688J3360J0001j3014K309J6542j3072l5050M440N7115L5021m4886o1548
161e4470K0119O3985m049m9859Q761M3771j1480l9839O920K7651l368q875J8343
174A7610J5443k2839l4477M710M0591J3379k7877j1775J6167r930k5187J8744
186e441L4457j1744k3811J1934P003k9324q010M0686K2643l7792l8992K5731M6360
199C3700j7915n8147R237O9684Q341o0955j7688L6306K889k1784K2263L0772l4046
212B657n2836J6645O3758J2041n8411l4075M4291M6092k6906m3947Q801K3820
$$ plain form
224 1930 -1123 2970 16027 -6648 -41591 -23455 25203 28947 -12373 -36049 -13488 19554 16954
237 16954 -8850 -16387 -6864 -5257 1478 19294 8436 -29106 -24293 21533 30166 -8011 -22613
250 -22613 2046 17268 6592 -5797 -3106 2407 216 -1530 10132 13858 -8584 -20670 5677
263 5677 23332 1415 -12544 5349 10876 -7312 -9810 5435 8422 -299 -2519 765 2381 -2235
277 -2235 -5393 2308 9388 2155 -3720 5609 4281 -13660 -9528 16262 16762 -6877 -10715 1093
291 1093 1250 -549 7166 7593 -3625 -7258 2448 11001 3041 -13949 -10747 14385 18548 -6905 -16733
306 -16733 -264 4280 -2854 7382 13651 -8483 -21985 -51 18313 4972 -14815 -11646 5614
319 5614 10491 -4767 -12269 -171 2990 -8026 -2306 13876 -432 -24313 -10416 15858 7160
$$ packed form
224A930l053M093J3057k2675l4943J8136M8658L744m1320k3676K2561L3042k600
237A6954k5804p537R523J607O735J7816j0858l7542M813M5826Q633l8177j4602
250b2613K4659J5222j0676j2389K691N513k191j746J1662L726k2442j2086K6347
263E677J7655k1917j3959J7893N527j8188k498J5245K987q721k220L284J616m616
277b235l158P701P080p233n875R329j328j7941M132K5790N00k3639l838J1808
291A093J57j799P715M27j1218l633R706Q553p960j6990L202K5132M163k5453r828
306a6733J6469M544p134J0236O269k2134j3502K1934J8364j3341j9787L169J7260
319E614M877j5258p502J2098L161j1016N720J6182j4308k3881J3897K6274q698
$$ plain form
332 7160 -13518 -9536 2295 -1785 -7218 -1685 3478 -3073 -13667 -7548 10188 6334 -17319 -16563
346 -16563 6344 7008 -10718 -6832 4684 -7464 -16857 1396 13631 -2952 -20458 -11423 7060
359 7060 9342 -6698 -16698 -5994 3484 -2038 -2775 3152 -7788 -20487 -2602 19147 3741
372 3741 -20911 -15344 3466 6860 807 -5659 -10440 -7976 842 6553 4975 -7138 -18563 -5989
386 -5989 17386 11895 -14555 -16647 1693 6628 2183 2640 -3359 -12066 -3913 12087 10640 -3688
400 -3688 -12280 -5490 9695 14569 -198 -11666 -3227 5476 5986 7580 4710 -9298 -8568 10803
414 10803 16183 -120 -8437 -2172 4150 7494 7153 -835 -6530 -2378 3863 6519 6077 -4061 -12687
429 -12687 -1778 11423 4329 -8514 -6358 -2152 -3190 1740 3134 -6971 -11774 -3901 2123 489
$$ packed form
332G160k0678L982J1831m080n433N533N163o551j0594O119J7736l854k3653P56
346a6563K2907O64j7726L886J1516j2148r393J8253J2235j6583j7506R035J8483
359G060K282j6040j0000J0704R478n522p37N927j0940j2699J7885K1749j5406
372C741k4652N567J8810L394o053o466m781K464Q818N711j578j2113j1425J2574
386e989K3375n491k6450k092J8340M935m445M57n999q707Q153J6000j447j4328
400c688q592O790J5185M874j4767j1468Q439Q703N10J594k870j4008P30J9371
414A0803N380j6303q317O265O322L344l41p988n695M152O241K656m42j0138q626
429a2687J0909J3201p094j2843K156M206j038M930J394j0105m803P873O024j634
$$ plain form
443 489 -3290 -9068 -10641 -1566 3162 -3358 -7493 -5666 -6971 -4596 3645 219 -11637 -9573 172
458 172 487 -2549 -3015 -6331 -8517 -1144 2005 -2981 -5294 -5270 -6529 -2440 3531 -2835 -9789 -5689
474 -5689 -1131 -2207 -34 -1080 -9070 -8924 1617 3076 -3389 -4361 -4668 -6336 -90 6353 -325 -7495
490 -7495 -5083 -292 2792 5276 -271 -8540 -3304 6433 4797 -133 -1478 -4780 -3436 7505 9363
505 9363 -3533 -9846 -2356 4145 5504 4673 -4400 -10698 -3120 6818 5169 -887 -6168 -8504 -560
520 -560 9377 3206 -9915 -7050 2892 4781 4151 1044 -7863 -8672 6067 14198 4821 -5219 -6697
535 -6697 -688 9619 12466 2106 -5282 574 6123 7275 7830 1978 -7375 450 16555 11830 -5498
550 -5498 -8332 488 7267 9891 6402 -4240 -9754 -3449 5361 10382 4200 -11030 -13232 4644
$$ packed form
443D89l779n778j573R075M728o520m135J827j305K375Q241l426j1856K064R745
458A72L15l036m66l316k186P373L149m986k313K4j259M089N971o366o954M100
474e689M558j076K173j046p990J46J0541J459o465r72l07j668O246O443o678p170
490g495K412M791L084K484n547q269N236R737j636m930j345l302J344J0941J858
505I363j2896o313P490O501J359q31r073o298P578R938j649o056n281k336P944
520e60R937o171j3121K865R942J889o30l107q907q09J4739Q131r377j0040j478
535f697O009J0307K847j0360p388N856N549J152N55n852r353P825J6105m725j7328
550e498k834Q820O779K624l489j0642n514O305Q810N021o182j5230k202J7876
$$ plain form
564 4644 13421 -2305 -12349 -3612 2016 -258 2814 3001 -8913 -13089 352 13265 8156 -8273
578 -8273 -16541 -2778 12806 6776 -6384 -3606 1118 -4719 -1005 11959 4892 -14104 -9655 10962
592 10962 12173 -4480 -10708 -2240 5973 2997 -3396 -104 2215 -6795 -8068 10239 13473 -10888
606 -10888 -18219 6070 16630 -1165 -9657 2814 5883 -4447 -4500 8710 11852 -2371 -11785 2964
620 2964 17715 2561 -13679 1487 19012 3765 -10709 2683 10150 -4240 -7105 11556 15405
633 15405 -3506 -15125 -3625 10683 7404 -4378 -1723 5406 -3474 -12817 1992 13294 -2748
646 -2748 -13420 4421 12852 -6560 -16038 -140 10967 3717 -1523 1553 674 -7718 -7423 9382
660 9382 19537 2912 -14200 -1308 14482 3397 -6900 6719 14639 2145 -1998 8509 6036
$$ packed form
564D644Q777j5726j0044Q737N628k274L072J87j1914m176J3441J2913n109j6429
578h273q268J3763J5584o030j3160K778M724n837L714J2964p067j8996M449K0617
592A0962J211j6653o228Q468Q213k976o393L292K319r010j273J8307L234k4361
606a0888p331K4289J0560j7795q492J2471L069j0330n3J3210L142j4223r414J4749
620B964J4751j5154j6240J5166J7525j5247j4474J3392P467j4390k865J8661L849
633A5405j8911j1619J1500J4308l279j1782K655P129q880r343J4809J1302j6042
646b748j0672J7841Q431j9412r478J5898J1107p250n240L076q79q392K95J6805
660I382J0155j6625j7112J2892J5790j1085j0297J3619P920j2494m143J0507k473
$$ plain form
673 6036 -6429 -1006 16596 18337 1088 -10987 -2943 11057 9953 2645 6497 6538 -5333 -4197
687 -4197 13466 11028 -8909 -5953 15231 13061 -5069 -6710 2780 2700 1197 8853 12381 -2375
701 -2375 -16001 -4575 19211 15370 -12029 -13354 11319 12295 -9265 -6241 10832 750 -14644
714 -14644 2742 21135 875 -25181 -11857 17718 16255 -11287 -17708 3010 9399 -6810 -7477
727 -7477 8279 -89 -20108 -3762 23574 6499 -27537 -18045 14027 14030 -6115 -7143 2094 -3997
741 -3997 -11467 2101 17820 2631 -22882 -8851 24383 14118 -23151 -17400 16989 14244 -10296
754 -10296 -2594 14470 -2868 -22937 -2308 27354 14861 -18940 -17391 12907 15917 -11495 -12491
767 -12491 16025 15857 -13223 -11823 15464 9036 -16606 -6675 21365 14804 -11942 -12595 7009 9623
$$ packed form
673F036j2465N423J7602J741j7249j2075Q044J4000j104p308L852M1j1871J136
687d197J7663k438j9937K956K1184k170j8130j641R490q0j503P656L528j4756
701b375j3626J1426K3786l841k7399j325K4673R76k1560L024J7073j0082j5394
714a4644J7386J8393k0260k6056J3324K9575j463k7542o421K0718O389j6209o67
727g477J5756q368k0019J6346K7336j7075l4036R492L2072Lk0145j028R237o091
741c997p470J3568J5719j5189k5513J4031L3234j0265l7269N751L4389k745k4540
754a0296P702J7064j7338k0069K0629K9662j2493l3801J549L0298L010k7412r96
767a2491K8516j68k9080J400K7287o428k5642R931K8040o561k6746o53J9604K614
$$ plain form
781 9623 -3224 -1574 12892 9251 -11164 -10660 12580 13241 -7795 -4777 15887 9228 -12361 -6520
795 -6520 12041 7030 -5392 2720 13173 2953 -12816 -6545 12547 13118 -4110 -7844 7407
808 7407 8549 -7943 -5658 10154 4963 -8862 851 14263 1501 -14689 -7105 9065 10527
821 10527 582 -4764 -2728 -1300 -3196 619 7354 1185 -10795 -3686 10664 3433 -12767 -7533
835 -7533 4997 3135 203 4220 -1476 -14111 -10058 6987 12498 -654 -11420 -6066 5190 573
849 573 -9267 -1922 8453 -65 -8391 2873 5846 -12887 -16267 9617 20132 -671 -17974 -8690
863 -8690 4831 2970 -2805 1061 5965 -3688 -11631 365 11426 -4759 -18026 2960 21666
876 21666 3531 -19188 -11285 3296 2481 2214 8495 4117 -13226 -17867 1536 18048 5929 -14519
$$ packed form
781I623j2847J650J4466l641k0415N04K3240O61k1036L018K0664o659k1589N841
795f520J8561n011j2422Q112J0453j0220j5769O271J9092N71j7228l734J5251
808G407J142j6492K285J5812n191j3825R713J3412j2762j6190P584J6170J462
821A0527r945n346K036J428j896L815O735o169j1980P109J4350p231j6200N234
835g533J2530j862k932M017n696j2635M053J7045N511j3152j0766N354J1256m617
849E73r840P345J0375q518q326J1264K973j8733l380K5884J0515k0803j7303R284
863h690J3521j861n775L866M904r653p943J1996J1061j6185j3267K0986J8706
876B1666j8135k2719P903J4581q15k67O281m378j7343m641J9403J6512j2119k0448
$$ plain form
890 -14519 -7293 12307 3902 -14210 -5535 10020 1177 -6701 6889 10517 -10705 -19758 2413
903 2413 21749 9700 -12323 -10695 6151 6255 -6797 -956 13465 3304 -12778 146 16472
916 16472 -288 -17492 112 21584 9197 -11487 -8102 6144 5999 -2280 2725 12137 2317
929 2317 -13959 -3497 17684 8977 -14162 -5775 15145 7831 -9985 -3121 9301 814 -7384
942 -7384 3568 12828 784 -12280 -4587 12193 7777 -9075 -6230 9442 4873 -9606 -1548
955 -1548 11499 -1535 -14715 565 15927 1782 -13419 -5276 6766 2319 -6045 -554 7145
968 7145 -412 -11481 -2832 11744 2119 -14722 -3355 14369 3009 -13661 -4226 7041 -1380
981 -1380 -5381 6418 9171 -7175 -14926 19 13636 5028 -9869 -4653 8930 2556 -10313
$$ packed form
890a4519P226J9600q405j8112Q675J5555q843p878J3590L628k1222r053K2171
903B413J9336j2049k2023J628J6846J04j3052N841J4421j0161j6082J2924J6326
916A6472j6760j7204J7604K1472j2387k0684L385J4246j45q279N005R412r820
929B317j6276J0462K1181q707k3139Q387K0920p314j7816O864J2422q487q198
942g384J0952R260j2044j3064P693J6780m416j6852K845J5672m569j4479Q058
955a548J3047j3034j3180J5280J5362j4145j5201Q143J2042m447q364N491P699
968G145p557j1069Q649J4576r625j6841J1367J7724j1360j6670R435J1267q421
981a380m001J1799K753j6346p751J4945J3617q608j4897N216J3583o374j2869
$$ plain form
994 -10313 -631 10194 -1737 -9392 7961 13724 -8637 -18840 2890 17940 5445 -7898 -4648
1007 -4648 1612 -2080 -3188 6911 10724 -5942 -14767 4137 17285 -2584 -18065 688 15598
1020 15598 2500 -7833 663 1948 -8441 -3887 12899 12529 -8567 -16963 1028 16436 3626
1033 3626 -12068 -2150 10958 1471 -7553 4387 7558 -7687 -7284 13418 15113 -7557 -14641 2773
1047 2773 14516 5647 -3938 -191 5553 68 -2399 8698 11108 -5721 -9886 11540 18731 -2611
1061 -2611 -12389 4071 12732 3575 762 6732 3600 -5339 -1925 11662 12754 -2357 -9879 4992
1075 4992 15419 1784 -8160 2783 10030 -900 -1535 9999 5632 -9812 -5412 10709 11034 -3208
1089 -3208 -7669 1106 6402 858 -3430 2381 4523 -4294 -5269 7641 7212 -9380 -10159 7240 9230
$$ packed form
994a0313R682J0825j1931p655J7353N763k2361j0203K1730J5050j2495j3343L250
1007d648O260l692j108J0099L813j6666q825J8904J3148j9869j5481J8753J4910
1020A5598j3098j0333Q496J285j0389M554J6786l70k1096q396J7991J5408j2810
1033C626j5694R918J3108r487r024J1940L171j5245M03K0702J695k2670p084J7414
1047B773J1743q869r585L747N744n485k467J1097K410j6829m165K1426P191k1342
1061b611r778J6460Q661r157k813N970l132q939L414J3587J092j5111p522J4871
1075D992J0427j3635r944J0943P247j0930o35J1534m367j5444M400J6121L25j4242
1089c208m461Q775N296n544m288N811K142q817r75J2910m29j6592p79J7399J990
$$ plain form
1104 9230 -4606 -7266 716 735 -3528 -819 4446 1281 -7140 -6659 3945 7135 -4279 -10031 1215
1119 1215 6585 -3009 -5276 3305 851 -7244 -1185 8859 3271 -7185 -5255 3917 6249 1088
1133 1088 -2972 424 3374 -161 -791 6202 5235 -5679 -4339 9627 9373 -2960 -4247 3447 4298
1148 4298 2096 3442 3644 -745 -2200 1644 7438 6384 -2759 -5673 3694 9285 1653 -3443 922
1163 922 1293 -990 4371 7575 -1463 -7746 -82 8221 5973 -1017 -5435 -1810 4966 5174 209 -923
1179 -923 -876 -2557 2333 9569 2735 -9155 -4726 7549 7918 -37 -3445 -2823 -127 4429 5462 741
1195 741 -3961 -3971 880 8252 6234 -5259 -7694 3483 7870 1663 -1042 -208 -2465 -191 6790
1210 6790 6122 -2451 -5737 355 6892 7680 -494 -6335 -625 7169 4939 318 1074 -616 -3078 3304
$$ packed form
1104I230j3836k660P982J9m263K709N265l165q421M81J0604L190j1414n752J1246
1119A215N370r594k267Q581k454q095O059J0044n588j0456J930R172K332n161
1133A088m060L396K950l535o30O993r67j0914J340J3966k54j2333j287P694Q51
1148D298k202J346K02m389j455L844N794j054r143k914R367N591p632n096M365
1163I22L71k283N361L204r038o283P664Q303k248o990m418L625O776K08m965j132
1179i23M7j681M890P236o834j1890M429J2275L69p955l408O22K696M556J033m721
1195G41m702j0M851P372k018j1493k435J1177M387o207k705Q34k257K274O981
1210F790o68q573l286O092O537P88q174n841N710P794k230m621P56j690k462O382
$$ plain form
1226 3304 9355 1717 -6509 -3109 4035 5101 1926 -2745 -4342 350 3397 1045 -978 -1951 -4901
1241 -4901 -3352 5075 4101 -6403 -8493 -1013 2282 -236 -1767 -3826 -5387 -2625 246 -395 -1584
1256 -1584 -4090 -6406 -1631 4300 -510 -8187 -4643 1528 1026 -934 -1708 -3642 -4465 -531 2409 1236
1272 1236 -1051 -3900 -4871 1300 5709 68 -4807 -871 1925 -82 724 1739 -812 -1531 1539 3186
1288 3186 1866 -290 -2853 -1132 6071 6088 -1619 -2824 2155 2073 800 4852 4852 -1768 -2969 2603 6305
1305 6305 3962 -1199 -2708 2118 6578 1916 -3021 734 3029 -593 949 6028 456 -7420 -2494
1320 -2494 7046 5722 -2194 -5714 -2902 2195 3443 -86 -1994 -984 -3340 -2844 4528 4099 -6451
1335 -6451 -8345 2847 6233 -1757 -5913 -2771 -628 1240 2729 -422 -4239 -5223 -2007 4390 6377
$$ packed form
1226C304O051p638q226L400P144J066l175m671j597M692L047k352k023r73k950
1241d901J549Q427r74j0504k090P480L295k518j531k059j561K762K871o41j189
1256a584k506k316M775N931m810p677L544O171n02j960p74j934q23L934K940j173
1272A236k287k849r71O171M409n641m875L936K796k007Q06J015k551p19L070J647
1288C186j320k156k563J721P203J7p707j205M979q2j273M052%o620j201N572L702
1305F305k343n161j509M826M460m662m937L755K295l622J542N079n572p876M926
1320b494R540j324p916l520K812N097J248l529j908J010k356M96P372m29j0550
1335f451j894J1192L386p990m156L142K143J868J489l151l817r84L216O397J987
$$ plain form
1350 6377 -2549 -10114 -2942 5982 2805 -2624 -1498 -1580 -2738 1697 3702 -2279 -6023 -1238 4173
1365 4173 4194 -748 -6650 -5774 2719 5852 1538 -2299 -4590 -5624 -21 6919 2550 -5900 -4158 1036
1381 1036 312 -814 -565 -3263 -3937 2291 5026 -1381 -7597 -5779 949 6429 3137 -5098 -6162 -1454
1397 -1454 -693 -498 4758 2072 -8290 -6541 5294 5094 -5346 -6466 2458 4956 0 -3489 -2313
1412 -2313 -403 -1145 -15 5685 5361 -6616 -10687 3693 11328 -543 -7289 1812 5012 -2812 -2425
1427 -2425 4727 3340 -3546 -3360 5447 7689 -1798 -8547 872 9936 2303 -6264 994 6207 -3147
1442 -3147 -4924 7246 8566 -5486 -8130 4534 9302 523 -5483 -543 4831 740 -3398 3320
1456 3320 7852 -2986 -9926 2876 11764 -414 -9652 1240 8652 -100 -5906 794 4132 -1034
$$ packed form
1350F377q926p565P172Q924l177n429J126q2j158M435K005n981l744M785N411
1365D173K1m942n902Q76Q493L133m314l837k291j034N603O940m369q450J742N194
1381A036p24j126K49k698o74O228K735o407o216J818O728N480l292q235j064M708
1397a454P61J95N256k686j0362J749J1835k00j0440j120Q924K498m956l489J176
1412b313J910p42J130N700l24j1977m071J4380P635j1871o746R101L200p824L87
1427b425P152j387o886J86Q807K242r487o749R419R064p633q567P258N213r354
1442c147j777J2170J320j4052k644J2664M768q779o006M940N374m091m138O718
1456C320M532j0838o940J2802Q888j2178r238J0892P412q752n806O700L338n166
$$ plain form
1470 -1034 -2709 3697 6441 -2318 -10329 -1424 11750 5940 -7262 -4128 4488 108 -4690 2768
1484 2768 5825 -2235 -5003 2838 4907 -3428 -7567 -261 8544 5757 -4608 -7281 -1074 391 -810
1499 -810 4569 5892 -5406 -10952 777 7934 -821 -6565 -1135 3703 937 -3012 -3905 -3057 -1560
1514 -1560 489 4346 4526 -5472 -12700 -3351 9275 5054 -4128 -3487 -1367 -3954 -1768 3751 1119
1529 1119 -4699 -2424 3073 3474 -3090 -7147 -2021 6056 4958 -1703 -2588 -882 -3385 -785 8361
1544 8361 6464 -5626 -6468 4990 6765 -1114 -3457 1752 4231 2836 944 2299 1121 -2934 -1022
1559 -1022 8996 10246 -4111 -9220 4059 10692 798 -3896 3532 3732 -2787 247 7361 3604
1573 3604 -6377 -5230 6362 10506 -662 -9054 -38 7660 -291 -5087 4032 6101 -5689 -6141
$$ packed form
1470a034j675O406K744q759q011Q905J3174n810j3202L134Q616m380m798P458
1484B768L057q060k768P841K069q335m139P306Q805k787j0365k673O207J465j201
1499h10N379J323j1298n546J1729P157q755n744N430M838k766l949q93Q48J497
1514a560K049L857J80r998p228R349J2626m221r182O41K120k587K186N519k632
1529A119n818K275N497M01o564m057N126Q077j098o661q85J706k503K600R146
1544H361j897j2090q42J1458J775p879k343N209K479j395j892J355j178m055J912
1559a022J0018J250j4357n109J3279O633r894m694P428K00o519L034P114l757
1573C604r981J147J1592M144j1168q392R016P698p951m796R119K069j1790m52
$$ plain form
1587 -6141 7704 7661 -6619 -8281 5151 9026 -533 -6812 -570 4511 -1519 -4349 5589 9388 -5263
1602 -5263 -11569 3261 10522 -3316 -8425 4673 8170 -4437 -7626 2800 4905 -3811 -5184 5393
1616 5393 8135 -5145 -12916 -243 10416 514 -7893 2529 6313 -6990 -9582 5942 8722
1629 8722 -5792 -7659 5893 7519 -5538 -10839 638 9005 2192 -5182 166 2382 -8390 -8670
1643 -8670 8419 13232 -6220 -13583 1277 7381 -4511 -7494 2838 4472 -4171 -4759 2546 1260
1657 1260 -9001 -8185 7378 11849 -4854 -14451 -2197 6000 -2639 -3793 6751 3591 -10027 -6616
1671 -6616 7902 5301 -7405 -5171 8651 9152 -4279 -9894 769 7288 1004 -323 7618 3890
1685 3890 -11122 -6586 12743 11762 -6392 -7151 6395 6581 -4297 -3943 4694 3058 -3111 253 8048
$$ packed form
1587f141J3845m3j4280j662J3432L875r559o279O242N081o030k830R938L799j4651
1602e263o306J4830P261j3838n109J3098L497j2607l189J0426K105q716j373J0577
1616E393K742j3280p771J2673J0659r902q407J0422L784j3303k592J5524K780
1629H722j4514j867J3552J626j3057n301J1477Q367o813p374N348K216j0772k80
1643h670J7089M813j9452p363J4860O104j1892k983J0332J634q643n88P305j286
1657A260j0261Q16J5563M471j6703r597J2254Q197q639j154J0544l160j3618L411
1671f616J4518k601j2706K234J3822N01j3431n615J0663O519o284j327P941l728
1685C890j5012M536J9329r81j8154p59J3546J86j0878L54Q637j636o169L364P795
$$ plain form
1700 8048 2353 -11501 -7925 10638 12087 -5585 -9587 3234 3812 -6070 -1090 8875 1067 -10109
1714 -10109 -2319 9975 3780 -9499 -6375 7330 7800 -4309 -6857 2896 3270 -6083 -1333 9926
1728 9926 1782 -12894 -4715 11163 5061 -10123 -5877 5283 2590 -5827 -2604 4128 -21 -8665
1742 -8665 -3349 8640 3625 -11288 -7886 8058 5036 -9136 -5743 5823 1452 -7300 -961 6784
1756 6784 -1363 -9816 -2513 7968 4408 -6792 -6718 3382 3111 -5345 -2856 6717 1499 -9511 -2656
1771 -2656 8199 394 -10348 -2627 7632 2204 -6895 -4269 1237 -1083 -4905 -203 6173 -162
1785 -162 -11247 -6693 6648 4379 -7335 -4992 4542 -445 -7456 -1572 4330 -2134 -6185 436
1799 436 5900 -506 -8638 -4757 5199 5927 -2187 -3468 1931 -639 -5499 1610 8366 -428 -9004
$$ packed form
1700H048n695j3854L576J8563J449j7672m002J2821N78r882M980R965p808j1176
1714a0109P790J2294o195j3279L124J3705M70j2109k548R753L74r353M750J1259
1728I926q144j4676Q179J5878o102j5184M246J1160k693q417L223O732m149q644
1742h665N316J1989n015j4913L402J5944l022j4172L393J1566m371q752O339P745
1756F784q147q453P303J0481l560j1200P4J0100k71q456K489R573n218j1010O855
1771b656J0855p805j0742P721J0259n428r099K626N506k320l822M702O376o335
1785a62j1085M554J3341k269j1714K343R534m987p011N884N902o464m051O621
1799D36N464o406q132L881R956P28q114j281N399k570m860P109O756q794q576
$$ plain form
1814 -9004 -237 8032 952 -6404 -2142 4122 3339 -579 -810 525 -2094 -4057 2224 8872 1786
1829 1786 -9707 -4765 6871 4618 -3398 -1580 2351 -678 -1889 3210 3247 -3075 -4906 1966 7628
1844 7628 2601 -6754 -5346 4009 5351 -1392 -1110 2144 -2022 -4567 3382 7011 -2182 -7786 263
1859 263 6510 2294 -4744 -4332 476 2496 -130 -529 758 -2674 -6357 635 7641 -211 -9414 -3604
1875 -3604 5299 1468 -4373 -2378 -155 -2374 -2386 1581 2412 -3532 -7728 -1436 6535 2704 -7464
1890 -7464 -5577 3083 1474 -4367 -931 2747 -3231 -5829 1604 5030 -2415 -7659 -2601 4190 2719
1905 2719 -4079 -4632 1006 1139 -3952 -621 4621 -1459 -7808 -525 7069 213 -7293 -2162 3683
1920 3683 1504 -2349 -792 1757 -521 -3406 225 5428 1563 -6706 -2715 6387 3779 -4544 -1944
$$ packed form
1814i004Q767Q269p080p356M262O264p83l918k31J335k619j963O281O648p086
1829A786j1493M942J1636k253q016J818L931l029j211N099L7o322j831O872N662
1844G628n027r355J408R355J342o743K82L254m166k545P949L629r193n604Q049
1859B63O247m216p038M12M808K020k626l99J287l432l683O992P006p852r203N810
1875c604Q903l831n841J995K223k219j2L967Q31n944m196O292P971l831j0168
1890g464J887Q660j609n841L436L678n978k598P433L426p445n244N058O791j471
1905B719o798n53N638J33n091L331N242o080o349P283P594o856p506N131N845
1920C683k179l853J557K549k278k885L631N203l865q269L991R102k608q323K600
$$ plain form
1935 -1944 3917 605 -3033 1960 4399 -1519 -4869 543 6059 3094 -3735 -3637 3027 3992 -1317 -1136
1951 -1136 3053 -134 -4594 1105 7104 537 -6089 -1044 5326 2881 -1480 -1773 101 807 357 1638
1967 1638 2933 -712 -4786 -883 6693 3064 -4779 -2938 2968 2104 -755 811 614 -2657 -655
1982 -655 3996 3183 -1443 -3934 -1097 4216 4217 -1295 -3547 -355 1395 551 2595 1686 -3889 -4035 3902
1999 3902 5255 -1489 -4044 -853 1285 1969 1321 -1153 -3157 -2003 1224 3178 1703 -3976 -6048
2014 -6048 982 5344 -37 -4499 -2088 -1199 -1629 829 2688 -2806 -6145 -1454 3680 1540 -3446
2029 -3446 -5348 -1477 2877 1034 -2739 -2396 -1255 -2636 -280 4241 550 -7014 -4222 3954 3702
2044 3702 -2018 -3393 -1134 90 775 672 -85 -418 -2286 -997 3707 3656 -3261 -5013 2371 5292
$$ packed form
1935a944N861l312l638M993K439n918l350N412N516k965o829R8O664R65n309J81
1951a136M189l187m460N699N999o567o626N045O370k445m361k93J874P06m50J281
1967A638J295l645m074L903P576l629p843J841N906q64k859J566j97l271K002
1982f55M651q13m626k491K837N313Jn512k252L192J750q44K044r09n575j46P937
1999C902J353o744k555L191K138O84o48k474k004J154L227J954j475n679k072
2014f048P030M362n381m462K411Q89m30K458J859n494l339M691N134k140m986
2029c446j902L871M354j843l773L43J141j381K356M521l691p564K792Q176k52
2044C702n720j375K259J224O85j03p57l33j868J289M704n1o917j752P384K921
$$ plain form
2060 5292 69 -1909 410 -263 -276 2154 3157 385 -2398 -1680 2046 4296 1234 -3505 -573 4024
2076 4024 2103 -1187 804 1409 -1004 43 3562 2041 -1969 -2200 286 3156 2978 -1194 -3059 -105
2092 -105 2275 816 423 1975 -401 -2859 327 3748 795 -2186 -1010 1051 2212 1424 -1773 -2216
2108 -2216 786 2033 255 856 792 -3005 -3566 2800 4228 -564 -3567 -1612 853 1852 232 -1673
2124 -1673 -1192 338 -437 156 1520 -765 -4488 -847 5602 2440 -4012 -3794 450 1623 1267 336
2140 336 -1254 -1888 -1721 337 2546 924 -4208 -4676 2485 4542 -2079 -5149 -1229 994 -645 -76
2156 -76 -173 -3269 -4365 -1219 2571 1237 -3472 -6094 -1543 3834 374 -4819 -3376 -68 -1203 -608
2172 -608 2132 -515 -5130 -2652 3010 3298 -1410 -4111 -2158 2369 3253 -1079 -2517 -509 11 294
$$ packed form
2060E292n223j978K319o73j3K430J003k772k783P18L726K250l062m739K932M597
2076D024j921l290J991O05k413J047L519j521m010k31K486K870j78m172j865K954
2092a05K380j459l93J552k376k458L186L421k953k981J176K061J161p88l197m43
2108b216L002J247j778O01o4l797n61O366J428m792l003J955K465R99j620j905
2124a673M81J530p75N93J364k285l723L641O449l162o452K18M244J173l56r31
2140C36j590o34J67K058K209j622n132m68P161K057o621l070L920K223j639N69
2156g6r7l096j096L146L790j334m709k622M551N377l460n193J443L308j135N95
2172f08K740k647m615K478N662K88m708k701J953M527Q84m332j438K008N20K83
$$ plain form
2188 294 3151 2398 -4243 -4895 2439 5797 1014 -2628 -1865 -74 1305 1971 356 -1296 -1260 -309 2016
2205 2016 2761 -1825 -4642 271 4725 2080 -2104 -1359 -1439 -823 2231 4408 35 -3185 -1482 1856
2221 1856 2349 526 -1358 -361 2356 1452 -778 -164 -240 -2125 219 4739 1645 -4767 -3203 1591
2237 1591 2015 -260 -38 60 -1670 -2286 -394 983 381 -2910 -1647 2559 2272 -3930 -4028 1648 2469
2254 2469 -1429 18 2615 -1694 -4910 402 5141 1929 -2850 -2306 2004 2512 -1246 -2311 1627
2269 1627 1592 -3381 -653 4858 278 -7352 -3105 5603 3172 -4430 -4048 615 -961 -3128 -808 2246
2285 2246 -1313 -6017 -3524 4035 1571 -6752 -5750 3520 3628 -4669 -3926 1549 -1627 -5373 503
2300 503 5871 -418 -7320 -3401 4567 3417 -4221 -4576 2346 3824 -2968 -2650 2661 -193 -5709 741
$$ packed form
2188B94K857p53o641o52P334L358m783l642P63J791J379O66j615j652L6R51K325
2205B016P45m586k817M913M454k645m184P45q0O16L054K177m373l220J703L338
2221A856M93j823j884R97K717r04k230O14p6j885K344M520l094o412J564M794
2237A591M24k275K22R8j730o16J892J377o02l291J263M206k87o202r8N676Q21
2254B469l898J447K597m309l216N312M739l212m779N44M310N08l758j065L938
2269A627l5m973K728N511m580p630M247Q708k431p602L82M663j576k167K320L054
2285B246l559m704K493P559k464q323J002R270J08q297P43N475l176l746N876
2300E03N368o289o902L919P968j150p638l55O922J478o792L18N311k854n516O450
$$ plain form
2316 741 8140 1301 -8400 -4134 5421 3930 -2054 -1564 1926 333 -2590 343 4695 638 -5926
2331 -5926 -1050 8274 4272 -7438 -4853 5446 4522 -1326 878 3348 -2046 -4363 3079 7888 1666
2346 1666 -5539 -1946 6092 4521 -3734 -3154 4127 3109 -2167 1016 4546 -2242 -7305 2089 9005
2361 9005 1097 -6804 -2420 3972 1761 -2691 -819 2633 -125 -3575 878 5358 -1822 -7840 -292
2376 -292 8528 1875 -6847 -2317 3631 -99 -2879 2517 3957 -2643 -4853 1917 5620 -468 -6605
2391 -6605 -1168 6246 2625 -4858 -1461 4135 -1072 -4860 3034 6597 -3005 -7597 793 5923 -383
2406 -383 -4724 -323 3525 -200 -4118 -610 2955 -1692 -5267 1940 7150 -1748 -8297 -1080 5234
2421 5234 -225 -3558 1669 2886 -3645 -4805 1933 4411 -1441 -4941 867 5325 -584 -6564 -1170
$$ packed form
2316G41P399o839r701M266R555j491n984M90L490j593k923K933M352m057o564
2331e926M876R324m002j1710K585J0299r24n848K204K470n394k317P442M809o222
2346A666p205L593Q038j571q255N80P281j018n276L183L530o788n063R394O916
2361I005p908p901M384O392k211m452J872L452k758l450M453M480p180o018P548
2376b92Q820o653q722M530N948l730k780N396J440o600k210O770L703o088o137
2391f605N437P414l621p483L397N596n207l788P894L563r602m592Q390N130o306
2406c83m341M401L848l725l918L508L565m647l575P207N210q898o549P217O314
2421E234n459l333N227J217o531j160O738K478n852l500N808M458n909n980N394
$$ plain form
2436 -1170 4901 205 -3294 2371 3767 -4688 -6112 3403 6924 -1248 -4741 714 3408 -492 -3143
2451 -3143 770 3943 253 -2850 2282 4340 -3347 -6451 3522 9374 614 -5502 -525 2644 -390
2466 -390 -132 4450 3342 -2991 -3457 2758 5618 -268 -4786 1227 7041 1629 -4443 -475 3075 -1114
2482 -1114 -484 5593 4367 -4340 -5593 2852 6728 682 -3163 -96 3564 1106 -2704 147 3340
2497 3340 -667 -2237 4216 5449 -3940 -6999 1937 7418 1084 -3162 -942 1003 -184 -449 2264
2512 2264 2502 -2504 -3937 2051 5644 -1314 -6474 -292 5672 727 -3601 -9 1030 -3183 -1739
2527 -1739 4422 2980 -3769 -5398 1072 4686 367 -5104 -1859 3439 535 -3396 506 2197 -3551
2542 -3551 -4050 3501 4561 -3382 -5876 1162 3686 -738 -3459 -677 1415 -1144 -2212 1598 2825
$$ packed form
2436a170O071m696l499N665J396q455j424R515L521q172l493N455K694l900k651
2451c143L913L173l690l103N132K058p687l104R973N852q760o116M977L169l034
2466c90K58M582j108o333m66O215K860n886m518O013N814n412o072L968L550m189
2482a114O30O077j226q707j253Q445L876o046l845L067L660k458l810K851L193
2497C340m007j570O453J233r389l059Q936N481o334m246K220J945j187k65K713
2512B264K38n006j433N988L593o958n160O182N964m945m328L592J039m213J444
2527a739O161j442o749j629O470L614m319n471L245N298k904l931L902J691n748
2542c551m99P551J060p943k494P038K524m424k721K782K092k559j068L810J227
$$ plain form
2557 2825 -3617 -5839 1971 6274 -1605 -5903 502 3853 -1910 -2765 2665 2904 -2830 -2979 2660 3407
2573 3407 -2330 -4414 1873 5728 394 -4749 308 3503 -1611 -2632 4417 5163 -4005 -4717 3888
2588 3888 5281 -1385 -3108 1975 3758 -848 -2804 1990 4089 -1616 -3397 4329 6514 -3237 -6885
2603 -6885 3178 6810 -472 -2792 2500 2522 -3632 -2224 4456 4769 -2798 -4532 2793 5702 -1462
2618 -1462 -5610 996 5714 174 -3614 2335 2680 -4487 -3279 5826 5663 -4153 -5680 2196 4710
2633 4710 -453 -3012 937 2761 -1243 -2687 2566 3358 -4301 -5171 4619 6314 -3428 -6668 1087
2648 1087 4198 -766 -1661 1317 397 -3616 -1767 3532 3394 -3467 -5542 1748 5145 -1339 -5255 180
2664 180 2526 -1814 -1408 2826 206 -5464 -2451 4267 2955 -3487 -4529 474 3018 -399 -2793
$$ packed form
2557B825o442k222P810M303p879m298O405L351n763q55N430K39n734j49N639P47
2573C407n737k084O287L855n334n143N057L195n114j021P049P46r168p12Q605
2588C888J393o666j723N083J783m606j956M794K099n705j781P726K185r751l648
2603f885J0063L632p282k320N292K2o154J408O680L13p567j734P325K909p164
2618a462m148O606M718n540l788N949L45p167J208R105j63r816j527P876K514
2633D710n163k559L949J824m004j444N253P92p659q70R790J695r742l240P755
2648A087L111m964q95K978r20m013J849N299j38o861k075P290L397o484l916N435
2664A80K346m340M06M234k620n670L013O718j312o442j042N003K544l417k394
$$ plain form
2679 -2793 -65 243 -2414 -1282 3762 1580 -5800 -3516 4401 3220 -3283 -3100 1193 667 -1556 225
2695 225 1915 -1457 -3336 -538 4121 1872 -4153 -3524 2878 3506 -1820 -1870 2167 -8 -3565 1291
2711 1291 4458 -239 -4363 -207 4364 1682 -2491 -1477 2351 2337 -1069 -60 2911 252 -3874
2726 -3874 740 6101 1264 -4852 -1135 4473 1757 -2166 330 2429 -296 -1735 891 3554 976
2741 976 -3594 -971 4502 2846 -3559 -1965 3405 1867 -2651 337 3739 -716 -3569 1207 4695
2756 4695 1384 -3091 -2049 2121 2696 -1058 -1319 1764 1287 -2303 -462 4225 954 -4602 -917 4582
2772 4582 1773 -2995 -1964 1082 922 -330 -215 323 -712 -2522 -907 3338 1889 -3868 -3781 2099
2788 2099 2929 -1555 -2058 148 -708 -1079 934 1660 -1211 -2464 -579 1955 2225 -1664 -3970 -446
$$ packed form
2679b793K728L08k657J132N044k182p380K284P917j181o503J83M293n26k223J781
2695B25J690l372j879K798M659k249o025O29O402O28n326n0M037k175l557M856
2711A291L167m697m124M156M571k682m173J014L828j4l406J009K971k659m126
2726c874M614N361m837o116L717N608k716l923K496K099k725j439K626K663k578
2741I76m570K623N473j656o405J594N370j538m518K988L402m455k853M776L488
2756D695l311m475J042M170N75l754k61L083m77l590J841M687l271n556L685N499
2772D582k809m768J031L046j60j252J15N38j035j810J615M245j449n757Q7N880
2788B099Q30m484n03K206q56l71K013P26k871j253J885K534K70l889k306L524
$$ plain form
2804 -446 2407 897 -1087 -187 -738 -1791 698 3162 367 -3395 -1312 1119 1818 91 -1529 -1951
2820 -1951 616 2043 511 -704 -1223 -1584 295 3073 1677 -2552 -2385 463 1838 1439 969 -1369
2836 -1369 -1992 994 2290 380 -751 -565 -157 1750 2394 -109 -2045 -103 1683 1758 1526 107 -2126
2853 -2126 -1174 3087 2976 -223 -940 -154 513 1386 1751 -295 -809 629 1816 1893 1244 -895 -1657 1399
2871 1399 3654 807 -1317 14 775 247 1670 1821 -494 -1501 838 1900 1565 126 -1164 -591
2887 -591 1986 1962 -343 -295 517 -87 38 2041 1351 -1680 -1046 1521 1707 278 -382 -606 -507 1204 1160
2906 1160 -411 -466 -485 -1151 523 2076 -34 -2153 -508 948 264 122 168 -1213 -541 896 586 -711
2924 -711 -639 -618 -639 1126 1535 -1335 -2047 -391 1027 912 428 -827 -1673 -287 1131 503 -277 -312 -965
$$ packed form
2804d46K853j510j984R00n51j053K489K464k795l762K083K431O99j727j620m22
2820a951K567J427j532j215n19l61J879K778j396m229J67K848J375l99m70k338
2836a369o23K986J296j910j131J86M08J907O44k503j936J942J786P5k32j419k233
2853b126R52M261j11l199p17P86O67Q73L65k046n14J438J187P7o49k139p62L056
2871A399K255k847k124J331P61n28J423J51k315j007K339J062l35j439j290N73
2887e91K577k4k305M8Q12o04J25K003o90l031O34K567J86j429o60k24R9J711m4
2906A160j571n5j9o66J674J553k110k119J645J456o84j42M6j381O72J437l10j297
2924g11P2K1k1J765M09k870p12J656J418j15m84j255q46J386J418o28p80l5o53
$$ plain form
2943 -965 -330 1635 1004 -1876 -2151 800 1494 270 -410 -1093 -919 447 2103 1277 -79 -1472 -1774
2960 -1774 1554 3472 32 -2366 -320 2316 899 123 423 -455 -716 1588 3155 787 -1562 -1962
2976 -1962 694 3412 2053 -1456 -993 1407 1207 58 1473 1213 -1781 -741 3294 2572 -1845 -2479
2992 -2479 565 2649 2119 -374 -991 -3 564 550 1891 2163 -1201 -2463 2312 4061 -335 -2743 425
3009 425 2509 1083 490 328 -577 -1352 551 2370 2370 -990 -3017 125 3640 1048 -2246 -527 1802
3026 1802 -150 -670 1776 318 -3002 -1374 2966 2427 -1220 -2765 -849 1315 944 -909 -375 712
3042 712 -1465 -1793 1756 2206 -2386 -2944 1849 2532 -1466 -2519 -184 197 -642 102 700 -147 -2295
3059 -2295 -2310 1108 2258 -1203 -3161 293 2129 -1297 -2410 769 760 -2139 -422 2906 523 -3111
$$ packed form
2943i65O35J965o31k880k75K951O94j224o80o83J74J366J656q26j356j393l02
2960a774L328J918l440k398K046K636j417p76L00q78k61K304J567k368k349m00
2976a962K656K718j359l509M63K400k00j149J415k60k994J040M035p22m417o34
2992b479L044K084n30k493o17R88N67j4J341K72l364j262M775J749m396k408L168
3009D25K084j426n93j62r05p75J903J819%l360k027L142L515k592l294J719K329
3026A802j952n20K446j458l320J628M340n39l647j545J916K164l71j853N34J087
3042G12k177l28L549M50m592n58M793O83l998j053K335L81q39P44N98q47k148
3059b295j5L418J150l461j958L454J836l426j113L179rk899J717L328k383l634
$$ plain form
3075 -3111 -2149 1521 2217 -103 -1924 -722 740 -823 -1117 1642 1383 -2106 -1819 2837 2032 -2805
3091 -2805 -2431 1601 2158 -90 -370 650 -744 -1830 408 2885 2355 -2135 -2957 1424 3245 -910
3107 -910 -2176 1504 1975 -1319 -211 2379 80 -2889 -85 4128 2569 -1558 -2514 244 2607 1126
3123 1126 -341 1309 1258 -1701 -1005 3318 1998 -2877 -1165 3916 3058 -1817 -2179 537 1342 837 1019
3140 1019 1070 -374 -2499 -911 3562 3472 -2545 -3137 1828 3071 -1164 -2321 770 789 -1181 1020 2446
3157 2446 -580 -3402 -1749 3058 3046 -1631 -3606 -213 2304 -339 -1524 1025 146 -3047 -924 3613
3173 3613 682 -4240 -2304 2511 2394 -859 -2430 -562 696 -699 -849 1207 519 -2926 -2252 2923
3189 2923 2299 -3690 -3357 2110 2182 -1330 -1534 417 -570 -1878 -739 2440 795 -2768 -2591 1609 2689
$$ packed form
3075c111R62L670O96k320j821J202J462j563k94K759k59l489K87M656q05m837
3091b805L74M032N57k248k80J020j394j086K238K477n30m490q22M381J821m155
3107i10j266L680M71l294J108K590k299k969K804M213j559m127r56K758K363j481
3123A126j467J650n1k959O96M323j320m875J712N081q58m875l62K716Q05n05J82
3140A019N1j444k125J588M473r0o017n92M965J243m235j157L091J9j970K201J426
3157B446l026k822J653M807j2m677j975L393K517k643j185K549q79l193K123M537
3173C613k931m922J936M815j17l253j571J868J258j395j50K056o88l445O74N175
3189B923o24n989L33N467P2l512k04J951r87j308J139L179j645l563J77M200J080
$$ plain form
3206 2689 -1748 -3003 1362 2563 -1582 -1640 1344 281 -3038 -517 4029 1762 -3154 -2891 988 2452
3222 2452 -89 -1293 1073 1256 -1849 -1718 2774 2007 -3063 -1672 4190 2845 -2695 -2435 1832 1533
3238 1533 -554 557 2154 -26 -2806 -1257 3651 3476 -1814 -2598 2239 2152 -2600 -1618 2981 1840
3254 1840 -2439 -99 3556 67 -3964 -847 4279 3328 -1704 -2496 1071 1476 -1366 -293 3752 1751
3270 1751 -3598 -1587 4433 2230 -4031 -1178 4266 2386 -2342 -1501 1543 409 -1484 1162 4300
3285 4300 724 -4682 -2363 4392 3489 -3076 -2532 2688 1034 -3535 -550 3452 -316 -3729 145
3300 145 4614 251 -5244 -2599 3313 2989 -2555 -2460 1623 510 -3340 -485 4286 193 -5570 -1162
3316 -1162 5211 1514 -5183 -2082 3000 1670 -2233 -937 1530 -544 -2959 244 4130 613 -5775
$$ packed form
3206B689m437j255M365J201m145n8K984j063l319K521M546k267m916K63L879J464
3222B452k541j204K366J83l105J31M492p67n070J391N862j345n540K60M267k99
3238A533k087J111J597k180k780J549M908j75n290p84M837q7m752R82M599j141
3254A840m279K340L655l489m031L117N126r51n032p92L567M05k842J073M045k001
3270A751n349K011O020k203o261K853N444j880m728Q41L044j134j893K646L138
3285D300l576n406K319O755r03o565N44N220j654m569K985M002l768l413L874
3300A45M469m363n495K645N912l24n544R5M083j113l850K855M771m093n763M408
3316a162O373l697o697L101N082j330l903J296K467k074k415L203L886l517o388
$$ plain form
3331 -5775 -2348 4709 2324 -4078 -2479 2505 112 -2999 587 2786 -1027 -3692 367 4103 1234
3346 1234 -3928 -1864 3290 2332 -2358 -1408 2498 442 -2699 1279 4613 -599 -4488 140 4738
3361 4738 1545 -2449 -259 2132 1025 -1030 619 2388 173 -2520 555 4213 316 -3991 -384
3376 -384 4169 969 -2077 667 1887 -1206 -1439 2191 3103 -911 -2877 293 2925 604 -2055 37
3392 37 2786 281 -2543 1261 2755 -1372 -2759 2823 4205 -1397 -3395 473 2308 341 -802
3407 -802 1085 1469 -1187 -2105 1210 3385 -947 -3513 1133 3719 -890 -3633 253 2269 -895 -1321
3423 -1321 1817 1128 -3032 -2503 2012 3340 -270 -3517 -909 2433 250 -2033 758 2430 -1733
3438 -1733 -2680 2034 2520 -2489 -3380 1643 3742 -617 -3147 -775 1508 323 -815 303 1625 -1872
$$ packed form
3331e775L427P057k385o402J599M984k393l111L586K199l813k665M059L736k869
3346A234n162K064N154r58m690R50L906k056l141L978L334n212l889M628M598
3361D738l193l994K190K391j107k055J649J769k215k693L075L658l897m307L607
3376c84M553l200l046K744J220l093k33L630R12m014j966L170K632k321k659K092
3392C7K749k505k824L804J494m127j387N582J382n602j998L868J835j967j143
3407h02J887L84k656r18L315K175m332k566M646K586m609k743L886K016l164m26
3423a321L138o89m160N29M515J328l610l247K608L342k183k283K791J672m163
3438a733r47M714M86n009q91N023K099m359k530K372K283j185j138J118J322l497
$$ plain form
3454 -1872 -3278 1210 3981 -1218 -4425 -104 3008 -293 -2599 -508 842 -951 -1078 1229 1174 -2209
3470 -2209 -3482 872 3436 376 -3814 -1468 2337 766 -1625 519 1201 -1761 -1807 2127 2371 -1474
3486 -1474 -2619 7 2847 1184 -1936 -1374 1052 799 -484 392 1619 -1063 -2587 1693 3926 -420
3502 -420 -2554 14 2088 805 -106 -75 504 213 206 1200 1808 -172 -1999 325 3326 1040 -2318 -600
3520 -600 2133 467 29 1321 496 -1383 -456 1646 1759 -153 -1598 -647 1412 1029 -814 -498 637
3537 637 -411 -909 1453 1136 -1831 -2346 1141 1925 -443 -1609 -177 26 -288 -50 172 -68 -1275
3554 -1275 -1569 634 1857 -1140 -2733 107 1879 -686 -1740 122 154 -1784 -545 1399 438 -1993
3570 -1993 -1728 664 1065 -170 -2145 -1157 773 -694 -1143 1100 632 -2214 -1706 2028 1871 -1728 -2200
$$ packed form
3454a872j406M488K771n199l207M321L112l301k306K091J350j793j27K307n5l383
3470b209j273M354K564l060m190K346L805j571k391K144O82k962m6L934K44l845
3486a474j145K626K840j663l120N62K426k53j283Q76J227k682j524M280K233m346
3502d20k134K568K074j283r11L1N79k91pR94O08j980j827K324L001k286l358J718
3520f00K733j666m38J292q25j879R27K102J13j912j445R51K059l83j843L16J135
3537F37j048m98K362l17k967n15L487P84k368j166J432K03l14K38K22k40j207
3554a275k94K203J223k997j593K840J772k565j054J862L2j938J239J944r61k431
3570a993K65K392M01j235j975R88J930j467m49K243m68k846N08L734j57l599m72
$$ plain form
3587 -2200 603 1677 -143 -872 -344 -25 -577 -321 1111 1460 -1497 -2794 1076 2651 -693 -2413
3603 -2413 110 1130 -536 -286 1111 -100 -1916 -471 1489 1420 -1598 -2403 -286 2221 766 -1767
3619 -1767 -963 737 -151 -529 1569 793 -2390 -1560 1879 2073 -479 -1472 -198 1222 1135 225 29 362
3637 362 -174 -16 1815 1758 -1282 -2186 1536 2762 260 -1227 -395 512 782 1235 1120 -573 -1060 -302
3655 -302 1151 1786 -84 -1800 -397 1869 982 -711 -105 7 -275 973 1660 -141 -1523 -756 1067
3672 1067 1069 545 -910 -1071 -19 678 163 -133 -566 -1156 -661 1196 640 -1333 -1482 177 328 -164 -40
3691 -40 -995 -1418 -479 766 195 -689 -1139 -1366 172 1054 -522 -1613 -396 296 -431 22 -19 -1273 -1027
3710 -1027 677 1126 -218 -685 -594 -381 132 913 -414 -969 -486 -113 203 429 69 -1197 -503 798
$$ packed form
3587b200K803J074j820p29N28L19n52K56J432L49k957j297L870J575l344j720
3603b413K523J020j666K50J397j211j816J445J960o9l018q05K117K507j455k533
3619a767Q04J700q88l78K098p76l183Q30L439J94k552r93J274J420q7r10j96L33
3637C62n36J58J831n7l040r04L722J226k502j487Q32R07K70M53j15j693m87P58
3655c02J453O35j870j716J403K266q87j693O06J12k82J248O87j801j382P67J823
3672A067Kn24j455j61J052O97n15k96m33n90M95J857n56j973j49J659J51m92J24
3691d0r55m23R39J245n71q84m50k27J538Q82j576j091J217O92p27M53m1j254K46
3710a027J704M49j344m67R1K13N13P81j327n55M83L73L16K26l60j266O94J301
$$ plain form
3728 798 495 -490 -392 -496 -398 1134 1256 -440 -990 -21 7 531 624 -87 -1337 -281 981 353 -166 -410
3748 -410 -458 -84 1425 580 -880 -841 114 502 1020 956 -682 -1100 428 1348 576 -381 6 -297 503 1367
3768 1367 489 -525 -311 516 1086 1349 245 -1676 -699 1867 1382 -202 -204 256 -71 595 1532 295
3786 295 -1188 -234 824 1088 747 -777 -1624 611 1877 538 -326 -90 -692 -682 1413 1380 -961 -1712
3804 -1712 83 1205 767 -540 -1179 -242 791 865 -249 -189 -888 -1253 314 1795 114 -2088 -834
3821 -834 922 388 -519 -406 -434 -443 -152 374 -347 -1024 -1627 -511 1375 949 -1982 -2261 186 878 -575
3840 -575 21 93 -1259 -1279 699 1245 -776 -1682 -811 903 1179 -598 -1766 -43 742 -59 326 1058
3858 1058 -605 -1968 47 2126 280 -1421 -445 757 466 -307 -161 285 -141 -510 188 1151 94
$$ packed form
3728G98l03r85R8j04R8J532J22j696n50R69K8N24R3p11j250J056J262o28n19k44
3748d10m8L74J509q45j460L9R55L88N18o4j638m18J528R20p72r57L87l03Q00Q64
3768A367q78j014K14Q27N70K63j104j921R77K566m85j584kM60l27O66R37j237
3786B95j483R54J058K64l41j524q47K235J266j339q64K36o02J0K095l3k341p51
3804a712J795J122m38j307o39R37J033P4j114O0o99l65J567J481j681k202J254
3821h34J756n34r07J13k8rK91N26p21o77o03J116J886m26k931k79K447O92j453
3840e75N96P2j352k0J978N46k021r06Q71J714K76j777j168J723P85q01L85P32
3858A058j663j363K015K079j846j701R76J202k91p73J46M46m26l69O98R63j057
$$ plain form
3875 94 -2066 -988 2384 1219 -1336 -499 1093 88 -1258 541 1326 -254 -1467 431 1410 368
3891 368 -1418 -950 1276 1575 -500 -421 825 -136 -1301 760 2880 128 -2489 62 2068 381
3907 381 -874 -144 860 406 94 320 821 -358 -1737 478 2581 993 -2751 -820 1573 385
3923 385 -878 448 902 -1098 -1438 1104 1537 -956 -1720 18 1960 701 -1424 -768 1104 787 -939
3940 -939 754 1649 -1393 -2448 974 2709 -419 -2540 55 1611 -60 -1208 -355 255 -907 -1163
3956 -1163 670 1473 -1764 -3458 475 3213 -105 -3101 -718 1051 -1063 -1125 715 820 -2070 -1574
3972 -1574 1427 1996 -1471 -3206 -479 2821 299 -2502 -670 1209 -997 -2023 1530 2034 -1934
3987 -1934 -2749 1319 2484 -1090 -2818 -163 1870 130 -1548 119 1074 -1191 -2151 1509 3132 -1607
$$ packed form
3875I4k160J078L372j165k555Q37J592j005j346J799P85j580j213J898R79j042
3891C68j786M68K226K99k075P9J246r61j165K061K120k752k617K551K006j687
3907C81j255P30J004m54l12K26N01j179j379K215K103j588l744J931K393j188
3923C85j263J326M54k000l40K542M33k493p64J738J942j259k125O56J872l17j726
3940i39J693Q95l042j055L422J735l128k121K595J556j671j148Q53O10j162k56
3956a163J833Q03l237j694L933K738l318k996K383J769k114o2J840J05k890M96
3972a574L001N69l467j735K727L300k522k801J832J879k206j026L553N04l968
3987a934q15M068J165l574j728K655K033j740j678J667R55k265r60L660J623m739
$$ plain form
4003 -1607 -3213 965 3033 -667 -2614 695 1740 -610 -857 1368 1159 -1462 -1789 1520 3046 -273
4019 -273 -2747 -124 2538 97 -1378 1263 2123 -1262 -1540 1865 2160 -1148 -1552 1496 2389 -462
4035 -462 -2104 -19 1391 232 -750 1157 1636 -1513 -2381 1758 2575 -941 -2120 912 1509 -1131
4051 -1131 -1127 667 863 -1021 -601 1340 1170 -1502 -2245 532 2596 -90 -1963 321 1083 -1547 -853
4068 -853 2017 1059 -2082 -1566 1364 786 -1766 -1451 627 1306 -406 -1462 -6 205 -1450 -1010 2252
4085 2252 1432 -3029 -2564 1653 1662 -1478 -1347 668 -1 -1354 -490 1196 292 -1543 -832 1545 1673 -2203
4103 -2203 -2968 768 1519 -819 -1059 879 -166 -2611 -280 2614 533 -2569 -1507 1721 1337 -955
4119 -955 -1509 256 1285 -742 -1046 933 656 -2234 -957 2677 1547 -2584 -1998 1483 1677 -651
$$ packed form
4003a607j606M178K068l700j947L309J045k350k47K225k09k621l27L309J526l319
4019b73k474K623K662k441j475K641Q60l385k78L405K95l308m04L048Q93k851
4035d62j642K085J410j159r82J907M79l149q68M139Q17l516j179L032N97k640
4051a131MJ794J96j884M20J941j70k672p43K777K064k686j873K284P62k630O94
4068h53K870r58l141N16K930n78k552L15K078O79j712j056J456K11j655M40L262
4085B252q20m461M65M217Rl140J31K015o69j353Q64J686r04j835P11K377J28l876
4103b203p65L736P51k338k40J938j045k445K331K894k081l102J062L228l84k292
4119i55n54J765J029k027l04J979k77k890J277L634j130m131N86L481J94k328
$$ plain form
4135 -651 -816 396 -16 -742 -203 1584 929 -1876 -2263 2186 2552 -1557 -2287 1387 2013 -1128 -969 987
4153 987 200 -1541 -225 2270 1403 -1730 -1863 1006 2803 -122 -1896 582 1645 -1083 -894 1916
4169 1916 1485 -1863 -1239 2365 1859 -1629 -1798 1294 2203 40 -1121 199 374 -1017 -913 2179 1993
4186 1993 -1866 -2197 1716 2195 -1172 -1587 910 778 -764 -1133 1094 357 -1405 -715 1482 1450 -1454
4203 -1454 -2581 350 1978 -635 -1676 891 751 -1939 -1047 1595 668 -2127 -1287 1150 805 -1244
4219 -1244 -1748 96 753 -746 -621 531 374 -2356 -1564 2026 1391 -2027 -1696 1246 654 -1581 -703
4236 -703 869 -81 -1706 -484 1467 184 -2006 -1397 1482 1741 -1105 -1690 777 654 -1272 -202
4252 -202 1954 -12 -2624 -60 2090 698 -1984 -1059 1259 1234 -688 -951 832 578 -1148 202
$$ packed form
4135f51j65J212m12p26N39J787o55k805l87M449L66m109p30L674O26l141J59J956
4153I87p87j741J316K495q67l133j33K869J797k925j774K478J063k728J89K810
4169A916m31l348O24L604n06l488j69L092R09k163j161J320J75j391J04L092j86
4186A993l859l31L913M79l367m15K497j32j542l69K227p37j762O90K197l2k904
4203a454j127K931J628k613j041K567j40k690Q92K642r27k795Q40K437l45k049
4219a244n04J844O57j499J25J152j57k730P92L590o35l418L31K942n92k235Q78
4236g03J572r50j625J222J951j283k190O09K879K59k846n85K467j23j926J070
4252b02K156j966k612K564K150j392k682R25K318k5j922k63J783k54j726J350
$$ plain form
4268 202 2495 336 -2864 -1019 2784 1270 -1853 -813 1313 528 -710 385 1270 -50 -1647 -77
4284 -77 2185 1113 -2348 -1690 2293 1932 -1145 -742 1540 535 -1445 757 2325 -432 -2369 -18
4300 -18 2649 834 -1349 -1153 1352 1241 -650 -178 1422 56 -1835 167 2413 442 -2793 -477
4316 -477 2411 847 -1622 -999 805 74 -748 257 782 -244 -2095 -588 2142 1086 -2340 -1421
4332 -1421 1443 725 -1405 -200 931 -642 -1542 633 1487 -798 -1810 -700 1255 540 -1472 -998
4348 -998 635 454 -822 -171 1290 -560 -2252 -39 1606 -246 -1850 -554 647 124 -785 -410
4364 -410 148 -598 -931 110 1080 -332 -1894 -607 1839 431 -1630 -255 734 -390 -714 807 334
4381 334 -929 -1224 837 1031 58 -1086 -788 649 749 -657 -278 922 -325 -735 1177 1988 -433
$$ packed form
4268B02K293k159l200J845L803j514l123J040K126p85j238J095Q85j320j597J570
4284g7K262j072l461O58L983l61l077M03K282j005j980K202J568k757j937K351
4300a8K667j815k183J96K505j11j891M72J600j366j891K002K246j971l235K316
4316d77K888j564k469O23J804p31q22J005N25j026j851J507K730j056l426R19
4332a421K864p18k130J205J131j573r00K175Q54k285j012J110J955p15k012M74
4348i98J633j81j276O51J461j850j692K213J645j852j604J296J201n23r09L75
4364d10N58p46l33J041R70j412j562J287K446j408k061J375R89j124l24J521m73
4381C34j263k95K061J94r73j144K98J437J00j406L79J200j247m10J912Q11k421
$$ plain form
4398 -433 -1330 597 1493 153 -437 -119 269 190 338 538 594 -319 -735 584 1812 133 -1420 -215
4416 -215 1405 219 -252 413 -38 -868 224 1271 715 -848 -862 315 1192 613 -817 -598 830 899
4434 899 -36 534 335 -1315 -741 1272 1486 -791 -1307 212 795 494 -78 -780 -354 118 168 538 476
4453 476 -751 -1408 285 1493 56 -1137 -224 112 7 147 73 -668 -950 -115 779 314 -571 -1450 -738
4472 -738 920 573 -960 -912 -295 41 -249 486 -108 -1499 -615 664 740 -25 -766 -512 28 692 115
4491 115 -925 -490 -415 -371 462 441 -521 -1389 97 734 203 -576 -424 -302 -129 653 -81 -679 -579 132
4511 132 180 459 81 -1145 -824 560 528 -313 -7 -25 -115 155 285 -566 -658 -224 121 192 463 59 -560
4532 -560 87 881 316 35 -9 -192 -2 908 913 -336 -427 90 28 440 806 -333 -788 143 890 338 57
$$ packed form
4398d33q97J927Q96j340n90L18L88p9J48K00N6r13m16J319J228j679j553J205
4416b15J620j186m71O65m51q30J092J047n56j563j4J177Q77n79j430K19J428O9
4434H99r35N70j99j650N74K013K14k277n16J519N83l01n72p02M26M72N0L70o2
4453D76j227o57J693J208j437j193R13L36j05J40p4p41k82Q35Q94m65q85q79P12
4472g38J658l47j533M8O17L36k90P35n94j391Q84J279P6p65p41K54N40O64n77
4491A15j040M35P5M4Q33k1r62q68J486O37n31p79J52J22J73P82p34n98J00P11
4511A32M8K79l78j226L21J384l2q41L06j8r0K70J30q51r2M34L45P1K71m04o19
4532e60O47P94n65k81m4j83J90R10Nj249r1N17o2M12L66j139m55R31P47n52k81
$$ plain form
4553 57 46 -114 33 786 840 -53 48 91 26 517 534 -270 -362 621 633 -116 -123 -152 -588 205 1205 330 -816
$$ packed form
4553E7j1j60J47P53N4q93J01M3o5M91J7q04r2R83J2p49pk9m36P93J000q75j146
$$ [...]
8191C24
##END NTUPLES=NMR FID
##END=
