##TITLE=1H_EC-3190(1)
 CDCl3, 8 sc, 
 10.4.2019
##JCAMPDX= 6.0         $$ Bruker NMR JCAMP-DX V2.0
##DATA TYPE= NMR FID
##DATA CLASS= NTUPLES
##ORIGIN= UXNMR, Bruker Analytische Messtechnik GmbH
##OWNER= root
$$ XWIN-NMR		Version 3.5
$$ Wed Apr 10 14:08:24 2019 Russian Standard Time (UT+4h)  she@DPX200
##.OBSERVE FREQUENCY= 200.1315
##.OBSERVE NUCLEUS= ^1H
##.DELAY= (6, 6)
##.ACQUISITION MODE= SIMULTANEOUS
##.ACQUISITION SCHEME= undefined
##.AVERAGES= 8
##.DIGITISER RES= 18
##SPECTROMETER/DATA SYSTEM= spect
##.PULSE SEQUENCE= zg30
##.SOLVENT NAME= CDCl3
##.SHIFT REFERENCE= (INTERNAL, CDCl3, 0, 15.7039)
##AUDIT TRAIL= $$ (NUMBER, WHEN, WHO, WHERE, WHAT)
$$ ##TITLE= Audit trail, XWIN-NMR		Version 3.5
$$ ##JCAMPDX= 5.01
$$ ##ORIGIN= Bruker BioSpin GmbH
$$ ##OWNER= she
$$ F:/spectra/data/she/nmr/H-F/1/audita.txt
$$ ##AUDIT TRAIL=  $$ (NUMBER, WHEN, WHO, WHERE, WHAT)
(   1,<2019-04-10 14:05:41.53 +0400>,<she>,<DPX200>,
      <created by zg, POWCHK disabled, PULCHK disabled
       configuration hash MD5:
       00 E9 B6 7A A2 85 ED C7 34 08 36 98 17 FE 4E 26
       data hash MD5: 16K
       71 7D F5 EC EB 77 A6 42 12 55 2E B0 F3 BA 09 95>)
$$ ##END=
$$ 
$$ hash MD5
$$ 67 C3 B0 1E 34 73 6D 09 A8 A5 E4 9E 71 6C 56 0E
##$RELAX= 
##$RELAX= 
##$RELAX= 
##$RELAX= 
##$RELAX= 
##$RELAX= 
$$ Bruker specific parameters
$$ --------------------------
##$DU= <F:/spectra>
##$EXPNO= 1
##$NAME= <H-F>
##$PROCNO= 1
##$TYPE= <nmr>
##$USER= <she>
##$AMP= (0..31)
100 100 100 100 100 100 100 100 100 100 100 100 100 100 100 100 100 100 
100 100 100 100 100 100 100 100 100 100 100 100 100 100 
##$AQSEQ= 0
##$AQ_mod= 1
##$AUNM= <au_zg>
##$AUTOPOS= <>
##$BF1= 200.13
##$BF2= 200.13
##$BF3= 200.13
##$BF4= 200.13
##$BF5= 200.13
##$BF6= 200.13
##$BF7= 200.13
##$BF8= 200.13
##$BYTORDA= 1
##$CFDGTYP= 0
##$CFRGTYP= 5
##$CHEMSTR= <none>
##$CNST= (0..31)
1 1 145 1 1 1 1 1 1 1 1 1 1 1 1 1 1 1 1 1 1 1 1 1 1 1 1 1 1 1 1 1 
##$CPDPRG= <>
##$CPDPRG1= <>
##$CPDPRG2= <>
##$CPDPRG3= <>
##$CPDPRG4= <mlev>
##$CPDPRG5= <mlev>
##$CPDPRG6= <mlev>
##$CPDPRG7= <mlev>
##$CPDPRG8= <mlev>
##$CPDPRGB= <>
##$CPDPRGT= <>
##$D= (0..31)
0 1.2 0 0 0 0 0 0 0 0 0 0.03 0 0 0 0 0 0 0 0 0 0 0 0 0 0 0 0 0 0 0 0 
##$DATE= 1554890740
##$DBL= (0..7)
120 120 120 120 120 120 120 120 
##$DBP= (0..7)
150 150 150 150 150 150 150 150 
##$DBP07= 0
##$DBPNAM0= <>
##$DBPNAM1= <>
##$DBPNAM2= <>
##$DBPNAM3= <>
##$DBPNAM4= <>
##$DBPNAM5= <>
##$DBPNAM6= <>
##$DBPNAM7= <>
##$DBPOAL= (0..7)
0.5 0.5 0.5 0.5 0.5 0.5 0.5 0.5 
##$DBPOFFS= (0..7)
0 0 0 0 0 0 0 0 
##$DE= 6
##$DECBNUC= <off>
##$DECIM= 24
##$DECNUC= <off>
##$DECSTAT= 4
##$DIGMOD= 1
##$DIGTYP= 9
##$DL= (0..7)
0 120 120 120 120 120 120 120 
##$DP= (0..7)
150 150 150 150 150 150 150 150 
##$DP07= 0
##$DPNAME0= <>
##$DPNAME1= <>
##$DPNAME2= <>
##$DPNAME3= <>
##$DPNAME4= <>
##$DPNAME5= <>
##$DPNAME6= <>
##$DPNAME7= <>
##$DPOAL= (0..7)
0.5 0.5 0.5 0.5 0.5 0.5 0.5 0.5 
##$DPOFFS= (0..7)
0 0 0 0 0 0 0 0 
##$DQDMODE= 0
##$DR= 18
##$DS= 0
##$DSLIST= <SSSSSSSSSSSSSSS>
##$DSPFIRM= 0
$$ [...]
##$SUBNAM2= <"">
##$SUBNAM3= <"">
##$SUBNAM4= <"">
##$SUBNAM5= <"">
##$SUBNAM6= <"">
##$SUBNAM7= <"">
##$SUBNAM8= <"">
##$SUBNAM9= <"">
##$SW= 24.9337058887773
##$SWIBOX= (0..15)
0 0 2 0 0 0 0 0 0 0 0 0 0 0 0 0 
##$SW_h= 4990.01996007984
##$TD= 16384
##$TD0= 1
##$TE= 0
##$TE2= 300
##$TE3= 300
##$TEG= 300
##$TL= (0..7)
0 120 120 120 120 120 120 120 
##$TP= (0..7)
150 150 150 150 150 150 150 150 
##$TP07= 0
##$TPNAME0= <>
##$TPNAME1= <>
##$TPNAME2= <>
##$TPNAME3= <>
##$TPNAME4= <>
##$TPNAME5= <>
##$TPNAME6= <>
##$TPNAME7= <>
##$TPOAL= (0..7)
0.5 0.5 0.5 0.5 0.5 0.5 0.5 0.5 
##$TPOFFS= (0..7)
0 0 0 0 0 0 0 0 
##$TUNHIN= 0
##$TUNHOUT= 0
##$TUNXOUT= 0
##$USERA1= <user>
##$USERA2= <user>
##$USERA3= <user>
##$USERA4= <user>
##$USERA5= <user>
##$V9= 5
##$VALIST= <valist>
##$VCLIST= <CCCCCCCCCCCCCCC>
##$VD= 0
##$VDLIST= <DDDDDDDDDDDDDDD>
##$VPLIST= <PPPPPPPPPPPPPPP>
##$VTLIST= <TTTTTTTTTTTTTTT>
##$WBST= 1024
##$WBSW= 4
##$XGAIN= (0..3)
0 0 0 0 
##$XL= 0
##$YL= 0
##$YMAX_a= 530582
##$YMIN_a= -849902
##$ZGOPTNS= <>
##$ZL1= 120
##$ZL2= 120
##$ZL3= 120
##$ZL4= 120
##$ABSF1= 10
##$ABSF2= 0
##$ABSG= 5
##$ABSL= 3
##$ALPHA= 0
##$AQORDER= 0
##$ASSFAC= 0
##$ASSFACI= 0
##$ASSFACX= 0
##$ASSWID= 0
##$AUNMP= <proc_1d>
##$AZFE= 0.1
##$AZFW= 0.1
##$BCFW= 1
##$BC_mod= 2
##$BYTORDP= 1
##$COROFFS= 0
##$CY= 11.3945322036743
##$DATMOD= 1
##$DC= 2
##$DFILT= <>
##$DTYPP= 0
##$F1P= 18.9103706918063
##$F2P= -1.10871071338519
##$FCOR= 0.5
##$FTSIZE= 0
##$FT_mod= 4
##$GAMMA= 1
##$GB= 0.15
##$INTBC= 1
##$INTSCL= 1
##$ISEN= 128
##$LB= 0.24
##$LEV0= 0
##$LPBIN= 0
##$MAXI= 10000
##$MC2= 0
##$MEAN= 0
##$ME_mod= 0
##$MI= 1.114404
##$NCOEF= 0
##$NC_proc= 0
##$NLEV= 6
##$NOISF1= 3.799351
##$NOISF2= 2.8
##$NSP= 1
##$NTH_PI= 0
##$NZP= 0
##$OFFSET= 15.70392
##$PC= 1
##$PHC0= -8852.129
##$PHC1= 14.00026
##$PH_mod= 1
##$PKNL= yes
##$PPARMOD= 0
##$PSCAL= 0
##$PSIGN= 0
##$REVERSE= no
##$SF= 200.130013532006
##$SI= 16384
##$SIGF1= 3
##$SIGF2= 2
##$SINO= 400
##$SIOLD= 16384
##$SREGLST= <1H.CDCl3>
##$SSB= 0
##$STSI= 0
##$STSR= 0
##$SW_p= 3612.71676300578
##$SYMM= 0
##$S_DEV= 0
##$TDeff= 0
##$TDoff= 0
##$TI= <>
##$TILT= no
##$TM1= 0
##$TM2= 0
##$TOPLEV= 0
##$USERP1= <user>
##$USERP2= <user>
##$USERP3= <user>
##$USERP4= <user>
##$USERP5= <user>
##$WDW= 1
##$XDIM= 8192
##$YMAX_p= 0
##$YMIN_p= 0
$$ End of Bruker specific parameters
$$ ---------------------------------
##NTUPLES= NMR FID
##VAR_NAME=  TIME,          FID/REAL,        FID/IMAG
##SYMBOL=    X,             R,               I
##VAR_TYPE=  INDEPENDENT,   DEPENDENT,       DEPENDENT
##VAR_FORM=  AFFN,          ASDF,            ASDF
##VAR_DIM=   8192,          8192,            8192
##UNITS=     SECONDS,       ARBITRARY UNITS, ARBITRARY UNITS
##FACTOR=    0.0002004,     1,               1
##FIRST=     0,             0,               0
##LAST=      1.6414764,     0,               0
##MIN=       0,             -849902,         0
##MAX=       1.6414764,     530582,          0
$$ Real data points
##PAGE= N=1
##DATA TABLE= (X++(R..R)), XYDATA
$$ [...]
3085e324M261J150n701k156M901L703l787m168L003L892j516l648J302L058k205
3100c235k330N207K967o603m014N918N027l999l648L249K086l253J47L792K78
3115A589m502q19M692L486m712m460M367M103l290k289M609J384o297J62O302
3130D325J014o314o9N914N29n184j278M012J992k505r71L310o59n354J022P671
3146G455K33q197j532P200J157m740J60L211k320l283M152M777l733p121R18P051
3162E388K000n371j963L130r42l906L580O120m168p330K667O479k794n069K497
3177C18M287k630m040K777K730k877l791L378M814l902o213L418O169l680o240
3192e482L408N161l751l684M055K369o788j804O569M205o162n433K862M310j603
$$ plain form
3085 -5324 -1063 87 -5614 -7770 -2869 834 -2953 -7121 -4118 -226 -1742 -5390 -4088 -1030 -3235
3100 -3235 -5565 -358 2609 -3994 -8008 -2090 2937 -1062 -4710 -1461 625 -2628 -2481 1311 1589
3115 1589 -2913 -3732 960 4446 -266 -4726 -359 3744 454 -1835 2774 4158 -2139 -1977 4325
3130 4325 5339 -975 -1044 4870 5399 215 -1063 2949 4941 2436 1465 4775 4116 -1238 -216 7455
3146 7455 7688 -509 -2041 5159 6316 1576 1736 4947 2627 -656 3496 8273 4540 -2581 -1663 5388
3162 5388 7388 2017 54 3184 2242 -1664 1916 8036 3868 -3462 -795 5684 2890 -2179 318
3177 318 4605 1975 -2065 712 3442 565 -3226 152 4966 1064 -5149 -1731 4438 758 -5482
3192 -5482 -2074 3087 -664 -4348 -293 2076 -4712 -6516 53 4258 -1904 -7337 -4475 -165 -1768
3207a768k757K983J767n985k707P499L913p502m788O600M299m974k580L645P43
3222a612m381P17O046L16p166k331O824L925n464l388N440K203n615q90O685j73
3238A136o696J230P782p09p859R7P135J238n049p37M145J77m555J090O356q13
3254C968o855P96Q439n75q518K88P627n43m821K041L934l951m340M525O349l085
3270E279p398J629O418l00n633N47N377k184n301M635N858n813p117N174P283
3285H454l197o164K313L577k919k794M061L658m993m962M068N612m028o163L983
3300E06N732m243n275M611L321n433k823O553K350p061l476N930L950n034m395
3315d787L883L419l292k955M012J865o254j856Q159L129q429m241O243L490m982
$$ plain form
3207 -1768 -4525 -1542 225 -5760 -8467 -968 2945 -4557 -9345 -2745 1554 -3420 -6000 -2355 -1612
3222 -1612 -5993 -5276 770 1086 -6080 -8411 -1587 2338 -3126 -6514 -1074 1129 -4486 -5376 1309 1136
3238 1136 -5560 -4330 3452 2743 -5116 -5019 2116 3354 -1695 -2432 1713 1890 -2665 -1575 4781 3968
3254 3968 -2887 -2091 6348 5773 -2745 -2457 5170 4627 -194 1847 5781 1830 -2510 2015 8364 5279
3270 5279 -2119 -490 5928 5628 -5 542 5919 3735 -1566 3069 8927 3114 -4003 1171 8454
3285 8454 5257 -907 1406 4983 2064 -730 3331 6989 1996 -2966 1102 6714 2686 -3477 506
3300 506 6238 1995 -3280 1331 4652 -781 -3604 2949 5299 -1762 -5238 692 4642 -392 -4787
3315 -4787 -904 2515 -777 -3732 280 2145 -4109 -5965 2194 5323 -3106 -7347 -1104 2386 -2596
3330b596q36M672j193n297L78O304R10p099k020O699L053o513k840N326J605n678
3346e125N27O212j713p484J473P602r15o757J98N761k99m418l4M659j031m789
3362f133J953O810k164p640J535P900k03o748J366M925k177m420M313M838m096
3377E9m953L499O066k754n226J598N315p58m711K083M797l902m573M983N710n132
3393B101o243N139N704l988l649K678K865k982j521M284K060n333l803N326O253
3408H891m432n944L510M220l232k645M791J841o524j366O980J876o142k967M489
3423C346L180l740k731K787J595l779j478N149J434o877k005O623K198o932k094
3438c324N366R25m288r62L985j290m420J372N177j05o677j851N839K197m639j626
$$ plain form
3330 -2596 -3432 1240 47 -5250 -4872 1432 2342 -4757 -6777 -78 2975 -3538 -6378 -1052 553 -5125
3346 -5125 -4598 1614 -99 -7583 -6110 1492 577 -6180 -5982 -221 -520 -4938 -4972 -313 -1344 -6133
3362 -6133 -4180 2630 466 -7174 -5639 2261 2058 -4690 -3324 1601 -576 -4996 -683 4155 59
3377 59 -4894 -1395 4671 1917 -3309 -1711 3604 2846 -1865 218 5015 1113 -3460 1523 7233 2101
3393 2101 -4142 997 6701 2713 -936 1742 4607 1625 104 4388 6448 1115 -2688 2638 8891
3408 8891 4459 -1485 2025 6245 3013 368 5159 7000 476 -890 6090 7966 1824 -1143 3346
3423 3346 6526 2786 55 2842 4437 658 -820 4329 5763 -1114 -3119 3504 5702 -1230 -3324
3438 -3324 2042 2967 -1321 -2283 1702 412 -4008 -2636 2541 2436 -4241 -6092 -253 1944 -2695 -4321
3454d321M404n21n231K010N753k315o871J981O200j010n079J57L873p04l191J733
3470c132L383k389m581J950O087j379o818J162O269j015n076J954L654l039l080
3485f050M525L041l711m199K919N167j256m862J220L518q88k635K914K729m122
3500a690l463N343M528m481m352L213L784k317j575K108J041k764m82L621K013
3515D527m195k942L866M144l331l410K651K562k992o98M006K07n290j82N448J181
3531E552m463j627L023J717j952j299J924P02k973n34M272Q35n722j019N745J136
3547E317m232j275L016l04k612J720K628j798l905J056M052M87m190j494L468
3562A934J443l221j38K565j384l386K487M309k520m817J296L817n47k248k73Q33
$$ plain form
3454 -4321 83 -438 -5669 -3659 2094 -221 -7092 -5111 1089 79 -5000 -4843 -970 -1674 -4865 -3132
3470 -3132 251 -2138 -6719 -4769 1318 -61 -6879 -5717 552 -463 -5539 -3585 69 -2970 -6050
3485 -6050 -1525 1516 -2195 -6394 -3475 1692 436 -4426 -3206 312 -576 -3211 -297 2432 -1690
3500 -1690 -5153 190 4718 237 -4115 -902 2882 565 -1010 1098 2139 -625 -1107 2514 4527
3515 4527 332 -2610 1256 5400 2069 -1341 1310 3872 880 182 4188 4395 -895 -1077 4371 5552
3531 5552 1089 -538 2485 4202 2250 951 2875 3577 604 70 4342 5177 -545 -1564 4181 5317
3547 5317 1085 -190 2826 2522 -90 1630 4258 2460 -1445 -389 3663 4150 -40 -1534 1934
3562 1934 3377 156 18 2583 1199 -2187 300 4609 2089 -2728 -1432 2385 1838 -410 -683 150
3578A50m76j047J345J524j670l768J442L944p21m340K80L132p78k381K036O98
3594f30k984j202L513J542k897k439J430K724l91k449o0J455l59r60J891J245
3610e71l238j585L371K521k453k362J775J136p43K95J038r25j846O16K377J601
3626A007k549k572J799L101j351j215J090L50j719O10L128m06l259JK958J141
3642B114j555q67P62P84K09O9P79k67j860M56L512M22l339j029K861J210j147
3659C114K0L79j060o15J801J108j209k291N21J661J189j625j653P13J045p05K93
3676B686R32j807j666J496K477k000j745M26J220K05k57n16j183j06N32J031J34
3693A859j104k236O35K741Nk019r35N28K12P72N70j018k306K26J710J183o74j541
$$ plain form
3578 150 -326 -1373 -28 1496 -174 -3942 -2500 1444 723 -3617 -3337 -205 -983 -3364 -1328 -630
3594 -630 -3614 -4816 -1303 239 -2658 -5097 -3667 -943 -1334 -3783 -3843 -2388 -2747 -3707 -1816 -571
3610 -571 -3809 -5394 -2023 498 -1955 -4317 -2542 -1406 -2149 -1854 -816 -1741 -3587 -2971 -594 1007
3626 1007 -1542 -4114 -2315 786 -565 -1780 -690 -340 -2059 -1449 1679 1273 -1986 -1985 973 2114
3642 2114 559 -308 454 1238 1447 1516 2295 2028 168 624 4136 4558 1219 190 3051 4261 3114
3659 3114 3134 3513 2453 1838 3639 4747 3538 1247 1768 3429 4618 2993 1340 2053 3098 2393 2686
3676 2686 3618 1811 145 1641 4118 2118 373 799 2019 2224 1967 1451 268 162 694 1725 1859
3693 1859 755 -1481 -846 1895 1900 -119 -1054 -526 -314 458 1028 10 -2296 -2070 -360 823 149 -1392
3711a392j833J026J902O8j136q20n67p4J430Q58j621j112R38P21l86p9k63p09
3729c049N92J105k71j276K53L40L59N95l16j548K40J609P42p44p86m80L08J648
3747f79N30j046j624M68P35J311J254j728k102J26K452Q03o75n31r92m27J136
3764i89J911j14j360l84K65J471R95j649j162J366J168p82J5J118j353n99J816
3781A733Q47j274r05J154J071j16r03m70L74J208L62k49n8j189m69J746K050j412
3799C500k650N61J925o6n12P89j014j366R29J962j19j705j912M03L040j93k063
3816A509n37M56p84O2J685K20l205r35K602J031k324j436J350O82m41l68k35l57
3834a025r41P5K313N34k759k297K413K005j715p02P68L43k003R45J890j239k407
$$ plain form
3711 -1392 -3225 -2199 -297 -229 -1365 -2185 -2752 -2826 -1396 -538 -2159 -3271 -2333 -1612 -1998 -2077 -2340 -3049
3729 -3049 -2457 -1352 -1623 -2899 -2646 -2306 -1947 -1352 -1668 -3216 -2976 -1367 -625 -1369 -2155 -2635 -2327 -679
3747 -679 -149 -1195 -2819 -2351 -1616 -305 949 -779 -2881 -2755 -303 500 -175 -706 -1698 -2125 -989
3764 -989 922 808 -552 -936 -671 800 1795 146 -1016 350 1518 736 751 1869 516 -83 1733
3781 1733 2580 1306 401 1555 2626 2510 1607 1137 1511 2719 3081 2832 2774 1585 1116 2862 4912 3500
3799 3500 850 1411 3336 3270 2758 3547 2533 1167 2096 4058 3939 2234 322 725 3765 3572 1509
3816 1509 972 1428 644 706 2391 2611 -594 -1529 1073 2104 -220 -1656 -306 376 -65 -433 -668 -1025
3834 -1025 -1966 -1891 422 956 -1803 -4100 -1687 318 -1397 -2099 -1331 -988 -2991 -2046 -156 -1395 -3802
3851c802N22K652L83k271j252J288J200j170k34J492k56k673K50L471m80l562
3867d442M17L239l76k341Q3J321Ln13J712P03k008k395J704M145l4l308r70K733
3885c27O62j655J588J474l019j482L581L164k765l122J294K315K44q94J84O99
3901A941j945j283K500L124k539l260K091K898k289k526K757J906k023j191J951
3916B112M03k360o6K792J140k743j977K696K300j513k280J707J320j861k13L528
3932D985l57n292m92N166J986l610k083J069N28j023R55K134j087l919q52M743
3948B851J486m376k043L471P00l034k62L306j118l959J803L706j346l812j80L814
3964A007k03k676n94K783J4k633K96K390r10l685J997M726k025n216P02M256l27
$$ plain form
3851 -3802 -3280 -628 -245 -2516 -3768 -2480 -1280 -2450 -2684 -1192 -1448 -4121 -3871 -400 -880 -4442
3867 -4442 -4025 -786 -1162 -3503 -3420 -2099 -2096 -2609 -897 -194 -2202 -4597 -2893 1252 1218 -2090 -3060 -327
3885 -327 335 -1320 268 1742 -1277 -2759 822 3986 1221 -1901 -607 1708 1952 1058 1242 1941
3901 1941 -4 -1287 1213 4337 1798 -1462 629 3527 1238 -1288 1469 3375 1352 161 2112
3916 2112 2515 155 89 2881 4021 1278 -699 1997 4297 2784 504 2211 3531 1670 1457 4985
3932 4985 4628 -664 -1156 4010 5996 2386 303 1372 1900 877 1832 3966 2879 -1040 -1892 2851
3948 2851 4337 -39 -2082 1389 2089 -945 -1207 2099 981 -2978 -1175 2531 1185 -2627 -2807 1007
3964 1007 804 -1872 -2466 317 331 -2302 -2006 384 -526 -4211 -2214 2512 487 -4729 -4027 229 -98
3981i8k448O01J443k043k072K753K371j631l973J315L981n32l780O37K631j368
3997b213k411L377K306l955l184M070L354k395l056J819K302j027j910J600J747
4012D24j584j830L268K738m594k639M125L453l158k460K718Q13l099O90L774O01
4028C240m562r42L805K368l448k134K881K036k441j291L135R51m453k22N177P85
4044D885m946o53M174R87l561l15K967k6k573M30K867p42m070O18N246N04n519
4061B73j240M232N39l199Q02K899j966m445K675M907j627n300L27L774O20k880
4077C91m19K465j268l662K225M734k729n081J549M905j584m493K154L002k015
4092A74l537K381K670k604k551K506K988k992m082J625M713j371l962J219L098
$$ plain form
3981 -98 -2546 -1945 -502 -2545 -4617 -1864 507 -1124 -5097 -3782 199 -333 -4113 -3476 -845 -2213
3997 -2213 -4624 -1247 1059 -2896 -6080 -2010 1344 -1051 -4107 -2288 14 -1013 -2923 -1323 424
4012 424 -1160 -2990 278 3016 -1578 -4217 -92 3361 203 -2257 461 1274 -1825 -1135 2639 3240
4028 3240 -1322 -2264 1541 3909 461 -1673 1208 3244 803 -488 2647 3598 -855 -1077 4100 4885
4044 4885 -61 -714 3460 4447 886 571 3538 3512 939 1369 4236 3494 -576 42 5288 5792 273
4061 273 -967 3265 3804 605 1407 4306 2340 -2105 570 5477 3850 -1450 -1123 2651 3271 391
4077 391 -28 2437 1169 -2493 -268 4466 1737 -3344 -1795 3110 1526 -2967 -813 2189 174
4092 174 -3363 -982 1688 -916 -3467 -961 2027 -965 -5047 -3422 1291 -80 -4042 -2823 275
4107B75k876k190L864K035m625l029M729L474l496k811J782K068j584l14K668
4122c0N69m165k341M992L554m157l568L739K496l102j596L640P70l663m1M087
4138A184J39m092j009M063J918l133k047K856J338k635r26M077K23m931L40N657
4154C022J11n473k79M383J010k943L45K253j223k310J200M204m37m804n37M497
4170C019J528m331q9L676o86l614J878L715k593l603K443M016k053l552R13K923
4186C590n15k299L45K623j642l099K265L778k790m806K344N295j897m177J534
4201E49K018j811j647L242J607l623k586K751L471k200l370J324K671j877k064
4216a545K127J944l338k292M075K060m274k438L213K336k749j855J921R78k076
$$ plain form
4107 275 -2601 -4791 -927 1108 -3517 -6546 -1817 1657 -1839 -4650 -2868 -800 -2384 -2698 -30
4122 -30 539 -3626 -5967 -975 2579 -1578 -5146 -1407 1089 -2013 -3609 31 801 -2862 -2903 1184
4138 1184 1323 -2769 -3778 285 2203 -930 -2977 -121 1217 -1418 -2344 1733 1956 -2975 -2635 3022
4154 3022 3133 -2340 -2619 1764 2774 -169 176 2429 1206 -1104 96 4300 3863 -941 -1478 3019
4170 3019 4547 216 127 3803 3117 -497 1381 5096 2503 -1100 1343 5359 3306 -246 667 3590
4186 3590 3075 776 1121 3744 2102 -997 1268 5046 2256 -2550 -206 5089 3192 -985 549
4201 549 2567 756 -891 2351 3958 335 -2251 500 3971 1771 -1599 -275 2396 519 -1545
4216 -1545 582 2526 -812 -3104 971 3031 -1243 -3681 -468 1868 -881 -2736 -815 163 -1913
4231a913j016K429J214l970j674M448K142m113k984L396J965k811k25K504n57
4246a165l552N85M395Q1l711j422K864J741k023q71J909M53k797L97L810n90m191
4263d087M77M499J01l853N25K519l45j838J137J731j125k365J489L241q45l650
4279b389J64M077N44k939q0K298j077j922K776K517k879l244K639L362r38k775
4295A34L42K012n34j130J065J874k362k290K375L460j995l750K039K544j771j446
4311E67J417J091k614k38K512J006k670j721K262K259j448k708J415J759j448
4326A441j337K293M77l457r21L838J357l565j255K094J117j783o27J118kj805
4342a017QK615L84l330j797L255K240k576j620J840K65k144J032K013j175k971
$$ plain form
4231 -1913 -2929 -500 714 -3256 -4930 -482 1660 -2453 -5437 -2041 -76 -2887 -3112 -608 -1165
4246 -1165 -4717 -4132 263 344 -3367 -4789 -1925 -184 -2207 -3078 -1169 -716 -3513 -3116 694 104 -4087
4263 -4087 -3610 889 990 -2863 -2338 181 -164 -2002 -865 866 -259 -2624 -1135 2106 1261 -2389
4279 -2389 -2225 1852 2396 -543 -623 1675 598 -1324 1452 3969 1090 -2154 485 3847 2909 134
4295 134 476 2488 1954 824 1889 3763 1401 -889 1486 4946 2951 -799 1240 3784 2013 567
4311 567 1984 3075 461 223 2735 3741 1071 -650 1612 3871 2423 -285 1130 2889 1441
4326 1441 104 2397 2874 -583 -1504 2334 3691 126 -1129 965 2082 299 -328 790 788 -1017
4342 -1017 -1009 1606 1990 -1340 -3137 118 2358 -218 -1838 2 267 -1877 -845 1168 -7 -2978
4358b978P58K987j49k379j342K028Q66j371o08J215k13k054J020K764r74l395
4374c825L19K919m30j819K97P67l53o54J605N87j370j576O27L085m50k723k08
4391c202K458L03j764Q13J403j867j067K558J638k267j270J077J714k30r41L14
4407c30K49j03k22Q29J532j830j786K083K462j401k540J127J549p12l01J078m07
4424A277j482Q64J605O44j489j498J290J483k93j189M63N54j061r9K491j50k463
4441I47p52K381P72j241p96L93K03N3L49J84l99j115M9J286O33j874j108J604
4459A569O05r04j024Q15j68p49M61J448j798j149L20J685q8o68j691J61J471j9
4477B77l58k33l26j725J475J850m55k413l38J162M37J41q0p74j144M38J233J91
$$ plain form
4358 -2978 -2220 767 618 -1761 -3103 -1075 -209 -1580 -2188 -973 -1186 -3240 -2220 544 -430 -3825
4374 -3825 -3506 -587 -1017 -2836 -2539 -1772 -2125 -2779 -1174 -587 -1957 -3533 -2906 179 -271 -2994 -3202
4391 -3202 -744 -441 -2205 -1392 11 -1856 -2923 -365 1273 -994 -2264 -1187 527 297 -644 -330
4407 -330 -81 -184 -406 423 1955 125 -1661 422 2884 1483 -1057 70 1619 907 606 1684 1277
4424 1277 -205 659 2264 2908 1419 -79 1211 2694 2401 1212 1675 2229 1168 1069 3560 3410 947
4441 947 195 2576 3348 2107 1311 1704 1907 1960 2309 2493 2094 979 1028 2314 2947 1073 -35 1569
4459 1569 2174 1270 246 1061 893 144 605 2053 255 -894 -574 1111 1023 355 -1336 -1175 296 277
4477 277 -81 -314 -640 -2365 -890 960 505 -1908 -2246 -1084 -647 -506 -586 -1360 -2504 -2066 -833 -642
4495f42o97q92l82J012P84j169l56J62L16l93R18M6j480j58J325Q87r60n80j3
4514b272L67O36P7m10n24L93O25J67M03j026r96J318J964o22j442K8K94N33J043
4533E56M22j094q92N49P86R30k61r93o62J240P96m88m05k78K17O47O30L1j024
4552G07k30Q23R6P32k02p65n69J323N13r54m01L43K02M13N57m48j133l14J105
4571A798R90L6j099q09K79J213j01o68n7m45l27R18R53j290j439Q01Q95J6m71
4590A193n17j24J1N16L57o59m36p80P09J041l73j835J22J292L1m72j85o09r62
4609a680R82J366m22j526q52O77J365k7p61r51J09J8K57O84K43j425j081J596
4627a428J342j345j030N18P8j70L38N98r12m14J14P88K93p01o16P27J531j167
$$ plain form
4495 -642 -1339 -2231 -2613 -1601 -817 -1986 -2342 -2180 -1864 -2257 -1339 -1293 -2773 -2931 -1606 -719 -1679 -2259 -2272
4514 -2272 -1905 -1269 -1192 -1602 -2126 -1733 -1108 -941 -538 -1564 -2560 -1242 722 100 -1342 -1314 -1020 -487 556
4533 556 978 -116 -1008 -459 327 1257 996 3 -659 581 1377 889 484 206 423 1070 1700 1731 707
4552 707 477 1300 1396 2128 1926 1161 592 1915 2428 1474 1073 1416 1618 2031 2588 2140 1007 693 1798
4571 1798 2788 2824 1725 916 1195 2408 2307 1639 1582 1137 810 1728 2681 1391 -48 753 1648 1664 1193
4590 1193 676 552 563 1079 1436 777 341 -439 270 1311 938 -897 -775 517 548 76 -109 -718 -1680
4609 -1680 -698 668 246 -1280 -2132 -1455 -90 -117 -878 -1829 -1720 -1702 -1445 -761 -518 -1943 -3024 -1428
4627 -1428 -86 -1431 -2461 -1943 -1865 -2035 -1697 -1099 -2011 -2425 -2311 -1523 -1230 -1931 -2547 -1820 -289 -1456
4645a456j504J133R56p49jJ364p19j759Q07K302l7j441j154R62J133N9j08L87
4663A75l84j158R78K215l63l284l38K957J380j377l76M89j065k06J687J311j065
4680A576j518K46J690L84j161o57J632p3r81J21J099q80j450J822J614j329j836
4697B99Q84J667l90j182M99K34j97r22J076N28j361j340J534K091q51k811O41
4714C99J519n70o95J310J28k500n86K199J273j873j488P75J176m9j548M69M38
4731C77p17o80K101P25l230j223K270J870k125j388J384J89j049N48P96j35j829
4748b116J1J792R39k459j684K076J170j131p58J389J2k565O69L119p90k578j40
4765c044K265N71j886n98J382L54p54j81J456n99j745K53K939K20l145k31K704
$$ plain form
4645 -1456 -2960 -1827 -871 -1620 -1621 -257 -976 -2735 -1928 374 337 -1104 -2258 -1296 -163 -104 -212 175
4663 175 -209 -1367 -389 1826 1463 -1821 -2159 798 2178 801 425 914 -151 -357 1330 2641 1576
4680 1576 58 304 1994 2378 1217 560 2192 2119 1138 1259 2358 1478 28 1850 3464 2135 299
4697 299 1183 2850 2460 1278 1777 2011 1814 892 1968 2496 1135 -205 1329 3420 2569 -242 399
4714 399 1918 1348 653 1963 2091 -409 -995 1204 2477 604 -884 -109 1067 1018 -530 -61 377
4731 377 -340 -1020 1081 1806 -1424 -2647 -377 1493 -632 -2020 -636 -447 -1496 -948 -152 -287 -2116
4748 -2116 -2105 -313 626 -1833 -3517 -1441 -271 -1402 -2160 -771 -759 -3324 -2655 464 -326 -2904 -3044
4765 -3044 -779 -208 -2094 -2692 -1310 -956 -1710 -1891 -435 -1034 -2779 -2526 413 633 -2512 -2743 -39
4782c9K18k293M44J840q29j773J870J715j197k368O75L087mk144l81J659j31j503
4800a154J220K545k242k266K117K708j543k660J507J753p52q31P11R50j192j037
4816a66J949J838j733k624J463K435r87k071J702J036j541j201K722N44k850q51
4832c35K897J168j964k121J368J870j091j172J085Q48k140q17L137R95l402j859
4848a533L009J578k630r92J760l9j404M32J642m87k875o40L073J406k359k086
4864b145K061Q51k112l61K249m79l082P33L365n87l201J29K325J04k053K30J402
4881e71k12j861N35K241m90k854K33L179j01l370J19L008q86j443O97J582j855
4898b049j630K012K510j216l052O22K628m6j951N80J416r26j716K039K202k382
$$ plain form
4782 -39 179 -2114 -1670 170 -659 -2432 -562 1153 -44 -2412 -1737 1350 1346 -798 -1179 480 349 -1154
4800 -1154 66 2611 369 -1897 220 2928 1385 -1275 232 1985 1233 402 1113 2063 871 -166
4816 -166 1783 3621 1888 -736 727 3162 2175 104 1806 2842 1301 100 2822 3366 516 -335
4832 -335 2562 3730 1766 -355 1013 2883 1792 620 1705 2553 413 -404 2733 3728 326 -1533
4848 -1533 1476 3054 424 -568 1192 1153 -251 181 1823 1336 -1539 -2179 894 2300 -59 -2145
4864 -2145 -84 767 -1345 -1706 543 64 -3018 -2285 1080 493 -2708 -2579 -254 -150 -2203 -1973 -571
4881 -571 -783 -2644 -2109 132 -358 -3212 -2979 200 99 -3271 -3152 -144 -1030 -2473 -1776 -194 -2049
4898 -2049 -3679 -1667 843 -373 -3425 -2803 -175 -221 -2172 -1592 -176 -1102 -2818 -779 1423 -959
4914i59k719K510K911j794j533N24J551o91j213J590J599k160j248J558K289j832
4930C83k203J880K545j441k246J645J560j935p86K822R42l223p66K394J755j721
4946A605k099J760J266j281l27J591M76l034m64L246J355l217j636L058N69j953
4962I15p9J648l55k298N60K514j44k875n98K711J145k738j017K541L95k353K34
4979B06K128j146k717J249K922n77l182k52K150J43j521J22J548j219j842J317
4995f71K254r24l468M30L467n57k642O09J691j348j475J924J475k121j910J740
5011a526J992j102k224O54K022o82j847J203J288j349k113K678K127k440k641
5026c960K188K479j779j463J276R20j712N6J670M97k195j063J987K298j796k085
$$ plain form
4914 -959 -3678 -1168 1743 -51 -1584 -1060 491 -200 -1413 177 1776 -384 -1632 -74 2215 383
4930 383 -1820 60 2605 1164 -1082 563 2123 188 -598 2224 3166 -57 -823 1571 3326 1605
4946 1605 -494 1266 2532 1251 924 2515 2991 -43 -507 2739 4094 877 -759 2299 2868 915
4962 915 836 2484 2129 -169 391 2905 2761 -114 -712 1999 3144 406 -611 1930 2325 -28 206
4979 206 2334 1188 -1529 -280 2642 2065 -1117 -1369 781 924 -597 -475 1073 -146 -1988 -671
4995 -671 1583 659 -2809 -2379 1088 531 -2111 -1502 189 -1159 -2634 -710 765 -1356 -3266 -1526
5011 -1526 466 -636 -2860 -2206 -184 -866 -2713 -1510 -222 -1571 -3684 -1006 1121 -1319 -3960
5026 -3960 -1772 707 -1072 -2535 -1259 -339 -2051 -1995 -325 172 -2023 -3086 -1099 1199 -597 -2682
5042b682J303J889j435q26J985N60k927j5L004M87k137r73K014J081j143q56J171
5059E00O69j080n64K281L90k520o17L204N76k630q43K440J92j614Q21J183q82
5076A506j528P44K478n28k050n13J919J015j542o79J894q97j635J197K110j099
5092B392l068J051K393l10k037P0R94M7j055N08J121j101j605R27K526j083k906
5109a136L68K573m54k061J429L93j277q64J779P37k030j449J157K199j319j449
5125a404K58R66k30j244J315Q82k314q41K315J499k355j665J331J224r70n15Q14
5142i34J02r63l66J505N83k051j273J984J640j262j666J294J151j438j56J407
5158d43J9k322L73K134L15j857l06Q79Q73l92l99P09k06q69N0K154L32k863l94
$$ plain form
5042 -2682 -1379 510 -925 -1751 234 794 -2133 -2148 856 1343 -794 -1767 247 1328 185 -671 500
5059 500 1169 89 -475 1806 2196 -324 -941 2263 2839 209 -634 1806 1998 384 1205 2388 1506
5076 1506 -22 722 3200 2672 622 109 2028 3043 1501 822 2716 1819 184 1381 3491 2392
5092 2392 -676 375 2768 2458 421 491 1485 1532 477 985 2106 1005 -600 327 2853 1770 -1136
5109 -1136 -768 1805 1351 -710 719 1112 -165 -1029 750 1487 -543 -1992 -835 1364 45 -1404
5125 -1404 -1146 -180 -410 -1654 -339 543 -1771 -2612 -297 1202 -1153 -2818 -1487 -263 -1233 -1748 -934
5142 -934 -832 -1795 -2161 -656 -73 -2124 -3397 -1413 227 -1035 -2701 -1407 -256 -1694 -1850 -443
5158 -443 -424 -2746 -2373 -239 76 -1781 -2087 -1208 -335 -727 -1126 -417 -623 -1492 -1442 712 1044 -1819 -2213
5177b213K722N17j633k42J182m10q54R56J213r49j143L27J854L38j435r59J776
5194A047O05j318K83P57o60j190J375K004j639j560M88J774R8j002N9M8j29j19
5212I21P90O52r53j246R35K226r69k057M25J144k40m05J056j64j214o47J244J218
5230B716j193j038J69J086k94p81J10M05q50l79J184k4j161q46J546J066j676
5247D0p95M19K29J90k09%l96p40K86R73K55r75j457P84J520n78p76l2K40q17M25
5268a414J557p55j488l06J326L38m53o98m8L58J38pK5j74n86L50J286K51j736
5287b036k73R71N82l68J42l06OJ69M99K98o40o66M69R45M04m10q27j08R05K39
5307ej81P10r53o89J046J097o91q21M66N09J85k32L64n45l69P93J72K74k23r77
$$ plain form
5177 -2213 509 1026 -607 -849 333 -77 -931 25 1238 289 -854 -527 1327 1665 230 -729 1047
5194 1047 1652 334 617 1374 714 -476 899 2903 1264 -296 192 1966 2064 1062 1121 1169 1040 921
5212 921 1711 2363 1410 164 1099 3325 2356 299 724 1868 1628 1223 2279 2115 901 254 1498 2716
5230 2716 1523 485 654 1740 1446 665 775 1180 330 -49 1135 1111 -50 -896 650 1716 40
5247 40 -755 -336 -107 83 -126 -126 -522 -1262 -976 -3 252 -723 -2180 -1396 124 -454 -1230 -1262 -1022 -1839 -1414
5268 -1414 143 -612 -2100 -2406 -1080 -742 -1195 -1893 -1941 -1583 -1445 -1452 -1427 -1601 -2187 -1837 -551 -300 -2036
5287 -2036 -2309 -1338 -756 -1124 -982 -1288 -1282 -1113 -614 -316 -956 -1622 -1153 -208 196 -214 -1041 -1149 -244 -5
5307 -5 -186 524 -429 -1118 -72 1025 334 -487 -21 488 673 441 805 260 -109 684 856 1130 907 -70
5327g0J56J434K25r12l41P18k51N18L77m73q13L88P01J46k39m39k98J95R28O3
5347B013r65k53r1M24R89L8r73p12L29N80J16L0o04p58O56O67j03j053j9K57j06
5368D62M37Q4p52j63L36L3q8k81l12J19M33N8p18p86N35Q4L04N44r04j016L08
5389a283J154N9m04o63o29K43Q94M37o55p44m66Q52R53m1j440n99P34J042m75
5408a031q9j47q19nJ325J79n89p59K73N80j17j2n9k8M2M28j8j60n42j79P87J084
5430A44n97j319Q57P66k41o5M52l59n24N53R13L8r47k53N50J059K12j015k65M27
5450C86j31L52R38L4j588k17J721M73j221j97K01L40O9N82k67n85J64J64Q14J19
5470B151r95p96Q51J007o90m80P00j43m62j08J069p89j065L54J229J40p91q75
$$ plain form
5327 -70 86 1520 1745 833 492 1210 959 1477 1854 1381 568 956 1657 1803 1564 1125 827 1022 1950 2013
5347 2013 1048 795 704 1128 2117 2155 1182 470 799 1379 1495 1525 921 163 819 1486 1383 330 311 568 462
5368 462 899 983 231 68 404 437 349 68 -244 -125 308 366 -352 -1138 -603 -519 -215 329 -575 -1591 -1283
5389 -1283 -129 -70 -474 -1137 -1766 -1523 -629 -192 -847 -1591 -2057 -1205 -252 -293 -1733 -2332 -1598 -556 -1031
5408 -1031 -1120 -1267 -2086 -2091 -766 -587 -1176 -1935 -1662 -1082 -1199 -1211 -1270 -1298 -1256 -828 -846 -1006 -1548 -1727 -940 144
5430 144 -453 -1772 -915 -149 -390 -455 -3 -362 -886 -333 580 618 -329 -582 -32 1027 1239 224 -41 386
5450 386 255 607 1545 1579 -9 -226 1495 1968 747 550 751 1091 1160 1742 1475 890 1054 1218 2032 2151
5470 2151 1156 360 1211 2218 1528 1048 1748 1605 1143 1035 2104 1315 250 604 1833 1973 1182 307
5488C07n5Q48L0m49N60m41j242P12J481o38j885L37J408j58j291L73K13o69j3
5507e72Q18N1q01j112M02J592J86j739k92P89K15q06N62N83j517j89J235Q12j358
5526a141j013M41J428l92l13k41k24q6m38J372M53j084j542J403J508j212j084
5543b165R44L39o15M4J086l62j256P1J326P47j266r09J046J102q27p43R28M53
5561e7j029m8J510rj938J49K065L99j477m97P13K97j12N23P12p72r26m4K028N71
5581B058j888q35J423J009j081k11J139n93j124R75J611p55k000M93J510J30j107
5598G54l3J098j0q59R7Q91m74j521P32K223j026k179L20J995n12m73O0P89j506
5617C66l84J233Q55q89j628M87J748l96j539j14J579q34o15J169O08j864j243
$$ plain form
5488 307 252 1100 1130 681 1241 800 -442 270 1751 1113 -772 -435 973 815 -476 -103 110 -559 -572
5507 -572 246 297 -504 -1616 -1214 378 564 -1175 -1467 -678 -463 -1269 -707 -124 -1641 -1830 -595 217 -1141
5526 -1141 -2154 -1713 -285 -677 -990 -1231 -1455 -1541 -1979 -607 -154 -1238 -2780 -1377 131 -1081 -2165
5543 -2165 -1221 -882 -1497 -1453 -367 -729 -1985 -1914 -588 159 -1107 -2016 -970 132 -695 -1438 -510 -57
5561 -57 -1086 -1134 376 367 -1571 -1422 643 1042 -435 -932 -219 78 -34 489 1201 429 -497 -541 1487 2058
5581 2058 170 -665 758 1767 686 475 1614 1021 -103 872 2483 1728 -272 221 1731 1861 754
5598 754 721 1819 1809 950 1047 1938 1464 -57 675 2898 1872 -307 13 2008 1496 1023 1083 1872 366
5617 366 -18 1215 2070 1181 -447 40 1788 1392 -147 -261 1318 484 -131 1038 1646 -218 -1461
5634a461J616J366j234j436Q17N65k36j221R58M01r11q79J408J212j806k032J822
5651a051J456j186j241J000L5r55J92J279m5j899k49J509J330j865p68P76J080
5668f02q98o41J453K22k031K8K388J54k096l52J964J92j381o2J205o5r09L47J529
5687D45q42j549K39K141M64k238k75J589K93j037L81J706j099j684J135K124p43
5704A050k003K46J628M86j117p5O94q4q46P56J561r37k431J467K243j004j531
5721A03P18J394p44j126J268O61j341q05J066J599j400j476Q77J487n08j391N43
5738I25Q48j171r91K250P29j998j232J628J306j226j177M74R35o96m48J126M8
5755A330j429r70J922J062j467j644J535N24j237m96J656l32j513O2J797l00j599
$$ plain form
5634 -1461 155 1521 287 -1149 -332 233 -3 -1224 -266 135 -776 -1655 -247 965 -841 -2873 -1051
5651 -1051 405 -781 -2022 -1022 -987 -1942 -1750 -471 -516 -2415 -2664 -1155 175 -1690 -2458 -1682 -602
5668 -602 -1500 -2141 -688 -466 -2497 -2469 -81 73 -2023 -2375 -411 -219 -1600 -1662 -457 -522 -1431 -1084 445
5687 445 -397 -1946 -1707 434 898 -1340 -1615 -26 267 -770 -389 1317 218 -1466 -331 1793 1050
5704 1050 -953 -707 921 1407 290 215 909 825 -21 735 2296 1359 -1072 395 2638 1634 103
5721 103 821 2215 1471 345 1613 2274 933 128 1194 2793 1393 -83 794 2281 1773 382 925
5738 925 1773 602 -389 1861 2590 592 -640 988 2294 1068 -109 365 1300 604 156 1282 1330
5755 1330 -99 -1069 853 1915 448 -1196 339 863 -374 -870 786 454 -1059 -997 800 500 -1099
5772a099l83J675N28j262j126J375L75j092l41J659m89k157N40K077k11k575J95
5789b311J903J66j104L5Q15q92q00N51J559o5k343L28J469O36j679L4J498o53
5807h53j621J264J394r49j683J188J724p77j539K77J596k5q20LJ057n24j349J596
5825d1J578j357j958J355J817k93j817P07R83j052k82J474N56j699n59Q78J901
5842B191r05j442N62J536q17j008J205P23j578n44K063O97j753j043J681M61q60
5859A169m77P24J07o93R9R10J45j303n58J543R53j504j474J449P86j151k45J242
5877A722q53j278O29J614j05k032k10J330L43j070k54P20L38j575J12J887n04
5894H14k400N25J847L1j903j03J570p46p20M21P96m96j293N93J149j07j911J3
$$ plain form
5772 -1099 -1482 193 721 -541 -1667 -292 83 -1009 -1350 309 -180 -2337 -1797 280 69 -2506 -2311
5789 -2311 -408 -242 -1346 -1311 -496 -1388 -2188 -1637 -78 -143 -2486 -2158 -689 -53 -1732 -1698 -200 -853
5807 -853 -2474 -1210 184 -765 -2448 -1260 464 -313 -1852 -1575 21 -4 -824 -821 236 -288 -1637 -41
5825 -41 1537 180 -1778 -423 1394 1101 -716 -9 974 -78 -360 1114 1670 -29 -588 290 2191
5842 2191 1286 -156 406 1942 1125 117 1322 2045 467 -77 1986 2683 930 -113 1568 2029 1169
5859 1169 692 1416 1523 830 929 1839 1984 681 123 1666 2619 1115 -359 1090 1876 725 480 1722
5877 1722 869 -409 220 1834 1729 -303 -513 817 1160 90 -164 556 894 -681 -569 1318 814
5894 814 -1586 -1061 786 817 -1086 -1189 381 -365 -1085 -664 132 -364 -1657 -1064 85 -22 -1933 -1920
5912a920J312M44j463L42R55r63q68J496Q83j713p86L87J825n35r85j26O26L03
5930g86q11P88M48j050p30J137J605j186j571O81J512o78n01N88K75r29q9J407
5948A10L43j222q03Q65J233l86p77L09Q11n16p05J524J69j507k1J563N96j294
5966B92q54J066N62l64l32K91K22q09J11J218L53j453l04J446N95j343l21O63
5984A039K07o93N65Q74m62j322K15J425J62q47m30M89N99n40k48N01l88j165L28
6003C09J731m46j642k12J699j20o77j29L69k85n80J166j46o88n90K19R70l9j508
6022e99Q4J065k17o61P4N70r02o36J239O08j432n40K56Q55k17o10K82k50K3k89
6042a297O40M87q71q37O20J003o00o35J62K82k74P7N13o45j91O7R38J30p36p43
$$ plain form
5912 -1920 -608 -164 -1627 -1285 -330 -1293 -2161 -665 218 -1495 -2281 -1894 -69 -604 -1589 -1715 -1089 -786
5930 -786 -1597 -809 -361 -1411 -2141 -1004 601 -585 -2156 -1475 37 -641 -1142 -554 -279 -1208 -1297 110
5948 110 453 -769 -1572 -707 526 140 -637 -328 483 -33 -738 786 955 -552 -573 990 1586 292
5966 292 -562 504 1066 702 370 661 883 74 185 1403 1756 303 -1 1445 2040 697 376 1039
5984 1039 1246 553 1118 1992 1530 208 423 1848 2010 1163 733 1222 1821 1281 1033 1534 1146 -19 309
6003 309 2040 1594 -48 -260 1439 1319 642 513 882 597 17 1183 1037 349 -241 -22 948 909 -599
6022 -599 -515 550 333 -328 -254 316 -586 -1222 17 625 -807 -1347 -1091 -236 -453 -1063 -781 -1031 -1008 -1297
6042 -1297 -657 -170 -1041 -1878 -1258 -255 -855 -1490 -1328 -1046 -1320 -1243 -730 -1375 -1566 -1499 -561 -431 -1167 -1910
6062a910M25R19o9n92M63o2n86K68J084k95j048l4J114P57p91k77l47L30L50K56
6082d5J82n57l68R2J120L23r15n78J014O70n98K36L82k93m79N59M67l90p96O59
6102F85M27J88l1q27o4Q20o0N1j26j33o79Q38Q14m49q63o1P87K54j03l7m04l47
6124F80K98K79M52m75m72l95R58L67o49n29K04k31L13M48j39p81l01O36K98n17
6144D44l64j3P3K80L29n43k23k26L49L1j62m69j63J71N69j56o29j82j46M47M35
6165a48j8q70j67K49K38M37l63l49p31K62R69m33l64k71mL90P47j37r93j64O52
6186a068L10K01j57p24j16P09L60n85J50k28J52L78O08k32q75MN56K31J41l83
6206e68n90M05O30M2n18k1K35j89P29M20q00m18M88Q07K29p63J31j04l5P49Nl80
$$ plain form
6062 -1910 -1485 -566 -635 -1227 -764 -826 -1412 -1144 -60 -355 -1403 -1437 -323 434 -357 -634 -981 -651 -301 -45
6082 -45 137 -420 -788 -696 424 747 -168 -746 268 938 340 576 958 665 186 745 1212 822 26 685
6102 685 1112 1300 1269 442 378 1198 1138 1189 1063 930 251 1089 1903 1454 591 530 1317 1571 1468 1431 1027 680
6124 680 978 1257 1709 1234 762 367 1325 1692 1043 514 718 487 800 1248 1109 328 27 663 961 444
6144 444 80 67 140 420 749 206 -17 -243 106 137 -25 -494 -657 -486 83 -73 -702 -884 -1030 -583 -148
6165 -148 -166 -1036 -1203 -954 -716 -279 -642 -991 -1722 -1460 -491 -924 -1288 -1559 -1563 -1173 -426 -563 -1556 -1720 -1068
6186 -1068 -758 -557 -714 -1438 -1554 -845 -485 -1070 -920 -1148 -996 -618 -10 -242 -1117 -1113 -557 -326 -185 -568
6206 -568 -1158 -753 -123 -81 -599 -620 -385 -574 155 575 -225 -643 -155 652 881 118 249 145 110 859 864 484
6228D84on64L84J076l38n35j79O24J55K09k46N2l22J70J022k18p37j14K30J88
6248A335j7o3o43L48K62J47j33K9o49O8O85N33r28q12P42r2nm2L70q72k86L99
6270C76N02r0l80p38K98O68m2p41L42r0j91QN25n62j205P90M66j37l46l57Q9N59
6292b56J16p06K43j3o90L70N66P4j349j56Q14P35p57r3j45n9p3M13M91p11l41
6313a527M8Q51J96p39l52N74M25n36J48M61n49p42P97J153p22r91O11M72l92Q9
6333g25N22j52j41j62L76L21m94m66M40J329n61r02J19Q39%m03P89r7r49j56J140
6354F67O84j044l50R7J017P4n92L4K41l77JJ089nj059o54J211Q51r44o20N22M59
6375A302n44L41N96n87o43J56R47K28q70m71N7J325r98k31O07j03r02R4J076l1
$$ plain form
6228 484 478 -86 298 1374 1036 501 322 946 1101 1310 1064 1116 794 964 1986 1768 1031 917 1147 1335
6248 1335 1318 1255 612 960 1222 1369 1236 1265 616 684 1369 1902 974 162 904 812 807 765 1135 263 -23 376
6270 376 878 788 408 -330 -32 636 594 -147 195 105 -86 -78 447 -115 -1320 -530 -64 -201 -547 -904 -815 -256
6292 -256 -140 -846 -603 -616 -1306 -936 -370 -296 -1645 -1801 -987 -252 -1009 -1102 -1247 -1306 -1379 -966 -475 -1186 -1527
6313 -1527 -1479 -628 -432 -1171 -1523 -949 -524 -1060 -912 -451 -1000 -1742 -945 208 -514 -1505 -894 -422 -814 -725
6333 -725 -203 -355 -496 -658 -282 39 -455 -921 -481 848 287 -615 -496 343 343 -60 729 632 -317 -473 667
6354 667 1351 307 -43 54 1071 1145 553 587 828 451 452 1541 1536 477 -177 1034 1885 941 321 843 1302
6375 1302 758 1099 1695 1108 465 621 1568 1796 926 455 512 1837 839 608 1215 1112 210 304 1380 1349
6395A349j422M7J300O7q71n40O56q8l83J04Q13l61j278m4J737j62j921M80O60
6414A43N8o96j75Q93q73l36P08M99p44j241N82J009M08j411j05N37m93j26P96
6433e67L59r67j181J270R65r13n90N94M16j44o95J43J17l21l18J160M90q52q33
6452a867L30J625m76j030M27Q18p06k33R30M38j077n00J098N16o89n58K86N67
6470a01j31J3L81J0p16j41J418O31j815o94J625R32j166m94J178l00n17M89R25
6489A527qj504o6J132Q61j198p41R18O82p68k16J060r22o21N03J517m76j461l63
6508a44J737m7m67k03J97j03l12j50Q69k02j042N9J484K48k088M79R17p1j146
6527A5N11Q25j317o61J199J129j169j083L26N26J42o05j02O15o85n95J175N02
$$ plain form
6395 1349 -73 -26 1274 1341 470 -70 586 498 115 219 1032 671 -607 -651 1086 924 -997 -517 143
6414 143 201 -495 -670 223 -650 -986 -278 221 -523 -1764 -1182 -173 235 -1176 -1281 -744 -1237 -1363 -567
6433 -567 -208 -1175 -2356 -1086 -121 -1034 -1624 -1030 -614 -758 -1453 -1310 -1193 -1514 -1832 -672 -182 -1034 -1867
6452 -1867 -1537 88 -388 -1418 -991 -173 -879 -1112 -182 256 -821 -1321 -223 293 -396 -954 -668 -101
6470 -101 -232 -219 162 172 -544 -685 733 1364 -451 -1145 480 1412 246 -248 930 630 113 602 1527
6489 1527 1519 15 -51 1081 1942 744 3 921 1603 835 619 1679 757 136 639 2156 1680 219 -144
6508 -144 1593 1546 1079 876 1073 970 658 508 1377 1175 133 192 1676 1924 -164 315 1232 1161 15
6527 15 526 1351 34 -627 572 1701 532 -551 -225 301 443 -162 -264 351 -334 -929 246 748
6545G48j169j277J211P81o54n91N85J01p07l63J036j41p49l47R63Q79q28j617
6563b139N85J446p05p06O25L54r14m25J139M68j595q2J157Q33j070o66Q03OJ6
6582h70l19J051K48j638l17J856L51j473n83J449J91p27n8J026o14m89N67Q13
6600D64K19j701L77J366J13j089k17J147n6r22O44J022q42j002O77J195k61j433
6618b99K48Q60L06n07j14R64q10p80R37J405q08j395L05J447o5j253L82N12l37
6637I98l75Q07N31j142q01P72J077o76r58M29O06q6r18P26L70p83j034J499P50
6656A792j312j039R50Q43p88p44N71K64o99L1N56J9p60r03J173J138j077r77O74
6675b88P60q16o80R96K38j611K08J457R8j514M3M35M33o84l13M68N54j063j59
$$ plain form
6545 748 -421 -1698 -487 294 -360 -951 -366 -265 -972 -1335 -299 -440 -1189 -1536 -573 306 -522 -2139
6563 -2139 -1554 -108 -813 -1519 -894 -540 -1454 -1879 -740 -272 -1867 -1949 -792 41 -1029 -1695 -892 -886 -870
6582 -870 -1189 -138 110 -1528 -1845 11 362 -1111 -1694 -245 -54 -781 -839 187 -427 -916 -349 464
6600 464 683 -1018 -641 725 838 -251 -468 679 623 -299 345 1367 525 -477 200 1395 1134 -299
6618 -299 -51 809 1115 608 494 1458 648 -132 805 2210 1402 7 312 1759 1694 441 823 1335 998
6637 998 623 1430 1961 819 18 790 1867 1191 233 662 1268 1182 264 990 1360 577 -457 1042 1792
6656 1792 480 -559 391 1234 446 -298 273 537 -162 -131 425 444 -316 -1219 -46 1092 15 -962 -288
6675 -288 472 -344 -1024 -28 210 -1401 -1193 264 362 -1152 -1109 -674 -241 -925 -1238 -770 -216 -1279 -1438
6694a438R91o0j296l7J585O1j189m5M81K76p32L00P05o35k91K23R96kj289l98
6714a794J011Q76o43q29J009n47m37P07J267q11j322N13J348j46p70K3P21o63
6732d87L94j18O15n16l21N08J180q96j029O57J216p16m45N62N84r06l24J040N48
6751A546p77q51Q22P58j35p19o7P06j50n86O22N58j131p36J555N00j033p42O96
6770H36N44r4o60J68K93r36K55R11L21j136m90P19O82k49j192M50M68p99L26N78
6790I95l92r86J79R31q0p97m65O36L19n68J18K22j59o36J5J020k68r75l32J248
6810B5q4n26j11K72l05l98O01L90p25j017Q57J66L36n29m42M44M21m77j56O20
6830f38k53n88N84J007j070r54R03P97j08p12N19k49k36k04P65N34j138l71R41
$$ plain form
6694 -1438 -447 -507 -1803 -1840 -255 -194 -1383 -1428 -947 -671 -1403 -1103 -398 -1033 -1324 -1101 -105 -107 -1396 -1794
6714 -1794 -783 93 -550 -1379 -370 -917 -1354 -647 620 -191 -1513 -1000 348 202 -568 -545 176 -487
6732 -487 -93 -211 404 -112 -433 75 1255 359 -670 -13 1203 487 42 604 1188 282 -42 998 1546
6751 1546 769 -82 740 1498 1363 644 577 1283 1133 547 1169 1727 596 -140 1415 1915 882 140 836
6770 836 1380 1286 626 794 1087 151 406 1317 1638 502 12 731 1413 1164 -28 422 890 91 417 995
6790 995 603 -383 -204 727 647 -150 -615 21 340 -228 -110 112 -47 -683 -668 352 84 -891 -1223 25
6810 25 -59 -585 -696 -424 -729 -1127 -526 -136 -861 -1878 -1021 -855 -519 -1048 -1490 -1046 -625 -1102 -1258 -638
6830 -638 -891 -1479 -895 112 -958 -1912 -1009 -212 -320 -1032 -513 -762 -998 -1202 -437 97 -1041 -1412 -471
6849d71Q90k69q96j96O66m9J04K52k15j63l54Q17M37o56l19O15J16K09k25j9K99
6870E73p43L62M35N52p79m71Q08N75o39n22N01J06l9J73M24p18j04N7O61J21m02
6891I31n31M74L79Nl97j20J28l20K53P70n34p81J55O65K66n52k34K11j80M93k29
6912H52j04o6p13L26N47k06m23n32P69J60l52J79j83k72j37L12J82l24n81K73
6932b93L49J60l36p17K13L21j32M04k38m17l83L28Q35m15q91K15K49j0m4J24k59
6953i37m55L99M16p5j23l50j62M43J34l59n4J46J11J91m1J02q63M57N4N14j21
6974e73k81l69N87o3N23m45m11N28j89N82p2k6l81N01K72n7k79M8j41M9P04k35
6996B72k92L2j13K97O34k76k85k6qQ67r1j68l60O4N91k89k2K9l07J89L97k1j71
$$ plain form
6849 -471 419 150 -746 -942 -276 -325 -221 31 -184 -347 -701 116 553 -103 -422 193 309 518 293 274 573
6870 573 -170 192 627 1179 400 -71 737 1312 673 151 652 758 719 892 1316 598 494 551 1212 1333 931
6891 931 400 874 1253 1258 861 741 869 549 802 1572 1038 257 412 1077 1343 791 557 768 588 1081 852
6912 852 748 682 -31 295 842 636 213 -319 450 610 258 437 254 -18 -155 157 339 15 -566 -293
6932 -293 56 216 -120 -837 -624 -303 -435 -31 -269 -686 -1069 -741 94 -321 -1212 -997 -748 -758 -802 -678 -937
6953 -937 -1392 -993 -577 -652 -775 -1125 -1287 -844 -710 -1069 -1123 -977 -866 -675 -716 -614 -1477 -1020 -966 -452 -573
6974 -573 -854 -1223 -636 -699 -176 -621 -1032 -504 -693 -111 -183 -209 -590 -89 183 126 -153 -105 -246 -197 507 272
6996 272 -20 12 -101 196 830 554 269 243 235 1102 1011 843 483 547 1138 849 827 856 549 738 1135 1114 943
7019I43o22K46N83J71m0l27j50J16n3N41n45l51K35j9M23K09p72l70P5O13JR8
7041A005j18p98K16L23O84j077k12J72M08J0m10R6l42J71l1J02k01Qo16M83N54
7062D27m26q28J04J51L14k56K58m31k22J00L44J83l81n38J76M84P4o57k1L55k67
7083a057J07N02j86j028M2J208j71m31k08K1L55O8J00l1j21l62M31oP31j136k11
7104a383Q95L57m02k17J94k09m19P08O46n33n06L06O90j56p3l92L57M72l75M44
7124D04j59p3m29L81N69K4r68N6J117k42l33K26L31n75J83P62k66k49o89M20P21
7145A211J23j020K32N46l25j89K47M87r98K0P47O10p86o58K43M95M38m90k1j97
7165G15l40R6P54j19l84j149O43J229p79q14N73K79n43K8O90l14j043K08K72N45
$$ plain form
7019 943 321 567 1150 1321 1281 954 804 920 867 1408 863 512 747 728 1151 1360 588 218 293 906 907 1005
7041 1005 887 89 305 628 1312 235 23 195 603 613 203 299 -43 128 97 199 -2 6 -610 -127 427
7062 427 1 -827 -723 -572 -258 -514 -256 -687 -909 -809 -465 -282 -663 -1201 -1025 -541 -467 -1124 -1145 -790 -1057
7083 -1057 -950 -448 -634 -1662 -1620 -412 -583 -1014 -1222 -1201 -846 -778 -678 -709 -830 -1192 -761 -767 -36 -1172 -1383
7104 -1383 -488 -131 -533 -750 -556 -765 -1184 -476 170 -363 -869 -563 127 -29 -102 -494 -137 335 -40 404
7124 404 245 172 -257 124 693 717 -251 -195 922 680 347 573 904 329 512 1274 1008 759 70 490 1211
7145 1211 1334 314 546 1092 767 578 825 1312 314 334 1081 1691 905 247 490 985 1423 933 912 715
7165 715 375 471 1225 1106 722 -427 216 1445 666 -148 425 704 161 189 879 565 -478 -270 2 547
7185E47m65o88O00J50Lo00O29j3j016R6J074j02j233k3O72N61j079j15J59M29
7205d14n65L66J89l29o16J0J252N6j084n11R04L83o10p1M97l33n10N31P93n24
7225e86q81K42P90J49r94J25O13r7j45J65O66o56o25K38R16P9j189P20Q00q30
7245e00n1P43r4n88m78J431L07q18l68J66J084j23m86K19q5j53m93J095M59j023
7265B44m14J194K79r23k20K19O29J62n94K23J61l26k59P07M58o56j029J110P83
7284A748r87k08M34j63n14L03J131o62q83r4J209l43n57n98Q10K09m73j25M76
7303G13r5j031N09O13N44j685rJ209k5r70J14P27n87l11J92N05k10q60J38P87
7323B68J41j245k16R73l15p04M34Q02j044m94Q05J090p94j052Q8Q40j01l34k46
$$ plain form
7185 547 82 -606 -6 144 147 -453 176 163 -853 -757 317 215 -1018 -1041 -369 192 -887 -1002 -843 -414
7205 -414 -979 -613 -424 -753 -1369 -1359 -107 -51 -1135 -1646 -742 -359 -969 -1040 -543 -876 -1386 -855 -62 -586
7225 -586 -1467 -1225 -435 -286 -1280 -1155 -542 -639 -784 -619 47 -609 -1234 -996 -80 -1 -1190 -470 330 -500
7245 -500 -551 192 98 -490 -968 463 770 -48 -416 -250 834 711 225 444 359 206 -287 808 1267 244
7265 244 -170 1024 1303 380 160 379 1008 1170 576 799 960 634 375 1082 1540 884 -145 965 1748
7284 1748 761 553 987 824 310 613 1744 1082 199 105 1314 971 414 -184 626 835 362 237 713
7303 713 618 -413 96 709 1253 -432 -441 768 743 -227 -113 614 27 -284 -92 413 203 -657 -519 268
7323 268 409 -836 -1052 -79 -394 -1098 -664 138 -906 -1400 -595 495 -299 -1351 -1263 -423 -524 -858 -1104
7342a104M08j28n28N02R52q97j089M78J264m37j000O41M98l17m40P10L28q63j15
7361a137R44K76q06o10O00P81k23p32O27M77r22l03J356K71j053l56R99M51o49
7380ik54M56j34J38k30P77q9q93k13J229K21p65l63Q23L66q81L59M70k11n88K03
7401D12J039j33r30k88P79N74p41n73P58K82n27K97N02k74j330K57J486Mj439
7420A55J77N20L10o94Q4M10m13o50K98P23m0j227J07R25J77p48m11R52l33p87
7440d65N92J015j020r11Q59Q52p16o99j0N09j08k86J01O18j022k62N00J060p92
7459a85j450O16J175m93o56N64o5n73o6Q87J28q73l06M38O10l69o66M21M79n47
7479i31L7L01K03p45l83J042M52j019k44N84N99o26o23J001pm07K89O32L81j131
$$ plain form
7342 -1104 -696 -824 -1352 -850 102 -795 -1884 -1406 -142 -579 -1579 -938 -440 -757 -1197 -487 -159 -1022 -1137
7361 -1137 -193 83 -723 -1333 -733 48 -175 -907 -280 197 -725 -1028 328 599 -454 -810 189 640 -9
7380 -9 -263 193 59 197 -33 744 655 -238 -451 778 999 234 -129 694 1060 179 538 1008 797 209 412
7401 412 1451 1318 388 100 879 1453 712 139 897 1179 652 949 1451 1177 -153 104 1590 1594 155
7420 155 332 852 1162 468 552 962 549 -101 197 920 880 -347 -240 685 862 114 -297 655 322 -465
7440 -465 127 1142 122 -789 70 922 206 -493 -503 6 -102 -388 -287 331 -691 -953 -453 607 -185
7459 -185 -1635 -1019 156 -337 -993 -429 -494 -1067 -1133 -246 -118 -991 -1297 -859 -249 -618 -1284 -863 -384 -931
7479 -931 -894 -593 -390 -1135 -1518 -476 -24 -1043 -1287 -703 -104 -730 -1353 -352 -359 -766 -477 155 536 -595
7499e95k53Q61O22r96o92J222j28k72L9O01j34r93O40O57M11j072m16N36P65n38
7519B65k92P33l4q17L53J054l67r34p9J197j94m41j07N72j55j39K59L25n33j89
7539D77J56R13m07j246L10J036J02j136M52K13n03k24Q23M09q93m72M87M89l56
7558F30m03P5L31l99k28N60L9m65l05M73K89l91r57O16N57l14o03N30K50q10j3
7579e38P26J28j036J79L40M63l64p79K05L87n42J25P88m13q50k29J317K76j249
7598a066l1N15j30j50P1M05l37j64k22O45M40j013m86J019L03n30l95P92Om99
7618h27L79M27m51o96L50K45K42m40m00O37N52q3k81L70m10q32J184O55m01j001
7638g81L81P89j78j84Q3P8l50K70L42J84k36j33J42O47Qr33M06J40M3l61J45N45
$$ plain form
7499 -595 -848 13 635 -361 -1053 169 41 -231 -192 409 275 -718 -78 579 990 -82 -498 38 803 265
7519 265 -27 706 672 -145 208 1262 895 -39 -118 1079 885 444 337 909 754 615 874 1199 666 477
7539 477 633 1546 1139 -107 203 1239 1341 205 657 870 367 143 966 1375 482 10 497 986 630
7558 630 227 302 633 234 6 566 605 140 -165 308 597 206 -751 -135 422 108 -495 35 285 -525 -538
7579 -538 188 316 -720 -541 -201 262 -102 -881 -676 -289 -831 -706 82 -331 -1181 -1410 -93 183 -1066
7598 -1066 -1097 -582 -712 -862 -791 -386 -723 -887 -1109 -464 -24 -1037 -1523 -504 -201 -731 -1126 -334 -328 -827
7618 -827 -448 -21 -472 -1168 -818 -573 -331 -771 -1171 -534 18 -65 -346 24 -386 -1218 -34 621 220 -781
7638 -781 -400 389 211 27 110 188 -162 108 450 634 398 265 407 1054 1062 129 535 675 718 357 502 1047
7660A047m41l02N01O02o89o76O62N84m39k6k51J28m5K62n1K16m98o46O06P90p21
7681F13l95O22k12j40J34N01k32o50l28P21J90m95l61k88Q66nm94Q5l82J58M0
7702e2O46l39p50J99M77m3m92J73r3k73M87p2k49j77k90O5L70L63q61j23N47o8
7724e55kP0j09n40M5L39L99o28m55N46K82J12O2l53j08K48n3J07R1l04p2J03M87
7747b88q4j51j63L75l41J89M0n6j33K23K24K14l79k58K54L61J88k31j01j36M11
7768A58J33J54j85j93m51Q06O8l95M30k91J37L24j79jP9R4j87k46N75q4m48K96
7790E94L33j66j45k99K96J09L33J86r76L44j34L42m4M57p20o9L36L78m21j53P2
7811F53l13m1O10j63n60l45N89r7K3L01o02l5K52L60m24J89o05K26J86L5j92m18
$$ plain form
7660 1047 606 304 805 1407 718 42 704 1288 849 823 572 700 655 917 866 1082 584 -62 544 1334 613
7681 613 218 840 628 488 622 1123 891 241 -87 634 824 329 -32 -320 546 541 47 132 -250 -92 -52
7702 -52 594 255 -495 -296 181 138 -354 -181 -274 -547 -60 -132 -381 -558 -848 -783 -413 -50 -911 -1034 -487 -555
7724 -555 -557 -487 -596 -1136 -1091 -752 -353 -981 -1436 -890 -608 -496 -434 -787 -895 -647 -700 -593 -502 -806 -878 -775 -288
7747 -288 -372 -523 -686 -311 -652 -463 -423 -479 -612 -389 -165 49 -330 -588 -334 27 215 -16 -117 -253 158
7768 158 291 445 260 67 -384 422 490 95 525 234 371 695 516 515 594 688 501 255 830 746 298 594
7790 594 927 761 616 317 613 722 1055 1241 265 609 475 817 773 1230 510 441 777 1155 734 581 653
7811 653 340 299 909 746 186 -159 430 333 356 657 55 20 272 632 208 397 -208 18 204 239 47 -371
7833c71J82n6J82qp1n64L7P98k48l24J98l50k05O21k7o07j22L14J22J79o8k05
7855e93l50J64L72M8k71m21nJ27M70m7n35j36N87K89m90L2K1l56N39M24o9m87
7877f87k57L63L87k54J03j4l16J22L38J08K28n32j50L68P20q95m8R9L29J85K99
7898D96m69l10J38K7M11K27l79k64M91L94k57l76M89k45j09L50M57n90k77L55
7918E59K79N6j20n5p6R1K65N2l12l06p8L78J17J59p12k52P75M20p97J79l8j26
7940D58k03N36K17m52m50J52K69J79n67j76O63n7m23J84o0j32l78L28J006q00
7960B94p51O39K13j36l99M3l8j62o6J3L28k61n97J23R92l66q58L60L87k70l11
7981h23L88J95n91l34R82k58l16l56L2M97ll28J81j74M3P7K06K16o47n0N05O94
$$ plain form
7833 -371 -189 -245 -63 -71 -142 -706 -669 129 -119 -443 -245 -595 -800 -179 -206 -813 -935 -621 -499 -320 -388 -593
7855 -593 -943 -779 -407 -359 -630 -1051 -1056 -929 -459 -506 -1041 -1177 -590 -301 -791 -759 -738 -1094 -555 -131 -200 -687
7877 -687 -944 -581 -194 -448 -345 -359 -675 -553 -215 -107 121 -411 -561 -193 527 -368 -416 -317 12 197 496
7898 496 27 -283 -145 -118 293 520 141 -123 368 762 505 129 618 373 264 614 1071 481 204 559
7918 559 838 894 774 719 643 734 999 1051 739 433 355 733 850 1009 297 45 820 1240 443 622 584 458
7940 458 255 791 1008 556 106 258 527 706 139 -37 626 569 146 330 270 138 -240 88 1094 294
7960 294 -457 182 395 259 -140 -97 -135 -297 -363 -350 -22 -283 -880 -757 235 -131 -989 -629 -242 -512 -823
7981 -823 -435 -240 -831 -1165 -183 -441 -757 -1113 -1081 -584 -587 -915 -734 -908 -865 -788 -582 -366 -1013 -1063 -558 136
8003A36p15j50J97J96k24J38K22k23n57L15M64K55m33o21P72M45j63l12L93n4
8023H1p71O75M82k04n75M1O30M33p58J13K53Q6l34J78M45l35k59M5Q76j4p29j00
8045B59N32k08R9j2M88n51j73K84L67k4r57L23O59n4n86L0O14l25n24N52O08p12
8067F89r42P72P62p80o66N53K2j60l1M50k00m40j76O87R1m63o10K17R20n28l47
8088a80R1K31m30N8O25%q40j70Q28K28n90n63J01N48k66q1o0M13n59l36Q35K65
8110A48r71n35Q53L29m37l65J38K34k38K34M92l17q78L52M77N10p73k02K41K88
8130d20l84J43K52p4m97M7J017k01q32K37K15K62K5l17J88M6k96K97O07l50l22
8151c57k04J035k57q11M44M50j35m29M17L73q59j58J091M26o58m70K91O08k00
$$ plain form
8003 136 -579 -729 -532 -336 -560 -422 -200 -423 -980 -665 -201 54 -379 -1000 -228 217 54 -258 135 81
8023 81 -690 -15 467 263 -312 -271 359 792 34 147 400 486 152 330 775 440 181 226 1102 1088 359 259
8045 259 791 583 682 670 1158 607 434 718 1085 1061 104 427 1086 1032 446 476 1090 765 241 793 1401 689
8067 689 -253 519 1281 501 -165 388 410 250 219 669 469 29 -147 540 631 168 -442 -225 695 167 -180
8088 -180 -89 142 -288 -230 395 395 -445 -615 213 441 -149 -712 -611 -63 -329 -410 -470 -57 -616 -952 -117 148
8110 148 -823 -1358 -505 -176 -613 -978 -840 -606 -844 -610 -118 -435 -1313 -961 -484 26 -747 -949 -708 -420
8130 -420 -804 -661 -409 -483 -980 -933 84 -117 -949 -712 -497 -235 -210 -527 -339 -293 -589 -292 315 -35 -357
8151 -357 -561 474 217 -594 -150 300 165 -264 153 526 -333 -491 600 1026 368 -102 189 797 597
8170E97m13N3O45o35j93K49R30q71k33P42M93k33o40J23K20m56L24O6K56m13n25
$$ plain form
8170 597 184 237 882 247 54 303 1233 362 129 871 1364 1131 491 614 834 378 702 768 1024 611 86
8191H6
$$ Imaginary data points
##PAGE= N=2
##DATA TABLE= (X++(I..I)), XYDATA
0@%%%Qj6QqJ6j6J9k7M0m8N6p2Q8j04J21j45J74k03K34k73L17l60M11m71N34o05
29c22O84p68Q61r65J081j205J340j493J657j834K034k252K492k762L060l388L759
46A979m182M661n213N858o622P545q682J0125j2030J4665j8554K4885l6902O7423
60D4956k78994o15864O75583O64005l16611o15862J48558M26388j19660l94618
70c82119J10638L73510l6757l34841J3308K77542j7010k87186O207L22176J24607
81A70075k41970k06651Q3969K09295P6017r4170j30047Q414J58638J01564j31385
92C749k03930M3154K88067J37523k23745k65057O5669K48136N7581j22274l8924
103a0051N0048l6818q0268N2472J32098K795j25801m1584J01213M1966j17101
$$ plain form
0 0 0 0 0 8 -8 0 -8 8 -8 11 -16 24 -24 32 -40 48 -56 65 -80 94 -109 125 -148 169 -191 220 -251 283 -322
29 -322 362 -406 455 -510 571 -634 706 -787 870 -964 1070 -1182 1310 -1452 1608 -1780 1979
46 1979 -2203 2458 -2755 3103 -3519 4026 -4656 5469 -6561 8104 -10450 14435 -22467 44956
60 44956 -234038 -849902 -174319 489686 173075 -442787 -294229 132159 12499 -382119
70 -382119 -271481 102029 65272 -269569 -256261 21281 4271 -282915 -276708 45468 170075
81 170075 -71895 -278546 -194577 14718 90735 -3435 -133482 -125068 33570 135134 3749
92 3749 -200181 -157027 131040 268563 44818 -220239 -154570 93566 151147 28873 -10051
103 -10051 39997 3179 -77089 -24617 107481 110276 -15525 -57109 44104 86070 -31031
114c1031o2995J54572J56476j09014k35873k0975K18088J51333r6751j82831j8874
125g7875J39217P5134q2737q5854L1853P4126K2453k6015o5247q5951R438J53942
137H2484J12009j19965k15148j5851J84551R4768j05287r1675M9009L2057o7653
148f0701q097Q2466j6433r8336N6992J54718p0510k47456o803K91021J47276k08695
160A5442k15717Q7540J95627j536j19464k471Q2053J1448l1177L912k1231n0253
172d5827N1241J36088J3748j45074r5306N8725R4479L4155l770l3908p9509m4846
184e9804P5280R9305m4259j21212K6354J39631k2280j91283m1611J94264J17839
195A72224j33981j55764L7343J14065Q673o0699j0682K6324q665j9198K6209J8735
$$ plain form
114 -31031 -94026 60546 217022 108008 -127865 -148840 69248 220581 123830 -59001 -77875
125 -77875 61342 136476 53739 -32115 -262 73864 96317 70302 5055 -80896 -71458 82484
137 82484 194493 74528 -140620 -156471 28080 122848 17561 -74114 -25105 6952 -60701
148 -60701 -68798 13668 -2765 -101101 -44109 110609 40099 -207357 -214160 76861 224137 15442
160 15442 -200275 -112735 82892 81356 -38108 -40579 41474 52922 21745 25657 4426 -45827
172 -45827 5414 141502 155250 10176 -85130 -26405 68074 102229 98459 64551 -14958 -59804
184 -59804 15476 114781 70522 -50690 -24336 115295 93015 -98268 -139879 54385 172224
195 172224 38243 -117521 -80178 33887 42560 -18139 -28821 -2497 -11162 -30360 -4151 14584
207A4584n3791m6753O3983R3886k4702j16157n4916O4495J03484K8466q3641r5818
219a06880K2955J02719J9671q4952l9225O7173N5325m7527p4239M890O0062K8910
231H882p823j1051l6398n4986K7598J17385L5167j16806q8716P0467R8896j0753
243C1862o0428j0373J9009J1961K0586J4521l4815m5292L4163Q9016K901j00993
255b7882m1208Q7369O3408n4142m7522M1464K6650m1220j2480M3978M844m1765
267A494J2063N5385j6681q3533r329R5385N2191p3112p4153L4502N5125j8293
279C1044k6238K7677J0237l9356o832L9447l488m7090R830O2321L952p2465l6570
292d7531N3602N4001k5803m7792O705K5291q527p643J6608r821l4121J7942N4673
$$ plain form
207 14584 -39207 -85960 -21977 71909 47207 -68950 -123866 -59371 44113 72579 -11062 -106880
219 -106880 -83925 18794 38465 -46487 -85712 -18539 36786 -10741 -84980 -80090 -20028 8882
231 8882 1059 -9992 -46390 -101376 -73778 43607 78774 -38032 -126748 -56281 42615 31862
243 31862 -28566 -38939 -19930 -7969 12617 27138 -7677 -52969 -18806 70210 73111 -27882
255 -27882 -69090 18279 81687 27545 -19977 21487 48137 6917 -5563 38415 43259 1494
267 1494 13557 68942 52261 -31272 -40601 54784 106975 33863 -40290 -5788 49337 31044
279 31044 4806 32483 42720 3364 -3468 35979 32491 -14599 -4769 57552 61504 -10961 -47531
292 -47531 6071 60072 34269 -13523 -6818 18473 9946 2303 18911 9090 -25031 -7089 47584
305D7584j1895p2213j8664N8653M3236k3365m3780j3829J5556K0993J3375n332
317A0319k9143k2502K6414M2786j6400n6707j783N1996J6395l2144j9076M774
329b5071K467R603K0393m310l3569j4600K8996K9818j3168l5697m217L0520J3043
342D208j6962j0069L686k166M349K0649k712l1719l552L4737J1194k7169j2493
355b8019J8303J0796j1354o355J1935Q045j3009j0310J5669J4865j4644j2821
367a6899J7295R676k0934n972K5331P438k2947r328J6913J0906m694o462k686
380b363KM951Q491L690j1059j6336P503K8135L075l1226j0884K4777J3555j2396
394I915n456L360n945m4J5313O238j6821j4294Q827J9860M879j6657j5105Q256
$$ plain form
305 47584 35689 -36524 -55188 3465 46701 23336 -20444 -34273 -18717 2276 15651 10319
317 10319 -18824 -41326 -14912 27874 11474 -45233 -47016 4980 21375 -10769 -29845 -25071
329 -25071 -22604 -13001 7392 3082 -30487 -45087 -16091 13727 559 -35138 -39355 -8835 4208
342 4208 -12754 -22823 -19137 -21303 -16954 3695 983 -30736 -34288 449 11643 -15526 -28019
355 -28019 -9716 1080 -10274 -16629 -4694 3351 -9658 -19968 -4299 10566 -4078 -16899
367 -16899 396 10072 -10862 -16834 8497 15935 -7012 -16340 573 11479 6785 323 -2363
380 -2363 -2361 2590 11081 14771 3712 -12624 -5121 23014 26089 -5137 -16021 8756 22311 9915
394 9915 4459 7819 1874 1830 17143 23381 6560 -7734 1093 20953 25832 9175 -5930 2326
408B326J6478J741m418m490r544P09K1967R428k3212j6476J7123J6283n809q277
422A3829J076m94l092N041Q702K41j2981j0646J0835J7788p544k0574J206J3543
436A6930l479p612M986j485j2479l60J2016R37j2822p248K706O595Q97p810n440
451a3668R96j375j580Q486L572j7086j1354J6315J5447r272j3832M80N245M554
465a3072L008l038o231r45J840N530O475m748j5514Q80J9135N641j3855j0043
479b4937J932N797P387J914q464p781J353M438N051N402n680j1167M632J3197
493f926j730p873K913O681q46K364L680k791m470N087J1610P430m084j3385j41
508b481J7527R603q070l531P257m452o060J1568R914j0360r637Q797Q910o078
$$ plain form
408 2326 18804 20545 16127 11637 2093 2802 24769 34197 10985 -5491 11632 27915 22106 13829
422 13829 14905 14411 11319 16360 25062 25303 12322 1676 12511 30299 22755 2181 3387 16930
436 16930 13451 5839 10825 9340 -3139 -3499 8517 9454 -3368 -10616 -7910 -1315 -418 -8228 -13668
451 -13668 -12672 -14047 -15627 -7141 -3569 -20655 -32009 -15694 -247 -9519 -23351 -22871 -17626 -13072
465 -13072 -10064 -13102 -19333 -20278 -18438 -12908 -6433 -11181 -26695 -25815 -6680 -1039 -14894 -24937
479 -24937 -23005 -17208 -9821 -7907 -16371 -24152 -22799 -18361 -13310 -7908 -13588 -24755 -20123 -6926
493 -6926 -8656 -16529 -13616 -6935 -7781 -5417 -1737 -4528 -8998 -3911 7699 15129 11045 -2340 -2481
508 -2481 15046 24649 16579 13048 20305 15853 9793 21361 31275 20915 11278 20075 28985 22907
522B2907j0698j814P592O326k637n865m521q447m601J5262J6966j4643k5577K973
536f777J6109n19m917N862j509j3365K58J3762K516j2668n222J3420J3261r985
550A0226j8354K989J6800N74m185R840p82k4505o383K9395J5668k0427j5950R095
564D001N948r164j653J1295L257j2726r549J0760P348j6550r712K2611J4186k3755
578c703j9875J4912J2723r163L91J4050q328k2774M274K5658N967k0697j0342
591a6907J7187J1926j5941j2682J4307J1300j2661k103J7629p966l4278K549M0756
604A3116J3528l0195k3933L584P627L420R815P913j4175k6787m341K3909J3160
617c359j4762q009J0795l309j7758M989J9345m255j1302J3354J2174j9099j7063
$$ plain form
522 22907 12209 10395 17987 24313 21676 15811 11290 2843 -1758 13504 30470 15827 -9750 -6777
536 -6777 9332 8813 3896 9758 8249 -5116 -4858 8904 11420 -1248 -6470 6950 20211 10226
550 10226 -8128 -5139 11661 12235 8050 17890 17108 -7397 -13780 15615 31283 10856 -5094 4001
564 4001 9949 785 -868 10427 13684 958 -8591 2169 9517 -7033 -16745 5866 20052 -3703
578 -3703 -23578 -8666 4057 -5106 -4715 9335 1007 -21767 -17493 8165 14132 -6565 -16907
591 -16907 280 12206 -3735 -16417 -2110 9190 -3471 -5574 12055 4089 -30189 -27640 13116
604 13116 26644 -3551 -27484 -23900 -16273 -12853 -3038 4875 -9300 -36087 -40428 -16519 -3359
617 -3359 -18121 -26130 -15335 -18644 -36402 -31413 -12068 -16323 -27625 -14271 -2097 -21196 -38259
630c8259J6576K3793j237j1241L428P710r169r992J5915K4339p087j8263J0872
643G385J4424k0340j6726K8780L0322j4159k4611J346L485r052R035L1414P369
656D8672l7880l3182J8243L7848K507k3108k497P326j2132o170K1710Q584k5375
669D546r306K6962J0341k5515j5084J5134J3230l372j40M049j2317k0323R350
682b445L3899M223l6262j3708K8905Q252k9198l504L3102K367l5152p222K5246
695H503J978k1416M699K3982p754l4635n734L2791J6169k2153j5511J2346L7j5685
709b2383R922K4589j1382k8337J1606K4326j5274k3814J8940K6435j5178k3312
721b3862J3173J8432j9429k3005K6587M0178j7547m9446l21L6886K357j8617J6692
$$ plain form
630 -38259 -21683 2110 873 -10368 -6940 770 -8399 -18391 -2476 21863 14776 -3487 7385
643 7385 21809 1469 -15257 13523 43845 29686 5075 6421 9906 854 9889 41303 48672
656 48672 10792 -22390 -4147 33701 36208 13100 10603 17929 5797 -373 21337 29921 4546
669 4546 -4760 22202 32543 7028 -8056 7078 20308 16936 16796 20845 8528 -11795 -2445
682 -2445 31454 35677 -585 -14293 14612 22864 -6334 -9838 23264 25631 -9521 -16743 8503
695 8503 10481 -10935 -6236 17746 9992 -24643 -30377 2414 18583 -3570 -19081 -6735 -6698 -22383
709 -22383 -12461 12128 746 -27591 -15985 8341 -6933 -30747 -11807 14628 -550 -23862
721 -23862 -10689 7743 -11686 -34691 -8104 32074 14527 -34919 -35240 1646 4003 -14614 2078
734B078J8609l3729l6445K5332M4150n842l0594j315J2697o758j0190J3829J3818
747E640j3778j3365J7727J3280k7437k0326L0075K9067k1143k1250J9643P995
759F128k8148m968L7990J5922l0811j7476K3371J0022k7622p509M1636K4843l7946
772E432l7621K1588L1141j1365r276K4753J068m2496r978M6485K2041l3066k2256
785a3550K1439J5689j7549q223K1234N677k7548p569L4697J3856l5682j9588K8366
798A1249J5929k0944k752K3761r176l4140O768M0695K905l4863r818K1219N485
811A6318j6228M264K0752j1924l3857Q001M1181j124l9779j640L1606n402l1491
824a9323J0656L3667q789l2706J334K0622m090j4083J4245J8763j9788l1774J0956
$$ plain form
734 2078 20687 -13042 -49487 -24155 19995 14153 -16441 -17756 -5059 -11817 -22007 -8178 5640
747 5640 -8138 -21503 -3776 9504 -17933 -38259 -8184 20883 -260 -21510 -1867 6128
759 6128 -22020 -26988 11002 26924 -3887 -21363 2008 12030 -15592 -23101 18535 43378 5432
772 5432 -32189 -10601 20540 9175 -101 24652 25720 -16776 -26754 19731 41772 8706 -13550
785 -13550 7889 23578 6029 -2194 19040 24717 -2831 -10400 24297 38153 2471 -17117 11249
798 11249 27178 6234 3482 27243 18067 -16073 -9305 31390 34295 -568 -10386 10833 16318
811 16318 90 4354 25106 13182 -20675 -12674 28507 27383 -12396 -14036 17570 12168 -19323
824 -19323 -8667 25000 16211 -16495 -15161 5461 1371 -12712 1533 20296 508 -31266 -20310
837b0310L6122j427k8557l01J7124q984j1651K0175J0186l1941j5263L7006K5608
850B7787l0996l3605J4644K5625m372r467J2700L773l0726j7341L4506L2830k3896
863A462l2476J5298K0191j9253j3449K6420J5616k4545j5368J9825R287j9400
875a6392o995K3162J1476k1493j3802J8868J1746j9417p400K5820P458k8438m462
888a9869L1349J496l4192r03L7864P525l0908q421K1857K039j8652P776L0097
901B7058n667l9298l217M1673J2338l4637j1845K9171O264k4156L986K4411j2853
914A3228k8280J7205L6115j0028l7760k58L0313N377k1062n79J7799p487k1879
927g296J2367K7159j4764l1841J4869L3169j2488l1595Q756K2949j0915j7174
$$ plain form
837 -20310 15812 14385 -14172 -14473 2651 -6333 -17984 2191 12377 -19564 -34827 2179 27787
850 27787 -3209 -36814 -22170 3455 -917 -10384 2316 6089 -24637 -41978 -7472 25358 1462
863 1462 -31014 -15716 4475 -14778 -28227 -1807 13809 -10736 -26104 -6279 3008 -16392
875 -16392 -23387 -225 11251 -10242 -24044 -5176 6570 -12847 -20247 5573 13031 -15407 -19869
888 -19869 11480 12976 -21216 -22119 15745 23270 -7638 -16059 5798 7837 -10815 -3039 27058
901 27058 21391 -17907 -21124 20549 32887 -1750 -13595 15576 21840 -2316 1670 26081 13228
914 13228 -15052 2153 38268 28240 -9520 -9778 20535 25912 4850 4271 22070 14583 -7296
927 -7296 5071 32230 17466 -14375 494 33663 21175 -10420 -1664 21285 10370 -6804
939f804J5114J7213j9096k1749J4618K2501j2741k2336J2839K3466j5894k7645
951b0514J3069K4856j2666j8433J6505J2252k4858j5802K6104J9722k0976k0363
963b1104J3048J5751j1675j1167J4207Q665k1374j2352K8101J9890k9454k6795
975c4259K1025K3842j2674j0156J4196k503k5389J917L3367Q712k9859j6852K0179
988h454J5557j5222r931J7072N774k1432l784K6071K452l0107j916L1519K929
1001A0528l0306k761K7212K483k4398k385K0774K942j6488J407J7439o185k4774
1014b4512N344L4124L167l2668q669K3041M327j3925Q373J6002j5136k1947J4261
1027h218K5794o876k2178K378J8448n42j3999L890J5284q967j8620J3295K6236
$$ plain form
939 -6804 8310 25523 6427 -15322 -704 21797 9056 -13280 -441 23025 7131 -20514
951 -20514 -7445 17411 4745 -13688 2817 15069 -9789 -25591 513 20235 -741 -21104
963 -21104 -8056 7695 -3980 -15147 -940 7725 -13649 -26001 2100 21990 -7464 -34259
975 -34259 -13234 10608 -2066 -12222 1974 -529 -25918 -24001 9366 18078 -11781 -28633 -8454
988 -8454 7103 -8119 -18050 -978 4796 -16636 -20420 5651 8103 -22004 -23920 7599 10528
1001 10528 -19778 -22539 4673 7156 -17242 -19627 1147 4089 -12399 -10992 6447 262 -24512
1014 -24512 -19168 14956 18123 -14545 -23214 -173 4154 -9771 -1398 14604 -532 -22479 -8218
1027 -8218 17576 10700 -11478 -9100 9348 8806 -5193 -1303 13981 5014 -13606 -311 25925
1040B5925j0522k7607O431K3749m719j4841R954J2101j3416j2876J3946J5381
1052B3506j0359j5593Q376J7556o191j8378M662J6882n032j1796R744P658j6138
1065D897r205K1010J1573k0725j4156J5215J3410r397j1189M323N337n856j930
1078C307J0963J621j9748q081K1537J3082j9985j4747J3250Q870j1558k219J0729
1091G021n614j5923O760J8954m365k2241m289J7600Q148j3298p785R229Q31j3254
1105a8226K564J7954m191k2541K538K1454k157j9008J800J4069k325j0552M341
1118a4280J0173o112j2199N737J5905j835j6801P06J6124j162j3769N523J4057
1131B067p939j3364J2213J4927j2041j4878J0745J7208m628j3891N30J0611J12
$$ plain form
1040 25925 15403 -12204 -5773 17976 13257 -1584 8370 20471 7055 -5821 8125 23506
1052 23506 13147 -2446 5930 23486 17295 -1083 3579 20461 15429 3633 13377 21035 4897
1065 4897 -4308 16702 28275 7550 -6606 8609 22019 12622 1433 5756 11093 5237 3307
1078 3307 14270 15891 -3857 -11938 9599 22681 2696 -12051 1199 10069 -1489 -3708 7021
1091 7021 1407 -14516 -7756 11198 6833 -15408 -19697 -2097 6051 -7247 -15032 -5803 -4972 -18226
1105 -18226 -15662 2292 -1899 -24440 -21902 -448 -2605 -21613 -19813 -5744 -8069 -18621 -14280
1118 -14280 -4107 -10219 -22418 -16681 -776 -2611 -19412 -18706 -2582 -3744 -17513 -11990 2067
1131 2067 -5872 -19236 -7023 7904 -4137 -19015 -8270 8938 4310 -9581 -9051 1560 1672
1144A672o079N354R455r685j3445J1524J9712q595j8789N399J5086k560p246M964
1158F767J807q566o97J3087N359j2915j1329R360J5056l851j3735J042R793l193
1172G985n707Q056L267j3625m553J5377P571j4146r608P896Q771k211n694p11
1186B668J608j916j054N885K912j0385p327J0792R095q440p791M662K602l581
1200b70K519N214n632p949L340Q672J761o975n921L248O207r66l393K332n03o024
1216d340K332R711r93j1490m23Q104J095k994m08j400k575K537N057r31n458m503
1232f679L016P451Q21q794m820N627K924k387J484l21p047k321R573L947q608
1247f134o200K982N360K226k635o065j885M111L976Q67j471o735m364P650R355
$$ plain form
1144 1672 -4407 947 10402 717 -12728 -1204 18508 9913 -8876 -3477 11609 9049 1803 6767
1158 6767 8574 8 -689 12398 17757 4842 -6487 2873 17929 14078 343 1385 11178 7985
1172 7985 2278 10334 13601 -24 -4577 10800 18371 4225 -5383 2513 11284 9073 3379 2668
1186 2668 4276 2360 1306 7191 10103 -282 -7609 3183 12278 3838 -3953 709 3311 -270
1200 -270 2249 7463 1831 -6118 -2778 5894 7655 680 -5241 -1993 4214 3248 -145 2187 1684 -4340
1216 -4340 -2008 7703 6710 -4780 -5203 2901 3996 1002 594 -806 -3381 -844 4213 3282 -2176 -6679
1232 -6679 -3663 3788 4609 -4185 -9005 -3378 -454 -2841 -1357 -1678 -8725 -11046 -1473 2474 -6134
1247 -6134 -12334 -9352 -3992 -1766 -4401 -10466 -12351 -8240 -4264 -3397 -4868 -11603 -15967 -8317 1038
1262A038l823q594n10L494J301K940J206n240l402M315M578L7k718l605K69P195
1278a519L845n468m881K390L203K255L546j793n718n47N096L285J272o78l785
1293E03j099O029K970m254j552L737J738k00N58j877k947L127N500O96k746l423
1309F760k417L911O715j234n782m69J279r83K839L199n545o137N696O834l347
1324A1319p294k153L611M661J404l800n560k549L91M517P548l364j3125l273R393
1339A726M846m156k192L89n968j170O986K903o193m739J979L771j05m838j879
1354h640M112J890l654oK832m939m510Q004O797q147p096N606M053m091j628L888
1370e529J306l315l81K506k73m602j403Q914P448q820j2557L220R746J215R1M284
$$ plain form
1262 1038 -2785 -11379 -11889 -8395 -7094 -4154 -2948 -8188 -11590 -7275 -2697 -2660 -5378 -8983 -8714 -1519
1278 -1519 2326 -3142 -8023 -5633 -2430 -175 3371 1578 -4140 -4687 409 3694 4966 4288 503
1293 503 -596 5433 8403 4149 2597 6334 8072 7872 8430 6553 3606 6733 12233 12929 10183 6760
1309 6760 4343 8254 14969 13735 7953 7484 8763 7780 10619 13818 8273 2136 7832 14666 11319
1324 11319 4025 1872 5483 10144 11548 7748 2188 -361 30 4547 12095 8731 -4394 -7667 1726
1339 1726 6572 2416 224 613 -5355 -6525 461 3364 -2829 -7568 -5589 -1818 -1923 -6761 -8640
1354 -8640 -4528 -2638 -6292 -6298 -3466 -8405 -12915 -4911 1886 -6261 -13357 -7751 -3698 -7789 -9417 -5529
1370 -5529 -4223 -7538 -7919 -5413 -5686 -10288 -11691 -2777 4671 -4149 -16706 -13486 -3740 -2525 -2434 1850
1386A850o727j2718L496J6158M829r533p017K049L461J142N47J785m68m603J037
1401d712Q479q52j2437n86J5379M967j1417l484N438k292l789R485Q540p977j0901
1416f159K442J0928Q14q853j36J1138J810j2506k753J0939L28p566O779J0997
1430A8202j0456j6374P674J7747j382j1085m65N402k517n277O344Q505n807j2956
1444b445N184J4313n208j5721M332J5780l478j2791M167O278q694m569J3987O809
1458A7944j5320j3582Q962J5252k201j2238o44N774n224n156J2393Q642j7372
1471b770j3760J4820J4865j2538j3578R157Q719p831m860P123J509j0658k419
1484a2221J3684P769j4973j2603J0496J1910r115p296J1310N399j5157o167J4021
$$ plain form
1386 1850 -4877 -17595 -14099 2059 6888 -2645 -9662 -7613 -4152 -3010 -2463 -678 -1146 -5749 -4712
1401 -4712 3767 2915 -9522 -10108 5271 10238 -1179 -4663 775 -1517 -5306 4179 12719 4742 -6159
1416 -6159 -3717 7211 8025 -828 -964 10174 11984 -522 -3275 7664 7992 426 7205 18202
1430 18202 7746 -8628 -954 16793 15411 4326 3861 9263 6746 1469 7813 16318 10511 -2445
1444 -2445 2739 17052 11844 -3877 455 16235 12757 -34 4133 10411 1717 -2852 11135 17944
1458 17944 2624 -10958 -1996 13256 11055 -1183 -1827 3947 -1277 -6433 5960 14602 -2770
1471 -2770 -16530 -1710 13155 617 -12961 -3804 4915 -2916 -7776 -653 856 -9802 -12221
1484 -12221 1463 9232 -5741 -18344 -7848 4062 -5053 -12349 -1039 4360 -10797 -16964 -2943
1497b943L859j1648J752J5133k882k0609n319J8526J2893p024j0272J170o20p674
1511a5658N558J9954O04k3636q070J8660P478j1470j761R259l394q971O511J1294
1525F358p548j4721M351J7970K040j4095m220R414j555r644R694J7154r404k2112
1539a6318M963J9131l707j2131Q049J2201j0337j4748O649J5768j934j0447M271
1552A410Q706r710j2254J3055K0185j0540k1059O496J7657n098r721J0547M707
1565A4381j6179o286K0399J3307j6901j6866Q811J5845m099r365N704O976j2691
1578C036p788J7842J0999k0054j3484J8357J3159j5972j1061J2694N661j2871
1590E18l184J4316K812j6016p101J5346P744j5679q535J6114Q214j8584r515J6389
$$ plain form
1497 -2943 916 -10732 -8980 6153 3271 -17338 -22657 -4131 8762 1738 -8534 -7364 -7984 -15658
1511 -15658 -10100 9854 10458 -13178 -21248 -2588 4890 -6580 -8341 918 -2476 -11447 -4936 6358
1525 6358 -1190 -15911 -11560 6410 8450 -5645 -9865 -451 -2006 -11650 -1956 15198 5794 -16318
1539 -16318 -11355 7776 4069 -8062 -13 12188 1851 -12897 -6248 9520 7586 -2861 1410
1552 1410 10116 406 -11848 1207 21392 10852 -10207 -3711 13946 8848 -873 9674 14381
1565 14381 -1798 -8084 12315 25622 8721 -8145 666 16511 12412 3047 8751 15727 3036
1578 3036 -4752 13090 24089 4035 -9449 8908 22067 6095 -4966 7728 13389 518
1590 518 -2666 11650 14462 -1554 -8655 6691 14435 -1244 -9779 6335 14549 -4035 -13550 2839
1604B839N339j5368j100J8210k763k2685j558K0517N523j5710m755J1140M87j3960
1618a3844m16J6696K296j7712k703J7998J4k1150P61K1669Q82j8026K04J2032
1632a299n193j1744R868J5696q190j9469L762J9646Q89j6745j196J4394j861j1279
1646a2721Q686J3194j4582j8347J6041K3411q698k0131L330J1969m655n026J1884
1659D355Q051j4346j4206J2484J7144q894j5671J0176J4835j2530j4510J4348
1671A236J3805j4374j1529J5148R257j5438p965J6815P845j7088j0955J6047J5842
1684A8646j1498j4970O771R783r830l648J9816N987k5395j3586K2031J6365j1861
1697H611r652Q018J113j1314K409J7623J539j9039o719J7580R422j4716q848J2654
$$ plain form
1604 2839 8178 -7190 -8290 9920 7157 -15528 -17086 3431 8954 -6756 -11511 -371 116 -13844
1618 -13844 -14260 2436 4732 -12980 -15683 2315 2329 -18821 -18060 3609 4491 -13535 -13331 -1299
1632 -1299 -6492 -18236 -8368 7328 -862 -20331 -16569 3077 3966 -12779 -13975 419 -1442 -12721
1646 -12721 -4035 9159 -5423 -23770 -7729 15682 6984 -13147 -9817 2152 -2503 -7529 4355
1659 4355 12406 -1940 -16146 -3662 13482 4588 -11083 -907 13928 1398 -13112 1236
1671 1236 15041 667 -10862 4286 13543 -1895 -9860 6955 14800 -2288 -13243 2804 18646
1684 18646 7148 -7822 -1051 8732 -1098 -4746 15070 21057 -4338 -17924 4107 20472 8611
1697 8611 -1041 6977 8090 -3224 -815 16808 18347 -692 -7411 10169 19591 4875 -3973 8681
1711H681N024j4825l35J8494j463k2826n10K1460J766j7932j419J4569r03j5959
1725f178L43J4962J168j4420j051J3204k030j7556L015K1269k011k1947o6J6953
1739E655j400j2632N137J0066r788j2044J1014J4714q803j8182L783J6809q33
1752C496j3833K271J0641q302j2498J2004J5669j3927j7111J1757J6139j0129
1764c823j3880P786J0768o154p170P943N344j1577p868J4315J3347j1416j5472
1777a7857R405J3131q868q437J3117P234j4820n795J5982O485j5754n708J5550
1790C665P954j1914q539R279O730q822l387J3112M130j6339o321J8158O173j6519
1804b640m457J6775L455j5746k578J2840R05j0832K500J4271k465j7851k312J8699
$$ plain form
1711 8681 13705 -1120 -1455 17039 15576 -7250 -7760 13700 15466 -2466 -3885 10684 9781 -6178
1725 -6178 -5835 9127 10295 -4125 -5176 8028 5998 -11558 -8543 12726 10715 -11232 -11298 5655
1739 5655 4255 -8377 -3240 6826 -2962 -15006 -3992 10722 1919 -16263 -12480 4329 3496
1752 3496 -10337 -8066 2575 -5727 -18225 -6221 9448 -4479 -21590 -9833 6306 -3823
1764 -3823 -17703 -9917 851 -5303 -12473 -4530 814 -10763 -18631 -4316 9031 -2385 -17857
1777 -17857 -8452 4679 -4189 -12626 491 7725 -7095 -12890 3092 9577 -6177 -11885 3665
1790 3665 11619 -295 -8834 445 7175 -1647 -5034 8078 12208 -4131 -10452 7706 13879 -2640
1804 -2640 -7097 9678 13133 -2613 -5191 7649 8554 -2278 222 14493 12028 -5823 -8135 10564
1818A0564P615j5059o442J1254K277j2286L577J5501m685j8270L655J8941j731
1831A4911j6083p22J1650N26q109J534P745m960j1689N710J5366m491j7309J957
1845c964J6558l359j3503L631J1129o564j0293Q001Q675r432j0811Q631J1985
1858A0684o536j3064L242J1242k508j0009L703P918p452q524J1207R489j2989
1871c597j2838J1164J1814p349q808N322L811p550j961J0074M016j1489q668J0631
1885e428J0384q609j0840P911Q032p818n479J0558J883j2785j094J4417L317j3288
1899h839n550J0141O248o774m176O009L706q216j938J1329K825j3095l600J4528
1913B598M924j2973l995J0315K472p151J346O726l057q336L304J1425j30j1582
$$ plain form
1818 10564 18179 3120 -3322 7932 10209 -2077 1500 17001 12316 -5954 -2299 16642 14911
1831 14911 -1172 -1894 9756 10282 2173 3707 11452 6492 -5197 513 15879 11388 -5921 -3964
1845 -3964 12594 9235 -4268 -637 10492 3928 -6365 1636 10311 879 -9932 -1301 10684
1858 10684 4148 -8916 -5674 5568 3060 -6949 -3246 4672 -2780 -11304 -97 9392 -3597
1871 -3597 -16435 -5271 6543 -806 -9614 -4292 -481 -8031 -9992 82 4098 -7391 -16059 -5428
1885 -5428 4956 -3653 -14493 -6582 1450 -6368 -11847 -1289 594 -12191 -13285 1132 4449 -8839
1899 -8839 -14389 -4248 2000 -4774 -8950 -2941 765 -7451 -9389 1940 4765 -8330 -11930 2598
1913 2598 7522 -5451 -9446 869 3341 -3810 -2464 4262 1205 -7131 -3827 7598 7468 -4114
1927d114l552J0529N423p520l028O460j027p907M899J0811m807j1884L364J1494
1941I141j084q213M12N854n31l627K126M278l691p376N009J1077l197j2025Q22
1956a025J0247l28o201L558L404o653l788P906M576o989n606N473O088l121o946
1971E95Q30N798r65l203K865K466q116m339R739P214q470p967M203M150k702j135
1987I63L078j006m772o80N165J413o227m571N923N987m921p567K291L041k321
2002d204O21N798l438j0071K57Q871K695n596l356R70J430o06n71J877N9l665
2018h929P8N760L3q255j215R285K832n730k881K116j307M17N334K383n049m471
2034i599J426N517K412l713k194K780K543k394p58K760j158j682M844M223n807
$$ plain form
1927 -4114 -7666 2863 8286 766 -2262 4198 3171 -4736 163 10974 6167 -5717 -2353 9141
1941 9141 8057 -156 256 6110 5579 1952 4078 8356 4665 -2711 2298 13375 10178 -1847 -1025
1956 -1025 9222 8894 2693 6251 9655 3002 -786 7120 11696 4707 -899 4574 10662 7541 595
1971 595 1425 7223 6258 3055 5920 8386 270 -4069 5670 12884 4414 -3553 650 4800 2098 963
1987 963 4041 3035 -1737 -2417 2748 4161 -2066 -6637 -714 5273 352 -7215 -4924 -1883 -4204
2002 -4204 -3583 2215 -1223 -11294 -11037 -2166 529 -5067 -8423 -7453 -6023 -6629 -7200 -5323 -5264 -8929
2018 -8929 -8851 -3091 -3058 -11313 -12528 -3243 -411 -6141 -9022 -6906 -8213 -7796 -2462 -79 -5128 -9599
2034 -9599 -8173 -2656 -244 -3957 -6151 -3371 -828 -3222 -3980 -1220 -2378 -4060 784 5007 -800
2049h00o682L976O926J581k198k413k315q7L387L563J421l606m666R44O811Q3
2065E925n068J08M111j57j764J192p24k886J752N056Q77l904m601l64M413M840
2081H806p57m211j112J39P4K187K249k102k150J639J097k067j492Q67J779K364
2097G310N53m791m078K108M060J443N87k198n775j134N558L132j576l351j848
2112@O27K510R83l137j541J850Q36N0L01k693n088K834O775K82n840k954Q1J156
2130b968K646J834k116k927j836N32K841J177l254k473L047J600l811k002K471
2145e239Q83p13J583l98n171j923M888M158j505l627k931J514K566J522k13N8
2161d548k725k249L325N287k633n338K661N492j297l135J190L86n61K263M277
$$ plain form
2049 -800 -7482 -3506 3420 5001 2803 390 -1925 -2012 1375 4938 6359 2753 -1913 -969 5842 5925
2065 5925 857 965 5076 4919 3155 4347 3623 737 2489 7545 8422 4518 -83 -447 3966 8806
2081 8806 8049 3838 2726 2865 2939 5126 7375 5273 3123 4762 5859 3792 2300 3167 4946 7310
2097 7310 7863 3072 -1006 1102 5162 6605 7192 4994 -781 -1915 3643 6775 5199 1848 0
2112 0 627 3137 4120 983 -558 1292 2128 2178 2479 -214 -5302 -2468 4307 4589 -1251 -4205 -4124 -2968
2130 -2968 -322 1512 -604 -3531 -5367 -4835 -1994 -817 -4071 -6544 -3497 -1897 -5708 -7710 -5239
2145 -5239 -4356 -5069 -3486 -3884 -9055 -10978 -6090 -1932 -3437 -7064 -9995 -8481 -5915 -4393 -4606 -4548
2161 -4548 -7273 -9522 -6197 -910 -3543 -8881 -6220 -728 -2025 -5160 -3970 -3584 -4145 -1882 2395
2176B395r11n297k283N152N673n14n040n19K814m69p61M200J751o105j447P359
2192E998J194o395k388O050L431k346k025k37r35j317K674O246N50q793n194P514
2208D027O042m501l297M627J18n865L23O769q69o151J761N766j682o920j374O231
2224E005L791m242l295K463N85n293J613P283k108r669J247R810l20q911j779
2239c820N007Q48j336J848L54m944n483M578R794m38j0532l625O840K535l598
2254a972J823L418o236n977P335P835n529q041L050N339j434l457J834K470l278
2269b820m459M187N872m579o718N117O136p503o890P690P504n945o486L765J937
2284c192m760M35Q061J004r806n256Q575P807m392q022L099M447l774o10P975
$$ plain form
2176 2395 1484 -3813 -6096 -944 4729 4215 -825 -1344 1470 1001 240 4440 6191 86 -1361 5998
2192 5998 7192 797 -1591 4459 7890 5544 3519 3282 2347 1030 3704 9950 10500 1707 -3487 4027
2208 4027 10069 5568 2271 6898 7016 1151 1474 8243 7374 1223 2984 8750 7068 148 -1226 5005
2224 5005 8796 4554 1259 3722 4307 -986 627 7910 5802 -3867 -2620 7190 6870 -2041 -3820
2239 -3820 1187 2035 699 2547 2901 -2043 -7526 -2948 6846 6408 -4124 -7749 -909 1626 -1972
2254 -1972 -149 3269 -2967 -8944 -1609 6226 697 -7344 -4294 1045 -389 -3846 -2012 458 -2820
2269 -2820 -7279 -3092 2780 -1799 -8517 -3400 2736 -4767 -11657 -3967 3537 -2408 -8894 -5129 -3192
2284 -3192 -7952 -7517 544 1548 -8258 -13514 -4939 2868 -1524 -9546 -6447 -2000 -5774 -6384 1591
2299A591M00j3016j950J4564O541j0176o825N521K857k943J693O463j415r971
2313f666j044J1061M680r663m539R767L720r234k114R243R73q636J323J0018j624
2328G265j0352J299R941O59q935j240Q800K898q386j451O864m55p477L945J1256
2343A4631m745j4006K247J2909M31q584J080M819l905n652N309P129n104q807
2357b248L105J0628k979j1368R47R177j408o844M652M890r374p595J0695Q918
2371A1196q484r081M562O891m881n463M525M687n730n105P061N544j0032q957
2385a3267J0529J0781p985r599N657M465p652j849J0613K537j1554n325R669N848
2399B868q302n919Q249O020q157p046Q234N022q724l173J0664K438j2725k655
$$ plain form
2299 1591 1991 -11025 -12975 1589 8130 -2046 -8871 -3350 -493 -3436 -1743 4720 3305 -6666
2313 -6666 -7710 3351 8031 -1632 -6171 3596 7316 -1918 -4032 5211 6184 -2452 -1129 8889 7265
2328 7265 -3087 -1788 8153 8812 -123 -1363 7437 10335 1949 498 7362 6907 -570 3375 14631
2343 14631 9886 -4120 -1873 11036 11467 2883 3963 8782 4877 -775 4534 11663 6559 -2248
2357 -2248 857 11485 8506 -2862 -1915 7262 5854 -990 3662 8552 -822 -8417 2278 11196
2371 11196 2712 -6369 -1807 5084 203 -5260 -735 3952 -1778 -6883 178 5722 -4310 -13267
2385 -13267 -2738 8043 58 -9541 -3884 581 -7071 -8920 1693 4230 -7324 -12649 -2980 2868
2399 2868 -5434 -11353 -3104 2916 -5241 -12287 -4053 969 -7755 -10928 -264 2174 -10551 -13206
2413a3206J3033L560j1508l614R382L084o257j371O046p40q811K093J3350J644
2427F685j5060n024J2199O299p806p40P158m095r509O033J2835l056j3299l63
2441g743J1616K210p059j012O222j608p883M071J1616k683j3085J630J1576k005
2455E863r204N107R469n732r325M483Q082l131n376N039N473p342q941P338J2162
2470A3965m493j1542K585Q560l999n853P542M986j1202o726J2240R460j0556j0546
2484e579N253P887k367l701M893J123j0358n074J2314R888j0182j1008P050P487
2498G626q046m213R397L396j0780l215R198K497r610k507J0272L187j0218n415
2512h431Q454N242q432l850Q731J667j0612r11J2433j21j4300j302J3105K955
$$ plain form
2413 -13206 -173 3387 -8121 -11735 -2353 731 -5526 -6897 -851 -1591 -10402 -8309 5041 6685
2427 6685 -8375 -13399 -1200 5099 -2707 -3447 3711 -384 -9893 -3860 8975 5919 -7380 -7743
2441 -7743 3873 6083 -976 -1988 4234 2626 -5257 -1186 10430 7747 -5338 -3708 7868 5863
2455 5863 -3341 1766 11235 5503 -3822 661 8743 5612 236 5275 10748 3406 -5535 1803 13965
2470 13965 9472 -2070 515 9075 5076 -777 6765 11751 549 -6177 6063 15523 4967 -5579
2484 -5579 -326 7561 5194 1493 6386 7509 -2849 -7923 4391 14279 4097 -6911 139 7626
2498 7626 -420 -4633 4764 8160 -2620 -5835 3363 5860 -3750 -6257 4015 7202 -3016 -8431
2512 -8431 23 5265 -3167 -7017 1714 3381 -7231 -8142 4291 4170 -10130 -11432 1673 4628
2526D628j0377k885O717j58o600K247R417k088j2430j001J2867K475j0605k034
2540i827R509l81r005K705Q788m177r415N095J0425m134j0146K529R075p94p478
2555g231J565P239l094p080M634R118n701j1126P037J2363n095j0609L350Q095
2569C465l682m298O869M415q304o984Q336R520m883r138L629Q355l981p096O034
2584B257O843p083n616Q981N931j0261n717R720O611p544o467O372M839n227l563
2599G6N844L169p378l911R735N671j1156p302R731P142p361l944O137k17q076
2614a840J534J0298K1j0943l621Q269N212o264m578N015K117o776p28Q789k39
2629F266j0970j062J1159J103j0272p08Q062o19o792R08N705j799n959J979O476
$$ plain form
2526 4628 -5749 -8634 -1917 -2075 -8675 -6428 2989 901 -11529 -12530 337 2812 -7793 -9827
2540 -9827 -318 -699 -9704 -6999 1789 -2388 -11803 -6708 3717 -417 -10563 -8034 1041 247 -7231
2555 -7231 -5666 1573 -1521 -8601 -3967 5151 -550 -11676 -4639 7724 2629 -7980 -4630 3465
2569 3465 -217 -4515 2354 6769 -1535 -8519 -183 9337 4454 -4684 -1055 7300 3319 -3777 2257
2584 2257 9100 2017 -3599 5382 11313 1052 -4665 5055 11666 4122 -2345 4027 8866 3639 76
2599 76 5920 9089 1711 -2200 7535 13206 2050 -5252 4479 11621 4260 316 6453 6236 -1840
2614 -1840 -306 9992 10013 -930 -4551 3718 8930 2666 -1912 3103 5220 -1556 -2284 6505 6266
2629 6266 -4704 -5766 5393 6496 -3776 -4484 3578 2959 -3833 -2925 2780 981 -4978 -2999 3477
2644C477k021r358J119J0582O3j0097r92P478j129o344M391O641o551q231N538
2659e434Q863l822q301J451P174r88n261J319M665l884o182O124Q700o090j0227
2674a1893M536R026l383n922L864L873n199k762O177L828n627m992N798O319m708
2689a065o782L765O482k584m940M666L419o647k808R066M143q256m767O298M870
2704D860l586l171L069K201l632r36N208K113o489l166P719M822o655m592N391
2719C156L389m483LM718k025n683J616P522m55o071k021N198K677l941j629L726
2735E697J93n139J295O292j821q125J545Q001J13p444m57M092n13k332K192K081
2751E670l845m168K611N410q32o602n85N841q4n134Q58L944l260l750M076M038
$$ plain form
2644 3477 1456 -7902 -6783 3799 3862 -6235 -7227 251 -878 -7222 -2831 3810 -2741 -10972 -5434
2659 -5434 3429 -393 -8694 -7243 -69 -1057 -6318 -4999 -334 -4218 -10400 -4276 4424 -1666 -11893
2674 -11893 -7357 1669 -1714 -7636 -3772 101 -5098 -7860 -1683 2145 -3482 -8474 -2676 3643 -1065
2689 -1065 -7847 -4082 2400 -184 -5124 -458 2961 -3686 -6494 2572 6715 -1541 -6308 -10 4860
2704 4860 1274 -1897 1172 3373 -259 -1195 4013 6126 -363 -3529 4190 9012 2357 -2235 3156
2719 3156 6545 2062 2065 6783 4758 -925 691 8213 7758 1687 -334 4864 7541 3600 1971 5697
2735 5697 5890 751 2046 8338 6517 -1608 -63 7938 8051 607 150 4242 3729 1397 3589 5670
2751 5670 1825 -2343 268 5678 4846 -1756 -2341 3500 3416 -1718 -860 3084 -176 -3926 150 4188
2767D188n259n462M151N572k335m637L8K283l09j881K154K337m454m406M360O297
2783B637m368o484L431M789k612k986K542Q27l892K53N019P86m755l458L165M997
2799a09j086m427M10L058j946j490M003J283n271j633N935K757m968k527K899
2814c112K539r55q49M85P2j099K77L346J053m064k917M643L762k764k346J714
2830b15O73j304K298K055k472l137J972M150L54k219k647J248K362P33p72%q72
2847B207k035J872M481j380m501Q6L500O74r03L43r42j432J261J827J85j746j574
2864A923N99K324R66l279j096J944J137j218J96l0k321k61L495J057l374k561
2880d99J202J851Q60p78j808j142J221Q89L01m01k142k256K424L286j113l414
$$ plain form
2767 4188 -1071 -6533 -2382 3190 855 -3782 -3744 -1461 -1770 -3651 -1497 840 -3614 -8020 -3660 2637
2783 2637 -1731 -8215 -4784 5 -2607 -5593 -3051 -2224 -6116 -5863 -844 -58 -4813 -8271 -5106 -109
2799 -109 -1195 -5622 -5212 -2154 -4100 -5590 -1587 -304 -5575 -7208 -1273 1484 -3484 -6011 -3112
2814 -3112 -573 -1528 -2377 -1892 -1820 -2919 -2642 704 1757 -2307 -5224 -581 3181 417 -1929 -215
2830 -215 458 -846 1452 3507 1035 -2102 -130 4020 4374 2155 -492 756 3118 3851 3079 3079 2207
2847 2207 172 2044 6525 5145 644 730 4230 4904 4001 4344 3402 1970 3231 5058 5243 3497 1923
2864 1923 2522 4846 5812 2533 1437 3381 4518 3300 3496 3466 1145 884 4379 5436 2062 -499
2880 -499 703 2554 3414 2636 828 -314 907 1796 2097 1696 -446 -2702 -278 3008 1895 -1519
2896a519q78P09M95J687N60k864k186J561J559K48p44k032j194K500J615j923
2912b406k142M45L29O47J690j153k648j59J978J041l25n93j735n31K610J320j886
2929c518j568N34R08J132J145j649k060J38K597J204l42j745r88N47K886k83j424
2946b486L50K47n35J096J606j875j869K616K690j278j882k67O61J596J214m75
2962A409j205j332P14J883K204o55m097K96M220J156k435p19K60j153J677L440
2978E663J90m489j928K413L276M72j642k163J014N57R8J114J382l026k543L203
2994C591K957k991k646K501J804k354p47J625m32r86n7J289n6j953j441L229K289
3011E622l172m587K468L496j169j639J579j786l780J211O089R3n648k322J893
$$ plain form
2896 -1519 -2397 -1688 -1193 494 1054 -1810 -3996 -2435 -876 -628 -1372 -3404 -4598 -2098 -483 -2406
2912 -2406 -4548 -4103 -3774 -3127 -1437 -2590 -5238 -5397 -3419 -2378 -2703 -3296 -5031 -5562 -2952 -1632 -3518
2929 -3518 -5086 -4552 -3644 -2512 -1367 -3016 -5076 -4938 -2341 -1137 -1479 -3224 -4212 -3665 -779 -1062 -2486
2946 -2486 -2136 -1889 -2424 -1328 278 -1597 -3466 -850 1840 562 -1320 -1587 -926 670 1884 1409
2962 1409 204 -1128 -414 1469 3673 3018 -1079 -783 3437 4593 2158 1439 1699 546 2223 5663
2978 5663 5853 1364 -564 1849 5125 5597 3955 1792 2806 3363 3461 4575 5957 2931 388 3591
2994 3591 6548 3557 911 3412 5216 2862 2115 3740 3308 2322 2265 3554 3498 1545 104 3333 5622
3011 5622 2450 -2137 331 3827 2658 1019 2598 812 -2968 -1757 4332 4425 -1223 -3545 -1652
3026a652L004l69j252l95o33j823O60M205J88o487j905N322K669l430j566J326
3042b138j227j902K457L477k336l654%L240K82l102n60L276J230l776j130L035
3058b828k31k869K530M387l534n803K735N632j314l440O72J801j98j057J627J414
3074d76l000k297L940N276k363o815J394N722q69k110K559J273m807j443N410
3089A394L458m599l402L452M221j736m018J210L674j183k522L776K253n740l803
3104c565O960N049n062m410L587K586k625j335L831q3m166l04M437K533m830m021
3120a418M008M756l724l278L759J108m727q80O346N23o302o35N764N9n479j023
3136a143M690J597l430j708K516l52l898J187O379o69q246j107P268J582o225
$$ plain form
3026 -1652 1352 983 -269 -664 -1297 -3120 -2460 1745 1933 -4554 -6459 -1137 1532 -1898 -3464 -2138
3042 -2138 -3365 -5267 -2810 667 -1669 -5323 -5323 -2083 -1801 -4903 -5463 -2187 -957 -4733 -5863 -2828
3058 -2828 -3059 -5928 -3398 989 -2545 -8348 -5613 19 -1295 -4735 -4063 -2262 -2460 -3517 -1890 -476
3074 -476 -3476 -5773 -1833 3443 1080 -5735 -4341 1381 512 -1598 961 2234 -2573 -4016 1394
3089 1394 4852 253 -3149 303 4524 2788 -1230 -20 3654 2471 -51 3725 5978 238 -3565
3104 -3565 3395 8444 3382 -1028 2559 5145 2520 1185 5016 4933 767 463 4900 7433 2603 -1418
3120 -1418 2590 7346 3622 344 4103 5211 484 -396 5950 6473 171 -464 5300 5359 -120 -1143
3136 -1143 3547 5144 1714 6 2522 2170 -1728 -541 5838 5169 -3077 -4184 3084 4666 -1559
3151a559p46L529j118k947L077L496m027o186K206P179P29o364k436L969K99l361
3167d260K404N104m248o977L460P170l141n717K697M868l039m818K981L172k292
3182b636l159K859L962l517n439L604O135l350o190L461N873l410m548M036K495
3197A76n357j133O535L177o354n134M287N462j615l670K542J696m184j867O779
3212A340L697p540m496P447M871n666l731M699K164l799R3N254r2o778r20P252
3228C795L439n814l882N258L223n525j246O209O02o489O13P357p11p947J14P550
3244F546R03n843r13M309R6m210L06N555j035o613O66P797j251q233M42P607k
3261F127o667J064M115l065l934M124N370l841p305J884P443r77o166J00M786
$$ plain form
3151 -1559 -2305 1224 106 -2841 236 3732 -295 -6481 -4275 2904 3633 -2731 -5167 -1198 -899 -4260
3167 -4260 -1856 3248 -1000 -7977 -4517 2653 -488 -6205 -3508 1360 -1679 -6497 -3516 -344 -2636
3182 -2636 -5795 -2936 1026 -2491 -7930 -4326 1809 -1541 -7731 -4270 1603 -1807 -6355 -2319 176
3197 176 -5181 -6314 221 3398 -2956 -8090 -3803 1659 44 -3626 -1084 612 -3572 -5439 1340
3212 1340 5037 -2503 -6999 448 5319 -347 -4078 621 2785 -1014 -921 4333 4241 -2537 -3457 3795
3228 3795 7234 1420 -2462 2796 6019 494 -752 5457 6059 -430 183 7540 6829 -1118 -1004 6546
3244 6546 7449 1606 693 5002 5098 888 1194 6749 5714 -899 -233 7564 6313 -1920 -1478 6129 6127
3261 6127 -540 524 4639 1574 -2360 1764 7134 3293 -4012 -2128 5315 4338 -1828 -1728 3058
3276C058j089n140L173N366n684o622N807P169m381o754K232M513k622l235M171
3291c8K745n032m792M835N586m578o233M210O254m473n721M414M349n410k905
3306f789O290K621p265k843O516L938n161m256M088M216l255l478L775K098n199
3321d704j352P477K562q574m118P463M433n552j806M432j98m950J209O124n68
3336A878o536j067P404K304o387k948N550K702n311l37N803j389o480J661Q112
3351D959j027p675R17O414j8m784j2M511l87l997J570N468j867p282J737Q982
3367G509r04p540O92O397j970m649L524M685m265n149M050N393k821n749J690
3382H93N861j553n688J802M540k832m687M744N117n841n940N246N724m329n121
$$ plain form
3276 3058 1969 -3171 2 5368 -316 -6938 -1131 6038 1657 -5097 -2865 1648 -974 -4209 -38
3291 -38 2707 -2325 -7117 -2282 3304 -1274 -7507 -3297 2957 -1516 -7237 -2823 1526 -3884 -6789
3306 -6789 -499 2122 -5143 -7986 -1470 2468 -2693 -6949 -2861 1355 -1900 -5378 -1603 495 -4704
3321 -4704 -6056 1421 3983 -4591 -8709 -1246 3187 -2365 -4171 261 63 -4887 -3678 2446 1878
3336 1878 -4658 -5725 1679 3983 -2404 -5352 198 2900 -2411 -2748 3055 1666 -4814 -3153 4959
3351 4959 3932 -3743 -2826 3588 3570 -1214 -1226 3285 2898 -1099 471 5939 4072 -3210 -1473 7509
3367 7509 6605 -935 -243 6154 4184 -465 3059 7744 3479 -1670 2380 7773 4952 -797 893
3382 893 6754 5201 -487 1315 5855 3023 -1664 3080 8197 2356 -3584 1662 7386 3057 -2064
3397b064L443L233k988k354L539J671n184k898N525N022n162o238L332N453l564
3412G66l385L806J684n461j881O473J685o584l103N140L101l894l342K751K207
3427c7l533j410M233J388o274j685O413K386o692k941O840J425m915m42L690m53
3443b007l924J713N012j272n804q09O224K472n190j724M207M65m032J614N357
3458B302k344o301K869O206j392n747O67M684l27k764R46K976j734m034K429N857
3474D293j848o342J064O454m14n473J654M425k282l092M042K647l606l710L736
3489A548M765k259m779Q73M308n62k886J300K781l233k977M581M054m762m987
3504b235M115M162k928k669K264J080k543r58L299J491l969k429L359L605l268
$$ plain form
3397 -2064 1379 4612 1624 -730 2809 4480 -704 -3602 1923 6945 1783 -4455 -1123 4330 766
3412 766 -2619 1187 2871 -2590 -4471 2002 3687 -2897 -6000 -860 2241 -1653 -4995 -2244 -37
3427 -37 -3570 -4980 -747 641 -5633 -7318 -905 1481 -5211 -8152 -1312 113 -4802 -5244 -1554 -2007
3443 -2007 -5931 -4218 794 -478 -6282 -7091 -867 1605 -3585 -5309 -1102 -637 -4669 -3055 2302
3458 2302 -42 -6343 -3474 2732 1340 -4407 -3740 944 617 -2147 -1201 1775 41 -3993 -1564 4293
3474 4293 2445 -3897 -2833 3621 3207 -2266 -612 3813 1531 -1561 2481 5128 1522 -2188 1548
3489 1548 6313 4054 -725 148 4456 3894 1008 2308 5089 1856 -1121 3460 7514 2752 -2235
3504 -2235 1880 6042 3114 445 2709 3789 1246 288 3587 5078 1109 -1320 2039 5644 2376
3519B376m073K694L410l102j786L639K4m733o8N342O62n187j697L775J567k615
3535B28j578J681R12k598m36L658K63n154q37N262J266n111j198L640M50k648
3551b200O94K555k066l314J129M297j03m441j135L851J332l133r62K834q41k882
3567d385K042L611k458m587J821M062j69l718J43J457p34j59J104P50j210k512
3583d942J931L438r68m272N33M038o83k591J562J374j886j172L151J529k733k034
3599c725K478K661r89k123J40J889K22j259J504J251k815j592M165K100l082k250
3615a425K258J529r90l6Q40n98j408R53K267Q69k775k041K289K780j237k262R94
3632B007J161j558O01K422q28l429J034K976J37j958j182J303P58j55n54N4k0
$$ plain form
3519 2376 -1697 997 4407 1305 -481 3158 3182 -1551 -1619 3723 4385 -802 -2499 1276 2843 228
3535 228 -1350 331 1243 -1355 -1791 1867 2130 -3024 -3861 1401 2667 -2444 -3642 -2 448 -2200
3551 -2200 -1506 1049 -1017 -4331 -3202 1095 992 -3449 -4584 -733 599 -2534 -3496 -662 -1503 -4385
3567 -4385 -2343 1268 -1190 -5777 -3956 106 -63 -3781 -3638 -2181 -2915 -3074 -1970 -1220 -2430 -4942
3583 -4942 -3011 427 -541 -4813 -4280 -242 -925 -3516 -1954 -580 -2466 -3638 -487 1042 -1691 -3725
3599 -3725 -1247 1414 425 -1698 -1558 331 553 -706 798 2049 -766 -2358 1807 3907 825 -1425
3615 -1425 833 2362 1372 1336 2176 1578 170 1123 3390 4259 1484 -557 1732 4512 3275 1013 2007
3632 2007 3168 1610 2211 4633 3805 376 1410 4386 4523 2565 1383 2686 3444 3289 2735 2789 2769
3649B769j206M2K859n93l363j003L201O53k200m48N51p33l46J445L51k223j388
3666a632O97K086k80j913j388J065J152o38m07O56j454j145J728J822j837k068
3682c556J010J209j31l78n21m61K4J064L40P2j165j403P61K697k23k595p65J510
3700b511P43k4L88r65j402O79K038J63j042j258k54J025J852N3j482j211R29N8
3718b221J744L65j464r47J442J258o44k71J55k34N50J308q52j040N27J260j20
3735H16N7k25j212M44J579P02j036r03P3N44J469L61j541j518J424R48O97J56
3753B835j259j699K16L254M88j737q48m58L55J243J002n77j619j60J136J124J63
3770C459j532j267J592Q92q93l00N17o05r84J682O40j802j027J540Q16o27j420
$$ plain form
3649 2769 1563 1605 4464 3871 508 -495 2706 3359 1159 711 1262 529 183 1628 1979 -244 -1632
3666 -1632 -935 1151 871 -1042 -2430 -1365 -213 -851 -1258 -602 -2056 -3201 -1473 349 -1488 -3556
3682 -3556 -2546 -1337 -1468 -1846 -2367 -2828 -2804 -1740 -1400 -1328 -2493 -3896 -3135 -438 -661 -3256 -4021 -2511
3700 -2511 -1768 -1792 -1404 -2369 -3771 -3092 -1054 -891 -1933 -3191 -3445 -2420 -568 -515 -1997 -3208 -2279 -2221
3718 -2221 -477 -112 -1576 -2523 -1081 177 -467 -738 -583 -817 -267 1041 189 -851 -324 936 816
3735 816 873 648 -564 -120 1459 2161 1125 222 295 839 2308 2669 1128 -390 1034 1982 2679 2835
3753 2835 1576 -123 93 3347 3835 2098 1250 792 1147 2390 3392 2815 1196 1036 2172 3296 3459
3770 3459 1927 660 2252 3144 2251 1951 2468 1863 879 2561 3201 1399 372 1912 2728 2101 681
3787F81j21Q29R17l14p00n82o70k31J384J701j968l320J385K286m33j465M31o66
3805h56j195J178J273n41k217j189R77K356k30k668k69J025K41n93J325Q7k795
3822d091k30K468J213k775q43J988O94p71k51j18j40J51l7J869L75k817j441L081
3840a675K263k026j625J768K27j345O81K049j304k261J205K430r1k363j024K205
3856h86J286n36o06J032j92j897O73L168l32l670J057L548n78k643L86K028P6
3873A914p51J146P33k023j482K079L329q09l524p25L092R23j938L30J367j871
3889A790k055L595K154k954l219J641K565j50j533k10L21j002p20K024K058k295
3905B010l615K042L115k274k465K505K106k553j848K139J148k553j67K707N93
$$ plain form
3787 681 560 1389 2306 1992 1292 710 40 -191 1193 2894 926 -2394 -1009 1277 844 -621 -190 -856
3805 -856 -2051 -873 400 -141 -2358 -3547 -2570 -214 -444 -3112 -3381 -2356 -2115 -2708 -1383 -1296 -4091
3822 -4091 -4321 -1853 -640 -3415 -4258 -2270 -1576 -2347 -2598 -2716 -2856 -2705 -2742 -873 -498 -3315 -4756 -1675
3840 -1675 588 -1438 -3063 -1295 -1068 -2413 -1732 317 -987 -3248 -2043 387 296 -2067 -3091 -886
3856 -886 400 -136 -742 290 98 -1799 -1126 2042 1710 -1960 -903 2645 2067 -576 -190 1838 1914
3873 1914 1163 2309 3042 1019 -463 1616 4945 4136 612 -113 2979 3902 1964 2294 3661 1790
3889 1790 -265 3330 5484 2530 -689 952 3517 3367 1834 1624 1945 943 223 2247 4305 2010
3905 2010 -1605 437 3552 1278 -1187 1318 3424 871 -977 1162 2310 -243 -410 2297 2890
3920B890l170j663L311K013k089k995J561J990j877j180K704n19m320k04N410
3935A862J144m728k562K449J331j740Q48J269j081l290o0M049J042l841j987L654
3951a641J474l186l79K992q57l119J490M017j612l959Q99L755j20k720l73K787
3967e52Q1k601j52L451o87k852J269L948j886n373K017M783o01l058M63J599j318
3984a469j448K826K129k546k989J535M470q20m118O88L615n87k720K783J915l380
4000a16k868M629L399l083l583K504K982j948j406J386J357j695j108K459J614
4015D523l564k752M139L898l518l382K624J622k735j66L576q9l951r34M157J388
4031D836l358k459K952K308k477k049K702J269l879p02M801J79n076p60M597Q63
$$ plain form
3920 2890 -280 -1943 1368 3381 1292 -1703 -142 1848 -29 -1209 1495 976 -3344 -3548 1862
3935 1862 3006 -1722 -4284 -1835 -504 -2244 -1396 -127 -1208 -4498 -4558 -509 533 -3308 -5295 -1641
3951 -1641 -167 -3353 -3732 -740 -1597 -4716 -3226 791 -821 -4780 -3881 -126 -246 -2966 -3339 -552
3967 -552 -471 -3072 -3224 227 -460 -3312 -2043 1905 19 -5354 -3337 1446 845 -2213 -1750 -151 -1469
3984 -1469 -2917 -91 2038 -508 -3497 -1962 2508 1688 -2430 -1742 1873 1286 -1434 1349 3264 -116
4000 -116 -2984 1645 5044 1961 -1622 882 3864 1916 510 1896 3253 1558 450 2909 4523
4015 4523 959 -1793 2346 6244 2726 -656 1968 3590 855 689 4265 4176 225 -709 3448 4836
4031 4836 1478 -981 1971 4279 1802 -247 2455 3724 -155 -857 3944 4123 -953 -1713 2884 3747
4047C747m310n62L243p5k893M13K378j111l209P06M518l18n854j097M879J570
4063B025m091j74L249k300l134K172M631k128n632J006M535M40l409q38K731p63
4079a680k499J639L585k083n162K219M890j357m677J996L531k037l295K404K848
4094C22k273k687K619K592k177l710K382M273j258l968J077L629j938k508L888
4109B63J858m133k180M693L085l604l148K342L044j493j122J729J025l388j385
4124b414M524L143m303l761L662L358l238j900L670P32l864o8L996K58m313p45
4140a263M528J184l658j934L247J835l002j026L475M03m372L07N245N2n728l40
4156a047M893O72l238q16K370l58k558J473L407j134m844l24N235N66m762m44
$$ plain form
4047 3747 -563 -1125 2118 2043 -850 -437 1941 830 -2379 -1673 2845 2527 -3327 -4424 455 2025
4063 2025 -2066 -2240 1009 -1291 -4425 -2253 2378 250 -5382 -4376 159 599 -2810 -3648 -917 -1680
4079 -1680 -4179 -2540 1045 -1038 -6200 -3981 909 -448 -5125 -3129 402 -1635 -4930 -2526 322
4094 322 -1951 -4638 -2019 573 -1604 -5314 -2932 1341 83 -3885 -2808 821 -1117 -3625 263
4109 263 2121 -2012 -4192 501 3586 -18 -3166 -824 2220 727 -395 1334 2359 -1029 -2414
4124 -2414 2110 5253 950 -2811 851 4209 971 -929 2741 3473 -391 -459 3537 3795 -518 -1263
4140 -1263 3265 4449 791 -1143 2104 3939 937 -89 3386 3789 -583 -276 4969 5021 -707 -1047
4156 -1047 3846 4518 1280 464 2834 2476 -82 1391 4798 3664 -1180 -1504 3731 4297 -465 -909
4172i09L449n13l338J564L019k139l783K278L934k692l695J212L575o12l030n2
4188a732K895j553k810K143L368l026m186L130M673k199m843J648K841j275j624
4203b550K013J423l404j859L055L154k420l775J369L100j449k558J952K224l112
4218b837k161M326J654m640j889M043K412l157j827K425J198k006n84K139Q71
4233c3k776j119L716K366m426k012L254K660k533j227K718M9l201J178M086l73
4249B327l567j009L733J345j816j748K076Q06k175k5L463l35m526P37M658J4m041
4266h3J6L051n4k186P37J850j068k198J420K732p17l615M35L592L85l751k04K872
$$ plain form
4172 -909 2540 2027 -1311 253 3272 1133 -2650 -372 3562 870 -2825 -1613 1962 1350 -1680 -1732
4188 -1732 1163 -390 -3200 -1057 2311 -715 -4901 -1771 2902 703 -4140 -2492 349 -926 -2550
4203 -2550 -537 886 -2518 -4377 -1322 1832 -588 -4363 -2994 106 -1343 -3901 -1949 275 -2837
4218 -2837 -4998 -672 982 -3658 -5547 -1504 908 -2249 -4076 -1651 -453 -2459 -3043 -904 -33
4233 -33 -2809 -3928 -212 2154 -2272 -4284 -1030 1630 -903 -2130 588 637 -2564 -1386 2700 2327
4249 2327 -1240 -2249 1484 2829 1013 -735 1341 2147 -28 -53 3410 3075 -1451 -714 3944 3958 -83
4266 -83 -67 2984 2930 744 1481 3331 2263 65 1485 4217 3500 -115 320 3912 4297 546 342 3214
$$ [...]
8191A51
##END NTUPLES=NMR FID
##END=
